##TITLE=31Pdec_LR-766-2H-2CR8
 D2O, 24 sc
 5.6.2023
##JCAMPDX= 6.0         $$ Bruker NMR JCAMP-DX V2.0
##DATA TYPE= NMR SPECTRUM
##DATA CLASS= NTUPLES
##ORIGIN= UXNMR, Bruker Analytische Messtechnik GmbH
##OWNER= root
$$ XWIN-NMR		Version 3.5
$$ Mon Jun  5 14:42:34 2023 Russian Standard Time (UT+4h)  she@DPX200
##.OBSERVE FREQUENCY= 81.013821
##.OBSERVE NUCLEUS= ^31P
##.ACQUISITION MODE= SIMULTANEOUS
##.ACQUISITION SCHEME= undefined
##.AVERAGES= 24
##.DIGITISER RES= 16
##SPECTROMETER/DATA SYSTEM= spect
##.PULSE SEQUENCE= zgpg30
##.SOLVENT NAME= CDCl3
##.SHIFT REFERENCE= (INTERNAL, CDCl3, 0, 248.564)
##AUDIT TRAIL= $$ (NUMBER, WHEN, WHO, WHERE, WHAT)
$$ ##TITLE= Audit trail, XWIN-NMR		Version 3.5
$$ ##JCAMPDX= 5.01
$$ ##ORIGIN= Bruker BioSpin GmbH
$$ ##OWNER= she
$$ F:/spectra/data/she/nmr/P31/1/pdata/1/auditp.txt
$$ ##AUDIT TRAIL=  $$ (NUMBER, WHEN, WHO, WHERE, WHAT)
(   1,<2023-06-05 14:39:51.26 +0400>,<she>,<DPX200>,
      <created by zg, POWCHK disabled, PULCHK disabled
       configuration hash MD5:
       00 E9 B6 7A A2 85 ED C7 34 08 36 98 17 FE 4E 26
       data hash MD5: 32K
       82 80 D9 A9 42 97 9A 19 84 74 30 7C 43 E8 2E 7D>)
(   2,<2023-06-05 14:39:55.59 +0400>,<she>,<DPX200>,
      <Start of raw data processing
       efp BC_mod = 2 LB = 1 FT_mod = 6 PKNL = 1 PHC0 = -10694.88 PHC1 = 49.88486 SI = 64K 
       data hash MD5: 64K
       F1 1D 40 5B CD 15 0D FE 70 08 30 C5 87 A0 93 42>)
(   3,<2023-06-05 14:40:59.03 +0400>,<she>,<DPX200>,
      <pk PHC0 = 29.37396 PHC1 = -72.2 
       data hash MD5: 64K
       64 A0 F0 75 A9 21 09 47 F0 FE 1D 3C AE 6B EA EF>)
(   4,<2023-06-05 14:41:04.81 +0400>,<she>,<DPX200>,
      <abs ABSG = 5 
       data hash MD5: 64K
       14 14 44 72 63 25 5A 15 B9 81 57 83 07 F7 42 1D>)
$$ ##END=
$$ 
$$ hash MD5
$$ 32 C6 AD 46 68 7B 85 FF 32 35 56 EC 55 26 B0 D5
##$RELAX= 
##$RELAX= 
##$RELAX= 
##$RELAX= 
##$RELAX= 
##$RELAX= 
##$RELAX= 
##$RELAX= 
##$RELAX= 
$$ Bruker specific parameters
$$ --------------------------
##$DU= <F:/spectra>
##$EXPNO= 1
##$NAME= <P31>
##$PROCNO= 1
##$TYPE= <nmr>
##$USER= <she>
##$AMP= (0..31)
100 100 100 100 100 100 100 100 100 100 100 100 100 100 100 100 100 100 
100 100 100 100 100 100 100 100 100 100 100 100 100 100 
##$AQSEQ= 0
##$AQ_mod= 1
##$AUNM= <au_zg>
##$AUTOPOS= <>
##$BF1= 81.014009
##$BF2= 200.13
##$BF3= 200.13
##$BF4= 200.13
##$BF5= 200.13
##$BF6= 200.13
##$BF7= 200.13
##$BF8= 200.13
##$BYTORDA= 1
##$CFDGTYP= 0
##$CFRGTYP= 5
##$CHEMSTR= <none>
##$CNST= (0..31)
1 1 145 1 1 1 1 1 1 1 1 1 1 1 1 1 1 1 1 1 1 1 1 1 1 1 1 1 1 1 1 1 
##$CPDPRG= <waltz16>
##$CPDPRG1= <>
##$CPDPRG2= <waltz16>
##$CPDPRG3= <>
##$CPDPRG4= <mlev>
##$CPDPRG5= <mlev>
##$CPDPRG6= <mlev>
##$CPDPRG7= <mlev>
##$CPDPRG8= <mlev>
##$CPDPRGB= <>
##$CPDPRGT= <>
##$D= (0..31)
0 1 0 0 0 0 0 0 0 0 0 0.03 2e-05 3e-06 0 0 0 0 0 0 0 0 0 0 0 0 0 0 0 0 
0 0 
##$DATE= 1685961590
##$DBL= (0..7)
120 120 120 11 120 120 24 19 
##$DBP= (0..7)
150 150 150 150 150 150 150 150 
##$DBP07= 0
##$DBPNAM0= <>
##$DBPNAM1= <>
$$ [...]
##$SUBNAM3= <"">
##$SUBNAM4= <"">
##$SUBNAM5= <"">
##$SUBNAM6= <"">
##$SUBNAM7= <"">
##$SUBNAM8= <"">
##$SUBNAM9= <"">
##$SW= 501.771253377433
##$SWIBOX= (0..15)
0 1 3 0 0 0 0 0 0 0 0 0 0 0 0 0 
##$SW_h= 40650.406504065
##$TD= 32768
##$TD0= 1
##$TE= 0
##$TE2= 300
##$TE3= 300
##$TEG= 300
##$TL= (0..7)
0 120 53 12 22 120 120 120 
##$TP= (0..7)
150 150 150 150 150 150 150 150 
##$TP07= 0
##$TPNAME0= <>
##$TPNAME1= <>
##$TPNAME2= <>
##$TPNAME3= <>
##$TPNAME4= <>
##$TPNAME5= <>
##$TPNAME6= <>
##$TPNAME7= <>
##$TPOAL= (0..7)
0.5 0.5 0.5 0.5 0.5 0.5 0.5 0.5 
##$TPOFFS= (0..7)
0 0 0 0 0 0 0 0 
##$TUNHIN= 0
##$TUNHOUT= 0
##$TUNXOUT= 0
##$USERA1= <user>
##$USERA2= <user>
##$USERA3= <user>
##$USERA4= <user>
##$USERA5= <user>
##$V9= 5
##$VALIST= <valist>
##$VCLIST= <CCCCCCCCCCCCCCC>
##$VD= 0
##$VDLIST= <DDDDDDDDDDDDDDD>
##$VPLIST= <PPPPPPPPPPPPPPP>
##$VTLIST= <TTTTTTTTTTTTTTT>
##$WBST= 1024
##$WBSW= 4
##$XGAIN= (0..3)
0 0 0 0 
##$XL= 0
##$YL= 0
##$YMAX_a= 7418
##$YMIN_a= -7495
##$ZGOPTNS= <>
##$ZL1= 120
##$ZL2= 120
##$ZL3= 120
##$ZL4= 120
##$ABSF1= 248.5645
##$ABSF2= -253.2056
##$ABSG= 5
##$ABSL= 3
##$ALPHA= 0
##$AQORDER= 0
##$ASSFAC= 0
##$ASSFACI= 0
##$ASSFACX= 0
##$ASSWID= 0
##$AUNMP= <proc_1d>
##$AZFE= 0.1
##$AZFW= 0.5
##$BCFW= 0
##$BC_mod= 2
##$BYTORDP= 0
##$COROFFS= 0
##$CY= -3
##$DATMOD= 1
##$DC= 0
##$DFILT= <>
##$DTYPP= 0
##$F1P= 0
##$F2P= 0
##$FCOR= 1
##$FTSIZE= 65536
##$FT_mod= 6
##$GAMMA= 0
##$GB= 0
##$INTBC= 1
##$INTSCL= 6.047779e-11
##$ISEN= 30
##$LB= 1
##$LEV0= 0
##$LPBIN= 0
##$MAXI= 10000
##$MC2= 0
##$MEAN= 0
##$ME_mod= 0
##$MI= 50
##$NCOEF= 0
##$NC_proc= -5
##$NLEV= 6
##$NOISF1= 182.463
##$NOISF2= 159.3651
##$NSP= 0
##$NTH_PI= 0
##$NZP= 0
##$OFFSET= 248.5645
##$PC= 4
##$PHC0= -10665.51
##$PHC1= -22.31514
##$PH_mod= 1
##$PKNL= yes
##$PPARMOD= 0
##$PSCAL= 0
##$PSIGN= 0
##$REVERSE= no
##$SF= 81.0140089999694
##$SI= 65536
##$SIGF1= 159.3651
##$SIGF2= -187.1042
##$SINO= 113.3802
##$SIOLD= 16384
##$SREGLST= <1H.CDCl3>
##$SSB= 0
##$STSI= 65536
##$STSR= 0
##$SW_p= 40650.406504065
##$SYMM= 0
##$S_DEV= 0
##$TDeff= 32768
##$TDoff= 0
##$TI= <>
##$TILT= no
##$TM1= 0
##$TM2= 0
##$TOPLEV= 0
##$USERP1= <user>
##$USERP2= <user>
##$USERP3= <user>
##$USERP4= <user>
##$USERP5= <user>
##$WDW= 1
##$XDIM= 65536
##$YMAX_p= 132699461
##$YMIN_p= -212312852
$$ End of Bruker specific parameters
$$ ---------------------------------
##NTUPLES= NMR SPECTRUM
##VAR_NAME=  FREQUENCY,     SPECTRUM/REAL,   SPECTRUM/IMAG
##SYMBOL=    X,             R,               I
##VAR_TYPE=  INDEPENDENT,   DEPENDENT,       DEPENDENT
##VAR_FORM=  AFFN,          ASDF,            ASDF
##VAR_DIM=   65536,         65536,           65536
##UNITS=     HZ,            ARBITRARY UNITS, ARBITRARY UNITS
##FACTOR=    0.620285442955139, 1,           1
##FIRST=     20137.2065510682, 0,            0
##LAST=      -20513.1999529968, 0,           0
##MIN=       -20513.1999529968, -212312852,  0
##MAX=       20137.2065510682, 132699461,    0
$$ Real data points
##PAGE= N=1
##DATA TABLE= (X++(R..R)), XYDATA
$$ [...]
##PAGE= N=2
##DATA TABLE= (X++(I..I)), XYDATA
13437h2701p0849n8036k70101r8200K17581r2613p23681n36756M91042J050097
13427a74217N27748j63425k19340m2632j29679j54692R8665O4740m91315p28113
13417a412260m5554P40513N70667k08465m25674J60625O93010N36776o9940n55876
13407a6178n85887j99113K27856L36362K66354L73262M35771p7706q13728o94103
13397g47110L03437P66237K4p30679k29210O00628K66843p50925p90973K25264
13387a086464P81911L40940l1372K17234K64480l11884o08543m9676M75723R8682
13377I1031n74136n28600O1447L68574L18091L87912N15808K53844k73585m95244
13367A25142l35234k42137l48879k96315Q9901M99301N63505K09553l57240p05155
$$ plain form
13437 -82701 -153550 -211586 -481687 -579887 -362306 -454919 -1178600 -1715356 -1224314 -174217
13427 -174217 353531 190106 -29234 -71866 -201545 -356237 -257572 -192832 -684147 -1412260
13417 -1412260 -1457814 -717301 -146634 -355099 -780773 -620148 72862 609638 539698 -16178
13407 -16178 -602065 -801178 -573322 -236960 29394 402656 838427 760721 -53007 -747110
13397 -747110 -443673 322564 322588 -408091 -637301 -36673 230170 -520755 -1311728 -1086464
13387 -1086464 -304553 36387 5015 222249 486729 174845 -433698 -483374 -7651 91031
13377 91031 -483105 -1011705 -950258 -581684 -263593 124319 640127 893971 620386 125142
13367 125142 -210092 -452229 -801108 -1097423 -1007522 -508221 55284 264837 -92403 -797558
13357g97558l91198M76142J076220P47621j18446n59028l10981j7449j44261l35377
13347c74315j14247L02284L55466L1227j18232J74570M53323J54407n76662r80665
13337f92844n77401K72547P87329N79419p4286o28236p27425l47023K67801P33188
13327d06931P61295L75301j29639m29963l61167J4137M02595M63077J74287p5144
13317G87848L4781K92258K30627k09132o05282o22979l30691N6156L82394M42462
13307D58442P4834m50717n24245L7034O20438N68849N6980k15501n5307M7083
13297F17890j74356k72477J24225M97307P7798q39849j028701m0760R69013P73660
13287G03750j45127l24177M31055P53201j05978j052682q30332J02217M26637
$$ plain form
13357 -797558 -1188756 -712614 363606 1111227 992781 433753 122772 105323 -38938 -374315
13347 -374315 -488562 -186278 169188 200415 82183 256753 710076 864483 287821 -692844
13337 -692844 -1270245 -997698 -210369 369050 294764 -333472 -1060897 -1407920 -1140119 -406931
13327 -406931 354364 729665 600026 170063 -191104 -176967 225628 688705 862992 787848
13317 787848 822629 1114887 1345514 1136382 531100 -91879 -422570 -366414 15980 458442
13307 458442 533276 82559 -441686 -404652 215786 784635 841615 626114 570807 617890
13297 617890 443534 171057 295282 792589 870387 30538 -998163 -1038923 -69910 703750
13287 703750 558623 234446 665501 1418702 1312724 260042 -570290 -468073 -41436
13278d1436n029k30586R9155L38748J36695r0807j15906k35117m12682j44777
13268g01742M82300O33122O7860l66533j33088J36746j22313l57200q662K88187
13258h1323k00414p89671l51278O99577R09038P8018m90072j23779L48870K40412
13248B39378P5949L56483N08288j2686n51616k48250M85098N57128j50252p35445
13238E24075o56511k41311R1246L08359M42380M46197L93841L21780m836o23325
13228A001895r15459l65019M07353L00268n62008q13486J68598J260331J148140
13219A630613Q0661o80149n89417j90339o8829k05095l04646k14413J8467J90548
13209c32599J17222o8579m9116J07222k3852l87114l05510L64823O91719L7195
$$ plain form
13278 -41436 -46465 -277051 -177896 160852 297547 206740 90834 -144283 -556965 -701742
13268 -701742 -219442 413680 481540 115007 -18081 118665 -3648 -360848 -369510 -81323
13258 -81323 -281737 -1071408 -1422686 -723109 185929 263947 -226125 -349904 -1034 239378
13248 239378 315327 671810 1180098 1167412 615796 367546 852644 1409772 1259520 524075
13238 524075 -132436 -373747 -282501 25858 468238 914435 1308276 1630056 1625220 1001895
13228 1001895 86436 -278583 128770 429038 -132970 -946456 -777858 482473 1630613
13219 1630613 1711274 1031125 441708 251369 182540 -22555 -327201 -541614 -523147 -332599
13209 -332599 -215377 -283956 -333072 -225850 -249702 -636816 -942326 -577503 114216 151411
13199A51411p43643n20793K70467L26776l24612l82595M31880P94084j6305q69292
13189h82622o07461K03250M46817K82355M74615P29880K21410o65264o80637K41958
13179b35699P54934J76954n15138l19296K84391K69439k87208m57309K4889M42392
13169A38349K65595j39365k14821n6211j15954l67617l18759J31423L88749K5915
13159b62696m61458k90052M23911P62787L16341k76409l16420L9483K18688O7335
13149B21510j95921m25183m85121j42282M88193P60440K99466l53676m65329j41659
13139d39562R362o1839Q9016M35411M35871J0696k30508L4594K99047P541n95000
13128e371p84547k82423M41949P17891L82903o9722r1815K26602L23714K2246
$$ plain form
13199 151411 -592232 -1113025 -842558 -515782 -840394 -1222989 -791109 2975 -13330 -882622
13189 -882622 -1490083 -1286833 -840016 -557661 -83046 646834 868244 202980 -477657 -235699
13179 -235699 519235 696189 181051 -138245 146146 415585 128377 -328932 -304043 138349
13169 138349 403944 264579 49758 -6453 -122407 -490024 -808783 -677360 -288611 -262696
13159 -262696 -724154 -1014206 -590295 172492 488833 212424 -103996 -64513 154175 221510
13149 221510 25589 -399594 -884715 -1026997 -538804 221636 521102 167426 -297903 -439562
13139 -439562 -430200 -492039 -403023 32388 468259 478955 248447 283041 582088 589629 -5371
13128 -5371 -789918 -1072341 -630392 87499 470402 400680 308865 535467 859181 881427
13118H81427k56495k87536m12558p24491n90955L16629J128180Q23749k33495
13109F44455p96441m90857m2097Q4224J56498K83777J54027j55186j13273K68652
13099f221L15294j71456n54939m37508j88945q1011J76914O26882O94482J43540
13089E17032l98434l69088J0081L63095O91911Q40843L47924n91742r30526k25064
13079B56032N85692N95592K06678J17447o593o98088j320977r11535J06819M52868
13069f16065j4548k03155L42651Q04973N31338m9981l06831k45453j03297R0659
13059B30291J90853r9248n84905n88931K8297N13138L00839j68723k22357J8956
13049c81790K1077j58531L127M98194O51990J35683m61714m27216P2686K56855
$$ plain form
13118 881427 624932 337396 -75162 -799653 -1390608 -1073979 54201 877950 644455
13109 644455 -151986 -642843 -684940 -600716 -444218 -160441 -6414 -161600 -274873 -6221
13099 -6221 309073 137617 -417322 -854830 -1043775 -1124786 -947872 -320990 373492 517032
13089 517032 118598 -250490 -240409 122686 814597 1655440 2003364 1411622 481096 256032
13079 256032 841724 1437316 1643994 1761441 1754848 1056760 -264217 -1175752 -1068933 -616065
13069 -616065 -630613 -833768 -491117 313856 845194 795213 488382 242929 139632 230291
13059 230291 421144 321896 -263009 -851940 -823643 -310505 -9666 -178389 -400746 -381790
13049 -381790 -360713 -519244 -516117 -17923 634067 769750 308036 -119180 -46494 210361
13039B10361j33283n02880l40888M0817J01707k4613J41443M42968K55595l46977
13029a55750m95838J13625O30025L33180k63948l04817P7111J73579n2235j07385
13019e2453l2883k80073o46109m01277M22238Q77943N14692J9496L7729J92267
13009F51570j18250o12481n78692m8503K58228N2596j50292R7347M68559L57011
12999C77093j91832m64070l7643N78584N65527r0286n44051k55903K57463J83821
12989C78703m16794p22559l04897L47213N30350J61418k49156k37680J27310L34514
12979e1578K5700m90087n42748j5172M24478K74626m7884J07398N61536N99131
12969H45400J12757k92362k84458j40556l7321K14666N22997L62769l47466q66530
$$ plain form
13039 210361 77078 -425802 -766690 -725873 -624166 -648779 -507336 -64368 191227 -155750
13029 -155750 -651588 -537963 92062 425242 161294 -143523 -66412 107167 54932 -52453
13019 -52453 -85336 -365409 -1011518 -1412795 -990557 -112614 402078 421574 459303 651570
13009 651570 533320 -79161 -657853 -706356 -448128 -395532 -545824 -448477 20082 377093
12999 377093 185261 -278809 -316452 262132 827659 737373 193322 -62581 194882 378703
12989 378703 -38091 -760650 -1065547 -718334 -187984 -26566 -275722 -513402 -386092 -51578
12979 -51578 -25878 -515965 -1058713 -1073885 -649407 -374781 -422665 -315267 246269 845400
12969 845400 958157 665795 381337 240781 203460 418126 941123 1303892 956426 89896
12959H9896o07294J3145K04657j12699l69209j96924K58433O57872O86255J71650
12949G95782o03208r33706m75563K07896L43511j546j11740K58957N90409M55908
12939E26700P0009j94717l02841l22371j74499P7599J17680r4649r1900L74417
12929a4572P57986M26425l38628o96408m29470o1427J23843L50154N45883K03397
12919H67183n91185q84140k26459M66766K38135m03495l16846M11969O54575J05200
12909C21703l08727j9675L62541K11331j55007j83686P4022L38251N61878N61465
12899A764096m01p57313o77652L41829Q62584j34864j491990j332637K34428J273050
12889H1130P38065l31446n51045N7123N35527L62765j98473o01473m50917J93972
$$ plain form
12959 89896 -517398 -504253 -299596 -412295 -781504 -978428 -719995 -62123 624132 795782
12949 795782 192574 -741132 -1216695 -1008799 -665288 -666834 -778574 -519617 70792 526700
12939 526700 596709 401992 99151 -223220 -397719 -320120 -202440 -297089 -388989 -14572
12929 -14572 743414 1169839 831211 134803 -294667 -356094 -232251 117903 663786 867183
12919 867183 275998 -608142 -834601 -367835 -129700 -533195 -850041 -438072 216503 321703
12909 321703 12976 -6699 355842 567173 412166 228480 302502 640753 1202631 1764096
12899 1764096 1763695 1006382 328730 670559 1533143 1398279 -93711 -1426348 -1191920 81130
12889 81130 819195 487749 -63296 -6173 529354 892119 693646 92173 -358744 -164772
12879a64772P13337M89432k78310p31529m52741N6474J79658o214l1399K15149
12869a0915M04579K84555j3329j84830j40533r8941k34673l36934j02840K45719
12859a88142J28093m33943o24287k5432O06383M24731j72382j73258M22156O26051
12849E89970L2155o38711o97243l14899L9186K39377L08849K09796P1472J06975
12839e3073J82203M469k47315j36269J87989J35151k77466l89530n4733J03537
12829e45037j50752k37279J15028K98757o4881l78089j02290K91709J67490k14021
12819h19365k75364j23691j49387j93808M5854K85044J59234l052K49346N97649
12809b27540M92394J45555P8801J20146j54822m00828n8048M00313O1082p40191
$$ plain form
12879 -164772 548565 1037997 759687 28158 -424583 -368109 -188451 -194665 -226064 -10915
12869 -10915 393664 678219 664890 480060 339527 240586 5913 -331021 -433861 -188142
12859 -188142 -60049 -493992 -1118279 -1143711 -537328 -112597 -284979 -458237 -36081 589970
12849 589970 622125 -16586 -713829 -1028728 -989542 -750165 -441316 -231520 -160048 -53073
12839 -53073 129130 133599 -113716 -249985 -61996 73155 -204311 -593841 -648574 -545037
12829 -545037 -695789 -933068 -818040 -519283 -584164 -962253 -1064543 -772834 -605344 -819365
12819 -819365 -1094729 -1218420 -1367807 -1561615 -1515761 -1230717 -1071483 -1074535 -825189 -227540
12809 -227540 264854 410409 489210 609356 454534 53706 -4342 395971 457053 -283138
12799b83138p18549K69981Q51328K35497o18085n70224R1583M17373K67786J40090
12789H3642J66119J31140M8216q07k02403n62240n57911Q5728O93853M70267k96307
12778E9297o49779l61420p1049j35274j94728K3365K47415K20905Q3056l5837
12768h14049k23156l58000o6682N74595Q46463L22686m55166p06810m25116j43765
12758a449000m5415P1446J72260N0633o2223K84237Q29948O87390l01722j029824
12748g92270n44366N49371Q81460J82773n27753n33127k31367j31263K7022N59832
12738e59688R68850O16558j26089l10758J35738K96349k75529q45357o34966M0584
12728f94308L51712J72946M8122K03104K77412J2687l50054m59571k62825M3445
$$ plain form
12799 -283138 -1001687 -731706 119622 355119 -262966 -833190 -741607 -324234 -56448 83642
12789 83642 249761 380901 429117 428310 225907 -336333 -894244 -808516 -114663 355604 59297
12778 59297 -590482 -951902 -1022951 -1158225 -1352953 -1329588 -1082173 -861268 -778212 -814049
12768 -814049 -1037205 -1395205 -1461887 -887292 -40829 281857 -173309 -880119 -1305235 -1449000
12758 -1449000 -1494415 -1422969 -1250709 -1200076 -1262299 -978062 -148114 539276 237554 -792270
12748 -792270 -1336636 -787265 94195 276968 -250785 -783912 -1015279 -1146542 -1119520 -559688
12738 -559688 409162 1025720 899631 588873 724611 1020960 745431 -99926 -734892 -694308
12728 -694308 -342596 -169650 -121528 81576 358988 371675 21621 -437950 -700775 -657330
12718f57330J89570j4897m21702n31626q4765M75778N66297L20034K87718M15616
12708E44693J43509m14608l70720M65504R80839L32642o78754p48244J4388L93364
12698F62613l4513m64653k83313J65124L96170M25245L31186J0821l45844l00201
12688E62635M4802P4424k54894k49748K29006L15249l86561q64995j85130Q91671
12678A76459R35829j8814o29917l04531J69394J11570j26957o8778O3398n9275
12668B48378k06100o6963J66302K18980K65386N12408O32224J89880n82938r93896
12658C83661p91278l82872j49411K0184L61990P25942O94922J37757n36510p34851
12648b70466k68067M44302P80239N20802J3982k54546j69008r555m0279j99488
$$ plain form
12718 -657330 -467760 -482657 -904359 -1435985 -1520750 -1044972 -478675 -158641 129077 544693
12708 544693 688202 273594 -97126 368378 1349217 1681859 1003105 254861 269249 662613
12698 662613 628100 163447 -119866 45258 441428 866673 1197859 1208680 862836 562635
12688 562635 607437 681861 426967 177219 406225 721474 334913 -530082 -715212 176459
12678 176459 1112288 1093474 463557 159026 328420 439990 313033 244255 307653 248378
12668 248378 42278 -24685 141617 360597 625983 1138391 1770615 1960495 1377557 383661
12658 383661 -407617 -790489 -939900 -919716 -557726 168216 863138 1000895 464385 -270466
12648 -270466 -538533 -94231 686008 1206810 1220792 966246 797238 787683 747404 547916
12638E47916k49476j40441p6577j95341l32031k31908Q7013L37357K94248j3650
12628B7110m00952o48107n63144j31722L60994N32932K90542q5316k34408k0456
12618h72527L70725N28698J78832l96113n42771r2410L06243J09300k60850j07241
12608g78114L40094K99242j62704j70463M36734P50980K89252k68033l41054l47468
12598D8466o20075n21884L53135J040687N22399n05042n67801K96499O63087J9765
12588G29236n47958k25273L20028J74216l97047n01916L7564N92007O35527K25872
12578A042256k62872n40505n76227n00330l32005M1736M79353N10968K8563k98870
12568d07933J07069P12907M86056n43393j171664o44582L64544P56592L90794
$$ plain form
12638 547916 298440 157999 81422 -113919 -445950 -677858 -590845 -253488 40760 27110
12628 27110 -373842 -1021949 -1585093 -1716815 -1355821 -822889 -532347 -617663 -852071 -872527
12618 -872527 -501802 26896 205728 -190385 -733156 -825566 -519323 -410023 -670873 -778114
12608 -778114 -438020 -138778 -301482 -471945 -35211 715769 1005021 736988 395934 48466
12598 48466 -571609 -1093493 -740358 300329 822728 317686 -250115 46384 709471 729236
12588 729236 181278 -43995 276033 450249 53202 -448714 -411150 180857 816384 1042256
12578 1042256 779384 238879 -337348 -837678 -1169683 -1127947 -648594 -137626 -109063 -407933
12568 -407933 -300864 412043 898099 354706 -816958 -1461540 -1096996 -340404 50390
12559E0390j1030K2120K10831Q3899l20265m90458j44383L09089K65407k01537
12549b25937m07975p8885K69530K16875P0879J66128J69409k69298p13781n48479
12539a351534L0473L95558M70222N35650M50676l5748n12085l95285M5353J03606
12529b63114j53711r2765K70738L37937R1445P9039K74304R7790l76134l91336
12519a25807J56064M66768J45662k73373l32427j91879J2081L54825N26451R0237
12509H28602n50571n61067j20377j82278o96125n77361K68324N80982l0506k67729
12499a308106N50338J097061K47986q53436n64374O00724Q80889N9028m92937
12490B17173j77520J71052j4879k14284K4378L04307J71233j68175k92222j33735
$$ plain form
12559 50390 39360 61480 272311 356210 35945 -454513 -598896 -289807 -24400 -225937
12549 -225937 -633912 -712797 -443267 -226392 -155513 10615 180024 -89274 -803055 -1351534
12539 -1351534 -1321061 -925503 -455281 80369 531045 495297 -16788 -412073 -366720 -263114
12529 -263114 -416825 -509590 -238852 99085 190530 269569 543873 641663 265529 -125807
12519 -125807 30257 497025 642687 369314 36887 -154992 -142911 211914 738365 828602
12509 828602 278031 -283036 -403413 -585691 -1281816 -1859177 -1590853 -1009871 -1040377 -1308106
12499 -1308106 -757768 339293 587279 -266157 -830531 -229807 651082 710110 217173
12490 217173 39653 210705 195826 -18458 5920 310227 481460 313285 21063 -112672
12480a12672J51565M18265M56069P5865n52128r01174n82523K24205Q55803P37589
12470G70864p372o39350o90451m97998m77795l17874L52888R06169M50077n40705
12460f91547o53876K93752R24950M81520j23495l7843J84982j46311n36365l09166
12450f13399J32010J39644j2706J32698J88792k77313p14772m55448J04738K34642
12440a141114P8075J32073K40738R9601K948J26712n0576o08008n40090N27933
12430a131708J169204K50297r40473n56094P61832R05201k36863p51516M427N18666
12420g027j21934q11845m75235L23202O66479O54766O42473M14815o0430j90683
12410A034581J90430L52903r0707m79031k80023J7150j19660l40998k22683j23745
$$ plain form
12480 -112672 38893 457158 913227 989092 436964 -464210 -1046733 -822528 33275 770864
12470 770864 763492 124142 -566309 -1064307 -1542102 -1859976 -1507088 -600919 -150842 -691547
12460 -691547 -1345423 -1051671 -126721 354799 231304 193461 378443 232132 -304233 -613399
12450 -613399 -481389 -341745 -354451 -221753 -32961 -310274 -1025046 -1480494 -1375756 -1141114
12440 -1141114 -1063039 -930966 -690228 -590627 -587679 -460967 -511543 -1119551 -1659641 -1131708
12430 -1131708 37496 287793 -652680 -1208774 -446942 458259 221396 -530120 -525693 -7027
12420 -7027 -128961 -940806 -1416041 -1092839 -426360 228406 870879 1285694 1225264 1034581
12410 1034581 1225011 1577914 1487207 1008176 728153 745303 625643 284645 61962 -61783
12400f1783m05707n53504K320P46156P07794p9191o12651l24201K59458L41032
12390A9723j50255n80045m09437K09378O56312N68362J60294j86085l36326k67289
12380c15368Q0135N15273N61742R6446l44401l03058l8537R574p5855m4230m4165
12369I7556k42825l59248j81663k7895q3975O5609N50454O41857m5235o13173
12359a98538k36651L77878J90175l16691k7105P23335P09837J3777k01324J51839
12349A186532P6624m42819l63759L06912L41810m38801p13563J2528N60407K25648
12339G51519j03166K06903L84044p0113k79918K95243O50206j0595p52669m90380
12329E81074J97447K20500j89453k12974j8812j85341l95669r6433K77711O2567
$$ plain form
12400 -61783 -467490 -1020994 -1018674 -272518 435276 356085 -256566 -580767 -321309 19723
12390 19723 -130532 -710577 -1120014 -910636 -254324 314038 474332 288247 -48079 -315368
12380 -315368 -235233 280040 841782 938228 593827 290769 252232 261806 185951 141721 97556
12369 97556 -145269 -504517 -686180 -714075 -798050 -732441 -181987 459870 414635 -198538
12359 -198538 -435189 -57311 132864 -183827 -210932 512403 1222240 1236017 1034693 1186532
12349 1186532 1263156 820337 456578 763490 1105300 666499 -47064 -34536 525871 751519
12339 751519 648353 855256 1239300 1169187 889269 1184512 1834718 1824123 1071454 581074
12329 581074 778521 999021 809568 596594 577782 392441 -3228 -99661 178050 240617
12319B40617l43672k37566L1241k00948m72488M3830Q48504P19613k58117p55092
12309c84078k31911M42071M89154J30796j91226m38597n46646k43955L80172P64010
12299A69790N70439M7374l79901m81488k42756R7863J57762q7730j56993K08041
12289i7599N33434L25196j12215j76698P0189J19935r3507k26620k31608l22831
12279b12324l87312j17441L41494N05952K85445M8289n514k3316q5361r9745j13470
12268A36697k95241n65139n77566j39702N27827R38026P08510m1279o58390o18580
12258e84837k02090q5437l09006k79894J59700M53588L08980J14640J00654k1470
12248c45172k26951j643N18398L75561n30355q14434L07603J460949R96028n03586
$$ plain form
12319 240617 -103055 -340621 -309380 -510328 -982816 -938986 -90482 629131 371014 -384078
12309 -384078 -615989 -173918 315236 446032 254806 -183791 -730437 -974392 -594220 169790
12299 169790 740229 787603 407702 -73786 -316542 -218679 -60917 -148647 -305640 -97599
12289 -97599 435835 761031 648816 472118 542307 662242 568735 342115 110507 -212324
12279 -212324 -599636 -717077 -375583 130369 415814 464103 458589 435273 349912 250167 136697
12268 136697 -158544 -723683 -1301249 -1440951 -913124 24902 733412 692133 33743 -584837
12258 -584837 -786927 -872364 -1181370 -1461264 -1301564 -847976 -538996 -424356 -323702 -345172
12248 -345172 -572123 -573766 -55368 320193 -210162 -1024596 -716993 743956 1739984 1236398
12238A236398j160676n71790N8948J38473K38486M95999K32464n30187p38810
12229f00695j2069O39766L88517k54842m85708l85708l41556j60451M13728R26022
12219A27004P59664Q6525l85376l52235q1793J30051K03688J32170j8284n3618
12209E47796J18978K84164J60732k00876m29591k45797K01994M37251J45072m33831
12199E85892p34057n22418j11469J39794K18412K08962M5196k20724k75648r360
12189f75420K24625J60336N5529J82670K95108R0510j74476q7018K22395L32139
12179F26398J83685l6254l21423o10736n31178J2222M20575K46583l1380J43046
12169A01538L40355p5967o20503l66653L81411M72913j63493m34233l800K07318
$$ plain form
12238 1236398 75722 -496068 -437120 -298647 -60161 435838 668302 138115 -600695
12229 -600695 -612764 27002 415519 160677 -325031 -710739 -1052295 -1212746 -799018 127004
12219 127004 886668 973193 587817 235582 153789 283840 487528 619698 601414 547796
12209 547796 666774 950938 1111670 910794 481203 235406 437400 874651 1019723 585892
12199 585892 -148165 -670583 -782052 -642258 -423846 -214884 -169688 -390412 -666060 -675420
12189 -675420 -450795 -290459 -234930 -52260 242848 333358 158882 71864 294259 626398
12179 626398 810083 773829 452406 -158330 -689508 -677286 -256711 -10128 -41508 101538
12169 101538 441893 365926 -254577 -621230 -239819 233094 69601 -364632 -368432 -161114
12159a61114k13029l96885J92505P27582M19806j92136k80724o9743j36329k17307
12149c27374J83167O22967L03939n45186r16809m64843J95878M95708M18919J06821
12139G3187l09474n17225k93154P2179J47929K7169P1564J89523K6909k58104
12129g69497j40537L63202O42424M21960P7788q8629k15474l31972j32316L72855
12119A99804N92353J80458l67386m27284j47443r9615l38057m03258j18342J92067
12109g36703K63570J75300L2264j75779l07920j06363L38151N50563L19281K6399
12099C78763O3144K36199J08741k92732n07431k85139J32685L53408K12668j45412
12089B54894l78636k28477J43948K75332L4858j45200M1414K38208O4156j02050
$$ plain form
12159 -161114 -374143 -771028 -578523 149059 568865 376729 96005 26262 -110067 -327374
12149 -327374 -144207 478760 782699 237513 -679296 -1144139 -948261 -452553 -33634 73187
12139 73187 -236287 -753512 -1046666 -974487 -826558 -799389 -727825 -538302 -511393 -769497
12129 -769497 -910034 -546832 95592 517552 595340 506711 291237 -40735 -173051 199804
12119 199804 792157 972615 605229 177945 30502 -69113 -407170 -810428 -928770 -736703
12109 -736703 -473133 -297833 -265569 -441348 -749268 -855631 -517480 33083 352364 378763
12099 378763 441907 678106 786847 494115 -13316 -298455 -165770 187638 400306 254894
12089 254894 -123742 -352219 -208271 67061 101919 -43281 -1867 236341 300497 198447
12079A98447K80697P91101M89942m92576q87418j54302O04004K48829p19443r73975
12069f14694k74909M03213L79200j7476j90084K0031M20886O79463M36323k71754
12059I70199p62711m37328L08792N21967K4278l81344j49187K80191K75233q5829
12049E64261l23705k95464j69300O43K24052L25349J64846l6119K4718K19094
12039F98375J32646l01868o75145o64701m05781j67910M4907L30336N41632M55501
12029a2008K11324J84236L52241K23876l54368p39621l15974N00145P02940P7085
12019H29876n30627m33049O2796L27871L08824K98072K80797O6428k21036l16682
12009F73270k95172l97670n16150l21579J46614M33550K35899k55371n66252l41600
$$ plain form
12079 198447 479144 1270245 1760187 1267611 380193 225891 829895 1078724 359281 -614694
12069 -614694 -889603 -486390 -107190 -124666 -314750 -294719 126167 805630 1241953 970199
12059 970199 207488 -229840 78952 600919 625197 243853 94666 374857 650090 564261
12049 564261 240556 -54908 -224208 -223565 487 325836 490682 454563 479281 698375
12039 698375 831021 529153 -145992 -810693 -1216474 -1384384 -1339477 -1009141 -467509 -12008
12029 -12008 199316 383552 735793 959669 605301 -134320 -450294 49851 752791 829876
12019 829876 299249 -133800 -71004 256867 565691 863763 1144560 1210988 989952 673270
12009 673270 378098 -19572 -535722 -857301 -710687 -277137 -41238 -296609 -862861 -1204461
11999a204461L17369P86757M85765l00346n91225l2888M79113O1501p74864q35741
11989a609020l1723N34586K54396k06389p3595M42538O65900M26491K9484k87073
11979A45595m24148l05380n6569Q773j27636p4439L15185N90184L76381L577n809
11968D45714K62521L51525K09229J48407J87509L6141k98347m63801l61917k51827
11958B65154j80052J17343N66602O02053n76o37316o56340k25375N5632N8005
11948c4870Q3528J87427J73293J12286K10159K34475k03354p69756o21509K83560
11938c44761Q90534M76891l34390n37325j07325K44590J94531k0005j94134k41498
11928B7108K7984N62716P74918K49804n22185p93226o20420n17601l93888J93027
$$ plain form
11999 -1204461 -887092 -100335 385430 85084 -506141 -539029 -59916 1585 -773279 -1609020
11989 -1609020 -1640743 -1106157 -851761 -1058150 -1131745 -689207 -23307 403184 432668 145595
11979 145595 -278553 -583933 -640502 -631729 -759365 -833804 -518619 71565 447946 451523 445714
11968 445714 708235 1059760 1268989 1417396 1604905 1641046 1342699 878898 516981 265154
11958 265154 85102 202445 769047 1371100 1370524 733208 76868 -148507 -92875 -34870
11948 -34870 48658 236085 409378 521664 731823 966298 762944 -6812 -628321 -344761
11938 -344761 545773 1022664 688274 150949 43624 288214 482745 462740 268606 27108
11928 27108 55092 617808 1392726 1642530 1120345 327119 -293301 -810902 -1204790 -1011763
11918a011763R27373R58918K50807l13735k71074m8510J6269J03870J77968j15329
11908F74794n37788l40596L72332M96689l35107j001818n72789L23735O43165
11899b77383M54155L53443K12753l63031r43103p80331n2866L91260K65701j0352
11889g49754j16148k2998K98361O60911N38146j39266n37845n6605O12923M79837
11879I67562j88603l64705P3730L38191J55963R315L4933j39870m26050k78476
11869A81990J98578K57761j80725l35851J8970R5503m55156p41777o0196P94150
11859b26753O29608l21278p50371j87351M68841M10295R351M5493M70476N64413
11849A112724P2377m56801n31416l57701l32400l52589j11413K25085K31837l6188
$$ plain form
11918 -1011763 -84390 874528 1125335 811600 540526 492016 508285 612155 790123 674794
11908 674794 137006 -203590 168742 665431 330324 -671494 -1244283 -920548 -277383
11899 -277383 176772 530215 742968 379937 -563166 -1343497 -1396363 -1005103 -739402 -749754
11889 -749754 -865902 -888900 -590539 70372 608518 469252 -68593 -125198 487725 967562
11879 967562 778959 414254 487984 826175 982138 991453 1026386 886516 460466 181990
11869 181990 380568 638329 457604 121753 140723 236226 -218930 -960707 -1020903 -226753
11859 -226753 402855 81577 -668794 -856145 -387304 22991 32342 77835 548311 1112724
11849 1112724 1185101 728300 196884 -160817 -493217 -845806 -957219 -732134 -500297 -536485
11839e36485j38430k962P0587J01739L51610N54456J45451o03392p02608j4227
11829g74261L95227l0412m22351k5688M91837K82034j55975O8236N74458L98006
11819H01111k45353l37831J42044K50326k18167m41673n8954L03103J90684n8507
11809C26783r6613n6048m9099L8737J24420P368j09012J05322L84174K08439k40143
11798F44328l42604j53569k76605o66402o03880K7987M70460L15018O3081J72220
11788c49966L82752L21962Q2711p8529n6727K03673N69266N29442j74623q48994
11778E80967o00092K88951O57614J41051m31253l97748m1917J72522K08542P4401
11768F53038k94432n59646k19637M97443P99396N02063J70179L2440k43576n88901
$$ plain form
11839 -536485 -674915 -677877 -607290 -505551 -153941 400515 545966 -57426 -760034 -774261
11829 -774261 -379034 -409446 -831797 -857485 -365648 -83614 -239589 -171353 403105 801111
11819 801111 555758 217927 359971 610297 392130 -49543 -108497 194606 385290 326783
11809 326783 230170 174122 125023 163760 288180 295548 186536 291858 676032 884471 644328
11798 644328 301724 148155 -128450 -794852 -1398732 -1370745 -900285 -585267 -522186 -349966
11788 -349966 32786 354748 437459 358930 302203 505876 1075142 1604584 1429961 580967
11778 580967 -19125 269826 927440 1068491 637238 239490 197573 370095 578637 653038
11768 653038 358606 -201040 -420677 76766 876162 1378225 1548404 1580844 1337268 748367
11758G48367m61063L1810P4333m49263o39731j17478K88517j5289l66549m2925
11748i49271M86162L96643j44354l71886j30764J38743K53174L90850N47182M48448
11738A064927m5021p02688j000594m90838N74861J168160O05492m31207p46654
11729c562l18043j36940m54342m32709K31052O32246J50441n08959m63496O4936
11719a239376L30654J86652l1102j29926l3469L10586O05850L96390j43407l23447
11709g0595n6280J3916k60480k13873L47126O58680L28050K7696K14061K70496
11699A258797k77996p55400m64913J07667J92455l512O9406J83814r7038l97944
11689a84664j53702K85705K13860k13350l17388q5275n3236k73348k83730O0488
$$ plain form
11758 748367 287304 319114 393447 -55816 -695547 -813025 -524508 -539797 -906346 -949271
11748 -949271 -463109 -66466 -210820 -582706 -713470 -574727 -321553 69297 616479 1064927
11738 1064927 1019906 317218 -683376 -1174214 -599353 568807 1174299 743092 -3562
11729 -3562 -321605 -458545 -912887 -1345596 -1114544 -482298 -331857 -840816 -1304312 -1239376
11719 -1239376 -908722 -722070 -753172 -883098 -916567 -605981 -131 396259 252852 -70595
11709 -70595 -126875 -112959 -373439 -587312 -240186 418494 746544 774240 988301 1258797
11699 1258797 980801 225401 -239512 -131845 60610 57098 126504 310318 213280 -184664
11689 -184664 -338366 -52661 161199 -52151 -369539 -454814 -508050 -781398 -1065128 -1004640
11679a004640M52425O56528N98207K05390l29285m89005j24855K16572J15452
11670B96789r9178l6151O6828q5619k11738k1022J89241J35775J13987L22395
11660F71307L16057j64087n36343l16746J9869p1636k33686k2337J20983k34394
11650d51013m44140J45428P75669L27308p23202r04236k4645O54563M56385M4721
11640a43162O268J2840k58890m74904l30632o0120O6951R2897M9255q3849m9945
11629a173291L84345Q14086O07894p0492m13266j62251J23834N1471j42828k26080
11619b06578l10062l81273j78054K51443M55789K28329j45566l71253l88179j45455
11609a190859L09154N55841K42784k30673j55035L72122N33575O7822l69597l21920
$$ plain form
11679 -1004640 -552215 104313 702520 907910 578625 89620 -35235 181337 296789
11670 296789 197611 161460 228288 142669 -69069 -90091 99150 234925 348912 671307
11660 671307 987364 823277 286934 -29812 -9943 -81579 -315265 -337602 -216619 -451013
11650 -451013 -895153 -749725 25944 353252 -369950 -1274186 -1298831 -644268 -187883 -143162
11640 -143162 -136894 -124054 -382944 -857848 -1188480 -1248600 -1181649 -1088752 -1039497 -1123346 -1173291
11629 -1173291 -788946 25140 633034 562542 149276 -12975 110859 162330 19502 -206578
11619 -206578 -516640 -897913 -1075967 -824524 -368735 -140406 -285972 -657225 -1045404 -1190859
11609 -1190859 -881705 -325864 -83080 -313753 -468788 -96666 436909 504731 135134 -186786
11599a86786j68669k80334l14418J06484O23193O55220K59671j03765l19295n19403
11589b48102n03908L6187P45165P59482j16715r43068p77114Q1684N29522J78572
11579b58295k20280K716M57342L77302j92618n10785k14560L18587N95019M51292
11569H05720n6404o70422q80452l98280L29805N98725L61746J12297j0606k75040
11559h2911n80292m55273R1501N06552N70230N65133N24107J89353k14303j54215
11549I59882J40072j24253q29391q91665n0098N74488K75312j64608N2892M15644
11539C58275J92445k34218j82884Q5814J0552j64765K9048K80631P2216l44849
11529A02265m58453l73304l49505j50665L07421M12604j37166n58103j63691M64446
$$ plain form
11599 -186786 -355455 -635789 -950207 -843723 -220530 434690 694361 590596 271301 -248102
11589 -248102 -752010 -715823 29342 788824 672109 -270959 -1048073 -966389 -436867 -258295
11579 -258295 -478575 -475859 -18517 358785 166167 -344618 -559178 -240591 354428 805720
11569 805720 749316 78894 -801558 -1199838 -870033 -271308 90438 202735 192129 -82911
11559 -82911 -663203 -1118476 -1026975 -520423 49807 614940 1139047 1328400 1114097 959882
11549 959882 1099954 975701 146310 -745355 -795453 -220965 54347 -110261 -57369 358275
11539 358275 550720 316502 133618 219432 229984 65219 94267 374898 447114 102265
11529 102265 -356188 -729492 -1078997 -1229662 -922241 -509637 -646803 -1204906 -1368597 -904151
11519i04151M84811J53303R7846Q5572k83614m69049R9348P30849M90831j44510
11509C41236j08196L71021K65977l12006l13884L25761N48728n3681p11227p77542
11499d23813l95732J21088N39902M80056r7847m66240j29681K66885O3437j39515
11489a81460L43539O91456j18714j157121p54877N98975Q59422k16105p24950
11480f59835J19122Q07713K92580l47384l1502M84261J49670n69995p04715l52821
11470h12906q3895J50200M52148L28070l82575q27267l59845L69389M41512K7891
11460f97278j31166R9083L93590O27503O71921K07418n76372q10460j75073M35408
11450D4574K16625l28359l25375J9742q6951n80594o42632m6402N26983N19625
$$ plain form
11519 -904151 -419340 -266037 -168191 -82619 -366233 -835282 -735934 -5085 485746 341236
11509 341236 233040 604061 870038 558032 244148 569909 1118637 1064956 353729 -423813
11499 -423813 -819545 -698457 -158555 321501 223654 -242586 -372267 -105382 -41945 -181460
11489 -181460 162079 853535 734821 -422300 -1177177 -578202 281220 65115 -659835
11480 -659835 -540713 267000 559580 212196 180694 664955 814625 244630 -460085 -812906
11470 -812906 -896801 -746601 -294453 33617 -348958 -1176225 -1536070 -1166681 -725169 -697278
11460 -697278 -828444 -729361 -335771 291732 963653 1171071 594699 -215761 -390834 44574
11450 44574 261199 -67160 -392535 -372793 -459744 -1040338 -1682970 -1729372 -1202389 -682764
11440f82764J52466l5354J44011L94698K69643l13545q38515p04393O344O24188
11430i83221P47567N29996J44820l77706p03759l65187L74273N93751K4150m66633
11420d81949j71206L97710L74392j32390l34440j5650K70175J25023k02436k97543
11410d68314j13874J02548J94269K45947L61787L86111O8004m19117m81529O3634
11400f0534N25859K09216n49289q27019l96330J30740L20255L46345M08793M14840
11390E22876L06734J28679k06467o49763o87138m852P01170M84937l68660o40574
11380d13058K012N79787M12297L5866Q6795L02620K26703K7971m0151k43351p21150
11369B56341q76792j94689P70438R92693L31951l80400n21342l44467l62160n03074
$$ plain form
11440 -682764 -530298 -565652 -421641 -26943 242700 -70845 -909360 -1613753 -1607409 -983221
11430 -983221 -235654 294342 439162 61456 -642303 -1007490 -633217 -39466 -15316 -481949
11420 -481949 -653155 -255445 118947 -13443 -347883 -363533 -93358 31665 -170771 -468314
11410 -468314 -582188 -479640 -285371 -39424 322363 708474 776478 357361 -124168 -60534
11400 -60534 465325 674541 125252 -701767 -1098097 -967357 -647102 -300757 108036 522876
11390 522876 829610 958289 751822 102059 -585079 -589931 111239 596176 227516 -413058
11380 -413058 -411046 168741 581038 616904 703699 1006319 1233022 1260993 1220842 977491 256341
11369 256341 -620451 -815140 -44702 947991 1279942 899542 378200 33733 -328427 -831501
11359h31501k41191M88933R05980L20438p03765q43922J36956Q96091M12297m98082
11349D2234m93014K31594M54520J971j68738K09106L29187j04913l51004l8297
11339A12646J97488l9631k18292J2092J30261k17681m96687k77293l7138k41265
11329a075500m32436k5423O34465P78916L24287j72365l06840r0199K42992L41576
11319B19473J7045l76651l06373Q1287R4469l68490n84756j70152L17629L08818
11309g67701R627j44558j22011J8092L76879P58371O58997J01601k43388j39576
11299E06333j60741n38846n67940J71403Q60818N83178k59235n89250k25618J10368
11289a09530K2388k16554l65953m55650l85220O009M47474M28012k9749l07359
$$ plain form
11359 -831501 -1072692 -583759 322221 642659 -61106 -905028 -768072 128019 540316 42234
11349 42234 -450780 -219186 235334 237305 68567 277673 606860 501947 150943 112646
11339 112646 310134 270503 52211 64303 194564 -23117 -519804 -797097 -834235 -1075500
11329 -1075500 -1507936 -1533359 -898894 -119978 204309 31944 -274896 -365095 -122103 219473
11319 219473 236518 -140133 -446506 -365219 -270750 -639240 -1223996 -1394148 -1076519 -767701
11309 -767701 -758074 -902632 -1024643 -1006551 -629672 128699 787696 889297 645909 506333
11299 506333 345592 -193254 -761194 -589791 271027 854205 594970 5720 -219898 -109530
11289 -109530 -87142 -303696 -669649 -1125299 -1510519 -1504510 -1057036 -629024 -658773 -966132
11279i66132p5013J91219j17281p88091r23622j20963Q32640Q44823k4893n77046
11269a724359q7835P46244R00358M17103L0324q2008k83515n29599l88781P0575
11259i31493K80072O6531j96958k98498l23595j80639K34335N09720J97267k82502
11249i25760j35318M67501N63880l0312l98557k978N22026M41944n5457l51464
11239I5505k62802k2020J41255J38378O6289J43985L16013J71031l32358n22060
11229f6784k0096M68678K11004l19744l05362m8590k82796n89268o7156P98272
11219b21842O77819l22138p12644m1498N18643K66525q5556k255j372l53203l98342
11208f75863J81346O94346O04132K11277j82366n86919o13624J57449R42405M77729
$$ plain form
11279 -966132 -1041145 -849926 -967207 -1755298 -2678920 -2799883 -1967243 -1122420 -1147313 -1724359
11269 -1724359 -1812194 -1065950 -165592 251511 281835 199827 -83688 -613287 -1002068 -931493
11259 -931493 -651421 -584890 -781848 -1080346 -1403941 -1584580 -1350245 -840525 -643258 -925760
11249 -925760 -1061078 -593577 -29697 -60009 -458566 -461544 60482 502426 446969 95505
11239 95505 -167297 -189317 -48062 90316 156605 300590 616603 787634 455276 -66784
11229 -66784 -86880 381798 592802 273058 -32304 -80894 -363690 -952958 -1020114 -221842
11219 -221842 455977 133839 -578805 -620303 -101660 164865 79309 77054 75682 -277521 -675863
11208 -675863 -494517 199829 803961 1015238 832872 245953 -367671 -210222 732183 1209912
11198A209912q04486j097766n3928O49379J14026m72047j61633J97024j25197
11189e44716k27620O00797J268311O51070m60238p47861m48202m89068o47803
11180a045330j59420O80140R80440O72684K55346j91448o64510o63693p859N12067
11170C68417K59818k40961l14667k48676m53320m58644J71219P72331N42213j41744
11160B55986l90466j50516L3581m863j10771k36797k03727K56683P48917M29145
11150F27172n57696r58322k63999N28603N95519L89559L88594J82801l59070m70557
11140A02604L6920J42495n54245q90070j20743O97122N29201M0917J28010K84810
11130C97021j16790l83542J22824N54552J05384l88997j0608M44563k1275o23009
$$ plain form
11198 1209912 405426 -692340 -746268 -96889 17137 -454910 -616543 -419519 -544716
11189 -544716 -772336 -171539 1096772 1747842 1287604 539743 91541 -397527 -1045330
11180 -1045330 -1204750 -524610 455830 1128514 1383860 1192412 527902 -135791 -143650 368417
11170 368417 628235 387274 72607 -176069 -629389 -1088033 -916814 -144483 397730 255986
11160 255986 -134480 -284996 -251415 -256278 -367049 -603846 -807573 -550890 198027 627172
11150 627172 69476 -888846 -1152845 -624242 -28723 360836 749430 932231 573161 102604
11140 102604 139524 282019 -272226 -1162296 -1283039 -585917 -56716 -15799 112211 397021
11130 397021 280231 -103311 19513 574065 679449 290452 279844 724407 703132 80123
11120H0123k09565N41002L27611m28183m57374N5400N8137k83386p6138M18692
11110B6319L23233p4131O0397L41749j01209p45551m48920M22118N58615l1017
11100C31603k22995J09099N2177m92508o65625k40898J77132L65535N10475L58508
11090B82503k97527p29987k47804M78074M53674O3615K15157N01849n5308j023285
11080c59039j108545k75032L83910M99510N33896M67417K128l51227K1976N01324
11070C16318J37979o41571p83313m00477k06842O1794Q60569J274503K68523j161195
11060b73712j189128J6253P55074N54738L11273J77116m02823r08435l29358O96443
11050e92559O21799l26641n22061J71773L00700m17927o81834q6006L53328L37691
$$ plain form
11120 80123 -129442 411560 739171 310988 -146386 -90986 -32849 -316235 -392373 26319
11110 26319 349552 275421 335818 677567 576358 -169193 -618113 -195995 362620 331603
11100 331603 108608 217707 269884 -222624 -888249 -1129147 -952015 -586480 -76005 282503
11090 282503 -15024 -745011 -992815 -514741 -61067 2548 217705 719554 664246 -359039
11080 -359039 -1467584 -1742616 -1358706 -859196 -325300 142117 144245 -206982 -185006 316318
11070 316318 454297 -187274 -970587 -1371064 -1577906 -1516112 -655543 618960 887483 -273712
11060 -273712 -1462840 -1446587 -691513 -136775 174498 351614 -51209 -959644 -1289002 -592559
11050 -592559 29240 -297401 -819462 -647689 -346989 -764916 -1446750 -1532756 -1179428 -841737
11040h41737O07522R47608K99783q60667p74837N34003R85318j39235j040477
11031b82719n24929J95822l7636l74386J59742P81156M49397l19053n28932l12033
11021g93571k45873j91778J35447M15632L77404K95601K57027p4894n35259m30656
11011g90920J63701K88958l11764p28372m00115J47566M47333O95141Q58899M92170
11001H62597j83833k95593K31030M85979J13123k51540k80013l35704m00934o1236
10991a16124L08349j13111r28657q60321Q6475N70756K43080J93714P17770O96126
10981G98057j77700o04124L7947N39143j0562p23680o36582k86827m08237n22714
10971a995279l0009N55768N69253K96285J82608J9200k75315j73024M09659O91642
$$ plain form
11040 -841737 -234215 713393 1013176 152509 -622328 -88325 896993 757758 -282719
11031 -282719 -807648 -611826 -649462 -1023848 -864106 -82950 366447 47394 -481538 -793571
11021 -793571 -1039444 -1231222 -1095775 -680143 -302739 -7138 249889 174995 -360264 -790920
11011 -790920 -627219 -338261 -650025 -1378397 -1778512 -1630946 -1183613 -488472 370427 862597
11001 862597 678764 383171 614201 1100180 1213303 961763 681750 346046 -54888 -116124
10991 -116124 192225 79114 -849543 -1709864 -1623389 -1052633 -809553 -615839 101931 798057
10981 798057 620357 16233 54180 593323 582761 -140919 -777501 -1064328 -1472565 -1995279
10971 -1995279 -2025288 -1469520 -900267 -603982 -421374 -402174 -677489 -850513 -440854 250788
10961B50788L28989j2091M6998j628l04272k12458K88569K39620m80318o03703
10951d59506L68651J069814M21569o20396p16496j81347l9965k21414o8991K86042
10941a62039L35151J95826J24661j71578p52013q40074k8578P55519N30696k72484
10931b84913o33526m72607l30677k18859J44999M92234L90896P2808M8118K74894
10921e16633L97432L95371L87665K25383j72042m95324m99012l35661j38286J71539
10911e79568M21197K29943k24983k68381J49893K52881k64110o32820k25176M53502
10901f87622N81527J68411j77983j11436K65193O23463N40862j24136q30662q44298
10891e96681k00463L73348M68339K88642K8207k95633m47797j76019K56856M33361
$$ plain form
10961 250788 579777 567686 614684 613056 308784 96326 384895 624515 144197 -459506
10951 -459506 -90855 978959 1400528 780132 63636 -117711 -157676 -379090 -448081 -162039
10941 -162039 173112 368938 493599 322021 -429992 -1270066 -1298644 -543125 -12429 -284913
10931 -284913 -918439 -1391046 -1721723 -1940582 -1795583 -1303349 -912453 -839645 -791527 -516633
10921 -516633 -119201 276170 663835 889218 717176 221852 -277160 -612821 -751107 -579568
10911 -579568 -158371 71572 -153411 -421792 -271899 -19018 -283128 -915948 -1141124 -687622
10901 -687622 -106095 62316 -115667 -227103 38090 661553 1202415 1078279 247617 -596681
10891 -596681 -797144 -423796 44543 333185 361392 65759 -382038 -558057 -301201 132160
10881A32160M60393N56473L60468m18228j097202q68831j53463O9201j34354K704
10871a090679M11376L97862L3668r0195j07389m01007m02406M50923J114171K68243
10861E84567j182373j154839K98377J076461M23344k25475m8536j75n84289q08368
10851a621306j70278L77777K51146J20403K86084O0009n69130n67401J78005M47739
10841a206952r3562k54597M07045P27895J76900j32940L64716N36806k90960r54402
10831g20051m59628L71387M88872K57323L39604M14531J03872j69402j67681l53877
10821A04950p06762m73599K78176M56240j30010l68691N9740R4684n38700o17418
10811a841390K95813Q99236M19650j64740j17172j30506n47149m77102K64088
$$ plain form
10881 132160 592553 1149026 1509494 1091266 -5936 -874767 -1028230 -959029 -1093383 -1090679
10871 -1090679 -679303 -281441 -247773 -337968 -445357 -846364 -1248770 -797847 316324 584567
10861 584567 -597806 -1752645 -1454268 -377807 45537 -179938 -228474 -228649 -812938 -1621306
10851 -1621306 -1791584 -1413807 -1162661 -1042258 -756174 -696165 -1265295 -1832696 -1654691 -1206952
10841 -1206952 -1300514 -1555111 -1148066 -420171 -243271 -376211 -11495 525311 234351 -720051
10831 -720051 -1179679 -808292 -319420 -62097 277507 692038 795910 626508 458827 104950
10821 104950 -601812 -1075411 -797235 -340995 -471005 -839696 -779956 -685272 -1223972 -1841390
10811 -1841390 -1545577 -646341 -226691 -391431 -508603 -639109 -1186258 -1663360 -1399272
10802a399272M56958k07164l27955N35859P68793l53523j049061m4648J125793
10793d94220P73094j46426n054O31535L60817m33379n36491j60688j76859k70733
10783d58404K04047O38214K47492l21603j66588J69868j74176o43896l19428L25151
10773d99323L42282K6059J45683L95697J25863k64720j16531J41797j91437p13728
10763f08358o36010j46848P3595q305p3206j17172o9995L65452Q91287P09807
10753C80247m7552k77641K22694L61773k26866m90066L4570L35027j30779m55125
10743b93718j26093L6959k95523j91919N15702N38822m33516q04886J45713P94735
10733a13724j4125q98977m15100M57246K18746n52437m82176K08513M37052J42746
$$ plain form
10802 -1399272 -942314 -1149478 -1477433 -941574 -172781 -526304 -1575365 -1620013 -494220
10793 -494220 278874 132448 127394 758929 1119746 686367 149876 -10812 -187671 -458404
10783 -458404 -254357 383857 631349 309746 143158 313026 138850 -505046 -824474 -499323
10773 -499323 -157041 -130982 14701 410398 536261 271541 155010 296807 105370 -608358
10763 -608358 -1244368 -1391216 -1317621 -1325926 -1399132 -1516304 -1586299 -1220847 -329560 380247
10753 380247 332695 55054 277748 639521 412655 -77411 -42841 292186 161407 -293718
10743 -293718 -419811 -382852 -678375 -870294 -354592 184230 -249286 -1054172 -908459 -113724
10733 -113724 -127849 -1026826 -1441926 -984680 -765934 -1318371 -1800547 -1592034 -1154982 -1012236
10723a012236j19523k95983l13641K58802J035690Q28767k86904p09122M4176
10714e69974M98322m1121k67880M53506P03145k64290r03787j53471N99014J21282
10704A74746m40147J36285Q41268M24676l54066l93361k32454n77439p64108l27972
10694a512572j25895m34947j27456Q97292R74761k06665n76524O11533J140347
10685F39874j75898j134409j21422Q55093j19366j282314m67444R28066O24202
10676b53618m66450l16138L64591j28230r25699k81365R16978P29035k85678l08325
10666i54899L94032M04808J9779K73782N37431j35695p43487j04271O85517K13922
10656E90919n20704n8676O08383o9546j073691n31631Q99637J205116K74500n73228
$$ plain form
10723 -1012236 -1131759 -1427742 -1741383 -1482581 -446891 381876 94972 -614150 -569974
10714 -569974 -71652 -112773 -380653 72853 775998 511708 -392079 -545550 53464 174746
10704 174746 -265401 -129116 712152 1136828 782762 389401 156947 -420492 -1184600 -1512572
10694 -1512572 -1638467 -2073414 -2200870 -1303578 -328817 -535482 -1112006 -500473 639874
10685 639874 463976 -670433 -791855 63238 -56128 -1338442 -1805886 -877820 -253618
10676 -253618 -720068 -1036206 -671615 -799845 -1725544 -2006909 -1089931 -360896 -646574 -954899
10666 -954899 -560867 -156059 -136280 137502 674933 539238 -204249 -308520 376997 590919
10656 590919 70215 11539 619922 550376 -523315 -1054946 -155309 1049807 1324307 751079
10646G51079j006887j301227r90612l2227L14103l33350m14865O49441R84930
10637a379615k70009r20945M32750J561091M48176j068942o67778L98308K9925
10628a437039p19181k220J023909M71165n41371p9183Q68018M07315o02128l65164
10618i75879M43227L52895K3080L92751K94814j008274j537129L683J365664N52289
10608i2879n62356J49492J049640O9479j154727m54830O80938J38692o96944P6769
10598g96726R25095K2779q80401Q0299R38979k98183j450490k28627J185183K89857
10588b12235q46097K16586J194301m89971k192550o97304J498605N98393j489569
10579b419841q68430J088452O87510j036200p19327P89524O21182k41299N73007
$$ plain form
10646 751079 -255808 -1557035 -2547647 -2579874 -2265771 -2599121 -3013986 -2364545 -1379615
10637 -1379615 -1649624 -2570569 -2137819 -576728 -128552 -1197494 -1865272 -1466964 -1437039
10628 -1437039 -2156220 -2158440 -1134531 -663366 -1204737 -1283920 -415902 -8587 -610715 -975879
10618 -975879 -532652 -179757 -156677 236074 530888 -477386 -2014515 -2010832 -645168 -92879
10608 -92879 -655235 -505743 543897 613376 -541351 -996181 -315243 -176551 -873495 -796726
10598 -796726 128369 151148 -729253 -648954 290025 -8158 -1458648 -1687275 -502092 -212235
10588 -212235 -1058332 -841746 352555 -137416 -2329966 -3027270 -1528665 -930272 -2419841
10579 -2419841 -3288271 -2199819 -1512309 -2548509 -3267836 -2478312 -1857130 -2098429 -1525422
10570a525422J484543J44798j282405q3610J325163r7762j756218k38882J741970
10561b87825K76271k079006j018089J295824N39426j354164k25820J868959O60827
10552c23597j757824r17160J281071M55844j496536l59221J688883L46424j937837
10543c019953o07096J794636N46572j697482j44914K217056L00937k573324p60177
10534c943745K391165P66975k428997r10371K066101J26669l045352o11754L324354
10525b264955J045676l386086j475250L052874J318910l105617j102392L558883
10517b357957J236636m110890k105046L356747J370878m075647j640260M194904
10509d130635J307296n138990j771976N596875J893273o637961k940603O470527
$$ plain form
10570 -1525422 -40879 103919 -1178486 -1262096 63067 -34695 -1790913 -2029795 -287825
10561 -287825 -11554 -2090560 -3108649 -1812825 -1273399 -2627563 -2853383 -984424 -323597
10552 -323597 -2081421 -2998581 -1717510 -1261666 -2758202 -3117423 -1428540 -1082116 -3019953
10543 -3019953 -3627049 -1832413 -1285841 -2983323 -3128237 -911181 -610244 -3183568 -3943745
10534 -3943745 -1552580 -785605 -3214602 -4124973 -2058872 -1932203 -4977555 -5589309 -2264955
10525 -2264955 -1219279 -4605365 -6080615 -3027741 -1708831 -4814448 -5916840 -2357957
10517 -2357957 -1121321 -5232211 -7337257 -3980510 -2609632 -6685279 -8325539 -4130635
10509 -4130635 -2823339 -7962329 -9734305 -4137430 -2244157 -8882118 -11822721 -5352194
10501e352194K385269q313674l929412P843213J815573j3119589o400513J2003853
10493a3067474L329163k2419493j4714407J6036110o768801q9249244j16904851
10486b43758997j4467755J19970079J37203581M2257703k9603030j4174891J9268655
10479A6695345P660098j6468066p878152J1378204N123242j0387795n026438Q386321
10471I482759L825450q285858m818902N891054L237401o071290l699419M782846
10463D344041L032173m103276k015384M662387K426720m301429k676241L434972
10455D803963J996801l558107k011981L379065J888682l533274k576266K260370
10447B649253J252774l343289k202375K763703K585407j450220j262347J993081
$$ plain form
10501 -5352194 -2966925 -11280599 -15210011 -7366798 -5551225 -18670814 -25071327 -13067474
10493 -13067474 -9738311 -32157804 -46872211 -30836101 -37604902 -126854146 -243758997
10486 -243758997 -258226752 -138256673 -1053092 41204611 11601581 -2573310 16695345
10479 16695345 24355443 7887377 9225 11387429 16510671 6122876 1096438 9482759
10471 9482759 13308209 5022351 203449 6094503 9331904 3260614 -438805 4344041
10463 4344041 7376214 3272938 1257554 5919941 8346661 4045232 1368991 4803963
10455 4803963 6800764 3242657 1230676 4609741 6498423 2965149 388883 2649253
10447 2649253 3902027 558738 -1643637 1120066 3705473 2255253 992906 2985987
10439B985987J111045k341439j406276K135061J302319k264738j685719J669321
10431A505561J223483j814921j222371J826933J402897j310408o64557J994281
10423B940898J057865k068542j642372J237993J021455j426074r81224J329181
10415A469180N57237j999949j173520J814307J564082j129257j029129J351437
10407A424388J062613j466260j446191Q71174J002448q53496n80318J409296J096599
10398B520253r66056p63235J106339O61628j383373r21667J331762J041017j339706
10389A286962j385092Q79983J258293n40204p83523P69432P01203j024129j033685
10380A29240O71355P83645p30355p66241N81818L63341j010023m21964J520158
$$ plain form
10439 2985987 4097032 1755593 349317 2484378 3786697 1521959 -163760 1505561
10431 1505561 2729044 914123 -308248 1518685 2921582 1611174 946617 2940898
10423 2940898 3998763 1930221 287849 1525842 2547297 1121223 139999 1469180
10415 1469180 2026417 26468 -1147052 667255 2231337 1102080 72951 1424388
10407 1424388 2487001 1020741 -425450 445724 1448172 594676 14358 1423654 2520253
10398 2520253 1554197 790962 1897301 2558929 1175556 253889 1585651 2626668 1286962
10389 1286962 -98130 781853 2040146 1499942 716419 1485851 2187054 1162925 129240
10380 129240 800595 1584240 853885 87644 669462 1032803 22780 -399184 1120974
10371A120974J252264r05457j175662O43991J020282n29812q48463N62824Q27870
10362A968811m63902o35493N51695M81605q84867p56631R27726J139850n55483
10353A773311j207598O1095P95857J0767m57943L5105J619o49675l04705Q35680
10343H93513Q65607j36282l22056K51529l6964q10055l43786P75132N53504n09299
10333A180843l61548N53004K17941q42630n10538P18092O51800l28249j26062
10324A152653Q37644N07105o17063m71356L62062j57859j164571l02859J441335
10315A587091J105794q32225j255887r498K09887q50990p46061P47476J214788
10306A170375J90669l11344Q9299k14063j094103q07452K85018K33245n39257
$$ plain form
10371 1120974 2373238 1467781 292119 936110 1956392 1426580 578117 1140941 1968811
10362 1968811 1504909 869416 1421111 1902716 1017849 261218 1188944 2328794 1773311
10353 1773311 565713 626808 1422665 1433432 975489 1010594 1012213 362538 57833 893513
10343 893513 1759120 1622838 1300782 1552311 1515347 705292 361506 1136638 1690142 1180843
10333 1180843 819295 1372299 1590240 747610 237072 955164 1606964 1278715 1152653
10324 1152653 1990297 2497402 1880339 1408983 1771045 1613186 448615 145756 1587091
10315 1587091 2692885 1860660 604773 595275 805162 -45828 -791889 -44413 1170375
10306 1170375 1361044 1049700 1138999 924936 -169167 -976619 -691601 -458356 -997613
10297i97613M0543J394967J060976n87409q38256L88467N95706m27174m10354
10288B19853P23969O47492o99761q13559N95466J000771k22489q03352O5948N29185
10278A243523r9291k75579L44099K43206o06544m75994N59697N16671o27524p32497
10268H9767M23781O89781l51115o59997K76314N42515m11397p51721J67036P04334
10258G19298J77365j28795J56805j15815p97120l31293J002774J085582k61646
10249A507155q30154O7495N85052j09054n66106r2964R6219m49832n54384P6565
10239b70008K79760r8429P2678O55727K71505q14670p69569M92044R98496J21777
10229I39311n76737k93783j212j54086l4497L53895K43241m5055L07504N22792
$$ plain form
10297 -997613 -957070 437897 1498873 911464 73208 461675 1057381 630207 219853
10288 219853 943822 1591314 891553 77994 673460 1674231 1451742 648390 714338 1243523
10278 1243523 1144232 868653 1212752 1455958 849414 373420 933117 1449788 822264 89767
10268 89767 513548 1203329 852214 192217 468531 1011046 599649 -152072 14964 719298
10258 719298 896663 767868 924673 808858 11738 -319555 683219 1768801 1507155
10249 1507155 677001 744496 1329548 1220494 654388 561424 657643 207811 -346573 -270008
10239 -270008 9752 -88677 -15999 639728 911233 96563 -673006 -180962 817534 939311
10229 939311 362574 68791 67579 -86507 -121004 232891 476132 431077 738581 1261373
10219A261373n49799j682673q41679J042602J277597n6477m31844N27246O64953
10210A211299m21535o94369K96650N66810m26367p50819K77044Q22086j4057p01462
10200A65280k81066J28830j92379l48724N4200J49346j72993K7297N87244L15133
10190D32168n29348m41448M86217O32822j34642l03353L37473M33514j64402k30863
10180E18138J78683k04504j117743j004679K8393M12681J11405L84958Q58223
10171A65555J07430j090391o22661R64599J024351n64540j108941K31251J238954
10162C45607O76292n4217J2258P322l98543l38814K5078l80237r74026j74408
10152a253688J348925J383195R1440k93870L84515J66820r09165p20581O48210
$$ plain form
10219 1261373 711574 -971099 -1812778 -770176 507421 450944 19100 546346 1211299
10210 1211299 789764 95395 392045 958855 532488 -218331 58713 880799 866742 165280
10200 165280 -115786 13044 -179335 -528059 -473859 -324513 -497506 -470209 117035 432168
10190 432168 -97180 -538628 -52411 580411 445769 142416 479889 913403 749001 518138
10180 518138 696821 492317 -625426 -1630105 -1601712 -1189031 -1077626 -692668 165555
10171 165555 272985 -817406 -1440067 -475468 548883 -15657 -1124598 -893347 345607
10162 345607 1021899 967682 979940 987262 588719 249905 274983 -105254 -1079280 -1253688
10152 -1253688 95237 1478432 1569872 1276002 1660517 1827337 918172 197591 845801
10143H45801P09973q08357j340638j74144M25032l50621m90071O68811J044461
10134E30247j20461p63795L7037M39225m10730p44853K21016P01392j06471m23143
10124f40536O08133J240138M77514j99525Q8732J06973n80076n20498M64851M48875
10114A494581r18291j378978j39988N95311k85111q10747K17319R71539J80371
10105g3994m75881K96221R03020l5323j058925o21134K41351J67810j28656K19963
10095e65548L40065l87863p30180J39453R48673N93651j5944P9037J93173k80692
10085C13825n26512l5966K99695j7061j75564J41240J01308l84733l02837L28240
10075b58365K96729l35823j46594Q12463Q27502l13461q21792j44299K16900k87151
$$ plain form
10143 845801 1555774 747417 -593221 -767365 -342333 -692954 -1183025 -514214 530247
10134 530247 409786 -354009 -316972 122253 -288477 -1033330 -812314 -110922 -217393 -640536
10124 -640536 -32403 1207735 1685249 1485724 1574456 1681429 1101353 580855 1045706 1494581
10114 1494581 576290 -802688 -942676 -347365 -632476 -1443223 -1225904 -254365 -73994
10105 -73994 -549875 -253654 649366 614043 -444882 -1066016 -824665 -656855 -785511 -565548
10095 -565548 -225483 -613346 -1343526 -1204073 -255400 338251 322307 401344 594517 313825
10085 313825 -212687 -248653 51042 33981 -141583 -343 100965 -283768 -586605 -258365
10075 -258365 38364 -297459 -444053 368410 1195912 882451 60659 -83640 133260 -153891
10065a53891l97639J97381K70246k23809O6495Q80794M08155j118540j351556
10056a422364K2046O56093j83253m46075O58263J204544K94166l95186k9737k3416
10046C35081p98543p11827N16193Q51627k74335p69513K25925P88983q1922p13887
10036f32218j08769L62397m5857j14571M69167K85540o83116n81012O52759P98420
10026D02740m82412q49263L08799O96361m60813r37771J58383O95748l18976r16741
10016a703945p7252M84993k7817j361R59116Q88388n87657j166310j24188M13687
10006i42346k60217j82294R84104R07183p34926j171733L12530Q84199n04559
9997g08059j115949L55022J373240M17058m54436N8441K18543o87609o54843P35137
$$ plain form
10065 -153891 -551530 -354149 -83903 -307712 -241217 639577 1047732 -70808 -1422364
10056 -1422364 -1400318 -744225 -927478 -1373553 -715290 489254 783420 388234 358497 335081
10046 335081 -463462 -1175289 -659096 192531 -81804 -851317 -625392 163591 81669 -632218
10036 -632218 -740987 -378590 -424447 -539018 -69851 215689 -467427 -1048439 -395680 402740
10026 402740 -79672 -928935 -620136 76225 -384588 -1322359 -1163976 -468228 -787204 -1703945
10016 -1703945 -1781197 -1296204 -1324021 -1325382 -366266 522122 -65535 -1231845 -1356033 -942346
10006 -942346 -1202563 -1384857 -400753 506430 -228496 -1400229 -1087699 -203500 -708059
9997 -708059 -1824008 -1468986 -95746 321312 -133124 -74683 143860 -543749 -1198592 -463455
9987d63455R96552m32377q51733M77121Q33388n02220o60763J038799J334456
9978A769768p91723j866914k64161R15927j46972q08397N15075J279143M7275
9969F49021p37993J16183K09619j174319j210508O50837J043405p80721j157372
9960b391848Q57396J373907p22401j267373J132892K039884m81089k065444k64347
9951a788423J106214k65122q37518J212190J929801n31511j862821R5369J059055
9942A17234j130908k015425O07444J947346n40962k009343L61206J841219l92031
9933a214220j621958P83515J787377j190585k579095N39366K321968n10820k143144
9924c827596O40469J800240j591989k675377J604836L376498j110375l376765
$$ plain form
9987 -463455 533097 100720 -751013 -273892 559496 57276 -603487 435312 1769768
9978 1769768 978045 -888869 -1153030 -237103 -384075 -1192472 -677397 601746 649021
9969 649021 -88972 27211 236830 -937489 -2147997 -1497160 -453755 -1234476 -2391848
9960 -2391848 -1534452 -160545 -882946 -2150319 -1017427 1022457 541368 -1524076 -1788423
9951 -1788423 -682209 -947331 -1784849 -572659 1357142 825631 -1037190 -941821 117234
9942 117234 -1013674 -3029099 -2421655 -474309 -1015271 -3024614 -2663408 -822189 -1214220
9933 -1214220 -2836178 -2052663 -265286 -1455871 -4034966 -3495600 -1173632 -1684452 -3827596
9924 -3827596 -3187127 -1386887 -2978876 -5654253 -4049417 -672919 -1783294 -5160059
9916e160059R90538L106702j771265m001968J524439M026048k239516n051574
9908h576655K262769N585412l344120q215803J637606P570579m181738j1915289
9900a9177239K433926J1937075j0067771k8066799R779871P5049792Q0573004
9893A22461859P652624n9155539n0877838l454490J2028081o881002j3994726
9886G778969P04193P028176l502919p806366J514980N650301k097099n890167
9878C380068N44236L840080j641119m333338P69758L346884j165456l377711J044270
9869B407672L510826l17497k855330P5920J975565o99643k018938R40228K303748
9860E322551p59454k541779K424J782933j61014j415854N08186J494111n12576
$$ plain form
9916 -5160059 -4169521 -1062819 -2834084 -6836052 -5311613 -1285565 -3525081 -8576655
9908 -8576655 -6313886 -728474 -4072594 -12288397 -10650791 -3080212 -7261950 -19177239
9900 -19177239 -16743313 -4806238 -14874009 -42940808 -33160937 41888855 122461859
9893 122461859 130114483 70958944 20081106 16626616 28654697 21773695 7778969
9886 7778969 8483162 15511338 12008419 4202053 5717033 11367334 9270235 3380068
9878 3380068 3924304 7764384 6123265 1789927 2559685 5906569 4741113 1363402 2407672
9869 2407672 5918498 5601001 2745671 2821591 4797156 4097513 2078575 3018803 5322551
9860 5322551 4563097 2021318 2023742 3806675 3645661 2229807 2737993 4232104 3719528
9851C719528j428540N62134J325164r05553j938921J87155J477293k02664j266282
9842A529314L36882J317632k52678j320215n0939Q05762l33815r03782L69679
9833A497840R18916l24595p31561O42836J051661m79743j159595J20532P26772
9824B263063m29340q47156M59874R97726k54781r40022o1376K76403o01155n65989
9814B97247P24210Q04188o46763q29310P95774J224527m74834j354060q5258P48857
9804A204578k69927r06557J22481P23531k70451p74258M20777J302113M79031
9795B031318m79088l80953l44681p99651l65961Q11035N47646j120550j267933
9786a368818P88702J911400M84595q86106j16682R68754L77651o31252l82985
$$ plain form
9851 3719528 2290988 2853122 4178286 3272733 1333812 1520967 2998260 2795596 1529314
9842 1529314 1866196 3183828 2931150 1610935 1559996 2365758 2031943 1128161 1497840
9833 1497840 2416756 2092161 1360600 2003436 3055097 2575354 1415759 1536291 2263063
9824 2263063 1833723 986567 1446441 2444167 2189386 1249364 1187988 1464391 863236 297247
9814 297247 1021457 1825645 1178882 349572 1145346 2369873 1895039 540979 455721 1204578
9804 1204578 934651 28094 150575 874106 603655 -170603 250174 1552287 2031318
9795 2031318 1552230 1171277 826596 26945 -339016 472019 1019665 -100885 -1368818
9786 -1368818 -580116 1331284 1815879 929773 813091 1781845 2159496 1528244 1145259
9777A145259K33056L8527j20191M46640N26089n31048j206099n02740K90329J43527
9767D63349L1247O25832Q22608J9422o29180n02374n27261q54278k77885R87696
9757A59176R35241o54516j329496j1530J155152N23510n07868l64498J45667m7978
9747B860k29906K40937M43840p5031j25625P48852J071370R1737p06809k38807
9737A223418L73066Q6914k51387J41131M37054R998l34305j74173l27518q12650
9727C71548l75416Q46331Q57884o92307j369807Q2098J473715Q19779m52287k57352
9717A304186N97195K24531q89487r28783R0824O50767L10566j04927j98435j90178
9707H66259k1470L97919O36285M02517P2303q6532k97717m57266j21275L44050
$$ plain form
9777 1145259 1378315 1416842 1296651 1743291 2269380 1738332 532233 29493 319822 463349
9767 463349 494596 1120428 1943036 1962458 1333278 830904 303643 -550635 -828520 159176
9757 159176 1094417 439901 -889595 -901125 254027 777537 269669 -94829 50838 2860
9747 2860 -227046 13891 457731 382700 257075 1005927 2077297 2169034 1462225 1223418
9737 1223418 1596484 1683398 1432011 1573142 2010196 2020194 1685889 1511716 1184198 371548
9727 371548 -3868 842463 1700347 1008040 -361767 -279669 1194046 2013825 1561538 1304186
9717 1304186 1901381 2125912 1236425 307642 398466 1049233 1359799 1254872 1056437 866259
9707 866259 844789 1242708 1878993 2281510 2353813 2267281 1969564 1512298 1391023 1735073
9697A735073L5804p47309p15024J25403L18844m29169o38461K39779P45499L5601
9687G06040o07679j34071M58432Q0203n07073k04714N17821O66752L59130J74140
9677A508981O4236p9139M2049K66370o4915p05076n82464K08182K81289n79782
9667C59731q37131J31368Q56800K96779m98467m02397L9711J04137K53279P34514
9657A038324O46303k81121p60528j29180L51426k37803p66794j80862M84190M655
9647A68610p35292l04154P45415Q88889J63387k02715L7698O8067l71490o98105
9637b39690n18682K7875N81525O29324p3932p74393m08202O47374Q38930j33293
9627E76836p61918k26827L57065Q8735j82235L18836P01758J18593n07486p5295
$$ plain form
9697 1735073 1770877 1023568 308544 433947 752791 323622 -314839 -75060 670439 706040
9687 706040 98361 -35710 422722 502925 -4148 -208862 308959 975711 1334841 1508981
9677 1508981 1573217 1494078 1536127 1802497 1737582 1032506 450042 658224 939513 359731
9667 359731 -477400 -346032 510768 807547 309080 -93317 -53606 50531 303810 1038324
9657 1038324 1684627 1403506 642978 513798 865224 627421 -139373 -320235 163955 168610
9647 168610 -566682 -870836 -125421 763468 926855 724140 761838 829905 458415 -239690
9637 -239690 -758372 -730497 -148972 480352 406420 -367973 -776175 -128801 710129 576836
9627 576836 -185082 -411909 -54844 33891 -148344 170492 872250 990843 483357 408062
9617D08062P04003N65228j71623l51568K7152J19346j82497l42908k76334k08839
9607B90022l3399K80029L18981L2800M1681M47765M06130l54261p93043k46532
9597C90173L91674K01589k84041k50751m6367k26753k84966L44477R85618P43047
9587A963700j1162l99322m80322p29715q53408l54915L40192M77488J82342R1735
9577B26613K69274L38314K15310J8476k35037l36124L9611N65106M38547k85217
9567A254873n75728p6197K97848o0992n16450m63057k79251l14626j72696K81808
9557f24468M35902J21359J4958K45376L9454o20659o25148K19493N46976k18742
9547d65499p14080K738P97746N44852N0234L16551O12465M8194n04318R886P23415
$$ plain form
9617 408062 1112065 1677293 1505670 1154102 1181254 1300600 1118103 775195 498861 290022
9607 290022 256623 536652 855633 888433 930114 1377879 1784009 1429748 636705 390173
9597 390173 781847 983436 699395 448644 402277 175524 -109442 235035 1220653 1963700
9587 1963700 1952538 1553216 1072894 343179 -510229 -865144 -524952 -47464 134878 226613
9577 226613 495887 834201 1049511 1067987 832950 496826 536437 1101543 1540090 1254873
9567 1254873 679145 602948 900796 839804 323354 -139703 -418954 -733580 -906276 -624468
9557 -624468 -188566 -67207 -52249 193127 232581 -388078 -1013226 -793733 -246757 -465499
9547 -465499 -1179579 -1176841 -379095 165757 215991 532542 1145007 1193201 688883 698769 1422184
9536A422184L19426n95264o02425R8826L69623K64708M67107M83594m79786j547166
9526B00827j221336Q0353O00069J4211l58757N8964M31274K41310q114K8070P2679
9515A39550L4966J06133J10440j80916l39622O7384N23953L62061k4800L3797
9505H32946J42295l13231o51009Q2528J081961O92972q20404j390992k38363J003390
9495D22093P90500k80476p20407k45172K81007K66250n1152j67235N2427K61725
9485F09560R5078k42915j61352L65713N67425k132o99597p16557k06793J54406
9475b37164K00265J71575R1094o0168j1331L01824M03654M0953l00615k30985
9465C69102j17587k74884k77246J74736N14243K65367p1105L1285J32447k44917
$$ plain form
9536 1422184 1741610 1146346 543921 642747 1012370 1277078 1744185 2227779 1747993 200827
9526 200827 -1020509 -940156 -340087 -325876 -684633 -625669 -194395 46915 38801 66871 139550
9515 139550 174516 280649 391089 210173 -129449 -62065 461888 823949 799149 832946
9505 832946 975241 662010 11001 93529 1175490 1868462 1048058 -342934 -581297 422093
9495 422093 1212593 932117 211710 -33462 247545 513795 462643 295408 347835 609560
9485 609560 704638 461723 300371 666084 1233509 1231377 531780 -184777 -391570 -237164
9475 -237164 -36899 134676 225770 165602 154271 456095 859749 900702 600087 369102
9465 369102 251515 -23369 -300615 -125879 388364 653731 582626 613911 746358 501441
9455E01441n41230j02780N64660O06156J96492K3321O5435n9728k20071k37834
9445G95862m39819p69203l69797Q14990J248466P0109j088660m10991J077059
9436I28016R99845o01885j439793o08243M16431N23652L62225M88623K50714o46772
9426F72813j195668o59649K23364M72571K24121J13020K09711K50643K13152J41964
9416F66042j4295j02716R9612L24772P8942m55926n48258m0113M20434L76882
9406H05376O6163j59672k14693l3656L80876O53230M09910r4723l26806k68893
9396A217112k30092j57172J02685J76559l09565q55529o80943K2057L79232J82058
9386a53598j2068M9721J03459P9717J29039J25941k1413Q0933N66983O51349j81871
$$ plain form
9455 501441 -39789 -142569 422091 1028247 1224739 1248060 1313495 1253767 1033696 795862
9445 795862 356043 -413160 -782957 32033 1280499 1350608 261948 -149043 928016
9436 928016 1927861 1325976 -113817 -722060 -305629 218023 580248 1068871 1319585 672813
9426 672813 -522855 -1182504 -959140 -486569 -262448 -149428 60283 310926 524078 666042
9416 666042 651747 549031 648643 973415 1052357 596431 48173 8060 428494 805376
9406 805376 871539 711867 497174 463518 844394 1497624 1907534 1812811 1486005 1217112
9396 1217112 987020 829848 932533 1109092 799527 -56002 -736945 -714888 -335656 -153598
9386 -153598 -165666 -115945 -12486 67231 196270 322211 300798 381731 948714 1600063 1418192
9375A418192r45935m91946M77373L96429n53221p30396J66498O38807R301n13088
9365a27986k6383O44179N87625K47581K16481K5932p19313j201411o04785M38543
9355e19537P72321L75707N5336Q2843J36362J32987K04378J83905j05996l55508
9345I62798k21952K5158o4088l35292k94929N2443K19381M819k24942n7642M29926
9334D95680P18216L98880k84027o05618k62464J82179J36341j02459R6857N44619
9324A318204N02563m3085l65884k64022k91917n67004m50214K08749N73901J41491
9314G62782l83622k24921K51209K44863j77940l28574l3960K39870J88678j9185
9304E19200j21308l3754J45194J79094m8591k32410N390M00330K75350l53629
$$ plain form
9375 1418192 472257 -19689 457684 854113 300892 -429504 -263006 375801 385102 -127986
9365 -127986 -154369 489810 1077435 1325016 1541497 1567429 848116 -353295 -958080 -519537
9355 -519537 252784 628491 683827 766670 903032 1036019 1240397 1424302 1318306 962798
9345 962798 740846 766004 701916 366624 71695 124138 343519 348338 123396 65754 495680
9334 495680 1213896 1612776 1328749 723131 460667 642846 779187 676728 773585 1318204
9324 1318204 1820767 1777682 1411798 1147776 855859 288855 -161359 47390 621291 762782
9314 762782 379160 154239 405448 650311 472371 143797 109837 349707 538385 519200
9304 519200 397892 364138 509332 688426 639835 407425 412815 813145 1088495 734866
9294G34866o31590j50112L96825L34583J1507J6541J17341j64784n01778k77092
9284a13693K26005K12502k33250k29085M00311P61616L07449l29913l83726o1985
9274E56231j1694k39517k50423N2191K57253J30187j18589k36607j92751l8821
9264i2540J36729J19100k14635n63450m51719J14813N95324O24683M12171K71509
9254I51985J56233n0577j47864O7295L27682J88257l08885o57435n40024j33082
9244a46415K10983L06460K01502J32732L13732N69240M02784k89372q66764p21721
9234A13161j29110J85955O7795q7293j44847l06628m78006l25952K2334Q5445
9224i97146j04011O238M92046P14586L24749j80215k13937J46482M44629M17618
$$ plain form
9294 734866 103276 -46836 349989 684572 696079 712620 829961 665177 163399 -113693
9284 -113693 112312 324814 91564 -137521 262790 1024406 1331855 1001942 618216 556231
9274 556231 544537 305020 54597 106788 364041 494228 375639 139032 -53719 -92540
9264 -92540 44189 163289 -51346 -614796 -1066515 -951702 -356378 268305 680476 951985
9254 951985 1108218 1057641 909777 977072 1304754 1493011 1184126 526691 -13333 -146415
9244 -146415 64568 371028 572530 705262 1018994 1588234 1991018 1701646 834882 113161
9234 113161 -15949 170006 237801 150508 5661 -300967 -778973 -1104925 -1082591 -997146
9224 -997146 -1101157 -1094919 -602873 111713 436462 256247 42310 188792 633421 1051039
9214A051039R6575k49742k17094K45021N27347R8089o11267p43999k55740J91765
9204A31994L53248M50958L27003k89889q10717m06014M29834L92377m71523p20664
9194f13393J12454Q23969O47137K80802K06218j56994p97006n57134O70146J139759
9184A755958P749j022933m58232M50432m6517j082014p23340O13932R24130K1640
9174D40805m13275J46374M79944K9981l35697j65435m2867j12376K07257P65357
9164A000068O31177j99226o36746l26501r8004k97500k32956L13757N35799R6268
9154G86136k07210J25616M49795K06305j18776K9414K78881L8767m99795p19020
9144C70113m48721j2065K58712K68672J67366J76737K33051K1134l91631m31859
$$ plain form
9214 1051039 1147614 897872 680778 925799 1453146 1551235 939968 195969 -59771 131994
9204 131994 485242 936200 1263203 973314 162597 -243417 186417 578794 107271 -613393
9194 -613393 -500939 323030 970167 1250969 1457187 1300193 503187 -53947 616199 1755958
9184 1755958 1763707 740774 282542 732974 686457 -395557 -1118897 -504965 419165 440805
9174 440805 27530 173904 653848 683829 348132 182697 139830 27454 234711 1000068
9164 1000068 1631245 1432019 795273 468772 370768 73268 -159688 154069 689868 786136
9154 786136 578926 704542 1154337 1360642 1241866 1271280 1550161 1588928 1089133 370113
9144 370113 -78608 -90673 168039 436711 604077 780814 1013865 1034999 643368 211509
9134B11509N8756M01805J52123j37619N8111K76238K9263j64660J81590L76111
9124A443227k50949q90483n05218K91579K79264k14471m7362N17599L45693l33927
9114F34952l54969J12056n8476n77312j41786Q98182Q13081m07058q20089J71197
9104B69778Q70770L18274k63711K6622K42269l03347o52834j80289J54546j87003
9094B95075j35583P72600J067810j38023j250774o65580N65343N40706m34774
9085F16800o86570J9158N28292M04961J72818K3888j75327j46484K24841K65533
9075A247910l27062n88510J61179Q72185L59903o23120n85911K54174N15286Q389
9065A294423k86816j70946l26300p04332n52521L5204K16145Q332K20329P46913
$$ plain form
9134 211509 270265 672070 824193 686574 744685 1020923 1050186 885526 1067116 1443227
9124 1443227 1192278 301795 -203423 88156 367420 152949 105587 623186 968879 634952
9114 634952 279983 392039 333563 -243749 -385535 512647 1325728 918670 98581 269778
9104 269778 1140548 1458822 1195111 1221733 1464002 1160655 507821 327532 482078 295075
9094 295075 159492 932092 1999902 1861879 611105 -54475 510868 1051574 616800
9085 616800 -69770 -50612 477680 882641 1055459 1079347 904020 757536 982377 1247910
9075 1247910 920848 332338 493517 1365702 1725605 1102485 516574 770748 1286034 1294423
9065 1294423 1007607 836661 510361 -193971 -746492 -711288 -495143 -486811 -266482 480431
9055D80431N50145m37186r38558k99456N30205N28882l7299l85758l60873j69434
9045e38901K07569O67778O82720J8619o56854n21453K65674P25175L22750l74920
9035G98157m82240M5453M02211Q2541m17636l82310M3229J61653j20036k20237
9025h9215O6992K78070J51252j6310n7697j69693k69478N134M27166K72403m28629
9014A69995p67562m45906k34671m60578l07971O26753J339341R53523J42565n8550
9004I56939J51296P3096j23413q008J1844m71306p37378q0090O52207K35920p75466
8993a14359p85442K88831R53574N68104R2284J82946J96025l73302q55490n62963
8983d09792O0428K20474l8942j41493L4765J15399q0602k80947j46536K81087
$$ plain form
9055 480431 1030576 593390 -345168 -644624 -114419 414463 377164 -8594 -369467 -538901
9045 -538901 -331332 336446 1019166 1037785 380931 -140522 125152 850327 1173077 798157
9035 798157 315917 361370 763581 846122 428486 46176 89405 251058 131022 -89215
9025 -89215 -22223 255847 407099 390789 333092 163399 -106079 -100945 326221 598624 169995
9014 169995 -597567 -1043473 -1278144 -1738722 -2046693 -1419940 -80599 872924 1015489 956939
9004 956939 1108235 1181331 1057918 1049910 1061754 590448 -146930 -227020 425187 661107 -114359
8993 -114359 -899801 -610970 342604 910708 1002992 1185938 1381963 1008661 153171 -409792
8983 -409792 -349364 -128890 -167832 -309325 -274560 -159161 -239763 -520710 -667246 -386159
8973c86159N55751L37401p1118l1191M62635O45360J38470l73599j80793L27285
8963A424042L12905k12902n72329n24513l35475o4923L28103M37606r0464p07073
8953e023n81201N3177J95133l00214m85405J08748P14570N56237k0338j94847
8943D0837J55257M86569M24786R5312j95739k76474j67579K866J36412K01500
8933I03747J31160j35337m22120l98300o2861J53290r793k65915k60265n3392
8923d19786J52386L48650M48742J52565m83173p99282l71009L07612M94463J76302
8913G470j42215k34129j72638Q0396N15509P85057N98238J53994k17922m78872
8903H94888n88067l26155J45692J93014k69207l83653L02983Q67059L36353o76074
$$ plain form
8973 -386159 169592 506993 435875 404684 867319 1512679 1651149 1277550 1096757 1424042
8963 1424042 1736947 1524045 951716 427203 91728 26805 354908 792514 702050 -5023
8953 -5023 -586224 -533047 -337914 -638128 -1123533 -1014785 -300215 256022 235684 40837
8943 40837 196094 682663 1107449 1202761 1007022 730548 562969 565835 702247 903747
8933 903747 1034907 899570 477450 79150 16289 169579 159786 -106129 -366394 -419786
8923 -419786 -267400 81250 529992 682557 199384 -599898 -970907 -663295 -168832 7470
8913 7470 -134745 -368874 -541512 -461116 54393 839450 1437688 1591682 1373760 894888
8903 894888 306821 -19334 126358 319372 50165 -333488 -30505 836554 1172907 496833
8893D96833q20540m0277M79042J71730k99530l00068j7052J59635J95591J67416
8883A92780R3202Q3214J62443M6952m01766p35605n04926j771J94554R3968P2959
8872g03996J42823J33529K08818M64413M65927r052k83743K28839Q71341O56006
8862B174905j32251m42693j79794j13075l46663k77953L8348p8984n07001l45751
8852b10912M37126P73973K38877k79421q9884L10022K88443O2178L5593N0047
8842A616042j32372l26615l76137m56168n75668m20441L2441L81475M61527M65582
8832F69666L30901j88671p51456o50141K3047L78627J10151j17100P5454J95490
8822G5968l6842q2563L58584O34804J76874n38728p65904n76718m78559m70081
$$ plain form
8893 496833 -323707 -363984 115058 286788 -12742 -312810 -329862 -170227 25364 192780
8883 192780 285982 369196 531639 578591 176825 -558780 -1063706 -1065477 -870923 -776955 -703996
8872 -703996 -561173 -427644 -218826 245587 711514 702462 418719 647558 1518899 2174905
8862 2174905 2042654 1599961 1420167 1307092 960429 682476 720824 641840 134839 -210912
8852 -210912 226214 1000187 1239064 959643 869759 1179781 1468224 1530402 1565995 1616042
8842 1616042 1483670 1157055 780918 324750 -250918 -671359 -638918 -257443 204084 669666
8832 669666 1000567 811896 60440 -589701 -566654 -188027 -77876 -194976 -119522 75968
8822 75968 39126 -43437 315147 949951 1126825 588097 -177807 -754525 -1233084 -1703165
8812a703165j68013M43221R25689Q81598K86193m36433o27981p9192N46344M90942
8802E59203k3382j93918N5624R5138j53037q0474L68195M84884R0115j35042L2191
8791A099497p8639o56619q46905k30696L36046J75362p2135K82892O49852K42425
8781I01080m17456l44335K42378L72461m1666k72499j43864j22446k28969o717
8771f2033M48645M59018j34075o78918o46081j78918L29352N92893L82335k65250
8761B46968p83875o01215P6085N13697M18900J20880j12249l04682l47461q440
8751g81392N26340P09968L93454K0422q3318r9719j97493j47889J93750M49184
8741I83307K15830k61877m16218k29342k35487n77208o32104N2938Q90974R19631
$$ plain form
8812 -1703165 -1871178 -1427957 -502268 379330 665523 229090 -398891 -478083 68261 559203
8802 559203 535821 341903 397527 492665 339628 259154 627349 1112233 1202348 1067306 1099497
8791 1099497 1020858 364239 -482666 -713362 -377316 -201954 -274089 8803 658655 901080
8781 901080 483624 139289 381667 754128 712462 439963 296099 173653 -55316 -62033
8771 -62033 386612 845630 711555 32637 -613444 -792362 -463010 129883 512218 246968
8761 246968 -536907 -1138122 -1062037 -548340 -129440 -8560 -120809 -425491 -772952 -781392
8751 -781392 -255052 454916 848370 868792 785474 685755 488262 340373 534123 983307
8741 983307 1199137 937260 521042 291700 56213 -520995 -1153099 -1100161 -209187 710444
8731G10444J48383m58263l73939j18307k06130k90167P2969M73583K66058l02078
8721g7447m31083J7340M54571N22443L38791j7804m61250n42799j6551M54713
8711B40924J30957m97167l82285K74294K81177m50576o40301J87292Q45293M59144
8701D48752j88640j69418R7442p2874k64970R9216M72195J26773m39215l46477
8691b37216J31374J93905K6368K82616N91253J03834p74978p63810K41186R53933
8681G48465O59674K8754k63978m28065o58396n31252J08981N87145L40914k62456
8671C29786n59825m36063j07190L30752O80667N33607j16423n95598l77918J77903
8661a40302L87399K10624J44687L48503M26698J07263l04621l42878j9765J98703
$$ plain form
8731 710444 858827 400564 26625 -91682 -297812 -587979 -515010 -41427 224631 -77447
8721 -77447 -508530 -491190 -36619 485824 824615 806811 345561 -197238 -213789 240924
8711 240924 371881 -125286 -507571 -233277 47900 -402676 -1042977 -855685 -10392 448752
8701 448752 260112 90694 188136 115262 -149708 -50492 421703 548476 109261 -237216
8691 -237216 -105842 88063 114431 397047 988300 1092134 317156 -446654 -205468 748465
8681 748465 1408139 1436893 1172915 744850 86454 -444798 -335817 251328 592242 329786
8671 329786 -230039 -666102 -773292 -442540 238127 771734 655311 59713 -318205 -140302
8661 -140302 247097 457721 602408 950911 1377609 1484872 1180251 837373 817608 1016311
8651A016311K5560k68646k50535O4181K63764J43162r2857k54665l89733m62275
8641b05733k58156J70316M06746K93590J95897L24649L21219m6290l22959r4190
8631G85089K25688L8488m25459n23759k74512j54199j24580J70177M34843L9398
8621A91174p12526p62000P2170P28814N08718j85p2657Q2811M0237L1146L03158
8610D10860L61785k31347q72502o90224R0182N18248L81214K99337M80895M21914
8600A170362l1853k87947k825L15243J27248l37448n52113m44291k19440J08205
8590a54859N07280O31934K72253j79090k37562o3693j40955m24781m29826n7113
8580b76412K95223M09699M09169K57120j93904n87958k88852N59801R86419N45851
$$ plain form
8651 1016311 1041871 773225 522690 586871 850635 993797 900940 646275 256542 -205733
8641 -205733 -463889 -293573 113173 406763 602660 927309 1248528 1202238 879279 785089
8631 785089 1010777 1049265 623806 100047 -174465 -328664 -453244 -283067 151776 191174
8621 191174 -521352 -1283352 -1211182 -482368 26350 26165 -46492 36319 76556 107702 410860
8610 410860 772645 541298 -331204 -1021428 -931246 -412998 -31784 267553 748448 1170362
8600 1170362 1138509 850562 847737 1162980 1290228 952780 400667 -43624 -263064 -154859
8590 -154859 352421 984355 1256608 1077518 839956 776263 635308 210527 -219299 -276412
8580 -276412 18811 428510 837679 1094799 900895 312937 24085 583886 1570305 2116156
8570B116156n9494j47480j7445j42694k40600K9275J90458k31706o60435l71972
8560D64063J12230j36101o62369k60453P81655Q62968k72797r20987j40973O78058
8550E05294J15141r41535p87717L49749Q08886J62887l54372k903M55493K18507
8540E29430l13106l03971K77924P19640M70925l03389q73283o19508K42472P92159
8530F19293N21196k4490j31297P309k30583p14483p25406j62199K81426J89078
8520c70156q6155j09780J08652L79748N37404L35690k63539p08642m25828K45091
8510c57515M35029P9469k2295L78000N20072m597m29020k8089O52294O32529j1959
8499A843918m05776k52141m6625q0449r8146K8958M3307j46900k76631k46811
$$ plain form
8570 2116156 2056662 1909182 1891737 1749043 1508443 1537718 1728176 1496470 836035 464063
8560 464063 576293 440192 -222177 -482630 299025 1161993 889196 -31791 -172764 505294
8550 505294 620435 -321100 -1108817 -759068 49818 212705 -141667 -144570 310923 529430
8540 529430 216324 -87647 190277 909917 1380842 1077453 204170 -415338 -172866 619293
8530 619293 1140489 1115999 984702 992011 761428 46945 -678461 -840660 -559234 -370156
8520 -370156 -456311 -566091 -457439 -77691 459713 795403 531864 -176778 -602606 -357515
8510 -357515 77514 156983 134688 512688 1032760 1028163 599143 571054 1223348 1855877 1843918
8499 1843918 1438142 1186001 1139376 1058927 960781 989739 1033046 886146 609515 362704
8489C62704k81178l78192j65782M09687P58385M13276k69893o24561n66725m64488
8479h06767l65245JN00240N92631J97418n5292K16334N19619L00000j31509j44454
8468H22976J14593J405m12631l46040L46836P54520K41744n59926o78311j46035
8458A39131K48341J71744J2514J09888L31486L97310J97009j79213m40080k94760
8448F93370P2831N1562n01214q41049l89251K39128J03370m75835l03273P07574
8438f42787J173989L16854p32958n44135N30543R69308L26432l30130j83318K66494
8428A150292K42528j15378k05027n748K7663k06553l90937m00700l80950k75322
8418e60132J17714N73454N34569m8304n24638m36988p5740J45575K90113M60242
$$ plain form
8489 362704 81526 -296666 -462448 -52761 705624 1118900 849007 224446 -342279 -806767
8479 -806767 -1172012 -1172011 -671771 -79140 118278 62986 279320 798939 1098939 967430 822976
8468 822976 937569 938974 526343 180303 527139 1281659 1523403 963477 285166 139131
8458 139131 387472 559216 571730 681618 1013104 1410414 1607423 1428210 988130 693370
8448 693370 766201 817763 316549 -524500 -913751 -674623 -571253 -1047088 -1350361 -642787
8438 -642787 531202 848056 115098 -429037 101506 1070814 1397246 1067116 883798 1150292
8428 1150292 1392820 1277442 1072415 1066667 1094330 887777 496840 96140 -284810 -560132
8418 -560132 -442418 131036 665605 617301 92663 -344325 -420065 -274490 15623 475865
8408D75865L57341j31960m38223j17868K93209O9037m51189l84416J85604L50347
8398B07747n5237k50619J0870M7392l29771l10976L97851Q04536K13998n30057
8388B05734m08029J33132Q3915l58863k56454L49947N51531J70976m5375J93881
8378F20395L26419L8487k44756j73333M7610J62283J54837k9386l82438m87132
8368C2986r977N27533L16409m27555o70394j61199K10936o6910l13542J14556
8358d47157O92769N88372O714j72283K24199M60166O3928m50467l19664L42373
8348I88950N97274m7850q21041o25231L72988Q62410K42606n52689n70436k10419
8338B36562k43722l70855M6728N32441K17754m51277l18349M34570N57003k0199
$$ plain form
8408 475865 833206 701246 263023 145155 438364 507401 56212 -328204 -142600 207747
8398 207747 152510 -98109 -87239 -39847 -369618 -680594 -282743 521793 735791 205734
8388 205734 -202295 -69163 14752 -344111 -600565 -250618 300913 471889 426514 620395
8378 620395 946814 985301 740545 567212 614822 777105 931942 902556 520118 32986
8368 32986 23009 550542 866951 439396 -230998 -392197 -181261 -248171 -561713 -447157
8358 -447157 245612 833984 840698 668415 892614 1352780 1416708 966241 646577 988950
8348 988950 1586224 1538374 717333 92102 465090 1327500 1570106 1017417 446981 236562
8338 236562 -7160 -378015 -331287 201154 418908 -32369 -350718 83852 640855 620656
8328F20656q7411M84483L31433q34280j306863j37443J083952O85298m49985m89777
8318i9937L60661N06661k06017m22821K56983P18861L18392k71258m70021n72307
8308A19197p31560m71520K76546P39510M61816J2609J4893K44650K17103l18r1671
8297G91255p1961p2556J7746K59515L75107J50267j72088k40434q3864M3961P7799
8286A074747R7979M0407k43434o55460p97331l77911L26990N86989M0082o63487
8276e70429m99411N17540J140155N04178o32881r10433j76484N29045N28963J43335
8266E73578j55856l14963l11076j4385L51195L19853l8778j36580J48542K44352
8256F65882r6101l25751n7456K50891R6491k20032j58545J63846K83613J93265
$$ plain form
8328 620656 533245 1017728 1349161 514881 -791982 -929425 154527 839825 389840 -99937
8318 -99937 260724 767385 561368 138547 395530 1114391 1432783 1161525 691504 119197
8308 119197 -612363 -1083883 -807337 -67827 393989 406598 421491 666141 883244 882926 791255
8297 791255 719294 646738 664484 923999 1299106 1449373 1277285 1036851 952987 996948 1074747
8286 1074747 1172726 1213133 969699 314239 -483092 -861003 -534013 52976 93058 -570429
8276 -570429 -1069840 -552300 587855 1092033 459152 -451281 -627765 -98720 430243 573578
8266 573578 417722 102759 -208317 -222702 128493 448346 409568 272988 421530 665882
8256 665882 569781 244030 186574 437465 533956 313924 155379 319225 602838 796103
8246G96103J82930J85377p4334m68604n99897m25959k38580j25199O0455K72130
8236d35578K84863R9318p7119k08038l91368m92331k34334L18737P42763P74143
8226C81056N44806K61077m2917l46441m94271l42588N7948M62137N55503J81679
8216A217989m09143o55940k50872M39390P11102K76320m40744p33015k89157M63617
8206C29547P04230J08529o39290n94746J64779N59861K1268o73460n56683J41003
8196d34962M75069K15978o0861o3341n5587j12233J1828K02150K5613l93564l66966
8185e56876K36646O55023L59904k09816m34665l40366j94942M5446L65315L83051
8175C08720o108k39715N0886L32329J0509n17544m52909J33396M68109K94127
$$ plain form
8246 796103 979033 1164410 1090076 621472 21575 -404384 -642964 -768163 -707708 -435578
8236 -435578 -150715 -51397 -128516 -336554 -727922 -1220253 -1454587 -1135850 -393087 381056
8226 381056 925862 1186939 1144022 797581 303310 -39278 18670 480807 1036310 1217989
8216 1217989 808846 152906 -97966 341424 1052526 1328846 888102 155087 -134070 329547
8206 329547 1033777 1142306 503016 -91730 73049 632910 654178 -19282 -575965 -434962
8196 -434962 40107 256085 195224 131883 76296 -35937 -24109 178041 203654 -189910 -556876
8185 -556876 -320230 334793 694697 484881 50216 -290150 -485092 -439646 -74331 308720
8175 308720 302612 62897 113783 446112 456621 -60923 -513832 -380436 87673 381800
8165C81800Q4312J30350K01843J26495K8012n7041k10074k74166k8979L10411
8155F92963L36679J22223L7682M065l41876p79360o47263K9673M19990J57277
8145C2053r2366K53576P48426O37758k1508n33161m97886j16087J86004J17581
8135G14390k36960l87661j5747L81139L7883p74478q56477J35494R66558N84802
8125E48943k81148k95942M01691N70973k5275l06800K31438O58043J57558o29279
8115A030202o20037N3200L21731j79578o25812k47148N93449R19486M10227k80148
8105A375572m53664k28517k11634n41094p01602l33065K18055L90082J24191j90496
8095e52172k32078O9154N90627R49407O68015j88908q07181n31313K27938N21206
$$ plain form
8165 381800 466112 596462 798305 924800 952812 895771 685697 411531 382552 692963
8155 692963 1029642 1151865 1189547 1193612 851736 72376 -574887 -545214 -125224 32053
8145 32053 -60313 193263 941689 1579447 1557939 1024778 526892 410805 596809 714390
8135 714390 477430 89769 74022 455161 493044 -281434 -1137911 -1002417 -35859 548943
8125 548943 267795 -28147 373544 944517 919242 612442 843880 1501923 1659481 1030202
8115 1030202 410165 463365 785096 605518 -20294 -267442 326007 1245493 1655720 1375572
8105 1375572 921908 693391 481757 -59337 -760939 -1094004 -875949 -485867 -361676 -552172
8095 -552172 -784250 -715096 -124469 824938 1492953 1304045 496864 -34449 193489 714695
8085G14695J22967l37483l98799k21888J422L38851O19730L90097k65346n35747
8075D28499l5373M59548J07282o42179o55636J49748O61403K48778l76786l88312
8065d3028q3103j74113m42566p6776Q41521J213886M90050n04816p37380k78413
8055B05262J03939J11399Q702n5761j02515M1292M29667N40698o4473p78026n75350
8044a35166L90558Q50204K69370m29995m14143j25287k44328m46580j31097L64490
8034e1974L48066M5476J77335N99581N00398j83505o45202n21336k90709k29180
8024b51050J9047N35210P29575L02769j73410j50515P2795j8522k52604j46273
8014F67022J88228J90875k39880n80948m35238J3800L84017N49439N30484K26064
$$ plain form
8085 714695 837662 500179 101380 -120508 -119086 219765 839495 1229592 964246 428499
8075 428499 393126 852674 959956 317777 -337859 -188111 473292 722070 345284 -43028
8065 -43028 -126131 -300244 -742810 -819586 21935 1235821 1725871 1221055 483675 205262
8055 205262 309201 420600 429302 373541 271026 312318 741985 1282683 1218210 440184 -135166
8044 -135166 255392 1105596 1374966 944971 530828 405541 161213 -285367 -416464 -51974
8034 -51974 296092 341568 518903 1118484 1618882 1435377 790175 268839 -21870 -251050
8024 -251050 -232003 303207 1032782 1335551 1162141 1011626 1084421 1065899 813295 667022
8014 667022 855250 1046125 806245 225297 -209941 -196141 187876 737315 1267799 1493863
8004A493863m00804r42618p67665J46920R03786O52247k55200o37897o9714N78208
7994G01126M51303j32603l81388k65819k83315m04760j67568L42802M95901J27472
7984D83151k42215k95867k78439l10890q6464M48035P43524L85030k65776n35567
7974D4522k49205J97402L45772P9754k97231l37206K1254K95693J06500k23004
7964a5749j52792J91580K24723j15819k82636m7514J68456M2343j86260k00619
7954c74287m6645Q8204J12899k0404j99648n8389M97056Q45050M17205k78404
7944I82637k78636L07302M49052r7861m42551j71717l5893m85046p35744j08813
7934f17270P16238P28356Q7445l39970l21870k21765j24131J15044L11686K18610
$$ plain form
8004 1493863 1093059 150441 -617224 -470304 433482 1085729 830529 192632 122918 701126
7994 701126 1152429 1019826 638438 372619 89304 -315456 -483024 -140222 355679 483151
7984 483151 240936 -54931 -333370 -644260 -730724 -282689 460835 845865 580089 44522
7974 44522 -204683 -7281 338491 418245 121014 -216192 -194938 100755 207255 -15749
7964 -15749 -168541 23039 247762 131943 -150693 -198207 -29751 12592 -173668 -374287
7954 -374287 -420932 -332728 -219829 -240233 -439881 -498270 -1214 843836 1261041 982637
7944 982637 704001 1011303 1460355 1362494 919943 748226 712333 227287 -508457 -617270
7934 -617270 98968 827324 914769 574799 252929 31164 -92967 22077 333763 552373
7924E52373L6461L6506N0020j04373j60858L7563O3063l64965p26228m83922K6711
7913a037649K26879K30146L56097L29770j07450l72802J20214P82426O20674j92498
7903I55807o47921m72026k14203n5572K37710L88993n4012n72416k26270O52955
7893f955P49359j17184o54011k27905J88861j63894n10112K7585Q42923Q21639
7883I50306Q7637l38681j15404J67870J3693m67844q47340o66178K23707J193922
7873B01688J217543J91687p03089n39849J01718J60011k62910k66554K60182N31299
7863H91726K15962j64260k66697l74738n73217l82016L39506Q48917M77498l42970
7853F69711o29547j61570L56300L66221J12790P1372J81016K7040m08953o34187
$$ plain form
7924 552373 588834 625340 675360 570987 410129 447692 510755 145790 -580438 -1064360 -1037649
7913 -1037649 -810770 -580624 -224527 105243 -2207 -375009 -254795 527631 1148305 955807
7903 955807 307886 -164140 -378343 -433915 -196205 192788 138776 -433640 -659910 -6955
7893 -6955 742404 625220 -28791 -256696 -67835 -231729 -741841 -714256 128667 950306
7883 950306 1037943 699262 583858 751728 765421 297577 -549763 -1215941 -992234 201688
7873 201688 1419231 1610918 907829 367980 469698 629709 366799 100245 360427 891726
7863 891726 1107688 943428 676731 301993 -271224 -653240 -313734 535183 1012681 669711
7853 669711 40164 -121406 234894 601115 713905 785277 966293 993333 584380 -49807
7843d9807l64180J1092m3453m31316n46646j12106M83464P46253O33750M09068
7833G36119K33015J04011O4j04818k16044k02982P9154M39313M15300r3290n38459
7822H51383l86462J46944M00046J66830j37691j92771j84306l39323m47237j85564
7812c08151K84460M45071J37543k03168j61022J11005K04995Q8426L2410K7422
7802F58991k12201n81187m94469K12117P99790N61438j40338m06602j13355P2440
7792C56624j05468j41979K15811M48490J58016k31328k03997k460j08108l29186
7782E6415j46229K99893L34765j93083o67064n82521j03437L56747N89058M93467
7772D38011L4812m96803o13877k55585Q9532R8338L4396J67348K21128j26436
$$ plain form
7843 -49807 -413987 -402895 -446348 -877664 -1424310 -1536416 -1052952 -306699 327051 736119
7833 736119 969134 1073145 1073209 968391 752347 549365 628519 1067832 1483132 1389842 851383
7822 851383 464921 611865 1011911 1178741 1041050 848279 663973 324650 -122587 -308151
7812 -308151 -23691 421380 558923 355755 194733 305738 510733 599159 631569 658991
7802 658991 446790 -134397 -628866 -416749 383041 944479 804141 397539 284184 356624
7792 356624 251156 109177 324988 773478 931494 700166 496169 493709 385601 56415
7782 56415 -89814 210079 544844 351761 -315303 -897824 -1001261 -644514 -55456 438011
7772 438011 472823 -23980 -637857 -893442 -803910 -705572 -671176 -503828 -282700 -409136
7762d09136n33614l97769J74269M53912J99415K1578L76220P81984N42342j54750
7752A054451n00961k61365j1955j31095k55248m0598J69113j8721k22415J41376
7742g7418P08924N11424m44788q97410j13086Q65017O02653n97795j049989j11022
7732f03490Q78780N22928o83870j142545l50978O33200P95776L17212p2836j33572
7722A60605q2914n0278n3512k02266m65902m74210m7N44676N69876J38652j58001
7711g3321q2147M2551J2852M1186K20506K66542N8817p2174P5720J87770R195
7700F87497j54175N338J63459j14512n54238n55435j64884O9181O9247K28929
7690c19593M65449K20188l79567l58320N66517J176213L54739j106593j384138
$$ plain form
7762 -409136 -942750 -1340519 -1166250 -712338 -512923 -491345 -115125 666859 1209201 1054451
7752 1054451 553490 292125 280170 149075 -106173 -146771 22342 3621 -218794 -77418
7742 -77418 631506 1142930 698142 -199268 -312354 552663 1155316 557521 -492468 -603490
7732 -603490 275290 798218 114348 -1028197 -1379175 -745975 49801 367013 294177 160605
7722 160605 77691 27413 -26099 -228365 -694267 -1168477 -1168524 -623848 -53972 84680 -73321
7711 -73321 -155468 -112917 -100065 -58879 161627 428169 486986 414812 490532 678302 687497
7700 687497 533322 538660 702119 587607 33369 -522066 -686950 -617769 -548522 -319593
7690 -319593 145856 366044 -13523 -371843 194674 1370887 1725626 619033 -765105
7681g65105r3750J185421J017893j73970r27542n92968K15545O32397M01635j55345
7671G44211n48154m54142L6029M40726L50695r7040l57422r9091M36047O94555
7661A146414L50671l64699q02561m93752K67450O27871J85958m24870l43211L07362
7651D56633N81236R3715m33740k86794K15295L24706J8548j35035k52j1019l14441
7640E08852m88100k69067L6145J20572J41981K95229L53416N1967l55951l67273
7630B7771O8701M77373M58974R5060k48759l28111j88150l2958K3347N3074J28522
7619E34844J32142p6085l49495l54917k0589L30471L58341N3178l09369l96217
7609i7696n5520M55659N89524J56131k90032j47218K87027J89876m71332p65503
$$ plain form
7681 -765105 -858855 326566 1344459 1170489 242947 -350021 -134476 497921 899556 744211
7671 744211 196057 -258085 -222056 218670 569365 472325 114903 15812 451859 1146414
7661 1146414 1497085 1132386 329825 -163927 103523 731394 917352 492482 149271 456633
7651 456633 1037869 1131584 697844 411050 626345 951051 969599 834564 834312 823293 508852
7640 508852 20752 -248315 -212170 -91598 50383 345612 699028 750995 395044 27771
7630 27771 96472 573845 1032819 1127879 879120 551009 362859 329901 353248 406322 534844
7619 534844 666986 590901 241406 -113511 -134100 196371 554712 607890 298521 -97696
7609 -97696 -153216 302443 891967 1048098 758066 610848 897875 1087751 616419 -149084
7599a49084j82784N60919N68827j5553m19732l84674k32937j24233P6397L28497
7589B5643L86259J93514r2448l61680n00258k88307K62543O85609N83853J69082
7579A063810j21871k78746n03322o13801k72070L22550N64634K57784j89275l66259
7569a36566k29891Q4617L95528M55716J86403j23415j77285r2306j23462j86842
7559E2497o5095J43710K22892K27943K26209j6986n43307p82586l27626K36212
$$ plain form
7599 -149084 -331868 229051 797878 782325 362593 -22081 -255018 -379251 -302854 25643
7589 25643 411902 605416 512968 151288 -348970 -637277 -374734 310875 894728 1063810
7579 1063810 941939 663193 159871 -453930 -726000 -403450 161184 418968 229693 -136566
7569 -136566 -366457 -281840 113688 569404 755807 632392 455107 362801 239339 52497
7559 52497 -12598 131112 354004 581947 808156 791170 247863 -534723 -862349 -626137
$$ [...]
##END NTUPLES=NMR SPECTRUM
##END=
