##TITLE=31Pdec_LR-766-2H-2CR5-7
 D2O, 24 sc
 5.6.2023
##JCAMPDX= 6.0         $$ Bruker NMR JCAMP-DX V2.0
##DATA TYPE= NMR SPECTRUM
##DATA CLASS= NTUPLES
##ORIGIN= UXNMR, Bruker Analytische Messtechnik GmbH
##OWNER= root
$$ XWIN-NMR		Version 3.5
$$ Mon Jun  5 14:31:38 2023 Russian Standard Time (UT+4h)  she@DPX200
##.OBSERVE FREQUENCY= 81.013821
##.OBSERVE NUCLEUS= ^31P
##.ACQUISITION MODE= SIMULTANEOUS
##.ACQUISITION SCHEME= undefined
##.AVERAGES= 24
##.DIGITISER RES= 16
##SPECTROMETER/DATA SYSTEM= spect
##.PULSE SEQUENCE= zgpg30
##.SOLVENT NAME= CDCl3
##.SHIFT REFERENCE= (INTERNAL, CDCl3, 0, 248.564)
##AUDIT TRAIL= $$ (NUMBER, WHEN, WHO, WHERE, WHAT)
$$ ##TITLE= Audit trail, XWIN-NMR		Version 3.5
$$ ##JCAMPDX= 5.01
$$ ##ORIGIN= Bruker BioSpin GmbH
$$ ##OWNER= she
$$ F:/spectra/data/she/nmr/P31/1/pdata/1/auditp.txt
$$ ##AUDIT TRAIL=  $$ (NUMBER, WHEN, WHO, WHERE, WHAT)
(   1,<2023-06-05 14:30:02.93 +0400>,<she>,<DPX200>,
      <created by zg, POWCHK disabled, PULCHK disabled
       configuration hash MD5:
       00 E9 B6 7A A2 85 ED C7 34 08 36 98 17 FE 4E 26
       data hash MD5: 32K
       07 6E 01 F1 A0 3C A2 AE EA A2 A1 0D BE DF D0 3C>)
(   2,<2023-06-05 14:30:30.43 +0400>,<she>,<DPX200>,
      <Start of raw data processing
       efp BC_mod = 2 LB = 1 FT_mod = 6 PKNL = 1 PHC0 = -10662.94 PHC1 = 49.88486 SI = 64K 
       data hash MD5: 64K
       5C 66 47 70 92 AE 8B A3 D2 05 37 B4 7A 5F A7 95>)
(   3,<2023-06-05 14:30:51.42 +0400>,<she>,<DPX200>,
      <pk PHC0 = -31.93455 PHC1 = 0 
       data hash MD5: 64K
       7E 75 88 7E 65 DC A7 A2 C7 32 0F 01 FC 9E 26 86>)
(   4,<2023-06-05 14:31:03.75 +0400>,<she>,<DPX200>,
      <abs ABSG = 5 
       data hash MD5: 64K
       20 20 6A 35 59 4E 3C D5 D1 8A B4 3F 37 41 B2 69>)
$$ ##END=
$$ 
$$ hash MD5
$$ D4 58 82 A3 57 97 B5 04 99 69 30 E9 EE E2 CA 1F
##$RELAX= 
##$RELAX= 
##$RELAX= 
##$RELAX= 
##$RELAX= 
##$RELAX= 
##$RELAX= 
##$RELAX= 
##$RELAX= 
$$ Bruker specific parameters
$$ --------------------------
##$DU= <F:/spectra>
##$EXPNO= 1
##$NAME= <P31>
##$PROCNO= 1
##$TYPE= <nmr>
##$USER= <she>
##$AMP= (0..31)
100 100 100 100 100 100 100 100 100 100 100 100 100 100 100 100 100 100 
100 100 100 100 100 100 100 100 100 100 100 100 100 100 
##$AQSEQ= 0
##$AQ_mod= 1
##$AUNM= <au_zg>
##$AUTOPOS= <>
##$BF1= 81.014009
##$BF2= 200.13
##$BF3= 200.13
##$BF4= 200.13
##$BF5= 200.13
##$BF6= 200.13
##$BF7= 200.13
##$BF8= 200.13
##$BYTORDA= 1
##$CFDGTYP= 0
##$CFRGTYP= 5
##$CHEMSTR= <none>
##$CNST= (0..31)
1 1 145 1 1 1 1 1 1 1 1 1 1 1 1 1 1 1 1 1 1 1 1 1 1 1 1 1 1 1 1 1 
##$CPDPRG= <waltz16>
##$CPDPRG1= <>
##$CPDPRG2= <waltz16>
##$CPDPRG3= <>
##$CPDPRG4= <mlev>
##$CPDPRG5= <mlev>
##$CPDPRG6= <mlev>
##$CPDPRG7= <mlev>
##$CPDPRG8= <mlev>
##$CPDPRGB= <>
##$CPDPRGT= <>
##$D= (0..31)
0 1 0 0 0 0 0 0 0 0 0 0.03 2e-05 3e-06 0 0 0 0 0 0 0 0 0 0 0 0 0 0 0 0 
0 0 
##$DATE= 1685961002
##$DBL= (0..7)
120 120 120 11 120 120 24 19 
##$DBP= (0..7)
150 150 150 150 150 150 150 150 
##$DBP07= 0
##$DBPNAM0= <>
##$DBPNAM1= <>
$$ [...]
##$SUBNAM3= <"">
##$SUBNAM4= <"">
##$SUBNAM5= <"">
##$SUBNAM6= <"">
##$SUBNAM7= <"">
##$SUBNAM8= <"">
##$SUBNAM9= <"">
##$SW= 501.771253377433
##$SWIBOX= (0..15)
0 1 3 0 0 0 0 0 0 0 0 0 0 0 0 0 
##$SW_h= 40650.406504065
##$TD= 32768
##$TD0= 1
##$TE= 0
##$TE2= 300
##$TE3= 300
##$TEG= 300
##$TL= (0..7)
0 120 53 12 22 120 120 120 
##$TP= (0..7)
150 150 150 150 150 150 150 150 
##$TP07= 0
##$TPNAME0= <>
##$TPNAME1= <>
##$TPNAME2= <>
##$TPNAME3= <>
##$TPNAME4= <>
##$TPNAME5= <>
##$TPNAME6= <>
##$TPNAME7= <>
##$TPOAL= (0..7)
0.5 0.5 0.5 0.5 0.5 0.5 0.5 0.5 
##$TPOFFS= (0..7)
0 0 0 0 0 0 0 0 
##$TUNHIN= 0
##$TUNHOUT= 0
##$TUNXOUT= 0
##$USERA1= <user>
##$USERA2= <user>
##$USERA3= <user>
##$USERA4= <user>
##$USERA5= <user>
##$V9= 5
##$VALIST= <valist>
##$VCLIST= <CCCCCCCCCCCCCCC>
##$VD= 0
##$VDLIST= <DDDDDDDDDDDDDDD>
##$VPLIST= <PPPPPPPPPPPPPPP>
##$VTLIST= <TTTTTTTTTTTTTTT>
##$WBST= 1024
##$WBSW= 4
##$XGAIN= (0..3)
0 0 0 0 
##$XL= 0
##$YL= 0
##$YMAX_a= 13778
##$YMIN_a= -13213
##$ZGOPTNS= <>
##$ZL1= 120
##$ZL2= 120
##$ZL3= 120
##$ZL4= 120
##$ABSF1= 248.5645
##$ABSF2= -253.2056
##$ABSG= 5
##$ABSL= 3
##$ALPHA= 0
##$AQORDER= 0
##$ASSFAC= 0
##$ASSFACI= 0
##$ASSFACX= 0
##$ASSWID= 0
##$AUNMP= <proc_1d>
##$AZFE= 0.1
##$AZFW= 0.5
##$BCFW= 0
##$BC_mod= 2
##$BYTORDP= 0
##$COROFFS= 0
##$CY= -3
##$DATMOD= 1
##$DC= 0
##$DFILT= <>
##$DTYPP= 0
##$F1P= 0
##$F2P= 0
##$FCOR= 1
##$FTSIZE= 65536
##$FT_mod= 6
##$GAMMA= 0
##$GB= 0
##$INTBC= 1
##$INTSCL= 6.047779e-11
##$ISEN= 30
##$LB= 1
##$LEV0= 0
##$LPBIN= 0
##$MAXI= 10000
##$MC2= 0
##$MEAN= 0
##$ME_mod= 0
##$MI= 50
##$NCOEF= 0
##$NC_proc= -5
##$NLEV= 6
##$NOISF1= 182.463
##$NOISF2= 159.3651
##$NSP= 0
##$NTH_PI= 0
##$NZP= 0
##$OFFSET= 248.5645
##$PC= 4
##$PHC0= -10694.88
##$PHC1= 49.88486
##$PH_mod= 1
##$PKNL= yes
##$PPARMOD= 0
##$PSCAL= 0
##$PSIGN= 0
##$REVERSE= no
##$SF= 81.0140089999694
##$SI= 65536
##$SIGF1= 159.3651
##$SIGF2= -187.1042
##$SINO= 113.3802
##$SIOLD= 16384
##$SREGLST= <1H.CDCl3>
##$SSB= 0
##$STSI= 65536
##$STSR= 0
##$SW_p= 40650.406504065
##$SYMM= 0
##$S_DEV= 0
##$TDeff= 32768
##$TDoff= 0
##$TI= <>
##$TILT= no
##$TM1= 0
##$TM2= 0
##$TOPLEV= 0
##$USERP1= <user>
##$USERP2= <user>
##$USERP3= <user>
##$USERP4= <user>
##$USERP5= <user>
##$WDW= 1
##$XDIM= 65536
##$YMAX_p= 319944991
##$YMIN_p= -72322194
$$ End of Bruker specific parameters
$$ ---------------------------------
##NTUPLES= NMR SPECTRUM
##VAR_NAME=  FREQUENCY,     SPECTRUM/REAL,   SPECTRUM/IMAG
##SYMBOL=    X,             R,               I
##VAR_TYPE=  INDEPENDENT,   DEPENDENT,       DEPENDENT
##VAR_FORM=  AFFN,          ASDF,            ASDF
##VAR_DIM=   65536,         65536,           65536
##UNITS=     HZ,            ARBITRARY UNITS, ARBITRARY UNITS
##FACTOR=    0.620285442955139, 1,           1
##FIRST=     20137.2065510682, 0,            0
##LAST=      -20513.1999529968, 0,           0
##MIN=       -20513.1999529968, -72322194,   0
##MAX=       20137.2065510682, 319944991,    0
$$ Real data points
##PAGE= N=1
##DATA TABLE= (X++(R..R)), XYDATA
$$ [...]
$$ plain form
40506 1108875 1263910 1199952 1291912 1861498 2188648 1393289 18848 -573930 -231058 -32942
40496 -32942 -351077 -390743 152052 500397 249443 -21580 -61332 -438639 -1123213 -1034114
40486 -1034114 143911 1030755 480139 -699079 -1075220 -662541 -443979 -632120 -706106
40477 -706106 -644380 -861011 -1207692 -1141174 -716374 -476355 -491848 -342247 66242 417156
40467 417156 621020 864197 1098106 1053673 686003 161981 -410521 -851099 -841909 -475272
40457 -475272 -483117 -1318991 -2321982 -2431467 -1511821 -377872 281227 413488 229994 -75684
40447 -75684 -304023 -400668 -533746 -709628 -600907 -136115 128451 -249243 -824715 -826891
40437 -826891 -224001 357879 549509 475889 267416 -64065 -356685 -415908 -320788 -222920
$$ packed form
40506A108875J55035o3958R1960N69586L27150p95359j374441n92778L42872J98116
40496c2942l18135l9666N42795L48345k50954k71023l9752l77307o84574Q9099
40486a034114J178025Q86844n50616j179218l76141M12679K18562j88141p3986
40477g06106O1726k16631l46681O6518M24800K40019j5493J49601M08489L50914
40467D17156K03864K43177K33909m4433l67670n24022n72502m40578R190L66637
40457d75272p845q35874j002991j09485R19646J133949O59099J32261j83494l05678
40447g5684k28339r6645j33078j75882J08721M64792K64566l77694n75472k176
40437h26891O02890N81880J91630p3620k08473l31481k92620n9223R5120R7868
$$ plain form
40427 -222920 -24056 352467 612994 443375 -28948 -495082 -859163 -999034 -603559 232532
40417 232532 740667 444053 -68826 -51426 187451 -150624 -936052 -1247939 -777814 -172577
40407 -172577 -23666 -338570 -951490 -1626780 -1801933 -1090174 -65302 271882 -160368
40398 -160368 -516191 -350878 -60112 68870 267522 529175 388982 -190485 -564513 -430925
40388 -430925 -308243 -544550 -627146 -56817 727453 924523 413619 -319351 -889610 -1143387
40378 -1143387 -961579 -457737 -92951 -140345 -289918 -180756 -14649 -162853 -419529 -214400
40368 -214400 505114 1122833 1162105 851360 721008 903544 1061323 897877 492030 71007
40358 71007 -313959 -653104 -694435 -237699 281681 83856 -821351 -1390831 -928486 -145950
$$ packed form
40427b22920J98864L76523K60527j69619m72323m66134l64081j39871L95475Q36091
40417B32532N08135k96614n12879J7400K38877l38075p85428l11887M70125O05237
40407a72577J48911l14904o12920o75290j75153P11759J024872L37184m32250
40398a60368l55823J65313K90766J28982J98652K61653j40193n79467l74028J33588
40388d30925J22682k36307q2596N70329P84270J97070n10904p32970n70259k53777
40378a143387J81808N03842L64786m7394j49573J09162J66107j48204k56676K05129
40368b14400P19514O17719L9272l10745j30352J82536J57779j63446m05847m21023
40358G1007l84966l39145m1331M56736N19380j97825r05207n69480M62345P82536
$$ plain form
40348 -145950 -115176 -613780 -498320 447383 1130359 774954 -72782 -555395 -652377 -764253
40338 -764253 -846966 -654578 -411089 -553934 -1000652 -1222932 -981155 -574297 -376230 -422166
40328 -422166 -484569 -397220 -262152 -320021 -562318 -613226 -220734 278960 335954 -79081
40318 -79081 -533290 -823083 -1065059 -1132218 -682223 91768 417104 -25049 -600682 -639767
40308 -639767 -321969 -197417 -307308 -331540 -244822 -229903 -178876 118478 415450 229256
40298 229256 -371368 -731729 -489586 -56122 -18307 -392354 -742066 -833243 -846607 -972151
40288 -972151 -1095171 -1033859 -906040 -1014828 -1401621 -1743706 -1741325 -1418142 -1011005 -784203
40278 -784203 -954378 -1458583 -1736042 -1196466 -100467 528422 192267 -407776 -434808 -86699
$$ packed form
40348a45950L0774m98604J15460R45703O82976l55405q47736m82613r6982j11876
40338g64253q2713J92388K43489j42845m46718k22280K41777M06858J98067m5936
40328d22166o2403Q7349J35068n7869k42297n0908L92492M99694N6994m15035
40318g9081m54209k89793k41976o7159M49995P73991L25336m42153n75633l9085
40308f39767L17798J24552j09891k4232Q6718J4919N1027K97354K96972j86194
40298B29256o00624l60361K42143M33464L7815l74047l49712r1177j3364j25544
40288i72151j23020O1312J27819j08788l86793l42085K381L23183M07137K26802
40278g84203j70175n04205k77459N39576J095999O28889l36155o00043k7032L48109
$$ plain form
40268 -86699 -48836 -295140 -320041 -231507 -588037 -1232741 -1320521 -636014 54502 202731
40258 202731 153280 288574 321434 -85388 -636692 -823380 -547543 20530 721330 1230625
40248 1230625 1126863 489264 -26818 -11022 264620 457103 624257 784103 633733 143596
40238 143596 -139357 109022 381591 78689 -555356 -810512 -531135 -206776 -217891 -450775
40228 -450775 -573138 -378488 50035 339172 156740 -346391 -657722 -515974 -104790 329024
40218 329024 611049 459701 -203903 -754218 -425537 482273 772622 -32006 -1084588
40209 -1084588 -1525224 -1462443 -1210536 -578740 378518 844817 363658 -283999 -234222 127691
40199 127691 -39586 -570337 -726346 -556134 -616380 -713112 -194637 668335 861175 212040
$$ packed form
40268h6699L7863k46304k4901Q8534l56530o44704q7780O84507O90516J48229
40258B02731m9451J35294L2860m06822n51304j86688K75837N68073P00800N09295
40248A230625j03762o37599n16082J5796K75642J92483J67154J59846j50370m90137
40238A43596k82953K48379K72569l02902o34045k55156K79377L24359j1115k32884
40228d50775j22363J94650M28523K89137j82432n03131l11331J41748M11184M33814
40218C29024K82025j51348o63604n50315L28681R07810K90349q04628j052582
40209a084588m40636O2781K51907O31796R57258M66299m81159o47657M9777L61913
40199A27691j67277n30751j56009J70212o0246r6732N18475Q62972J92840o49135
$$ plain form
40189 212040 -390928 -532882 -862935 -1773118 -2518002 -2263085 -1290668 -519297 -273791 -117788
40179 -117788 320704 848508 1035190 786223 483312 541385 875267 975831 542266 -204086
40169 -204086 -861599 -1132623 -735987 364262 1426100 1340588 39369 -1159039 -1161365
40160 -1161365 -398500 121769 299086 577889 795920 555563 281835 650634 1211556
40151 1211556 864072 -359887 -1248951 -1216355 -919644 -893120 -792550 -368826 -57365 -99892
40141 -99892 -68111 223211 258691 -171572 -412911 -40193 325179 48232 -392155 -172538
40131 -172538 514450 780025 411856 63688 172773 433193 422622 192907 54790 100704
40121 100704 124281 -86540 -458964 -689354 -640751 -535260 -539244 -370186 257028 949437
$$ packed form
40189B12040o02968j41954l30053r10183p44884K54917R72417P71371K45506J56003
40179a17788M38492N27804J86682k48967l02911N8073L33882J00564m33565p46352
40169b04086o57513k71024L96636J100249J061838q5512j301219j198408k326
40160a161365P62865N20269J77317K78803K18031k40357k73728L68799N60922
40151A211556l47484j223959q89064L2596K96711K6524J00570M23724L11461m2527
40141i9892L1781K91322L5480m30263k41339L72718L65372k76947m40387K19617
40131a72538O86988K65575l68169l48168J09085K60420j0571k29715j38117M5914
40121A00704K3577k10821l72424k30390M8603J05491l984J69058O27214O92409
$$ plain form
40111 949437 1009159 479371 128159 257849 297785 -77296 -202001 570542 1677875 1969808
40101 1969808 1277441 586965 622199 908923 525397 -606418 -1571453 -1558053 -811166 -287590
40091 -287590 -463765 -839568 -765199 -363225 -218602 -427856 -533091 -321381 -90604 -43757
40081 -43757 42867 389219 891628 1369156 1718810 1732447 1212692 387449 -246196 -588704
40071 -588704 -940668 -1245866 -980598 -69986 719114 736763 302572 125336 279184 280014
40061 280014 -87947 -520608 -636933 -306373 345931 972124 1171908 876062 436223 171417
40051 171417 33421 -100965 -75873 315950 912239 1259939 1073968 504565 28579 88343
40041 88343 657484 1152073 992966 257567 -462242 -774206 -710165 -332955 353583 1034031
$$ packed form
40111I49437N9722n29788l51212J29690L9936l75081j24705P72543J107333K91933
40101A969808o92367o90476L5234K86724l83526j131815r65035J3400P46887N23576
40091b87590j76175l75803P4369M01974J44623k09254j05235K11710K30777M6847
40081d3757Q6624L46352N02409M77528L49654J3637n19755q25243o33645l42508
40071e88704l51964l05198K65268R10612P89100J7649m34191j77236J53848Q30
40061B80014l67961m32661j16325L30560O52304O26193J99784k95846m39839k64806
40051A71417j37996j34386K5092L91823N96289L47700j85971n69403m75986N9764
40041H8343N69141M94589j59107p35399p19809l11964O4041L77210O86538O80448
$$ plain form
40031 1034031 1167959 674682 117541 -5236 206886 386041 363474 139483 -223411 -495807
40021 -495807 -418535 -70586 246792 513390 908348 1229078 1035328 490983 336805 751307
40011 751307 962447 406111 -393060 -613475 -248591 127933 250256 261516 296129 461982
40001 461982 911911 1491926 1658930 1175313 549675 388193 653966 929537 1005421 831937
39991 831937 348086 -213757 -322091 108140 459309 355239 272991 653947 1059952 961375
39981 961375 744489 995962 1283065 752404 -325168 -757140 -137870 724994 1184206
39972 1184206 1491309 1891723 1987834 1516904 990118 955971 1171988 1090752 767055 692986
39962 692986 970000 1206446 1166589 1039924 1012773 978328 855864 892564 1320835 1842281
$$ packed form
40031A034031J33928m93277n57141j22777K12122J79155k2567k23991l62894k72396
40021d95807P7272L47949L17378K66598L94958L20730j93750n44345j54178M14502
40011G51307K11140n56336p99171k20415L64884L76524J22323J1260L4613J65853
40001D61982M49929N80015J67004m83617o25638j61482K65773K75571P5884j73484
39991H31937m83851n61843j08334M30231L51169j04070q2248L80956M06005r8577
39981I61375k16886K51473K87103n30661j077572m31972O19270Q62864M59212
39972A184206L07103M00414R6111m70930n26786l4147K16017q1236l23697p4069
39962F92986K77014K36446l9857j26665k7151l4445j22464L6700M28271N21446
$$ plain form
39952 1842281 1858849 1302620 841064 1001866 1448586 1522511 1192506 922176 826865 643130
39942 643130 425954 512989 780089 728447 407018 404623 766004 845457 493498 355636
39932 355636 582846 372021 -562925 -1182714 -674675 187109 274252 -182555 -261013 45250
39922 45250 139401 95477 301330 366272 -233020 -851639 -475906 489779 743410 192810
39912 192810 -41991 317023 328567 -280254 -498847 217865 1056779 1287142 1263349 1371151
39902 1371151 1261685 851768 852250 1452672 1617988 675010 -395544 -343769 472510 746160
39892 746160 174038 -416822 -567504 -697202 -1143297 -1562564 -1440553 -698818 249004 751275
39882 751275 369719 -638207 -1476039 -1661543 -1447516 -1232685 -1002576 -640506 -328525
$$ packed form
39952A842281J6568n56229m61556J60802M46720P3925l30005k70330r5311j83735
39942F43130k17176Q7035K67100n1642l21429k395L61381P9453l51959j37862
39932C55636K27210k10825r34946o19789N08039Q61784Q7143m56807p8458L06263
39922D5250R4151m3924K05853O4942n99292o18619L75733R65685K53631n50600
39912A92810k34801L59014J1544o08821k18593P16712Q38914K30363k3793J07802
39902A371151j09466m09917M82O00422J65316r42978j070554N1775Q16279K73650
39892G46160n72122n90860j50682j29698m46095m19267J22011P41735R47822N02271
39882G51275l81556j007926q37832j85504K14027K14831K30109L62070L11981
$$ plain form
39873 -328525 -247162 -238600 -114413 40825 148986 323272 505824 379503 -44802 -229273
39863 -229273 135622 622785 694268 418269 193420 159698 233357 342001 331785 59951
39853 59951 -191758 70738 688046 851931 313572 -139814 126177 681965 890997 908826
39843 908826 1082597 1076724 528765 4255 236696 772451 479052 -698193 -1516256 -1092320
39833 -1092320 42862 767514 636292 105303 -102638 288797 812165 724907 -67125
39824 -67125 -840707 -1050671 -1025832 -1224768 -1323952 -769004 125320 476087 118695 -190448
39814 -190448 101973 667626 853621 442559 -219830 -537887 -189164 378472 229120 -898785
39804 -898785 -2054954 -2211589 -1575647 -1137043 -1243831 -1398996 -1261633 -1016438 -796728
$$ packed form
39873c28525Q1363Q562J24187J55238J08161J74286J82552j26321m24305j84471
39863b29273L64895M87163P1483k75999k24849l3722P3659J08644j0216k71834
39853E9951k51709K62496O17308J63885n38359m53386K65991N55788K09032J7829
39843I08826J73771n873n47959n24510K32441N35755k93399j177245q18063M23936
39833a092320J135182P24652j31222n30989k07941L91435N23368q7258p92032
39824f7125p73582k09964K4839j98936r9184N54948Q94324L50767l57392l09143
39814a90448K92421N65653J85995m11062o62389l18057L48723N67636j49352j127905
39804h98785j156169j56635O35942M38604j06788j55165J37363K45195K19710
$$ plain form
39795 -796728 -501312 -201195 -63350 98145 529571 878611 583773 -107158 -326014 130857
39785 130857 513932 276188 -259498 -608371 -741693 -694255 -266433 470085 940750 771473
39775 771473 298355 30499 -3465 -52648 -143111 -111930 88632 361149 586880 683302
39765 683302 683036 723427 800749 733931 617980 938300 1768415 2286466 1801879 886510 578135
39754 578135 760892 471514 -308083 -501106 225158 820957 540677 15654 -31616 34868
39744 34868 -244735 -312206 431783 1339178 1381288 736039 349847 358969 173089 -121288
39734 -121288 273071 1442517 2460035 2756153 2809770 3116027 3349360 3082282 2641725
39725 2641725 2579985 2707382 2344613 1409969 640540 606836 961482 981210 602168 448689
$$ packed form
39795g96728K95416L00117J37845J61495M31426L49040k94838o90931k18856M56871
39785A30857L83075k37744n35686l48873j33322M7438M27822P36518M70665j69277
39775G71473m73118k67856l3964m9183r0463L1181K00562K72517K25731R6422
39765F83302k66M0391P7322o6818j15951L20320Q30115N18051m84587r15369l08375
39754E78135J82757k89378p79597j93023P26264N95799k80280n25023m7270O6484
39744C4868k79603o7471P43989R07395M2110o45249l86192R122j85880k94377
39734a21288L94359J169446J017518K96118N3617L06257K33333k67078m40557
39725B641725o1740J27397l62769r34644p69429l3704L54646J9728l79042j53479
$$ plain form
39715 448689 802601 1066409 633167 -84392 -125281 623810 1201756 880666 56248 -452097
39705 -452097 -402507 -26717 556438 1274724 1771189 1684352 1131707 547358 180927 30046
39695 30046 56985 194985 341447 544278 921494 1263896 1178547 853545 1082983 2101674
39685 2101674 2993192 2883511 2231364 2176895 2944199 3696045 3802364 3468975 3133729 2931936
39675 2931936 2826442 2720650 2401712 1820616 1370936 1425162 1705203 1632637 1192737 877556
39665 877556 844574 743720 390054 34141 -93792 -17316 221071 563619 753583 631228
39655 631228 511171 725025 939150 596489 -67193 -223109 324646 902421 1042688 994920
39645 994920 1004181 896848 644542 567506 672649 536277 159923 149846 646103 884301
$$ packed form
39715D48689L53912K63808m33242p17559m0889P49091N77946l21090q24418n08345
39705d52097M9590L75790N83155P18286M96465q6837n52645n84349l66431j50881
39695C0046K6939J38000J46462K02831L77216L42402q5349l25002K29438J018691
39685B101674Q91518j09681o52147n4469P67304P51846J06319l33389l35246k01793
39675B931936j05494j05792l18938n81096m49680N4226K80041p2566m39900l15181
39665H77556l2982j00854l53666l55913j27933P6476K38387L42548J89964j22355
39655F31228j20057K13854K14125l42661o63682j55916N47755N77775J40267m7768
39645I94920R261j07333k52306p7036J05143j36372l76354j0077M96257K38198
$$ plain form
39635 884301 343491 -432816 -751352 -759344 -837880 -739590 -188015 271719 2896 -569403
39625 -569403 -548039 -11146 201911 19543 300779 1294593 1992410 1487544 220047 -667195
39615 -667195 -689328 -242031 135541 206617 -38920 -451743 -750839 -757156 -584912 -457570
39605 -457570 -410650 -312100 -103150 116463 221894 206868 201173 351493 646383 878146
39595 878146 844199 573728 299503 232549 404238 663402 780013 654004 487036 599126
39585 599126 960737 1090511 631714 -106585 -456601 -179776 332293 631415 667451 573770
39575 573770 319094 -148201 -569224 -553021 -152872 49579 -308168 -732109 -399571 659143
39565 659143 1399721 1059753 164788 -273571 -223555 -524828 -1372683 -1820430 -1158964 -44685
$$ packed form
39635H84301n40810p76307l18536p992p8536R8290N51575M59734k68823n72299
39625e69403K1364N36893K13057j82368K81236R93814O97817n04866j267497q87242
39615f67195k2133M47297L77572P1076k45537m12823k99096o317J72244J27342
39605d57570M6920R8550K08950K19613J05431j5026n695J50320K94890K31763
39595H78146l3947k70471k74225o6954J71689K59164J16611j26009j66968J12090
39585E99126L61611J29774m58797p38299l50016K76825N12069K99122L6036r3681
39575E73770k54676m67295m21023J6203M00149K02451l57747m23941L32538J058714
39565F59143P40578l39968q94965m38359N0016l01273q47855m47747O61466J114279
$$ plain form
39555 -44685 375167 -19463 -381715 -205963 162350 286643 226426 192437 145146 38915
39545 38915 125903 654767 1375712 1645223 1111272 172635 -388552 -253140 113935 125628
39535 125628 -134006 -114831 298060 592115 455211 280931 539969 1063830 1344506 1232814
39525 1232814 948053 667773 497410 578194 816624 776437 271144 -231327 -285350 -215428
39515 -215428 -552671 -1007194 -810029 4892 503573 153103 -530856 -836181 -661917 -224631
39505 -224631 360097 842065 790674 228507 -182503 -28705 242880 87799 -193174 105301
39495 105301 969701 1631221 1587552 1103104 650361 345682 106204 -2119 152760 475551
39485 475551 642061 417036 -76255 -443396 -421707 -178877 -113476 -357658 -622781 -587683
$$ packed form
39555d4685M19852l94630l62252J75752L68313J24293o0217l3989m7291j06231
39545C8915Q6988N28864P20945K69511n33951r38637n61187J35412L67075J1693
39535A25628k59634J9175M12891K94055j36904j74280K59038N23861K80676j11692
39525A232814k84761k80280j70363Q0784K38430m0187n05293n02471n4023O9922
39515b15428l37243m54523J97165Q14921M98681l50470o83959l05325J74264M37286
39505b24631N84728M81968n1391n62167m11010J53798K71585j55081k80973K98475
39495A05301Q64400O61520m3669m84448m52743l04679k39478j08323J54879L22791
39485D75551J66510k25025m93291l67141K1689K42830O5401k44182k65123L5098
$$ plain form
39475 -587683 -287044 -15850 35232 -62553 -114630 -16131 139276 143196 -80699 -332823 -340685
39464 -340685 -98905 101411 -11084 -423116 -868242 -1056929 -928362 -719392 -674319 -669373
39454 -669373 -365472 195421 524376 433362 400067 779320 1102965 785888 170774 72847
39444 72847 478327 596818 198854 -50183 218906 478747 260783 -122488 -278804 -402234
39434 -402234 -685340 -748786 -295719 236028 331645 205022 284057 384744 150783 -103735
39424 -103735 162623 700421 745097 185097 -334126 -415230 -269384 -91624 162822 302492
39414 302492 -52910 -740017 -1012048 -517088 201690 472317 315261 184373 249831 304216
39404 304216 193227 29441 6218 149516 282032 249714 176798 337849 708448 901908
$$ packed form
39475e87683L00639K71194N1082r7785n2077R8499J55407L920k23895k52124p862
39464c40685K41780K00316j12495m12032m45126j88687J28567K08970M5073M946
39454f69373L03901N60893L28955r1014l3295L79253L23645l17077o15114r7927
39444G2847M05480J18491l97964k49037K69089K59841k17964l83271j56316j23430
39434d02234k83106o3446M53067N31747R5617j26623P9035J00687k33961k54518
39424a03735K66358N37798M4676n60000n19223q1104J45846J77760K54446J39670
39414C02492l55402o87107k72031M94960P18778K70627j57056j30888O5458N4385
39404C04216j10989j63786k3223J43298J32516l2318p2916J61051L70599J93460
$$ plain form
39394 901908 727109 498693 508401 521976 215327 -181806 -190067 172060 464368 489910 375325
39383 375325 164624 -119832 -204563 39274 147847 -271971 -672448 -281963 450557 283932
39373 283932 -810122 -1327720 -401810 890845 1164745 649611 474296 820329 979462
39364 979462 779595 717318 823359 544681 -159854 -600805 -441210 -138904 -47003 115619
39354 115619 524726 728767 388217 -52377 -27464 252310 196739 -186059 -391162 -326333
39344 -326333 -387080 -594319 -393324 406994 1106235 988791 312077 -111829 -42577 80071
39334 80071 10474 -6905 117486 70301 -189399 -141386 441708 881359 468151 -421118
39324 -421118 -824760 -608000 -531917 -904903 -1071009 -555272 95142 194039 44667 446654
$$ packed form
39394I01908j74799k28416R708J3575l06649l97133q261L62127K92308K5542j14585
39383C75325k10701k84456q4731K43837J08573m19818m00477L90485P32520j66625
39373B83932j094054n17598R25910J292655K73900n15134j75315L46033J59133
39364I79462j99867o2277J06041k78678p04535m40951J59595L02306R1901J62622
39354A15619M09107K04041l40550m40594K4913K79774n5571l82798k05103O4829
39344c26333o0747k07239K00995Q00318O99241j17444o76714m23906O9252J22648
39334H0071o9597j7379J24391m7185k59700M8013N83094M39651m13208q89269
39324d21118m03642K16760P6083l72986j66106N15737O50414R8897j49372M01987
$$ plain form
39314 446654 1394547 2042252 1916138 1467765 1272048 1263916 1090598 798195 722475 881514
39304 881514 914964 641919 328657 271661 384979 421572 412182 571766 845313 919455 759388
39293 759388 765149 1179396 1647171 1674398 1297965 944402 800030 745714 810213 1175028
39283 1175028 1674952 1802249 1421482 1060434 1178174 1471426 1325396 786946 603725
39274 603725 1191760 1932879 1826307 755809 -239922 -141584 830329 1504867 1193509 392169
39264 392169 -54341 -1235 113499 36616 -126507 -267069 -332046 -203798 41271 -19791
39254 -19791 -533857 -862998 -400341 293915 78802 -998991 -1522583 -652487 658507
39245 658507 1020667 457283 100913 484330 984012 843561 55236 -823840 -1237901 -945079
$$ packed form
39314D46654R47893O47705j26114m48373j95717q132j73318k92403p5720J59039
39304H81514L3450k73045l13262n6996J13318L6593r390J59584K73547P4142j60067
39293G59388N761M14247M67775K7227l76433l53563j44372n4316O4499L64815
39283A175028M99924J27297l80767l61048J17740K93252j46030n38450j83221
39274F03725N88035P41119j06572j070498r95731R8338R71913O74538l11358q01340
39264C92169m46510N3106J14734p6883j63123j40562o4977J28248K45069o1062
39254a9791n14066l29141M62657O94256k15113j077793n23592Q70096J310994
39245F58507L62160n63384l56370L83417M99682j40451p88325q79076m14061K92822
$$ plain form
39235 -945079 -138308 645806 948659 752045 333013 -96028 -438983 -596043 -542030 -415349
39225 -415349 -320773 -144546 257449 790565 1188320 1252226 950414 439100 41738 -13840
39215 -13840 108657 89834 12227 283202 890176 1212389 838168 136455 -310787 -432727
39205 -432727 -441611 -292448 107374 429543 245751 -275198 -483796 -74162 572195 894733
39195 894733 741021 418108 309513 424785 305149 -452346 -1556152 -2199278 -1956002
39186 -1956002 -1162935 -334283 340752 760309 723779 311380 -19995 -55473 -82065 -244557
39176 -244557 -228252 37519 44925 -373330 -492039 200171 980309 882268 198729 -20650
39166 -20650 393784 676617 497492 278525 191420 -77342 -457515 -396839 167099 626149
$$ packed form
39235i45079Q06771P84114L02853j96614m19032m29041l42955j57060N4013J26681
39225d15349R4576J76227M01995N33116L97755O3906l01812n11314l97362n5578
39215a3840J22497j8823p7607K70975O06974L22213l74221p01713m47242j21940
39205d32727q884J49163L99822L22169j83792n20949k08598M09634O46357L22538
39195H94733j53712l22913j08595J15272j19636p57495j103806o43126K43276
39186a956002P93067Q28652O75035M19557l6530m12399l31375l5478k6592j62492
39176b44557J6305K65771P406m18255j18709O92210P80138r8041o83539k19379
39166b0650M14434K82833j79125k18967q7105k68762l80173O0676N63938M59050
$$ plain form
39156 626149 689870 699617 767563 513217 -40055 -192415 381799 1069179 1234411 1005073
39146 1005073 711513 246584 -479114 -1033569 -1002572 -622319 -382626 -334050 -183322 227525
39136 227525 828951 1394203 1535943 1060354 442962 380758 724999 582214 -263609 -877526
39126 -877526 -591494 -34694 -41260 -292135 32366 790544 1099533 750447 428676 580063
39116 580063 900188 1002213 880402 617912 240668 -45988 -17655 90998 -210443 -881547
39106 -881547 -1267615 -967670 -357417 -48844 -171738 -397912 -429984 -281762 -210113 -441269
39096 -441269 -855477 -994226 -562144 164893 666763 798115 766873 614040 170059 -451058
39086 -451058 -808834 -776275 -801446 -1232966 -1708327 -1595027 -859244 -107368 166973 7740
$$ packed form
39156F26149O3721R747O7946k54346n53272j52360N74214O87380J65232k29338
39146A005073k93560m64929p25698n54455L0997L80253K39693M8576J50728M10847
39136B27525O01426N65252J41740m75589o17392o2204L44241j42785q45823o13917
39126h77526K86032N56800o566k50875L24501P58178L08989l49086l21771J51387
39116E80063L20125J02025j21811k62490l77244k86656K8333J08653l01441o71104
39106h81547l86068K99945O10253L08573j22894k26174l2072J48222P1649k31156
39096d41269m14208j38749M32082P27037N01870J31352l1242j52833m43981o21117
39086d51058l57776L2559k5171m31520m75361J13300P35783P51876K74341j59233
$$ plain form
39076 7740 -323698 -680590 -898778 -723348 -190726 172239 -60947 -557064 -604629 -119406
39066 -119406 246472 102993 -119173 114845 661257 1018495 1009042 709204 126296 -518376
39056 -518376 -605494 90678 754228 469883 -419427 -798909 -494969 -448031 -1069317 -1528968
39046 -1528968 -1086165 -167944 436850 656703 793453 795725 556710 384084 507656 580451
39036 580451 287608 -4287 155592 490088 462473 183698 137666 294777 219035 -147529
39026 -147529 -485843 -718357 -982838 -1137258 -928271 -541807 -372452 -340139 -45578 459469
39016 459469 660739 331869 -233257 -710112 -968734 -883666 -454747 -74272 -151004 -500551
39006 -500551 -597274 -342332 -49634 204845 571832 827150 511578 -238719 -698668 -576774
$$ packed form
39076G740l31438l56892k18188J75430N32622L62965k33186m96117m7565M85223
39066a19406L65878j43479k22166K34018N46412L57238r453k99838n82908o44672
39056e18376q7118O96172O63550k84345q89310l79482L03940M6938o21286m59651
39046a528968M42803R18221O04794K19853J36750K272k39015j72626J23572P2795
39036E80451k92843k91895J59879L34496k7615k78775m6032J57111p5742l66564
39026a47529l38314k32514k64481j54420K08987L86464J69355L2313K94561N05047
39016D59469K01270l28870n65126m76855k58622Q5068M28919L80475p6732l49547
39006e00551r6723K54942K92698K54479L66987K55318l15572p50297m59949J21894
$$ plain form
38996 -576774 -386995 -548555 -731171 -475189 28391 238427 53761 -114735 63520 482375
38986 482375 812788 886631 804595 687470 436509 -50691 -469753 -333670 244021 493751
38976 493751 49092 -466740 -397274 -29738 80640 219989 976947 1939539 2075561 1359426
38966 1359426 876288 1139208 1393939 954477 245553 6010 248998 538774 648596
38957 648596 486755 -5643 -458612 -225479 613525 1061653 549676 -160841 -33969 826229
38947 826229 1493215 1535872 1348185 1432608 1928047 2661422 3240052 3300595 2960963 2705652
38937 2705652 2603215 2160919 1267067 609256 643888 815994 478824 -23299 -5706 339710
38927 339710 308881 -96476 -285989 -187407 -256160 -488620 -409401 -63722 -65195 -507628 -725412
$$ packed form
38996e76774J89779j61560j82616K55982N03580K10036j84666j68496J78255M18855
38986D82375L30413P3843q2036j17125k50961m87200m19062J36083N77691K49730
38976D93751m44659n15832O9466L67536J10378J39349P56958R62592J36022p16135
38966A359426m83138K62920K54731m39462p08924k39543K42988K89776J09822
38957F48596j61841m92398m52969K33133Q39004M48128n11977p10517J26872Q60198
38947H26229O66986M2657j87687Q4423M95439P33375N78630O0543l39632k55311
38937B705652j02437m42296q93852o57811L4632J72106l37170n02123J7593L45416
38927C39710l0829m05357j89513R8582o8753k32460P9219L45679j473m42433k17784
$$ plain form
38916 -725412 -386274 -3778 -37801 -225341 -192782 -73956 -78105 -16731 245635 334617 -110617
38905 -110617 -778215 -1050026 -833295 -595666 -680533 -948091 -1068365 -912710 -626682 -422235
38895 -422235 -301404 -24566 530351 1074564 1233142 1101467 1124295 1410642 1572648 1337377
38885 1337377 906986 556694 290626 116637 240994 655279 873584 492838 -186852
38876 -186852 -479185 -137404 437949 727516 581679 261134 172169 451292 700237 367325
38866 367325 -453719 -952738 -628336 -16858 65968 -302341 -373634 35678 294676 34126
38856 34126 -279875 -179345 29741 -181591 -706123 -1066910 -1221692 -1474297 -1764944 -1721461
38846 -1721461 -1405348 -1339562 -1641038 -1741620 -1261717 -617211 -353190 -341350 -155699 132237
$$ packed form
38916g25412L39138L82496l4023j87540L2559J18826m149O1374K62366Q8982m45234
38905a10617o67598k71811K16731K37629q4867k67558j20274J55655K86028K04447
38895d22235J20831K76838N54917N44213J58578j31675K2828K86347J62006k35271
38885A337377m30391l50292k66068j73989J24357M14285K18305l80746o79690
38876a86852k92333L41781N75353K89567j45837l20545q8965K79123K48945l32912
38866C67325q21044m99019L24402O11478Q2826l68309p1293M09312K58998k60550
38856C4126l14001J00530K09086k11332n24532l60787j54782k52605k90647M3483
38846a721461L16113O5786l01476j00582M79903O44506K64021J1840J85651K87936
$$ plain form
38836 132237 178535 152900 539138 1149892 1121893 163277 -853618 -990607 -439334 -76856
38826 -76856 -176872 -217776 136157 519160 478772 110766 -201389 -364657 -561448 -801516
38816 -801516 -825686 -511282 -150934 -149532 -488566 -669722 -282451 486999 1064772 1132673
38806 1132673 852444 483168 77517 -344784 -622796 -671783 -655440 -693802 -581372 -90010
38796 -90010 566136 887254 678466 208976 -211813 -549283 -887328 -1177473 -1239797 -923126
38786 -923126 -266929 422428 756712 666565 503501 582298 783492 825217 716785 613178
38776 613178 427596 50991 -180189 183853 901074 1186287 811631 435022 550887 730451
38766 730451 366989 -332216 -679226 -474935 -44424 426013 931488 1191284 866076 251148
$$ packed form
38836A32237M6298k5635L86238O10754k7999r58616j016895j36989N51273L62478
38826g6856j00016m0904L53933L83003m0388l68006l12155j63268j96791k40068
38816h01516k4170L14404L60348J402l39034j81156L87271P69450N77773O7901
38806A132673k80229l69276m05651m22301k78012m8987J6343l8362J12430M91362
38796i0010O56146L21118k08788m69490m20789l37470l38045k90145o2324L16671
38786i23126O56197O89357L34284r0147j63064P8797K01194M1725j08432j03607
38776F13178j85582l76605k31180L64042P17221K85213l74656l76609J15865J79564
38766G30451l63462o99205l47010K04291M30511M70437N05475K59796l25208o14928
$$ plain form
38756 251148 82078 504042 836915 587207 124542 22356 225795 313273 207633 124983
38746 124983 46141 -252454 -720299 -1017991 -980670 -758397 -503112 -245312 -103387 -282066
38736 -282066 -749386 -1149362 -1150526 -743182 -176704 221443 189227 -239868 -604741 -397512
38726 -397512 299221 797126 588494 -41975 -367591 -35313 642591 1098848 1035770 595412
38716 595412 148740 -78551 -197887 -443095 -828370 -1170124 -1378321 -1464758 -1297129 -725275
38706 -725275 -30854 186461 -207668 -621835 -558742 -284622 -282581 -446118 -370779 -136691
38696 -136691 -135765 -294011 -177892 172791 252035 1730 -13903 448976 882803 830025 472672
38685 472672 77737 -484735 -1188132 -1437274 -868739 -113559 -47084 -570361 -840229 -509602
$$ packed form
38756B51148j69070M21964L32873k49708m62665j02186K03439Q7478j05640q2650
38746A24983p8842k98595m67845k97692L7321K22273K55285K57800J41925j78679
38736b82066m67320l99976j164M07344N66478L98147l2216m29095l64873K07229
38726c97512O96733M97905k08632o30469l25616L32278O77904M56257o3078m40358
38716E95412m46672k27291j19336k45208l85275l41754k08197q6437J67629N71854
38706g25275O94421K17315l94129m14167O3093K74120K041j63537P5339K34088
38696a36691R26j58246J16119L50683P9244k50305j5633M62879M33827n2778l57353
38685D72672l94935n62472p03397k49142N68535P55180O6475n23277k69868L30627
$$ plain form
38675 -509602 -14791 280295 485233 663431 590190 232481 -71009 -148817 -278272 -683484
38665 -683484 -1110063 -1147992 -718874 -65827 499085 713473 503459 138332 -3652 87887
38655 87887 105408 9673 145101 584131 809133 406955 -266418 -548439 -353182 -118764
38645 -118764 -26735 181849 583677 786175 490547 -7971 -176140 82845 371279 323470
38635 323470 -33032 -406324 -522452 -258457 307809 868710 1036652 691008 155043 -105172
38625 -105172 30141 258711 275079 104045 -56843 -153206 -258435 -348056 -306927 -141646
38615 -141646 12471 111229 236336 372848 366843 213225 189776 526621 1078616 1531688
38605 1531688 1833209 2156759 2473110 2485762 2119356 1781049 1870834 2214276 2319753 2121534
$$ packed form
38675e09602M94811K95086K04938J78198p3241l57709l03490p7808j29455m05212
38665f83484m26579l7929M29118O53047N64912K14388k10014l65127j41984R1539
38655H7887J7521r5735J35428M39030K25002m02178o73373k82021J95257K34418
38645a18764R2029K08584M01828K02498k95628m98518j68169K58985K88434m7809
38635C23470l56502l73292j16128K63995N66266N60901J67942l45644n35965k60215
38625a05172J35313K28570J6368j71034j60888r6363j05229q9621M1129J65281
38615a41646J54117R8758J25107J36512o005j53618k3449L36845N51995M53072
38605A531688L01521L23550L16351J2652l66406l38307Q9785L43442J05477j98219
$$ plain form
38595 2121534 2063878 2378263 2696250 2620273 2331742 2273604 2476165 2626154 2645736 2704345
38585 2704345 2696532 2255190 1415040 775129 750681 1034016 1070127 774583 514557 609801
38575 609801 1073727 1638087 1883599 1613780 1215789 1275092 1683680 1641026 838954 82362
38565 82362 231687 1012150 1500996 1418861 1228490 1213023 1210577 1143966 1111669 1017966 754914
38554 754914 641759 994818 1386624 1122781 380502 -1572 145154 171519 -124883 -181732
38544 -181732 117514 77648 -463144 -567437 276482 1096530 842193 -13823 -317242 53542
38534 53542 439855 749672 1295450 1716717 1394592 723155 647720 1019642 773532 -167536
38524 -167536 -579643 111984 907735 850846 388682 368528 691323 833909 876778 1092249
$$ packed form
38595B121534n7656L14385L17987p5977k88531n8138K02561J49989J9582N8609
38585B704345p813m41342q40150o39911k4448K83335L6111k95544k60026R5244
38575F09801M63926N64360K45512k69819l97991N9303M08588m2654q02072p56592
38565H2362J49325P80463M88846q2135j90371j5467k446o6611l2297r3703k63052
38554G54914j13155L53059L91806k63843p42279l82074J46726K6365k96402n6849
38544a81732K99246l9866n40792j04293Q43919Q20048k54337q56016l03419L70784
38534E3542L86313L09817N45778M21267l22125o71437p5435L71922k46110r41068
38524a67536m12107O91627P95751n6889m62164k0154L22795J42586M2869K15471
$$ plain form
38514 1092249 1198407 966751 975827 1740266 2555737 2307675 1148540 264239 104201 -17903
38504 -17903 -503485 -807195 -534150 -185675 -252090 -329379 220047 1246008 2031792 2161533
38494 2161533 1692201 837412 -23626 -347066 44716 655358 965880 1106160 1400180
38485 1400180 1591194 1207924 514501 315004 787636 1254765 1258853 1131810 1203294 1165326
38475 1165326 727423 312774 440252 806260 715781 237903 183948 907374 1787258 2083018
38465 2083018 1768527 1280703 901450 715654 845889 1343900 1976220 2368059 2294865 1757893
38455 1757893 984434 454985 617211 1336281 1897361 1839529 1531008 1558594 1798532 1627429
38445 1627429 983518 609545 1039942 1815728 2047862 1483914 675659 256127 376594
$$ packed form
38514A092249J06158k31656R076P64439Q15471k48062j159135q84301j60038j22104
38504a7903m85582l03710K73045L48475o6415p7289N49426J025961P85784J29741
38494B161533m69332q54789q61038l23440L91782O10642L10522J40280K94020
38485A400180J91014l83270o93423j99497M72632M67129M088j27043P1484l7968
38475A165326m37903m14649J27478L66008r0479m77878n3955P23426Q79884K95760
38465B083018l14491m87824l79253j85796J30235M98011O32320L91839p3194n36972
38455A757893p73459n29449J62226P19070N61080n7832l08521K7586K39938j71103
38445A627429o43911l73973M30397P75786K32134n63948q08255m19532J20467
$$ plain form
38436 376594 759403 966326 620516 -298420 -1262758 -1555587 -993868 -128193 417212 595071
38426 595071 701191 715134 320510 -406101 -806023 -412092 396825 870097 837195 789249
38416 789249 1063093 1369992 1270264 795960 363874 228030 243222 139332 -118665 -284793
38406 -284793 -109268 378495 914129 1295126 1473981 1332126 670035 -337261 -961345
38397 -961345 -624617 352278 1152559 1503909 1773639 2073516 1989933 1423831 1008251 1245542
38387 1245542 1750396 1852701 1537386 1253086 1132097 980749 803885 761204 760265 631910
38377 631910 572542 866705 1276067 1269982 818549 403842 251062 104076 -185804 -385149
38367 -385149 -307590 -66287 199782 454311 588957 536882 539939 825973 1068819 754855
$$ packed form
38436C76594L82809K06923l45810r18936r64338k92829N61719Q65675N45405J77859
38426E95071J06120J3943l94624p26611l99922L93931Q08917M73272l2902m7946
38416G89249K73844L06899r9728m74304m32086j35844J5192j03890k57997j66128
38406b84793J75525M87763N35634L80997J78855j41855o62091j007296o24084
38397i61345L36728R76895Q00281L51350K69730K99877q3583n66102m15580K37291
38387A245542N04854J02305l15315k84300j20989j51348j76864m2681r39j28355
38377F31910n9368K94163M09362o085m51433m14707j52780j46986k89880j99345
38367c85149P7559K41303K66069K54529J34646n2075L057K86034K42846l13964
$$ plain form
38357 754855 82514 -180142 181860 579358 660694 811444 1286826 1628619 1438480 1048646
38347 1048646 853558 587820 -73975 -708319 -653437 14414 654107 907762 806131 390568
38337 390568 -131612 -198570 430617 1085110 989344 416192 264091 690487 1028795 971623
38327 971623 906593 987411 780998 124045 -437523 -455335 -244620 -359806 -831933 -1246053
38317 -1246053 -1261891 -857669 -325366 -77567 -158246 -41452 646684 1388357 1407324 902261
38307 902261 792320 1212401 1251643 454358 -398381 -474617 6603 406136 598577 669440
38297 669440 446825 28192 65168 772298 1326098 1059463 569747 700226 1094197 922723
38287 922723 513859 877228 1842318 2112798 1270530 395813 385689 846234 1101913 1232552
$$ packed form
38357G54855o72341k62656L62002L97498Q1336J50750M75382L41793j90139l89834
38347A048646j95088k65738o61795o34344N4882O67851O39693K53655j01631m15563
38337C90568n22180o6958O29187O54493r5766n73152j52101M26396L38308n7172
38327I71623o5030Q0818k06413o56953n61568j7812K10715j15186m72127m14120
38317a246053j5838M04222N32303K47799q0679J16794O88136P41673J8967n05063
38307I02261j09941M20081L9242p97285q52739p6236M81220L99533J92441P0863
38297F69440k22615m18633L6976P07130N53800k66635m89716J30479L93971j71474
38287I22723m08864L63369R65090K70480q42268q74717j0124M60545K55679J30639
$$ plain form
38277 1232552 1520902 1762220 1761044 1787223 1927774 1649131 653612 -396650 -692344 -373954
38267 -373954 -165837 -279387 -342732 -175700 11591 107162 266975 592755 966558 1174391
38257 1174391 1021330 497982 -9693 44340 711451 1419053 1685915 1610712 1455365 1223692
38247 1223692 980843 1090693 1665335 2190042 2201622 1978442 2030517 2249129 2155117 1724075
38237 1724075 1352400 1181735 1026905 838188 725827 671177 660545 866846 1227999 1196492
38227 1196492 521535 -84005 175418 930990 1170265 795083 652377 1064783 1409222
38218 1409222 1303085 1150937 1203294 1067371 583452 274620 422743 544458 325330 230506
38208 230506 562333 767692 472035 400682 1275938 2416833 2563191 1719213 1038098 1054555
$$ packed form
38277A232552K88350K41318j176K6179J40551k78643r95519j050262k95694L18390
38267c73954K08117j13550o3345J67032J87291R5571J59813L25780L73803K07833
38257A174391j53061n23348n07675N4033O67111P07602K66862p5203j55347k31673
38247A223692k42849J09850N74642N24707J1580k23180N2075K18612r4012m31042
38237A724075l71675j70665j54830j88717j12361n4650j0632K06301L61153l1507
38227A196492o74957o05540K59423P55572K39275l75182j42706M12406L44439
38218A409222j06137j52148N2357j35923m83919l08832J48123J21715k19128r4824
38208B30506L31827K05359k95657p1353Q75256J140895J46358q43978o81115J6457
$$ plain form
38198 1054555 1176668 965084 806977 1035856 1315477 1315919 1256506 1323219 1185475 629139
38188 629139 177475 462605 1238584 1611088 1212197 676683 817361 1608980 2215606 1975768
38178 1975768 1157553 580926 589931 724654 512920 193122 297388 808190 1232985 1374972
38168 1374972 1466319 1552994 1362769 930370 744607 961374 1023276 540907 105405 558496
38158 558496 1658943 2215427 1636048 678153 333799 523670 471977 62614 49488 822335
38148 822335 1674969 1736016 1133932 633573 426749 51322 -542919 -704125 -124941 576437
38138 576437 804752 883348 1357959 1917141 1831825 1189918 804781 958137 1118789 1022428
38128 1022428 1132685 1672550 2005856 1578776 887392 785500 1178251 1185163 526189 -2742
$$ packed form
38198A054555J22113k11584j58107K28879K79621M42n9413O6713j37744n56336
38188F29139m51664K85130P75979L72504l98891n35514J40678P91619O06626k39838
38178A975768q18215n76627R005J34723k11734l19798J04266N10802M24795J41987
38168A374972R1347Q6675j90225m32399j85763K16767O1902m82369m35502M53091
38158E58496J100447N56484n79379r57895l44354J89871n1693m09363j3126P72847
38148H22335Q52634O1047o02084n00359k06824l75427n94241j61206N79184P01378
38138E76437K28315P8596M74611N59182q5316o41907l85137J53356J60652r6361
38128A022428J10257N39865L33306m27080o91384j01892L92751O912o58974n28931
$$ plain form
38118 -2742 344790 1219966 1669703 1397439 1067166 1340830 2012237 2354390 2108063 1724238
38108 1724238 1613984 1590843 1301926 873460 735360 985041 1327674 1547041 1640976 1567352
38098 1567352 1285188 1014492 1006500 1068423 818045 434056 553676 1269292 1859595 1830176
38088 1830176 1619038 1805253 2143899 2015047 1495064 1291525 1715416 2312397 2536867
38079 2536867 2317829 1901908 1548760 1486711 1835684 2423474 2875111 2974907 2821044 2637228
38069 2637228 2580600 2693673 2878801 2959361 2908301 2925961 3120808 3238876 2962646 2410604
38059 2410604 2062974 2173803 2477285 2526400 2171392 1664335 1384704 1469392 1670162 1626658
38049 1626658 1293530 965459 854727 854388 797922 702333 619556 514540 471811 746737 1383565
$$ packed form
38118b742L47532Q75176M49737k72264l30273K73664O71407L42153k46327l83825
38108A724238j10254k3141k88917m28466j38100K49681L42633K19367R3935p3624
38098A567352k82164k70696p992O1923k50378l83989J19620P15616N90303k9419
38088A830176k11138J86215L38646j28852n19983k03539M23891N96981K24470
38079B536867k19038m15921l53148o2049L48973N87790M51637R9796j53863j83816
38069B637228n6628J13073J85128Q0560n1060J7660J94847J18068k76230n52042
38059B410604l47630J10829L03482M9115l55008n07057k79631Q4688K00770m3504
38049A626658l33128l28071j10732l39n6466r5589q2777j05016m2729K74926O36828
$$ plain form
38038 1383565 2039544 2410784 2541487 2482993 2042355 1235589 603262 591773 928884 1110111
38028 1110111 1174471 1402585 1563691 1215481 578982 318741 500670 557835 318409 256151
38018 256151 589429 929643 1048649 1240999 1644866 1921693 1923566 1987023 2249962 2399517
38008 2399517 2435624 2881052 3791648 4412466 4392206 4439899 5003089 5200493 4142732 2591627
37998 2591627 2016440 2442315 2603286 2032514 1568271 1685793 1736393 1270170 883686 1103078
37988 1103078 1414145 1149343 558452 221455 35856 -374085 -705303 -317013 696552
37979 696552 1558261 1854475 1855239 1807953 1565606 1052727 562630 341912 233860 -16468
37969 -16468 -330282 -403515 -142498 197216 316376 225541 218892 459246 664687 382217
$$ packed form
38038A383565O55979L71240J30703n8494m40638q06766o32327j1489L37111J81227
38028A110111O4360K28114J61106l48210o36499k60241J81929N7165k39426o2258
38018B56151L33278L40214J19006J92350M03867K76827J873O3457K62939J49555
38008B399517L6107M45428R10596O20818k0260M7693N63190J97404j057761j551105
37998B591627n75187M25875J60971n70772m64243J17522N0600m66223l86484K19392
37988A103078L11067k64802n90891l36997j85599m09941l31218L88290J013565
37979F96552Q61709K96214P64m7286k42347n12879m90097k20718j08052k50328
37969a6468l13814p3233K61017L39714J19160r0835o649K40354K05441k82470
$$ plain form
37959 382217 -390161 -1056523 -1050315 -480834 26497 65851 -169276 -257942 -126750 -104563
37949 -104563 -419879 -814053 -833115 -451042 -119025 -104794 -125282 99215 269660 -37786
37939 -37786 -560199 -599466 -56267 410439 368290 156986 237891 561774 866646 1065555
37929 1065555 993660 315780 -838719 -1605786 -1302046 -294583 529852 835805 864812
37920 864812 739422 400441 60445 82457 447803 834003 1127381 1398508 1528860 1380892
37910 1380892 1190475 1247681 1342549 1112878 776979 846385 1225617 1333988 1068176 861694
37900 861694 793949 505107 95308 182345 813546 1236193 1124369 1130606 1700883 2195841
37890 2195841 1866021 993810 347643 115810 123965 518533 1354328 1938797 1525848 443895
$$ packed form
37959C82217p72378o66362O208N69481N07331L9354k35127q8666J31192K2187
37949a04563l15316l94174j9062L82073L32017J4231k0488K24497J70445l07446
37939c7786n22413l9267N43199M66706m2149k11304Q0905L23883L04872J98909
37929A065555p1895o77880j154499p67067L03740J007463Q24435L05953K9007
37920H64812j25390l38981l39996K2012L65346L86200K93378K71127J30352j47968
37910A380892j90417N7206R4868k29671l35899O9406L79232J08371k65812k06482
37900H61694o7745k88842m09799Q7037O31201M22647j11824O237N70277M94958
37890B195841l29820q72211o46167k31833Q155L94568Q35795N84469m12949j081953
$$ plain form
37880 443895 -289916 -305381 -53511 177381 568679 1117800 1476590 1544304 1565881 1557143
37870 1557143 1250695 710005 408585 560733 872188 1050074 1095981 1059906 998580 1187587
37860 1187587 1826031 2499578 2528486 1933845 1463414 1539113 1782038 1735955 1441503 1082868
37850 1082868 688999 460249 778369 1538623 2030524 1877661 1589434 1762828 2220435
37841 2220435 2419409 2301007 2204667 2227457 2166743 1921230 1562869 1168008 855187 781520
37831 781520 881725 887064 780376 840462 1038073 918375 405766 131191 483758 928962
37821 928962 884366 697223 960589 1351435 1137974 561662 623625 1498647 2201138 2041244
37811 2041244 1492509 1260960 1296340 1214619 1078969 1199750 1535622 1767290 1749644 1581960
$$ packed form
37880D43895p33811j5465K51870K30892L91298N49121L58790O7714K1577q738
37870A557143l06448n40690l01420J52148L11455J77886M5907l6075o1326J89007
37860A187587O38444O73547K8908n94641m70431P5699K42925m6083k94452l58635
37850A082868l93869k28750L18120P60254M91901j52863k88227J73394M57607
37841B220435J98974j18402r6340K2790o0714k45513l58361l94861l12821p3667
37831G81520J00205N339j06688O0086J97611j19698n12609k74575L52567M45204
37821I28962m4596j87143K63366L90846k13461n76312O1963Q75022P02491j59894
37811B041244n48735k31549L5380q1721j35650J20781L35872K31668j7646j67684
$$ plain form
37801 1581960 1419248 1397560 1529161 1579507 1324165 954594 868048 1073605 1291414 1603128
37791 1603128 2308048 3042759 2916399 1884198 1110202 1371684 1935673 1839357 1519001
37782 1519001 2024662 3100329 3390607 2495974 1536412 1433399 1790372 1920510 1940064
37773 1940064 2197831 2484444 2561388 2760345 3233670 3250205 2233843 1035608 1011573 2025376
37763 2025376 2589016 2071668 1507729 1782882 2220546 1814553 958800 827811 1503741
37754 1503741 1870874 1298507 434554 172566 629194 1386505 2079198 2444606 2340853
37745 2340853 2023618 1960446 2145429 2085561 1684774 1544488 2025337 2604054 2656159 2336554
37735 2336554 2097454 1856939 1397854 1165050 1738379 2711937 3058364 2604597 2219385
$$ packed form
37801A581960j62712k1688J31601N0346k55342l69571q6546K05557K17809L11714
37791A603128P04920P34711j26360j032201p73996K61482N63989r6316l20356
37782A519001N05661J075667K90278q94633r59562j03013L56973J30138J9554
37773A940064K57767K86613P6944J98957M73325J6535j016362j198235k4035J013803
37763B025376N63640n17348n63939K75153M37664m05993q55753j30989O75930
37754A503741L67133n72367q63953k61988M56628P57311O92693L65408j03753
37745B340853l17235o3172J84983n9868m00787j40286M80849N78717N2105l19605
37735B336554k39100k40515m59085k32804N73329R73558L46427m53767l85212
$$ plain form
37726 2219385 2418746 2728754 2719324 2743459 3143691 3509504 3360727 2958492 2774432 2669604
37716 2669604 2315213 2010664 2296002 3005077 3475856 3566753 3719039 4051849 4137008 3780330
37706 3780330 3383990 3336135 3539918 3725054 3800468 3752775 3587391 3497669 3742414 4282337
37696 4282337 4869049 5450868 6046329 6306910 5855669 5111129 5041324 5879475 6791959 7114278
37686 7114278 7163297 7397278 7560324 7311548 7020761 7142921 7347377 7136968 6872774 7203715
37676 7203715 7813345 7830249 7341312 7345916 8137855 8876038 9024543 9107898 9567648 9892177
37666 9892177 9559437 9016148 8946336 9195773 9199724 8985069 8978209 9192677 9336758 9433616
37656 9433616 9666428 9884957 9902826 9989657 10416705 10835091 10820545 10705594 11049376 11583900
$$ packed form
37726B219385J99361L10008r430K4135M00232L65813j48777m02235j84060j04828
37716B669604l54391l04549K85338P09075M70779R0897J52286L32810Q5159l56678
37706C780330l96340m7855K03783J85136P5414m7693j65384q9722K44745N39923
37696D282337N86712N81819N95461K60581m51241p44540o9805Q38151R12484L22319
37686G114278M9019K33981J63046k48776k90787J22160K04456k10409k64194L30941
37676G203715O09630J6904m88937M604P91939P38183J48505Q3355M59750L24529
37666I892177l32740n43289o9812K49437L951k14655o860K14468J44081R6858
37656I433616K32812K18529J7869Q6831M27048M18386j4546j14951L43782N34524
$$ plain form
37646 11583900 11654799 11507714 12021244 13167524 13933982 14011793 14370662 15667028 17176242
37637 17176242 18002668 18400798 19036736 19722094 19891772 19803391 20207747 21125638 21969385
37628 21969385 22754853 24193757 26484376 28894311 30820837 32573539 34759815 37422584
37620 37422584 40164541 42766991 45344826 48127919 51370279 55317299 60044317 65424336
37612 65424336 71382945 78070819 85680539 94229930 103690822 114286368 126495057 140659140
37604 140659140 156616563 173845428 192032796 211321668 231763937 252640360 272630339
37597 272630339 290541418 305385542 315763854 319944991 317027783 307624287 293070578
37590 293070578 274510293 253224855 231171352 210186618 190785162 172507919 155327999
$$ packed form
37646A1583900P0899j47085N13530J146280P66458P7811L58869J296366J509214
37637A7176242Q26426L98130O35938O85358J69678q8381M04356R17891Q43747
37628B1969385P85468J438904K290619K409935J926526J752702K186276K662769
37620C7422584K741957K602450K577835K783093L242360L947020M727018N380019
37612F5424336N958609O687874P609720Q549391R460892J0595546J2208689J4164083
37604A40659140J5957423J7228865J8187368J9288872K0442269K0876423J9989979
37597B72630339J7911079J4844124J0378312M181137k917208r403496j4553709
37590B93070578j8560285k1285438k2053503k0984734j9401456j8277243j7179920
$$ plain form
37583 155327999 139896169 126459997 114503434 103693455 94338582 86531968 79607598
37576 79607598 73005937 67100974 62521625 59021762 55684593 52095441 48726087 46134601
37568 46134601 44242274 42568190 40927512 39672004 39210144 39373781 39461317 39071125 38708249
37559 38708249 39211829 40640988 42162447 43115706 43740633 44635556 45866624 46910940 47243565
37550 47243565 46709569 45459631 43724195 41602245 39065949 36313424 33971163 32541048
37542 32541048 31676673 30521041 28856514 27368208 26576635 26118911 25455950 24739016 24468893
37533 24468893 24717631 25230411 25975863 27047657 28264305 29393788 30575233 32008186
37525 32008186 33406410 34279495 34600963 34665663 34417991 33499655 31918574 30115464 28356386
$$ packed form
37583A55327999j5431830j3436172j1956563j0809979r354873p806614o924370
37576G9607598o601661n904963m579349l499863l337169l589152l369354k591486
37568D6134601j892327j674084j640678j255508m61860J63637Q7536l90192l62876
37559C8708249N03580J429159J521459R53259O24927Q94923J231068J044316L32625
37550D7243565n33996j249938j735436k121950k536296k752525k342261j430115
37542C2541048q64375j155632j664527j488306p91573m57724o62961p16934k70123
37533B4468893K48738N12780P45452J071794J216648J129483J181445J432953
37525C2008186J398224Q73085L21468O4700k47672r18336j581081j803110j759078
$$ plain form
37516 28356386 26571560 24811102 23332601 22158528 21022040 19824879 18691735 17539235
37508 17539235 16136931 14697135 13803543 13519288 13133074 12132658 10929073 10190438 9884076
37499 9884076 9491954 8866613 8294598 7854005 7293093 6593334 6153082 6205725 6393105 6200627
37489 6200627 5659630 5326486 5537478 5909259 5769984 5019043 4295268 4177233 4460677
37480 4460677 4500870 4108279 3704670 3605839 3611264 3488654 3457608 3830158 4401284 4612107
37470 4612107 4289867 3893561 3936834 4368845 4643703 4321202 3514450 2740274 2356465 2228708
37460 2228708 2043289 1849280 2021648 2627214 3136342 3013594 2402780 1912735 1819572 1848720
37450 1848720 1782401 1881221 2430827 3105503 3186926 2462211 1595820 1405408 1934491 2505534
$$ packed form
37516B8356386j784826j760458j478501j174073j136488j197161j133144j152500
37508A7539235j402304j439796q93592k84255l86214j000416j203585p38635l06362
37499I884076l92122o25341n72015m40593n60912o99759m40252N2643J87380j92478
37489F200627n40997l33144K10992L71781j39275p50941p23775j18035K83444
37480D460677M0193l92591m03609r8831N425j22610l1046L72550N71126K10823
37470D612107l22240l96306M3273M32011K74858l22501q06752p74176l83809j27757
37460B228708j85419j94009J72368O05566N09128j22748o10814m90045r3163K9148
37450A848720o6319R8820N49606O74676Q1423p24715q66391j90412N29083N71043
$$ plain form
37440 2505534 2627045 2502965 2527784 2628064 2455840 2058005 1898045 2168305 2487070 2455829
37430 2455829 2187826 2029987 2023800 1966113 1835759 1806043 1905828 2000879 2083849 2249088 2371951
37419 2371951 2183598 1761130 1577751 1877255 2324676 2528896 2605104 2868803 3220662 3302782
37409 3302782 3165603 3273191 3776968 4235917 4237900 3927610 3683707 3587775 3501308 3414394
37399 3414394 3377028 3248858 2870894 2411408 2216703 2331318 2435050 2247232 1752484 1065514
37389 1065514 367430 -17338 181362 769418 1118313 779919 -43510 -727114 -798943 -239336
37379 -239336 622866 1373388 1731244 1632584 1206641 761242 711928 1236340 1909604 2027724
37369 2027724 1520157 1166835 1543440 2149083 2137035 1562351 1153249 1071235 826025 398837
$$ packed form
37440B505534J21511j24080K4819J00280j72224l97835j59960K70260L18765l1241
37430B455829k68003j57839o187n7687j30354k9716R9785R5051Q2970J65239J22863
37419B371951j88353m22468j83379K99504M47421K04220P6208K63699L51859Q2120
37409C302782j37179J07588N03777M58949J983l10290k43903r5932q6467q6914
37399C414394l7366j28170l77964m59486j94705J14615J03732j87818m94748o86970
37389A065514o98084l84768J98700N88056L48895l38394q23429o83604p1829N59607
37379b39336Q62202P50522L57856r8660m25943m45399m9314N24412O73264J18120
37369B027724n07567l53322L76605O05643j2048n74684m09102q2014k45210m27188
$$ plain form
37359 398837 411431 934594 1152008 678124 267043 580721 1118274 1148706 926446 1041397
37349 1041397 1213687 821521 168144 64159 419196 437170 109942 286567 1127706 1679653
37339 1679653 1351843 784393 746274 1054803 1184886 1212829 1463786 1751858 1681897 1409018
37329 1409018 1472226 1972863 2363892 2070479 1129276 240985 169017 896868 1502611 1247204
37319 1247204 642155 824932 1885155 2575867 1931868 478825 -540394 -554335 113397
37310 113397 856447 1180284 947037 631307 907281 1669720 2008507 1514315 957672 1149177
37300 1149177 1765075 1976163 1685858 1369781 1138461 808727 587087 804818 1150386
37291 1150386 1011736 517820 452925 1112495 1935884 2323654 2214376 1842911 1522461 1658889
$$ packed form
37359C98837J2594N23163K17414m73884m11081L13678N37553L0432k22260J14951
37349A041397J72290l92166o53377j03985L55037J7974l27228J76625Q41139N51947
37339A679653l27810n67450l8119L08529J30083K7943K50957K88072o9961k72879
37329A409018O3208N00637L91029k93413r41203q88291p1968P27851O05743k55407
37319A247204o05049J82777J060223O90712o43999j453043j019219j3941O67732
37310A13397P43050L23837k33247l15730K75974P62439L38787m94192n56643J91505
37300A149177O15898K11088k90305l16077k31320l29734k21640K17731L45568
37291A150386j38650m93916o4895O59570Q23389L87770j09278l71465l20450J36428
$$ plain form
37281 1658889 2368140 3063644 3024506 2386933 1961645 2064709 2206089 2004539 1691242 1511293
37271 1511293 1285371 841533 342332 -62922 -433664 -720396 -767313 -768199 -1117876 -1615223
37261 -1615223 -1478574 -476123 592688 951918 796253 705130 673171 362255 -64722
37252 -64722 -67365 429872 867765 734996 85253 -593205 -802178 -435921 66721 137761
37242 137761 -222517 -421699 -91641 415489 563539 297495 -103698 -465656 -669228 -512181
37232 -512181 -8770 467784 705435 985024 1493750 1794821 1436250 794260 667636 1172262
37222 1172262 1653545 1642765 1314010 981261 715949 579589 744568 1191451 1617237 1770869
37212 1770869 1630229 1246733 733699 402328 539681 998826 1335296 1384787 1381089 1488360
$$ packed form
37281A658889P09251O95504l9138o37573m25288J03064J41380k01550l13297j79949
37271A511293k25922m43838m99201m05254l70742k86732m6917q86l49677m97347
37261a615223J36649J002451J068811L59230j55665r1123l1959l10916m26977
37252f4722k643M97237M37893j32769o49743o78458k08973L66257N02642P1040
37242A37761l60278j99182L30058N07130J48050k66044m01193l61958k03572J57047
37232e12181N03411M76554K37651K79589N08726L01071l58571o41990j26624N04626
37222A172262M81283j0780l28755l32749k65312j36360J64979M46883M25786J53632
37212A770869j40640l83496n13034l31371J37353M59145L36470M9491l698J07271
$$ plain form
37202 1488360 1587586 1588546 1587850 1606189 1480825 1134771 706336 357352 184584 284652 600561
37191 600561 775067 565341 351841 711415 1442549 1626119 875321 -52187 -249318 214427
37181 214427 601749 562830 375198 363792 592244 1047611 1683415 2238020 2338964 1905342
37171 1905342 1300123 1019097 1260200 1765479 2084544 2064567 2001683 2144668 2218025 1819621
37161 1819621 1189975 1021551 1430210 1754071 1620748 1543019 2000362 2550343 2513019 2079717
37151 2079717 1979740 2337079 2661326 2829220 3232714 3885429 4143270 3551509 2419281
37142 2419281 1354461 693861 519937 739118 986481 938534 862293 1319629 2156701 2422587
37132 2422587 1640064 565961 197009 510805 792370 836743 1088732 1686578 2072469
$$ packed form
37202A488360R9226R60o96J8339j25364l46054m28435l48984j72768J00068L15909
37191F00561J74506k09726k13500L59574P31134J83570p50798r27508j97131M63745
37181B14427L87322l8919j87632j1406K28452M55367O35804N54605J00944m33622
37171A905342o05219k81026K41103N05279L19065j9977o2884J42985P3357l98404
37161A819621o29646j68424M08659L23861j33323p7729M57343N49981l7324m33302
37151B079717r9977L57339L24247J67894M03494O52715K57841n91761j132228
37142B419281j064820o60600j73924K19181K47363m7947p6241M57336Q37072K65886
37132B422587p82523j074103l68952L13796K81565M4373K51989N97846L85891
$$ plain form
37123 2072469 1746100 961525 422567 499336 926700 1184073 1054954 792293 739696 886446
37113 886446 961132 899602 913455 1058186 1117690 1070313 1242356 1705034 1940743 1562409
37103 1562409 1030581 1081519 1635926 1904131 1528604 987071 765369 735309 596373 429423
37093 429423 474424 720970 1039338 1403552 1655771 1364352 370905 -686420 -884919 -93237
37083 -93237 814273 912483 158264 -697366 -917286 -414257 254617 445110 82795 -233991
37073 -233991 56820 709012 910248 383431 -130239 198996 1150761 1710832 1375741 688529
37063 688529 388122 536978 762382 919396 1077486 1136701 961136 761540 859343 1122728
37053 1122728 1121001 842867 737870 932281 939183 413163 -253137 -438572 -77053 416350
$$ packed form
37123B072469l26369p84575n38958P6769M27364K57373j29119k62661n2597J46750
37113H86446P4686o1530J3853J44731N9504m7377J72043M62678K35709l78334
37103A562409n31828N0938N54407K68205l75527n41533k21702l0060j38936j66950
37093D29423M5001K46546L18368L64214K52219k91419r93447j057325j98499P91682
37083i3237R07510R8210p54219q55630k19920N03029O68874J90493l62315l16786
37073b33991K90811O52192K01236n26817n13670L29235R51765N60071l35091o87212
37063F88529l00407J48856K25404J57014J58090N9215j75565j99596R7803K63385
37053A122728j727k78134j04997J94411O902n26020o66300j85435L61519M93403
$$ plain form
37043 416350 740933 872572 828420 638875 464016 457943 585559 752879 971024 1218815
37033 1218815 1358167 1397345 1587112 1994461 2252524 2059148 1660246 1459480 1403458 1203431
37023 1203431 949120 982418 1294675 1580201 1810437 2211231 2691648 2854304 2642847 2477007
37013 2477007 2642427 2981328 3242019 3279693 2889583 1993933 1093988 941855 1547139 2055500
37003 2055500 1875162 1394489 1262845 1477827 1611173 1522876 1386814 1308717 1343238 1638092
36993 1638092 2159721 2488162 2268977 1714532 1339458 1351379 1565035 1725719 1657626 1298003
36983 1298003 834657 597810 616613 578974 426833 547431 1033753 1257744 733185 -2409
36973 -2409 -55598 533764 920374 752442 547986 697676 852591 598488 165826 93481
$$ packed form
37043D16350L24583J31639m4152j89545j74859o073J27616J67320K18145K47791
37033A218815J39352L9178J89767M07349K58063j93376l98902k00766n6022k00027
37023A203431k54311L3298L12257K85526K30236M00794M80417J62656k11457j65840
37013B477007J65420L38901K60691L7674l90110q95650q99945j52133O05284N08361
37003B055500j80338m80673j31644K14982J33346q8297j36062p8097L4521K94854
36993A638092N21629L28441k19185n54445l75074J1921K13656J60684o8093l59623
36983A298003m63346k36847J8803l7639j52141J20598M86322K23991n24559p35594
36973b409n3189N89362L86610j67932k04456J49690J54915k54103m32662p2345
$$ plain form
36963 93481 538815 1206648 1688215 1667595 1076611 258595 -250259 -274475 -138444 -164475
36953 -164475 -299511 -345295 -242166 43838 594307 1254422 1550272 1190473 472765 -70278
36943 -70278 -256799 -220604 2960 457716 908748 946115 555649 236608 349440 604048
36933 604048 459930 -123488 -635617 -664179 -305989 98927 353808 412937 282778 131504
36923 131504 276305 777311 1201030 1117781 731297 633395 970581 1285976 1244679 1055675
36913 1055675 1005846 1030268 1032011 1217308 1704476 2098879 1929694 1355328 991393 1106212
36903 1106212 1387427 1482644 1390921 1286775 1296747 1517484 1949437 2311212 2191061 1537143
36893 1537143 812513 515576 674174 945802 1104410 1226963 1386362 1379298 995415 513012
$$ packed form
36963I3481M45334O67833M81567k0620n90984q18016n08854k4216J36031k6031
36953a64475j35036m5784J03129K86004N50469O60115K95850l59799p17708n43043
36943g0278j86521L6195K23564M54756M51032L7367l90466l19041J12832K54608
36933F04048j44118n83418n12129k8562L58190M04916K54881N9129j30159j51274
36923A31504J44801N01006M23719q3249l86484r7902L37186L15395m1297j89004
36913A055675m9829K4422J743J85297M87168L94403j69185n74366l63935J14819
36903A106212K81215R5217r1723j04146R972K20737M31953L61775j20151o53918
36893A537143p24630k96937J58598K71628J58608J22553J59399p064l83883m82403
$$ plain form
36883 513012 571083 1324991 2030955 1896732 1173007 840373 1233891 1640573 1452317 1044600
36873 1044600 1092934 1573320 1988688 2175594 2286950 2256552 1897529 1403102 1221963 1488040
36863 1488040 1946703 2305264 2319419 1789396 900317 315263 467366 1005448 1383287 1633627
36853 1633627 1985158 2128205 1660807 993706 925175 1430309 1734426 1527316 1231441 1101599
36843 1101599 999832 1090860 1734154 2534049 2565456 1826909 1384218 1664739 1747722 979610
36833 979610 195560 440667 1367230 1925972 1976915 2136893 2487855 2511311 2071936 1527724
36823 1527724 1011882 433520 43353 181061 554738 561396 275625 351026 943149 1495770
36813 1495770 1667306 1727181 1874233 1846580 1450204 908401 459410 126369 91570 726966
$$ packed form
36883E13012N8071P53908P05964j34223p23725l32634L93518M06682j88256m07717
36873A044600M8334M80386M15368J86906J11356l0398l59023m94427j81139K66077
36863A488040M58663L58561J4155n30023q89079n85054J52103N38082L77839K50340
36853A633627L51531J43047m67398o67101o8531N05134L04117k07110k95875j29842
36843A101599j01767R1028O43294P99895L1407p38547m42691K80521Q2983p68112
36833I79610p84050K45107R26563N58742N0943J59978L50962K3456m39375n44212
36823A527724n15842n78362l90167J37708L73677O658k85771P5401N92123N52621
36813A495770J71536N9875J47052k7653l96376n41803m48991l33041l4799O35396
$$ plain form
36803 726966 1903196 2735674 2468579 1367374 390408 166840 593185 1250717 1842320
36794 1842320 2216124 2263591 1980733 1574613 1363994 1485626 1751786 1918149 2040753 2358476
36784 2358476 2845388 3208420 3409129 3782863 4423006 4883898 4879281 4879384 5469744 6397356
36774 6397356 6913114 6950548 7254033 8229555 9299776 9667735 9255036 8588284 8112678
36765 8112678 7913695 7835077 7561868 6779596 5553099 4446270 3997913 4091924 4044917 3352931
36755 3352931 2215912 1256497 825022 743071 732135 835079 1173494 1475302 1293004 730860
36745 730860 486377 961444 1742314 2233919 2395056 2472150 2413755 2076678 1724542 1728692
36735 1728692 1927733 1856532 1525624 1409443 1680927 1994193 2054747 1918413 1701829 1467509
$$ packed form
36803G26966J176230Q32478k67095j101205r76966k23568M26345O57532N91603
36794A842320L73804M7467k82858m06120k10619J21632K66160J66363J22604L17723
36784B358476M86912L63032K00709L73734O40143M60892m617J03N90360R27612
36774F397356N15758L7434L03485R75522J070221L67959m12699o66752m75606
36765H112678j98983p8618k73209p82272j226497j106829m48357R4011m7007o91986
36755C352931j137019r59415m31475q1951j0936J02944L38415L01808j82298n62144
36745G30860k44483M75067P80870M91605J61137P7094n8395l37077l52136M150
36735A728692J99041p1201l30908j16181K71484L13266O0554j36334k16584k34320
$$ plain form
36725 1467509 1397582 1587910 1686161 1296793 752794 822567 1526121 1946032 1500580 762473
36715 762473 613887 1128973 1745791 2086565 2095100 1700673 897807 36111 -361901 -35041
36705 -35041 894001 1993307 2608734 2294826 1421968 940559 1215143 1527983 1149451 430777
36695 430777 239098 663254 994523 828034 476138 302925 289156 328155 386357 277830
36685 277830 -170445 -608438 -402610 380375 788666 158692 -964079 -1510836 -1165492
36676 -1165492 -489870 -20034 218062 349471 331068 146717 -4447 97565 458084 892458
36666 892458 1144920 998032 498404 98593 277440 894320 1215685 801322 96888 -162226
36656 -162226 94567 340403 333023 374174 622549 727275 445673 157093 313175 690300
$$ packed form
36725A467509o9927J90328R8251l89368n43999O9773P03554M19911m45452p38107
36715G62473j48586N15086O16818L40774Q535l94427q02866q61696l98012L26860
36705c5041R29042J099306O15427l13908q72858m81409K74584L12840l78532p18674
36695D30777j91679M24156L31269j66489l51896j73213j3769L8999N8202j08527
36685B77830m48275m37993K05828P82985M08291o29974j122771n46757L45344
36676a165492O75622M69836K38096J31409j8403j84351j51164J02012L60519M34374
36666H92458K52462j46888m99628l99811J78847O16880L21365m14363p04434k59114
36656a62226K56793K45836p380M1151K48375J04726k81602k88580J56082L77125
$$ plain form
36646 690300 700533 277106 -67643 -8054 269995 519214 705671 746022 470897 40262
36636 40262 -56892 331000 752386 815350 690563 618179 380743 -209319 -674466 -412499
36626 -412499 305179 601813 248137 -86519 38057 221305 76889 -25906 345283 816648
36616 816648 781116 490162 726716 1501920 1958124 1711439 1459647 1863532 2496262 2465691
36606 2465691 1642910 705435 248574 379063 951861 1655747 2009378 1813569 1530465
36597 1530465 1712212 2139914 2082425 1374787 648493 448907 710762 1175765 1682130 1890140
36587 1890140 1426368 603153 326688 883923 1441025 1225864 602841 373618 558189
36578 558189 609004 435710 413612 593571 655659 525236 359260 46408 -589604 -1190010
$$ packed form
36646F90300J0233m23427l44749N9589K78049K49219J86457M0351k75125m30635
36636D0262r7154L87892M21386O2964j24787p2384k37436n90062m65147K61967
36626d12499P17678K96634l53676l34656J24576J83248j44416j02795L71189M71365
36616H16648l5532k90954K36554P75204M56204k46685k51792M03885O32730l0571
36606B465691q22781r37475m56861J30489N72798P03886L53631j95809k83104
36597A530465J81747M27702n7489p07638p26294j99586K61855M65003N06365K08010
36587A890140m63772q23215k76465N57235N57102k15161o23023k29223J84571
36578E58189N0815j73294k2098J79959O2088j30423j65976l12852o36012o00406
$$ plain form
36568 -1190010 -1190005 -711638 -401808 -386469 -174950 309449 460867 37550 -304289 27163
36558 27163 662790 821273 323205 -354452 -681276 -408743 320900 898409 677692 -200792
36548 -200792 -818212 -631245 -170074 -185379 -570019 -689091 -420560 -197069 -184947 -97555
36538 -97555 159184 259341 47485 -114385 120428 490051 407127 -223305 -767211 -611541
36528 -611541 -16859 105814 -609747 -1369676 -1193735 -255359 359425 170374 -184368 -155382
36518 -155382 -149065 -600696 -912424 -289851 709708 613462 -837330 -2036272 -1543343 -2036
36508 -2036 791405 304880 -250151 116761 758080 517286 -434557 -836657 -205360 533684
36498 533684 506331 113829 252741 947382 1472989 1459898 1137459 692038 121083 -336694
$$ packed form
36568a190010NM78367L09830J5339K11519M84399J51418m23317l41839L31452
36558B7163O35627J58483m98068o77657l26824K72533P29643N77509k20717q78484
36548b00792o17420J86967M61171j5305l84640j19072K68531K23491J2122Q7392
36538i7555K56739J00157k11856j61870K34813L69623q2924o30432n43906J55670
36528f11541N94682J22673p15561p59929J75941R38376O14784j89051l54742K8986
36518a55382O317m51631l11728O22573R99559r6246j450792j198942M92929J541307
36508b036P93441m86525n55031L66912O41319k40794r51843m02100O31297P39044
36498E33684k7353l92502J38912O94641N25607j3091l22439m45421n70955m57777
$$ plain form
36488 -336694 -313847 90971 379479 314546 6798 -535343 -1295153 -1796778 -1544191 -896550
36478 -896550 -672335 -856207 -659732 4571 232724 -318479 -750170 -428769 -74026 -454232
36468 -454232 -956442 -576776 365945 723226 290833 -101216 -37633 86377 57941 174141
36458 174141 480696 591719 423820 335594 402393 287605 -11103 -1671 492205 986091
36448 986091 1053372 860363 742667 714286 649609 578933 568354 561033 472713 256738 -113536
36437 -113536 -502249 -561329 -131068 429181 636401 455797 149057 -193725 -543216 -654423
36427 -654423 -457991 -442725 -978507 -1500709 -1159418 -141963 516554 424398 229172 402329
36417 402329 548465 256024 -149803 -154098 212313 572124 699355 547135 184910 -114577
$$ packed form
36488c36694K2847M04818K88508o4933l07748n42141p59810n01625K52587O47641
36478h96550K24215j83872J96475O64303K28153n51203m31691L21401L54743l80206
36468d54232n02210L79666R42721L57281m32393l92049O3583J24010k8436J16200
36458A74141L06555J11023j67899q8226O6799j14788k98708R432M93876M93886
36448I86091O7281j93009j17696k8381o4677p0676j0579p321q8320k15975l70274
36437a13536l88713n9080M30261N60249K07220j80604l06740l42782l49491j11207
36427f54423J96432J5266n35782n22202L41291J017455O58517r2156j95226J73157
36417D02329J46136k92441m05827m295L66411L59811J27231j52220l62225k99487
$$ plain form
36407 -114577 -125551 -55739 -194585 -222599 433516 1515484 2015800 1542246 806841 492963
36397 492963 442639 306086 173723 109006 -184850 -725676 -972428 -674885 -323339 -289475
36387 -289475 -271604 -94054 -191745 -638023 -593280 396807 1359255 1173592 212900 -394803
36377 -394803 -521663 -789415 -1050307 -592755 287269 406727 -443770 -1103451 -856828 -409999
36367 -409999 -516590 -737115 -338012 393441 594854 107984 -442422 -583130 -405140 -185808
36357 -185808 -43039 98235 424869 975730 1356387 1036537 123493 -526546 -274931 495503
36347 495503 847893 351922 -594962 -1313213 -1424675 -1011795 -442809 -21938 256130 518271
36337 518271 639292 348609 -257616 -683402 -666828 -504211 -545620 -714037 -781654 -776819
$$ packed form
36407a14577j0974O9812j38846k8014O56115J081968N00316m73554p35405l13878
36397D92963n0324j36553j32363o4717k93856n40826k46752K97543L51546L3864
36387b89475J7871J77550r7691m46278M4743R90087R62448j85663r60692o07703
36377c94803j26860k67752k60892M57552Q80024J19458q50497o59681K46623M46829
36367d09999j06591k20525L99103P31453K01413m86870n50406j40708J77990K19332
36357a85808J42769J41274L26634N50861L80657l19850r13044o50039K51615P70434
36347D95503L52390m95971r46884p18251j11462M12880N68986M20871K78068K62141
36337E18271J21021k90683o06225m25786J6574J62617m1409j68417o7617M835
$$ plain form
36327 -776819 -769823 -554343 22982 611144 700136 335576 42736 50741 47554 -197180 -400615
36316 -400615 -196588 318799 774428 1050972 1267599 1328047 901228 12454 -668616 -491944
36306 -491944 294349 708647 217432 -555174 -602010 161558 799257 605352 10704 -63387
36296 -63387 525336 977235 646243 -133253 -526368 -220078 351952 671842 652529 464018
36286 464018 217267 19597 66674 389287 680495 675595 560942 659749 849053 753091
36276 753091 458719 458224 792659 910078 647570 643017 1231916 1592782 842633 -417637
36266 -417637 -674593 444905 1688497 1925678 1447815 1139606 1212062 1384368 1663161
36257 1663161 2157428 2511269 2314399 1907793 2062151 2878840 3627033 3711440 3251230 2638640
$$ packed form
36327g76819O996K15480N77325N88162Q8992l64560k92840Q005l187k44734k03435
36316d00615K04027N15387M55629K76544K16627O0448m26819q88774o81070J76672
36306d91944P86293M14298m91215p72606m6836P63568O37699j93905n94648p4091
36296f3387N88723M51899l30992p79496l93115L06290N72030L19890j9313j88511
36286D64018k46751j97670M7077L22613K91208m900j14653R8807J89304r5962
36276G53091k94372m95L34435J17419k62508m553N88899L60866p50149j260270
36266d17637k56956J119498J243592K37181m77863l08209P2456J72306K78793
36257A663161M94267L53841j96870m06606J54358Q16689P48193Q4407m60210o12590
$$ plain form
36247 2638640 2088390 1779241 1887576 2181681 2034389 1231542 453027 516040 1307172 1884334
36237 1884334 1600387 764068 134490 64859 300252 434094 349891 218669 194441 206918
36227 206918 61457 -316374 -788355 -1115656 -1094809 -645262 85899 711641 888498 691686
36217 691686 550946 717937 964890 954029 734629 642100 798054 976278 967913 843874
36207 843874 785091 825164 853558 772398 590603 427923 424251 558550 602009 398200 144980
36196 144980 174120 434724 467208 17123 -565176 -753019 -518335 -324033 -484327 -768881
36186 -768881 -720915 -242175 259074 315656 -71116 -457119 -524303 -444667 -520923 -654000
36176 -654000 -500149 -79338 201977 198542 240164 502645 620656 279603 -182191 -228615
$$ packed form
36247B638640n50250l09149J08335K94105j47292q02847p78515O3013P91132N77162
36237A884334k83947q36319o29578o9631K35393J33842q4203j31222k4228J2477
36227B06918j45461l77831m71981l27301K0847M49547P31161O25742J76857j96812
36217F91686j40740J66991K46953j0861k19400r2529J55954J78224q365j24039
36207H43874n8783M0073K8394q1160j81795j62680l672J34299M3459k03809k53220
36196A44980K9140K60604L2484m50085n82299j87843K34684J94302j60294k84554
36186g68881M7966M78740N01249N6582l86772l86003o7184P9636p6256j33077
36176f54000J53851M20811K81315l435M1622K62481J18011l41053m61794m6424
$$ plain form
36166 -228615 57846 111716 -279042 -737868 -863629 -618157 -164317 294979 505906 354485
36156 354485 100339 113419 387503 609030 627079 499716 197031 -276193 -562125 -327531
36146 -327531 66281 -74307 -673744 -877544 -351332 183333 94008 -247916 -278297 -272396
36136 -272396 -763699 -1418536 -1422223 -781720 -344800 -517346 -768864 -567913 -115862 114015
36126 114015 25120 -201365 -419760 -450218 -65530 629043 1055798 729831 -125751 -727673
36116 -727673 -472330 497574 1366180 1333642 430861 -405461 -331697 391441 745266 278158
36106 278158 -415809 -663648 -580611 -595282 -598433 -179167 514234 817379 494390 60790
36096 60790 -40317 -85000 -508493 -1041541 -952584 -112056 694629 729538 236842 81031
$$ packed form
36166b28615K86461N3870l90758m58826j25761K45472M53840M59296K10927j51421
36156C54485k54146J3080K74084K21527J8049j27363l02685m73224k85932K34594
36146c27531L93812j40588n99437k03800N26212N34665q9325l41924l0381N901
36136b72396m91303o54837l687O40503M36920j72546k51518K00951M52051K29877
36126A14015q8895k26485k18395l0458L84688O94573M26755l25967q55582o01922
36116g27673K55343R69904Q68606l2538r02781q36322P3764P23138L53825m67108
36106B78158o93967k47839Q3037j4671l151M19266O93401L03145l22989m33600
36096F0790j01107m4683m23493n33048Q8957Q40528Q06685L4909m92696j55811
$$ plain form
36086 81031 609665 1252867 1284651 660503 -63817 -426544 -437899 -351321 -288726 -156132
36076 -156132 152426 525256 653642 368546 -51662 -77243 475642 1186333 1503680 1351408
36066 1351408 1077605 900445 663412 166779 -487226 -1007257 -1248107 -1297293 -1274673 -1182812
36056 -1182812 -997483 -805138 -720347 -673095 -438360 34323 474204 635317 643114 742654
36046 742654 824020 581488 135865 32384 450084 846706 686795 158615 -210225 -344592
36036 -344592 -561885 -921388 -1149419 -1142296 -1050609 -866913 -435795 33974 -21171 -748421
36026 -748421 -1507203 -1585411 -1033290 -488788 -365348 -518089 -602590 -461333 -158774 142573
36016 142573 296096 284176 228300 211364 146573 -59544 -276464 -261214 -9992 176892
$$ packed form
36086H1031N28634O43202L1784o24148p24320l62727j1355Q6578O2595J32594
36076a56132L08558L72830J28386k85096m20208k5581N52885P10691L17347j52272
36066A351408k73803j77160k37033m96633o54005n20031k40850m9186K2620R1861
36056a182812J85329J92345Q4791M7252K34735M72683M39881J61113P797R9540
36046G42654Q1366k42532m45623j03481M17700L96622j59911n28180l68840j34367
36036c44592k17293l59503k28031P123R1687J83696M31118M69769n5145p27250
36026g48421p58782p8208N52121N44502J23440j52741q4501J41257L02559L01347
36016A42573J53523j1920n5876j6936o4791k06117k16920J5250K51222J86884
$$ plain form
36006 176892 56694 -260664 -479737 -478621 -376016 -321033 -377902 -573853 -859841 -1013606
35996 -1013606 -810557 -372057 -117216 -235649 -440760 -433204 -345419 -416926 -453149 -45261
35986 -45261 752574 1403682 1551771 1304993 853497 252511 -337693 -650007 -691017 -716270
35976 -716270 -719301 -425049 63192 187795 -206927 -521908 -316480 -20661 -199742 -609081
35966 -609081 -666096 -496289 -714461 -1322448 -1624609 -1300295 -871513 -897577 -1226675 -1320613
35956 -1320613 -993847 -582021 -520230 -865938 -1187502 -981170 -262750 421249 647780 500198
35946 500198 199442 -195165 -483132 -285342 261709 354441 -335697 -936766 -564997 292604
35936 292604 556475 282161 421861 1082905 1365960 1013774 855132 1245604 1365244 686702
$$ packed form
36006A76892j20198l17358k19073J116J02605N4983n6869j95951k85988j53765
35996a013606K03049M38500K54841j18433k05111P556Q7785p1507l6223M07888
35986d5261P97835O51108J48089k46778m51496o00986n90204l12314m1010k5253
35976g16270l031K94252M88241J24603l94722l14981K05428K95819j79081m09339
35966f09081n7015J69807k18172o07987l02161L24314M28782k6064l29098r3938
35956a320613L26766M11826O1791l45708l21564K06332P18420O83999K26531j47582
35946E00198l00756l94607k87967J97790N47051R2732o90138o01069L71769Q57601
35936B92604K63871k74314J39700O61044K83055l52186j58642L90472J19640o78542
$$ plain form
35926 686702 -7451 120868 649801 746174 549881 710266 1115917 1145870 871381 998818
35916 998818 1682302 2220800 2003796 1165092 264102 -219565 -110703 323520 521261 255753
35906 255753 -32418 125126 503744 563493 323901 302073 664367 974160 817344 275779
35896 275779 -247854 -375837 12983 604553 822920 486109 101444 147154 322211 42947
35886 42947 -515104 -572698 41810 554415 359005 -139064 -187743 252046 604437 588564
35876 588564 513377 686832 965143 1041842 902855 755738 636663 363125 -90632 -407846
35866 -407846 -276208 202489 608415 637697 326704 -37886 -99699 301572 849162 944911
35856 944911 452774 -11258 86183 368226 130805 -485014 -691076 -376682 -333299 -949637
$$ packed form
35926F86702o94153J28319N28933R6373j96293J60385M05651K9953k74489J27437
35916I98818O83484N38498k17004q38704r00990m83667J08862M34223J97741k65508
35906B55753k88171J57544L78618N9749k39592k1828L62294L09793j56816n41565
35896B75779n23633j27983L88820N91570K18367l36811l84665M5710J75057k79264
35886D2947n58051n7594O14508N12605j95410m98069m8679M39789L52391j5873
35876E88564p5187J73455K78311P6699j38987j47117j19075k73538m53757l17214
35866d07846J31638M78697M05926K9282l10993l64590o1813M01271N47590R5749
35856I44911m92137m64032R7441K82043k37421o15819k06062L14394M3383o16338
$$ plain form
35846 -949637 -1560965 -1501341 -1006500 -549443 -38319 635112 906833 272271 -698716 -954447
35836 -954447 -371587 209025 248821 65354 95958 272443 301370 115929 -123448 -224234
35826 -224234 -100433 126533 227218 159989 67939 -89551 -525127 -1105007 -1353744 -1222357
35816 -1222357 -1236703 -1503962 -1291991 -202537 945917 1228199 997238 1183057 1693569
35807 1693569 1644620 913638 291455 148883 66990 -152211 -185673 -53746 -247138 -734603
35797 -734603 -816511 -296553 118721 -9420 -140752 298705 1010332 1393401 1400594 1301845
35787 1301845 1107503 718476 255371 -145149 -510379 -757136 -648731 -234172 106131
35778 106131 196023 150332 -126855 -842525 -1577727 -1473658 -478976 381933 402485 77992
$$ packed form
35846i49637o11328N9624M94841M57057N11124O73431K71721o34562r70987k55731
35836i54447N82860N80612L9796j83467L0604J76485K8927j85441k39377j00786
35826b24234J23801K26966J00685o7229r2050j57490m35576n79880k48737J31387
35816a222357j4346k67259K11971J089454J148454K82282k30961J85819N10512
35807A693569m8949p30982o22183j42572q1893k19201l3462J31927j93392m87465
35797g34603q1908N19958M15274j28141j31332M39457P11627L83069P193r8749
35787A301845j94342l89027m63105m00520l65230k46757J08405M14559L40303
35778A06131Q9892m5691k77187p15670p35202J04069R94682Q60909K0552l24493
$$ plain form
35768 77992 105088 292515 132508 -217189 -279171 -91656 -3146 -46800 -128951 -392648 -778682
35757 -778682 -712815 67974 825514 726787 70422 -201273 73235 197240 -171872 -553266
35747 -553266 -417126 203979 902103 1200634 759858 -237432 -1029771 -1061869 -627268 -289779
35737 -289779 -36317 373226 616026 222080 -453145 -585427 -114764 274615 343288 494571
35727 494571 761348 661313 259947 286704 818123 932781 240729 -313097 21056 440609
35717 440609 -144277 -1213299 -1302344 -205195 820152 990823 830221 820381 508870 -398879
35707 -398879 -1097586 -759927 113513 410595 66683 -20724 436574 708288 336307 -171050
35697 -171050 -306613 -335328 -542149 -498823 152306 795041 642308 45178 -4894 525256
$$ packed form
35768G7992K7096J87427j60007l49697o1982J87515Q8510m3654q2151k63697l86034
35757g78682O5867P80789P57540r8727o56365k71695K74508J24005l69112l81394
35747e53266J36140O21105O98124K98531m40776r97290p92339l2098M34601L37489
35737b89779K53462M09543K42800l93946o75225j32282M70663L89379O8673J51283
35727D94571K66777j00035m01366K6757N31419J14658o92052n53826L34153M19553
35717D40609n84886j069022q9045J097149J025347J70671j60602r840l11511r07749
35707c98879o98707L37659Q73440K97082l43912q7407M57298K71714l71981n07357
35697a71050j35563k8715k06821M3326O51129O42735j52733n97130n0072N30150
$$ plain form
35687 525256 697962 215284 -92702 290213 693946 416099 -130464 -190483 62065 -118008
35677 -118008 -809074 -1367340 -1427749 -1263306 -1225417 -1383182 -1645994 -1789506 -1497357 -816722
35667 -816722 -376729 -668654 -1316526 -1597172 -1465776 -1423364 -1517923 -1232840 -420884 342874
35657 342874 524043 201736 -277724 -701988 -864538 -530739 199703 842334 1042062 868300
35647 868300 531422 159567 -87374 -109085 -177242 -707353 -1558157 -2014501 -1699353 -1080833
35637 -1080833 -795403 -857822 -876216 -717569 -569445 -556757 -658690 -865749 -1104890 -1111138
35627 -1111138 -670007 34010 515935 440313 -112258 -745624 -1034487 -835410 -422159 -216490
35617 -216490 -322813 -462593 -413221 -301617 -336100 -438581 -341131 40276 489742 721647
$$ packed form
35687E25256J72706m82678l07986L82915M03733k77847n46563o0019K52548j80073
35677a18008o91066n58266o0409J64443L7889j57765k62812j43512K92149O80635
35667h16722M39993k91925o47872k80646J31396M2412r4559K85083Q11956P63758
35657C42874J81169l22307m79460m24264j62550L33799P30442O42631J99728j73762
35647H68300l36878l71855k46941k1711o8157n30111q50804m56344L15148O18520
35637a080833K85430o2419j8394J58647J48124J2688j01933k07059k39141o248
35627a111138M41131P04017M81925p5622n52571o33366k88863J99077M13251K05669
35617b16490j06323j39780M9372J11604l4483j02481R7450L81407M49466K31905
$$ plain form
35607 721647 647049 446050 401523 595721 771831 593812 41834 -555598 -863982 -797645
35597 -797645 -478085 -107519 127323 184967 200020 271489 309999 263148 345485 748545 1210905
35586 1210905 1245113 806173 374454 292114 352186 189812 -200953 -529864 -603152 -477484
35576 -477484 -305281 -129450 157389 583744 838644 524359 -165061 -411336 174390 832196
35566 832196 609556 -222652 -510746 106848 785476 882418 809418 1049654 1214557 774999
35556 774999 74128 -184475 -22032 32011 -55472 158833 685560 965135 689073 159331
35546 159331 -252068 -487665 -558741 -393009 -76359 137952 207693 366223 680375 849430
35536 849430 610504 111224 -281744 -378259 -247914 -64612 -8573 -227593 -745833 -1386445
$$ packed form
35607G21647p4598k00999m4527J94198J76110j78019n51978n97432l08384O6337
35597g97645L19560L70566K34842N7644J5053P1469L8510m6851Q2337M03060M62360
35586A210905L4208m38940m31719q2340O0072j62374l90765l28911p3288J25668
35576d77484J72203J75831K86839M26355K54900l14285o89420k46275N85726O57806
35566H32196k22640q32208k88094O17594O78628R6942p3000K40236J64903m39558
35556G74999p00871k58603J62443N4043q7483K14305N26727K79575k76062n29742
35546A59331m11399k35597p1076J65732L16650K14311O9741J58530L14152J69055
35536H49430k38926m99280l92968r6515J30345J83302N6039k19020n18240o40612
$$ plain form
35526 -1386445 -1836946 -1862330 -1518365 -1125480 -938876 -885996 -773153 -673801 -830977 -1172473
35516 -1172473 -1283812 -991674 -631592 -542820 -622086 -611503 -502133 -367586 -126244 176208
35506 176208 161189 -358001 -881268 -755676 -83897 385075 224006 -266908 -615379 -692980
35496 -692980 -604515 -446604 -309051 -255103 -213269 -85600 33915 -29611 -225047 -328017
35486 -328017 -295688 -331198 -589757 -1024968 -1507336 -1903405 -2077525 -1988309 -1713361 -1251572
35476 -1251572 -497000 389478 858573 575090 -68547 -431487 -424949 -401277 -443162 -320031
35466 -320031 -76112 -82948 -450220 -866776 -1082396 -1103049 -890442 -361682 247029 506546
35456 506546 389977 296685 400857 435836 215173 -98122 -336573 -484842 -434471 -79874
$$ packed form
35526a386445m50501k5384L43965L92885J86604N2880J12843R9352j57176l41496
35516a172473j11339K92138L60082Q8772p9266J0583J09370J34547K41342L02452
35506A76208j5019n19190n23267J25592O71779M68972j61069m90914l48471p7601
35496f92980Q8465J57911J37553N3948M1834J27669J19515o3526j95436j02970
35486c28017L2329l5510k58559m35211m82368l96069j74120Q9216K74948M61789
35476a251572P54572Q86478M69095k83483o43637l62940O538K3672m1885J23131
35466c20031K43919o836l67272m16556k15620k0653K12607N28760O08711K59517
35456E06546j16569r3292J04172L4979k20663l13295k38451j48269N0371L54597
$$ plain form
35446 -79874 307840 370197 338838 726579 1280147 1108981 112011 -650418 -474707 -15083
35436 -15083 -136644 -603328 -719557 -560900 -607145 -699472 -399244 311 -110675 -484259
35426 -484259 -355969 157460 154481 -479622 -750929 -116978 681050 830323 575724 524030
35416 524030 597638 435476 270402 579741 1162424 1324955 883733 367343 255428 539469
35406 539469 1035575 1622458 2055949 1974338 1322971 553673 219215 471503 1036107 1558794
35396 1558794 1883375 2061642 2183860 2221264 2052537 1659911 1245255 1080425 1249394 1586140
35386 1586140 1863954 2004347 2082668 2150788 2112566 1842880 1420437 1130594 1171292 1437229
35376 1437229 1664114 1696543 1540466 1283125 1088434 1131898 1354922 1406285 1062796 615615
$$ packed form
35446g9874L87714O2357l1359L87741N53568j71166r96970p62429J75711M59624
35436a5083j21561m66684j16229J58657m6245r2327L00228L99555j10986l73584
35426d84259J28290N13429k979o34103k71307O33951P98028J49273k54599n1694
35416E24030P3608j62162j65074L09339N82683J62531m41222n16390j11915K84041
35406E39469M96106N86883M33491q1611o51367p69298l34458K52288N64604N22687
35396A558794L24581J78267J22218L7404j68727l92626m14656j64830J68969L36746
35386A586140K77814J40393P8321O8120l8222k69686m22443k89843M0698K65937
35376A437229K26885L2429j56077k57341j94691M3464K23024N1363l43489m47181
$$ plain form
35366 615615 549795 862981 1011490 604139 -111887 -583218 -584181 -382326 -364855 -596073
35356 -596073 -741719 -463011 111684 481157 437765 378609 692367 1098202 1024593 492161
35346 492161 107401 205998 517644 726899 838387 861608 655169 282613 47290 -31815
35336 -31815 -297233 -797235 -1094142 -999866 -904670 -989944 -755207 102222 919274 912835 354143
35325 354143 88885 210218 112334 -289541 -348602 220122 876181 1090896 948072 693603
35315 693603 337870 -39987 -187713 -154085 -331188 -774490 -1015576 -792082 -399163 -73295
35305 -73295 312083 601819 176509 -1000019 -1834270 -1401341 -317229 46340 -597828
35296 -597828 -1317183 -1509329 -1566829 -1824281 -1786492 -937742 260515 794615 310139 -547726
$$ packed form
35366F15615o5820L13186J48509m07351p16026m71331r63K01855J7471k31218
35356e96073j45646K78708N74695L69473m3392n9156L13758M05835p3609n32432
35346D92161l84760R8597L11646K09255J11488K3221k06439l72556k35323p9105
35336c1815k65418n00002k96907R4276R5196q5274K34737Q57429Q17052o439n58692
35325C54143k65258J21333r7884m01875n9061N68724O56059K14715j42824k54469
35315F93603l55733l77857j47726L3628j77103m43302k41086K23494L92919L25868
35305g3295L85378K89736m25310j176528q34251M32929J084112L63569o44168
35296e97828p19355j92146n7500k57452L7789Q48750J198257N34100m84476q57865
$$ plain form
35286 -547726 -944070 -684573 -194140 119226 286395 523467 742488 630481 241804 99831
35276 99831 456472 817683 599037 -37491 -465691 -461111 -236118 170082 833160 1345169
35266 1345169 1070288 159747 -417647 -145905 397180 522321 382707 419393 435034 -58188
35256 -58188 -887869 -1337951 -1108326 -564104 -76055 338108 690044 844688 791641 712427
35246 712427 656398 462513 116769 -92579 73501 476616 735930 592643 122721 -311172
35236 -311172 -356146 -32141 272690 273796 100962 -13218 -107898 -272233 -308144 -57575
35226 -57575 107667 -318107 -1115750 -1470444 -1076186 -542801 -475784 -696775 -729424 -568183
35216 -568183 -475301 -377145 -42823 321200 238253 -294513 -730174 -702325 -392670 -70274
$$ packed form
35286e47726l96344K59497M90433L13366J67169K37072K19021j12007l88677j41973
35276I9831L56641L61211k18646o36528m28200M580K24993M06200O63078N12009
35266A345169k74881r10541n77394K71742N43085J25141j39614L6686J5641m93222
35256e8188q29681m50082K29625N44222M88049M14163L51936J54644n3047p9214
35246G12427n6029j93885l45744k09348J66080M03115K59314j43287m69922m33893
35236c11172m4974L24005L04831J106j72834j14180r4680j64335l5911K50569
35226e7575J65242m25774p97643l54694L94258N33385O7017k20991l2649J61241
35216e68183R2882R8156L34322L64023q2947n32766m35661K7849L09655L22396
$$ plain form
35206 -70274 281187 641533 658594 81196 -698892 -963359 -533839 15339 103949 -186556
35196 -186556 -378875 -289519 -135123 -58622 54431 210108 138628 -261035 -598127 -462820
35186 -462820 -41693 143951 17288 -13157 186556 222600 -86174 -218240 346408 1244317
35176 1244317 1596075 1154839 554275 342893 274972 -162652 -876488 -1247797 -988731 -504034
35166 -504034 -282386 -245825 3939 442158 527353 -46632 -847181 -1220869 -1084198 -842484
35156 -842484 -670932 -351961 142902 407493 167742 -280454 -497625 -489957 -560694 -790916
35146 -790916 -1004277 -1104736 -1128572 -1061634 -905037 -835645 -996018 -1182181 -1043474 -569104
35136 -569104 -92794 171493 311457 424775 439076 302950 132830 74005 151730 299827
$$ packed form
35206g0274L51461L60346J7061n77398p80088k64467M29520N49178Q8610k90505
35196a86556j92319Q9356J54396P6501J13053J55677p1480l99663l37092J35307
35186d62820M21127J85644j26663l0445J99713L6044l08774j32066N64648Q97909
35176A244317L51758m41236o00564k11382o7921m37624p13836l71309K59066M84697
35166e04034K21648L6561K49764M38219Q5195n73985q00549l73688J36671K41714
35156h42484J71552L18971M94863K64591k39751m48196k17171P668p0737k30222
35146g90916k13361j00459k3836O6938J56597O9392j60373j86163J38707M74370
35136e69104M76310K64287J39964J13318J4301j36126j70120n8825P7725J48097
$$ plain form
35126 299827 433376 506067 570593 685399 687902 289188 -425413 -888729 -772598 -523308
35116 -523308 -708106 -1074872 -889479 -105291 509524 475615 136630 -90117 -302793 -627163
35106 -627163 -764118 -476628 -62447 82539 -30873 -270090 -684977 -1109843 -1001532 -241402
35096 -241402 395150 250828 -166726 46221 719380 870834 304018 -97127 192513 577357
35086 577357 377336 -194129 -572284 -694856 -760643 -665553 -294110 -10291 -241544 -773431
35076 -773431 -1002180 -775005 -485295 -372839 -197559 288220 860949 986485 380501 -608260
35066 -608260 -1184135 -855163 -64772 210623 -332033 -868862 -537273 360509 780920 386711
35056 386711 -89684 -325 341197 252411 -323191 -860951 -1024934 -926611 -721528 -403593
$$ packed form
35126B99827J33549P2691O4526J14806K503l98714p14601m63316J16131K49290
35116e23308j84798l66766J85393P84188O14815l3909l38985k26747k12676l24370
35106f27163j36955K87490M14181J44986j13412k39217m14887m24866J08311P60130
35096b41402O36552j44322m17554K12947O73159J51454n66816m01145K89640L84844
35086E77357k00021n71465l78155j22572o5787R5090L71443K83819k31253n31887
35076g73431k28749K27175K89710J12456J75280M85779N72729J25536o05984r88761
35066f08260n75875L28972P90391K75395n42656n36829L31589Q97782M20411l94209
35056C86711m76395Q9359L41522q8786n75602n37760j63983R8323K05083L17935
$$ plain form
35046 -403593 -54352 98192 57619 199497 745610 1277716 1159886 452630 5925 421789
35036 421789 1229419 1471982 957238 422783 387261 377255 -313022 -1434192 -1937285 -1323126
35026 -1323126 -327169 -5175 -455537 -827260 -507794 98228 160052 -439944 -902673 -505908
35016 -505908 479249 1117424 932923 377736 137761 312596 508826 504431 460626 517445
35006 517445 526260 317300 13105 -131283 -124279 -260085 -666576 -971894 -643591 291365
34996 291365 1098832 1143622 698339 583303 1020517 1326684 947262 309324 188637 557011
34986 557011 674259 234204 -219023 -149765 239379 411087 218629 -105144 -397903 -656564
34976 -656564 -838930 -875433 -787130 -588358 -206891 302533 647775 661814 607000 799572
$$ packed form
35046d03593L49241J52544m0573J41878N46113N32106j17830p07256m46705M15864
35036D21789Q07630K42563n14744n34455l5522j0006o90277j121170n03093O14159
35026a323126R95957L21994m50362l71723L19466O06022O1824n99996m62729L96765
35016e05908R85157O38175j84501n55187k39975J74835J96230m395m3805N6819
35006E17445Q815k08960l04195j44388P004j35806m06491l05318L28303R34956
34996B91365Q07467M4790m45283j15036M37214L06167l79422o37938j20687L68374
34986E57011J17248m40055m53227O9258L89144J71708j92458l23773k92759k58661
34976f56564j82366l6503Q8303J98772L81467N09424L45242J4039n4814J92572
$$ plain form
34966 799572 1063295 944682 426599 -1913 -65957 -80540 -398543 -816511 -834741 -312864
34956 -312864 426497 1000253 1148877 632684 -592051 -1961719 -2486058 -1718406 -387852
34947 -387852 307729 7562 -570941 -712535 -541990 -522149 -583408 -319742 169525 328570
34937 328570 86390 58779 529202 858931 410286 -430446 -789351 -539653 -288944 -319754
34927 -319754 -346837 -338747 -724703 -1510397 -1955385 -1606324 -1049177 -1061138 -1477156 -1543944
34917 -1543944 -1084575 -627275 -535599 -679479 -937455 -1381377 -1861260 -1975387 -1658825 -1364774
34907 -1364774 -1452836 -1758084 -1954351 -2002529 -2028861 -2056446 -2073123 -2119776 -2128835 -1915024 -1495162
34896 -1495162 -1178061 -1179564 -1391077 -1651033 -1921918 -2027128 -1606713 -651358 244876 537492
$$ packed form
34966G99572K63723j18613n18083m28512o4044j4583l18003m17968j8230N21877
34956c12864P39361N73756J48624n16193j224735j369668n24339P67652J330554
34947c87852O95581l00167n78503j41594J70545J9841o1259K63666M89267J59045
34937C28570k42180k7611M70423L29729m48645q40732l58905K49698K50709l0810
34927c19754k7083Q090l85956p85694m44988L49061N57147j1961m16018o6788
34917a543944M59369M57300R1676j43880k57976m43922m79883j14127L16562K94051
34907a364774q8062l05248j96267m8178k6332k7585j6677m6653r059K13811M19862
34896a495162L17101j503k11513k59956k70885j05210M20415R55355Q96234K92616
$$ plain form
34886 537492 379391 242345 165404 -132208 -573105 -733248 -532678 -390127 -558797 -738283
34876 -738283 -563109 -175040 -55238 -413404 -913163 -997764 -490466 109583 72874 -700309
34866 -700309 -1459814 -1449511 -743697 46227 617960 1063031 1318955 1162775 732110 447839
34856 447839 362024 192006 76358 543269 1451253 1753413 873440 -313745 -574509 66700
34846 66700 573498 448523 164154 106589 -31108 -549428 -1090789 -1078691 -445273 371846
34836 371846 900132 894527 388113 -289833 -711945 -740065 -596856 -483736 -336746 -85320
34826 -85320 67039 -147373 -644194 -968595 -733429 -39727 547460 499873 -108379 -583128
34816 -583128 -300968 578256 1215000 924177 -178106 -1329869 -1814359 -1534746 -1028734
$$ packed form
34886E37492j58101j37046p6941k97612m40897j60143K00570J42551j68670j79486
34876g38283J75174L88069J19802l58166m99759q4601N07298O00049l6709p73183
34866g00309p59505J0303P05814P89924N71733M45071K55924j56180m30665k84271
34856D47839q5815j70018j15648M66911R07984L02160q79973j187185k60764O41209
34846F6700N06798j24975k84369n7565j37697n18320n41361J2098O33418Q17119
34836C71846N28286n605n06414o77946m22112k8120J43209J13120J46990K51426
34826h5320J52359k14412m96821l24401K35166O93702N87187m7587o08252m74749
34816e83128K82160Q79224O36744k90823j102283j151763m84490K79613N06012
$$ plain form
34807 -1028734 -902768 -1197968 -1425393 -1287958 -1096208 -1218337 -1399890 -1100089 -385756
34798 -385756 63570 -97545 -463815 -591435 -611811 -807721 -1009927 -872669 -489234 -265090
34788 -265090 -296134 -284968 -38594 291057 451781 298784 -193723 -830593 -1153212 -848442
34778 -848442 -217963 107726 -33304 -220095 -241855 -502299 -1259638 -1870967 -1430776 -89794
34768 -89794 903506 694062 -142787 -429135 110635 697889 700934 374703 260184 376060
34758 376060 386517 257861 284216 552425 793996 807161 691517 562882 321546 -119696
34748 -119696 -570676 -729738 -526202 -149519 184016 336737 185531 -310351 -881634 -981555
34738 -981555 -317175 638354 956503 287284 -632026 -845158 -413412 -270789 -810741 -1277891
$$ packed form
34807a028734J25966k95200k27425J37435J91750j22129j81553K99801P14333
34798c85756M49326j61115l66270j27620k0376j95910k02206J37258L83435K24144
34788b65090l1044J1166K46374L29651J60724j52997m92507o36870l22619L04770
34778h48442O30479L25689j41030j86791k1760k60444p57339o11329M40191J340982
34768h9794R93300k09444q36849k86348N39770N87254L045l26231j14519J15876
34758C76060J0457j28656K6355K68209K41571J3165j15644j28635k41336m41242
34748a19696m50980j59062K03536L76683L33535J52721j51206m95882n71283r9921
34738i81555O64380R55529L18149o69219r19310k13132M31746J42623n39952m67150
$$ plain form
34728 -1277891 -922555 -140047 197850 105018 290566 777831 742711 -49718 -609222 -87894
34718 -87894 926785 1227739 658489 162422 333759 707099 607925 98971 -216724 -1884
34708 -1884 476417 682832 357527 -213714 -482892 -282968 -69188 -309841 -765628 -740563
34698 -740563 -73050 518256 297465 -535147 -1054319 -702224 95380 469439 86293 -574213
34688 -574213 -870387 -719589 -535806 -580508 -640797 -404542 69921 412898 353872 -50323
34678 -50323 -496150 -636027 -323193 201419 451722 162646 -436338 -885344 -922247 -576611
34668 -576611 -28556 449510 571809 306485 -5491 -14813 198375 250512 -19948 -361075
34658 -361075 -442971 -206524 140226 329431 225104 -66715 -267238 -200442 7439 79977
$$ packed form
34728a277891L55336P82508L37897r2832J85548M87265l5120p92429n59504N21328
34718h7894J014679L00954n69250m96067J71337L73340r9174n08954l15695K14840
34708a884M78301K06415l25305n71241k69178J99924K13780k40653m55787K5065
34698g40563O67513N91306k20791q32612n19172L52095P97604L74059l83146o60506
34688e74213k96174J50798J83783m4702o0289K36255M74463L42977n9026m04195
34678e0323m45827j39877L12834N24612K50303k89076n98984m49006l6903L45636
34668e76611N48055M78066J22299k65324l11976r322K13188N2137k70460l41127
34658c61075q1896K36447L46750J89205j04327k91819k00523O6796K07881P2538
$$ [...]
##END NTUPLES=NMR SPECTRUM
##END=
