##TITLE=31Pdec_LR-764-2-C1-R2A
 CDCl3, 128 sc
 19.5.2023
##JCAMPDX= 6.0         $$ Bruker NMR JCAMP-DX V2.0
##DATA TYPE= NMR SPECTRUM
##DATA CLASS= NTUPLES
##ORIGIN= UXNMR, Bruker Analytische Messtechnik GmbH
##OWNER= root
$$ XWIN-NMR		Version 3.5
$$ Fri May 19 14:33:01 2023 Russian Standard Time (UT+4h)  she@DPX200
##.OBSERVE FREQUENCY= 81.013821
##.OBSERVE NUCLEUS= ^31P
##.ACQUISITION MODE= SIMULTANEOUS
##.ACQUISITION SCHEME= undefined
##.AVERAGES= 128
##.DIGITISER RES= 16
##SPECTROMETER/DATA SYSTEM= spect
##.PULSE SEQUENCE= zgpg30
##.SOLVENT NAME= CDCl3
##.SHIFT REFERENCE= (INTERNAL, CDCl3, 0, 248.564)
##AUDIT TRAIL= $$ (NUMBER, WHEN, WHO, WHERE, WHAT)
$$ ##TITLE= Audit trail, XWIN-NMR		Version 3.5
$$ ##JCAMPDX= 5.01
$$ ##ORIGIN= Bruker BioSpin GmbH
$$ ##OWNER= she
$$ F:/spectra/data/she/nmr/P31/1/pdata/1/auditp.txt
$$ ##AUDIT TRAIL=  $$ (NUMBER, WHEN, WHO, WHERE, WHAT)
(   1,<2023-05-19 14:31:52.04 +0400>,<she>,<DPX200>,
      <continue with go, POWCHK disabled, PULCHK disabled
       configuration hash MD5:
       00 E9 B6 7A A2 85 ED C7 34 08 36 98 17 FE 4E 26
       data hash MD5: 32K
       79 B5 CE 72 1B C7 27 39 98 58 D9 B7 A4 50 4E 04>)
(   2,<2023-05-19 14:31:53.82 +0400>,<she>,<DPX200>,
      <Start of raw data processing
       efp BC_mod = 2 LB = 1 FT_mod = 6 PKNL = 1 PHC0 = -10557.26 PHC1 = 49.88486 SI = 64K 
       data hash MD5: 64K
       01 1B 76 17 C0 F9 A5 01 4D 75 97 BC F9 3B 21 64>)
(   3,<2023-05-19 14:32:11.17 +0400>,<she>,<DPX200>,
      <pk PHC0 = -105.6779 PHC1 = 0 
       data hash MD5: 64K
       2D 77 58 91 8A 5A 08 89 DB 0D D3 19 F0 3A 58 59>)
(   4,<2023-05-19 14:32:16.70 +0400>,<she>,<DPX200>,
      <abs ABSG = 5 
       data hash MD5: 64K
       3E 6B 17 F5 E4 AD 5D 1F 8F A4 D6 05 F4 A1 19 B4>)
$$ ##END=
$$ 
$$ hash MD5
$$ 2F D8 08 DD B0 2A 3E C1 09 DF C0 A0 08 27 8B 2A
##$RELAX= 
##$RELAX= 
##$RELAX= 
##$RELAX= 
##$RELAX= 
##$RELAX= 
##$RELAX= 
##$RELAX= 
##$RELAX= 
$$ Bruker specific parameters
$$ --------------------------
##$DU= <F:/spectra>
##$EXPNO= 1
##$NAME= <P31>
##$PROCNO= 1
##$TYPE= <nmr>
##$USER= <she>
##$AMP= (0..31)
100 100 100 100 100 100 100 100 100 100 100 100 100 100 100 100 100 100 
100 100 100 100 100 100 100 100 100 100 100 100 100 100 
##$AQSEQ= 0
##$AQ_mod= 1
##$AUNM= <au_zg>
##$AUTOPOS= <>
##$BF1= 81.014009
##$BF2= 200.13
##$BF3= 200.13
##$BF4= 200.13
##$BF5= 200.13
##$BF6= 200.13
##$BF7= 200.13
##$BF8= 200.13
##$BYTORDA= 1
##$CFDGTYP= 0
##$CFRGTYP= 5
##$CHEMSTR= <none>
##$CNST= (0..31)
1 1 145 1 1 1 1 1 1 1 1 1 1 1 1 1 1 1 1 1 1 1 1 1 1 1 1 1 1 1 1 1 
##$CPDPRG= <waltz16>
##$CPDPRG1= <>
##$CPDPRG2= <waltz16>
##$CPDPRG3= <>
##$CPDPRG4= <mlev>
##$CPDPRG5= <mlev>
##$CPDPRG6= <mlev>
##$CPDPRG7= <mlev>
##$CPDPRG8= <mlev>
##$CPDPRGB= <>
##$CPDPRGT= <>
##$D= (0..31)
0 1 0 0 0 0 0 0 0 0 0 0.03 2e-05 3e-06 0 0 0 0 0 0 0 0 0 0 0 0 0 0 0 0 
0 0 
##$DATE= 1684492063
##$DBL= (0..7)
120 120 120 11 120 120 24 19 
##$DBP= (0..7)
150 150 150 150 150 150 150 150 
##$DBP07= 0
##$DBPNAM0= <>
$$ [...]
##$SUBNAM3= <"">
##$SUBNAM4= <"">
##$SUBNAM5= <"">
##$SUBNAM6= <"">
##$SUBNAM7= <"">
##$SUBNAM8= <"">
##$SUBNAM9= <"">
##$SW= 501.771253377433
##$SWIBOX= (0..15)
0 1 3 0 0 0 0 0 0 0 0 0 0 0 0 0 
##$SW_h= 40650.406504065
##$TD= 32768
##$TD0= 1
##$TE= 0
##$TE2= 300
##$TE3= 300
##$TEG= 300
##$TL= (0..7)
0 120 53 12 22 120 120 120 
##$TP= (0..7)
150 150 150 150 150 150 150 150 
##$TP07= 0
##$TPNAME0= <>
##$TPNAME1= <>
##$TPNAME2= <>
##$TPNAME3= <>
##$TPNAME4= <>
##$TPNAME5= <>
##$TPNAME6= <>
##$TPNAME7= <>
##$TPOAL= (0..7)
0.5 0.5 0.5 0.5 0.5 0.5 0.5 0.5 
##$TPOFFS= (0..7)
0 0 0 0 0 0 0 0 
##$TUNHIN= 0
##$TUNHOUT= 0
##$TUNXOUT= 0
##$USERA1= <user>
##$USERA2= <user>
##$USERA3= <user>
##$USERA4= <user>
##$USERA5= <user>
##$V9= 5
##$VALIST= <valist>
##$VCLIST= <CCCCCCCCCCCCCCC>
##$VD= 0
##$VDLIST= <DDDDDDDDDDDDDDD>
##$VPLIST= <PPPPPPPPPPPPPPP>
##$VTLIST= <TTTTTTTTTTTTTTT>
##$WBST= 1024
##$WBSW= 4
##$XGAIN= (0..3)
0 0 0 0 
##$XL= 0
##$YL= 0
##$YMAX_a= 18566
##$YMIN_a= -11940
##$ZGOPTNS= <>
##$ZL1= 120
##$ZL2= 120
##$ZL3= 120
##$ZL4= 120
##$ABSF1= 248.5645
##$ABSF2= -253.2056
##$ABSG= 5
##$ABSL= 3
##$ALPHA= 0
##$AQORDER= 0
##$ASSFAC= 0
##$ASSFACI= 0
##$ASSFACX= 0
##$ASSWID= 0
##$AUNMP= <proc_1d>
##$AZFE= 0.1
##$AZFW= 0.5
##$BCFW= 0
##$BC_mod= 2
##$BYTORDP= 0
##$COROFFS= 0
##$CY= -3
##$DATMOD= 1
##$DC= 0
##$DFILT= <>
##$DTYPP= 0
##$F1P= 0
##$F2P= 0
##$FCOR= 1
##$FTSIZE= 65536
##$FT_mod= 6
##$GAMMA= 0
##$GB= 0
##$INTBC= 1
##$INTSCL= 6.047779e-11
##$ISEN= 30
##$LB= 1
##$LEV0= 0
##$LPBIN= 0
##$MAXI= 10000
##$MC2= 0
##$MEAN= 0
##$ME_mod= 0
##$MI= 50
##$NCOEF= 0
##$NC_proc= -6
##$NLEV= 6
##$NOISF1= 182.463
##$NOISF2= 159.3651
##$NSP= 0
##$NTH_PI= 0
##$NZP= 0
##$OFFSET= 248.5645
##$PC= 4
##$PHC0= -10662.94
##$PHC1= 49.88486
##$PH_mod= 1
##$PKNL= yes
##$PPARMOD= 0
##$PSCAL= 0
##$PSIGN= 0
##$REVERSE= no
##$SF= 81.0140089999694
##$SI= 65536
##$SIGF1= 159.3651
##$SIGF2= -187.1042
##$SINO= 113.3802
##$SIOLD= 16384
##$SREGLST= <1H.CDCl3>
##$SSB= 0
##$STSI= 65536
##$STSR= 0
##$SW_p= 40650.406504065
##$SYMM= 0
##$S_DEV= 0
##$TDeff= 32768
##$TDoff= 0
##$TI= <>
##$TILT= no
##$TM1= 0
##$TM2= 0
##$TOPLEV= 0
##$USERP1= <user>
##$USERP2= <user>
##$USERP3= <user>
##$USERP4= <user>
##$USERP5= <user>
##$WDW= 1
##$XDIM= 65536
##$YMAX_p= 307011332
##$YMIN_p= -72650744
$$ End of Bruker specific parameters
$$ ---------------------------------
##NTUPLES= NMR SPECTRUM
##VAR_NAME=  FREQUENCY,     SPECTRUM/REAL,   SPECTRUM/IMAG
##SYMBOL=    X,             R,               I
##VAR_TYPE=  INDEPENDENT,   DEPENDENT,       DEPENDENT
##VAR_FORM=  AFFN,          ASDF,            ASDF
##VAR_DIM=   65536,         65536,           65536
##UNITS=     HZ,            ARBITRARY UNITS, ARBITRARY UNITS
##FACTOR=    0.620285442955139, 1,           1
##FIRST=     20137.2065510682, 0,            0
##LAST=      -20513.1999529968, 0,           0
##MIN=       -20513.1999529968, -72650744,   0
##MAX=       20137.2065510682, 307011332,    0
$$ Real data points
##PAGE= N=1
##DATA TABLE= (X++(R..R)), XYDATA
$$ [...]
15292 -2465714 -3403942 -482247 2169223 983123 -1490035 -1018964 1424507 1960546 817974
15283 817974 1611074 4325046 4538741 525947 -3567437 -3523044 -476039 1651139 1488844
15274 1488844 605113 215527 -199950 -1534491 -3755732 -5895184 -6879259 -6652329 -6311182
15265 -6311182 -6428799 -5802054 -3251219 -222726 387524 -1822478 -3981563 -3668236 -1519801
15256 -1519801 710746 2761049 5029771 6596336 6046039 3807420 2014366 1956247 2836813
15247 2836813 3279776 3057447 2804600 2762636 2685540 2728316 3362449 4137011 3659698 1678678
15237 1678678 137265 682637 1930780 1289143 -889672 -1634378 -109863 1010334 63693
15228 63693 -887080 67915 1089719 -133021 -1941615 -1167112 1654227 3367180 3324924
15219 3324924 3400436 3665576 2483627 777815 1496905 4074604 4104143 212996 -3029529
15210 -3029529 -1496451 2814245 5249523 4639797 3011839 1676152 755729 801289 1880201
15201 1880201 2328594 924620 -951018 -1563376 -1691841 -2789945 -3867180 -3123270 -1499397
15192 -1499397 -1472927 -2989431 -3656519 -2699497 -1769098 -1716660 -1320443 263092 2006087
15183 2006087 2512137 1333001 -1267763 -4126365 -5065762 -3199388 -1168410 -2439756
15175 -2439756 -6159020 -7656043 -4961750 -1757264 -1979209 -4123670 -3743266 -89913
15167 -89913 2971500 2573334 496372 117950 1651103 2266120 295961 -2559146 -3696656
15158 -3696656 -2885988 -1918296 -1800022 -1888152 -1633768 -1399501 -1140370 -71707 1449140
15149 1449140 1441111 -921870 -3526667 -3968590 -2709582 -1730814 -1224827 54064 1875219
15140 1875219 2474830 1293353 -358574 -1285715 -1125766 540282 3475238 5428635 4181488
15131 4181488 1137440 129018 2150767 4094867 3501620 1569523 163567 -1094874
15123 -1094874 -2743300 -3242221 -1466232 636935 697048 -309003 170568 1853753 2074063
15114 2074063 182008 -1468587 -1118851 350393 1478001 2151787 2704058 2814545 2248406
15105 2248406 1523474 1125327 930406 853043 1216708 2074396 2834758 2824318 1732840 -341708
15095 -341708 -2547071 -3281287 -1685032 879648 1960694 718927 -1557193 -3578125
15087 -3578125 -5215774 -6224955 -5531608 -2926144 -235319 675349 382223 790002 1791463
15078 1791463 957143 -2663951 -6007749 -5058525 -53053 4293217 4325063 1523226 -214303
15069 -214303 158561 549084 -19361 137546 1996156 3709076 3576759 2985023 4098043
15060 4098043 6126937 6496084 4847409 3148341 2129794 421152 -2456016 -4887061
15052 -4887061 -5804757 -6208301 -6878621 -6659583 -4576068 -1995845 -852879 -855394 -326667
15043 -326667 864579 1074534 -535029 -2703219 -3622762 -2840667 -1380287 -524377 -552117
15034 -552117 -453463 838986 2856715 4004862 3854121 3819966 4697718 4832941 2373262
15025 2373262 -1500622 -3642292 -3044994 -1765889 -1404692 -864688 1188520 3463189 3595100
15016 3595100 1671589 117991 175588 480798 -270051 -1037478 -204453 1503670 1737617
15007 1737617 -54201 -1780118 -1791813 -1146208 -1626693 -2833670 -3028797 -2206097 -2184647
14998 -2184647 -3468484 -4082734 -2477929 35362 1124730 591105 143017 681978 1407229
14989 1407229 1406429 669825 -564474 -2182902 -3618867 -3972160 -3102739 -1817078 -765102
14980 -765102 -12077 185839 -618511 -1832193 -1874507 -374269 800222 19995 -1427676
14971 -1427676 -891887 1666793 3280948 2168422 440564 1095509 3522773 4156676 1430729
14962 1430729 -2105155 -3351850 -2472478 -1687088 -1665085 -1246679 -226278 -74070 -1484524
14953 -1484524 -3202208 -4150722 -5010347 -6481608 -7492894 -6732981 -4859884 -3430147 -2456598
14944 -2456598 -958900 629404 833267 -130272 -248101 1207044 2605924 2744754 2595531
14935 2595531 3024460 2743735 460051 -2358797 -3186835 -2210585 -1987581 -3342639 -3975001
14926 -3975001 -1992637 1080513 2350481 1538240 1150643 2792675 4901646 4932843 2871147
14917 2871147 1257689 1707804 2698483 1719862 -1162804 -3302067 -2920392 -1089633 181403
14908 181403 404729 196115 -356244 -1377282 -1917231 -690123 1910351 3972804 4454019
14899 4454019 4107606 3735153 2952518 1460435 246609 260529 706131 113259 -1250109
14890 -1250109 -1594018 -349214 883657 797171 353343 1046585 2284119 2296869 1169865
14881 1169865 835212 1835922 2347335 1350242 546640 1397873 2248323 937995 -1130773
14872 -1130773 -685476 2267448 4360691 3973916 2855945 2006803 -92515 -3395697 -4350845
14863 -4350845 -1053410 2773553 2613407 -375715 -1756940 -890230 -987837 -2882322 -3580865
14854 -3580865 -1452311 1489584 3442340 4940318 5826757 4124666 52248 -2340744
14846 -2340744 -270658 3670692 5108266 3314460 514275 -1968782 -3886605 -4189618
14838 -4189618 -2240959 152512 876751 811976 2139232 4202262 4308773 2361910 1314152
14829 1314152 2546853 3890311 3289034 1808260 1513606 2356547 2813530 2274397 1255892
14820 1255892 88714 -1281931 -2630591 -3552723 -3980266 -3999266 -3452463 -2219806 -708046
14811 -708046 281935 202118 -610986 -843205 735393 3524019 4919937 2940803 -1073037
14802 -1073037 -3448397 -2152987 1023838 2656049 1464913 -589926 -804556 1153564
14794 1153564 2992542 2715727 1165109 832234 2511409 4485905 5127864 4713532 4136859
14785 4136859 3521957 3020734 3251030 3696154 2456489 -756483 -3128715 -2305674 144183
14776 144183 1172943 584388 90438 -479569 -2388521 -4196138 -2875523 1023004 3261884
14767 3261884 1915549 -101298 183525 1880790 2851896 3129095 3538306 3517730 2681241
14758 2681241 2413276 3534745 4204289 2513527 -343618 -1749919 -1161475 218952 1893599
14749 1893599 3835359 4857969 3629693 769511 -1978839 -4018569 -5642186 -6406949
14741 -6406949 -5686448 -4139529 -2878055 -1946143 -1233345 -1702774 -3662852 -4999955 -3597515
14732 -3597515 -625553 1181860 1735728 3106318 5275034 5750718 3826513 2039634
14724 2039634 2335740 3438780 3330487 2086157 824518 -225031 -1083508 -1069546 -57937
14715 -57937 606111 3719 -624263 304561 1907037 1681042 -852152 -2928687 -1733388
14706 -1733388 1908971 4056636 2128864 -1876719 -3633192 -1693744 1112541 1902026
14698 1902026 1294949 1226901 1163298 -778394 -3964659 -5674203 -5271939 -4849103 -5259318
14689 -5259318 -4631255 -1911473 1006371 2285818 2769503 3750102 4368004 3366245 1563273
14680 1563273 358691 -551417 -1660603 -1530730 1034140 3953220 4085724 1792823 238035
14671 238035 550882 966207 839364 1947367 4796599 6908374 6492546 5122717 4739690
14662 4739690 4401586 2532962 490428 850602 3175553 4534675 3907638 3142837 3359813
14653 3359813 3303935 2126632 1128275 1251138 1092747 -600827 -2229005 -1550284 507496
14644 507496 941408 -763667 -1849636 -432631 2013948 3206769 2871586 1696268 -472789
14635 -472789 -3368184 -4738684 -2639679 1208581 2830361 969026 -1495121 -1644432
14627 -1644432 12438 1225849 1329070 1216467 1197901 817648 339039 562520 1146641
14618 1146641 787612 -589944 -1425033 -998104 -764004 -1975420 -3258660 -2369041 306967
14609 306967 2084937 1787565 1056653 1287795 1461306 397375 -754733 -392098 488749
14600 488749 -310159 -2282718 -2454515 215405 3204099 4006836 3119447 2300053 1880974
14591 1880974 1358566 1002307 1049235 451860 -1756288 -4622425 -6412444 -6892492 -6928533
14582 -6928533 -6538257 -5142040 -3365427 -2746424 -3532184 -4172764 -3219716 -796683 1731077
14573 1731077 2790155 1773392 42793 -13160 1964194 3196052 1302570 -1994712
14565 -1994712 -2774513 11844 3553612 5039685 4294461 2542009 778652 -232684
14557 -232684 -248211 -165218 -708485 -663645 1424328 3998545 3795180 779485 -1357220
14548 -1357220 -675373 225624 -1305204 -3610531 -3384761 -545363 2255240 3491575 3583087
14539 3583087 2978619 1854990 957412 663256 -2403 -1556058 -2382906 -1058475 762492
14530 762492 358598 -1932941 -3356865 -3029523 -2655459 -3033057 -2900335 -1730647 -725710
14521 -725710 -133531 1551485 4321550 5308799 2787774 -603182 -1142746 877738 1983706
14512 1983706 693245 -895825 -821446 -47547 -523836 -2178852 -3226714 -2594283 -821604
14503 -821604 1000749 2094922 2018412 990944 384633 1754226 4705129 6616265 5541530
14494 5541530 2836705 1557812 2425658 3027598 1438130 -1160454 -2687621 -3460982 -5247375
14485 -5247375 -7727614 -8295349 -5729847 -2047196 231410 1040473 1721550 2336516 1885314
14476 1885314 679846 469631 1759838 2611033 1158302 -1676185 -3315566 -2943989 -2293823
14467 -2293823 -2760967 -3196428 -1722622 1040250 2191695 249046 -2657656 -3165065 -585457
14458 -585457 2569543 3760355 3053127 2277635 2469416 3038751 3164112 2938207 2769427
14449 2769427 2478465 1796248 1337088 2084182 3894980 5407272 5624227 4794457 3560560
14440 3560560 2267085 1508106 2127178 3762621 4421953 2724637 -106431 -1677646 -1265325
14431 -1265325 -47747 822589 918042 -122095 -2158530 -3634836 -2915820 -691456 666487
14422 666487 418401 336073 1652210 2834597 1555456 -2094634 -5344763 -5312784 -1637430
14413 -1637430 2810113 3993173 581604 -4250315 -5985308 -3534294 370108 2957368
14405 2957368 3612071 2588326 102990 -2728062 -4221561 -4067641 -3142006 -1338840 1925408
14396 1925408 4963816 4876273 2144311 621338 1628180 1969365 -103016 -1222835 1410038
14387 1410038 4556220 3716132 503702 8053 2555826 3659538 1647781 -55966
14379 -55966 1126169 3434918 4445891 4245207 3482618 1702665 -734805 -1882022 -879552
14370 -879552 849208 2027282 2768993 2750602 995845 -1559092 -2283344 -915950 -394615
14361 -394615 -2019523 -2895608 -459152 3207820 4369219 2805665 1041540 28373
14353 28373 -1201090 -2384625 -1690547 1219104 4024184 4246827 1706497 -1680659 -3662326
14344 -3662326 -3287272 -1453781 315412 1687241 3187529 4084885 2559606 -1101604
14336 -1101604 -3554024 -2391693 522543 1739873 812749 -200079 -662535 -1816169
14328 -1816169 -3617834 -4162016 -2837511 -1508227 -1592245 -2144503 -2006029 -1803888 -2188141
14319 -2188141 -1843098 504109 3109601 2805970 -441365 -2884250 -1636911 1861245
14311 1861245 4161885 4087355 3108653 2478157 1991392 1364957 933769 707792 401999
14302 401999 780262 3134665 6633945 8098668 5871325 2404007 1245047 2608103
14294 2608103 3859369 3511860 2543461 2132684 2241536 2516484 2771822 2436753 1160947
14285 1160947 38566 529804 1995599 2047090 -224810 -2864562 -3332767 -951796 3056593
14276 3056593 6625322 7867163 6493821 4323572 3127581 2360657 653345 -1240045
14268 -1240045 -1555149 -1107500 -2436238 -5076032 -5441888 -2664275 -670432 -2120590 -3841902
14259 -3841902 -1782665 2179588 2726489 -879557 -3749411 -2554383 163343 223164 -2557965
14250 -2557965 -4968293 -4966223 -3559029 -2621489 -2496906 -2181768 -1079497 214933 952154
14241 952154 1417083 2401616 3702044 4032288 2634627 263470 -1656486 -2219127 -1328643
14232 -1328643 338443 1470822 1096581 -267167 -1094097 -533490 1065220 2987049 4384972
14223 4384972 4039158 1507226 -1468800 -2416285 -1267291 -420275 -1403435 -3211698 -4335071
14214 -4335071 -4590237 -4319402 -3461356 -2073416 -384323 1822594 4239333 4812386 2057353
14205 2057353 -1496937 -1464009 2183819 4563557 2770033 -278853 -736908 917236 1974670
14196 1974670 1755430 1030415 -163448 -1473100 -1527269 -726163 -1778795 -4773329 -5248320
14187 -5248320 -819515 3807737 3127974 -907075 -2445640 -1228109 -2155438 -6363633
14179 -6363633 -9286048 -8077458 -5057405 -2588435 63126 3033115 3972339 2159366
14171 2159366 388918 428747 254906 -1832944 -3789149 -3184161 -1073648 240715 865975
14162 865975 1929689 2519439 948962 -2025259 -3728070 -2814459 -391760 1534025 1649473
14153 1649473 172244 -1074401 -398993 1340211 1323494 -1573977 -5105554 -6379860 -4938548
14144 -4938548 -2429458 -546570 25507 -177280 231608 1764965 2734679 1284501 -1363727
14135 -1363727 -1913809 464693 2962246 3122824 1708174 772242 1098292 2423410 4066347
14126 4066347 4550058 2860573 770118 1291422 4004775 5007622 2821916 948199
14118 948199 2423909 5156080 5633048 4450148 4481289 5562984 5055890 2749436 1258451
14109 1258451 1523134 1390357 -577176 -2660284 -2570423 -574328 1264423 1818451 1645949
14100 1645949 1440270 800561 -928644 -2882261 -2839772 -55830 2960318 3212033 1355727
14091 1355727 837907 2747323 4147463 2497161 -772821 -2646642 -2349558 -1001565
14083 -1001565 679185 2322900 3054326 2650797 2314467 2611541 2146145 175129 -1130912
14074 -1130912 442853 3214667 3342167 57089 -3400567 -4133608 -2674461 -1266336
14066 -1266336 -726556 116777 2399032 5082946 5367874 2171725 -1277488 -544773 3937371
14057 3937371 6708200 4557225 964420 834623 3568101 4921947 3845340 3145170
14049 3145170 3896770 3498261 193576 -3773811 -5091906 -3441863 -1318339 -1062166 -2983229
14040 -2983229 -5623384 -7297610 -7596319 -7164570 -6008836 -3356019 156724 2011360
14032 2011360 1027701 -690695 -925584 -665325 -1822816 -3329338 -2616014 115856 2401674
14023 2401674 3593802 5015812 6370776 5633865 2900304 968578 1274425 2191511 2273411
14014 2273411 2369559 3344845 4223931 4069074 3782531 4665481 6489825 7826776 7197452
14005 7197452 3786185 -1479229 -5612409 -6125761 -3888040 -1761415 -978349 -1079151 -2475071
13996 -2475071 -5675583 -8240677 -6478718 -978197 3152931 2700915 -308409 -2672143
13988 -2672143 -3696056 -3355061 -767363 3081289 4548873 2049156 -1339439 -2534588
13980 -2534588 -2598260 -3293165 -2851435 779231 5062915 5897202 3979054 3512232 5306602
13971 5306602 5826028 3364606 881378 1418381 3957828 5438527 4636771 2577519 625270
13962 625270 -569276 -992062 -851559 -119779 1133113 1748376 248721 -2436236 -2910715
13953 -2910715 114817 3012690 1681978 -2627796 -5123931 -4103861 -2171647 -1300589
13945 -1300589 -741536 -307154 -1642191 -4667291 -6143393 -3838308 397787 3549135
13937 3549135 5067778 5688179 4924526 2223203 -899854 -2242321 -1605596 -402306 475689
13928 475689 897876 724281 383641 1138578 3161788 4460624 3468077 1604281 1259656
13919 1259656 2176215 2119040 550543 -838000 -1191749 -1698839 -3277381 -5044112 -5767760
13910 -5767760 -5288304 -3914527 -1879095 -11240 456812 -464374 -1239177 -908513 -363458
13901 -363458 -720884 -1506256 -1505713 -669347 -46978 -167309 -379261 248916 1843574 3418631
13891 3418631 3522173 1640014 -887159 -1959142 -969889 656406 1325342 821537 -188143
13882 -188143 -1062719 -1142355 -67960 1104083 466985 -1921920 -3134312 -914180 2893759
13873 2893759 4415843 2669844 380426 127044 1768388 3798289 5163288 5229240 3822642
13864 3822642 2017291 1298049 1399506 676126 -890876 -1201684 501825 1997654 1485656
13855 1485656 472247 1116349 2499147 2145440 30719 -1662096 -1979661 -1642552 -649442
13846 -649442 1553176 3655734 3417439 1451967 995978 3044085 4789798 4248145 3314960
13837 3314960 4101042 5009637 3408032 257929 -1217635 -454789 93989 -802807 -1574021
13828 -1574021 -769850 1029858 2761721 4003265 3864157 1088081 -3480778 -6407929
13820 -6407929 -5238055 -1401737 1722152 2563576 1891026 698847 -645079 -1570480 -1351619
13811 -1351619 -211545 753593 979730 893498 851068 589545 127893 342144 1821987
13802 1821987 3489264 3279614 550883 -2741968 -4022482 -3155488 -2525642 -3548960 -4287073
13793 -4287073 -2032070 2403284 5193100 4559531 2939892 2964684 3643689 2708037 846658
13784 846658 570301 1820394 2112828 1014604 1014001 3128111 4953489 4619107 3641720
13775 3641720 3702136 3344004 766182 -2248031 -2589150 -666398 481857 97221 54375
13766 54375 559788 -553272 -3479733 -5052556 -3274914 -306566 859650 212989 -588748
13757 -588748 -929560 -525421 1657062 5048368 5904511 1410899 -5497418 -8716181 -6391068
13748 -6391068 -2843492 -2557558 -4981485 -6692692 -6633583 -6906331 -8826701 -10206768 -7679028
13739 -7679028 -1270414 4653914 5951839 3621638 2659091 5900377 10725666 12624097
13731 12624097 10302292 5947169 2018926 -290713 -501560 973144 2348542 2018919
13723 2018919 568077 -166080 228180 435871 -462818 -2000305 -3216525 -3248974 -1509164
13714 -1509164 1269937 2788189 1741353 24305 320627 2051383 2249161 276016
13706 276016 -1226432 -569167 669312 632928 -71928 -87888 425873 880680 1725146 3042311
13696 3042311 3323669 1642127 -195581 246518 2569608 4175223 3927072 3255155 3550088
13687 3550088 4073221 3020745 -164726 -3988196 -6152488 -5617024 -3531522 -1891217
13679 -1891217 -1354839 -1025056 -268910 393175 511937 602651 1179481 1928012 2493304 3066452
13669 3066452 3491838 2902275 1152249 -390618 -503075 290719 723079 496705 -17670
13660 -17670 -800201 -1565676 -969666 1874746 5364569 6517102 4362866 1049780 -791973
13651 -791973 -823383 -566986 -862998 -718861 1001232 3327987 3694934 1089890 -2312191
13642 -2312191 -3687299 -2884738 -1709188 -659873 1238877 3343167 2956032 -776350
13634 -776350 -4803751 -5755851 -3925229 -1922577 -940166 -531878 -909399 -2768017 -5036174
13625 -5036174 -5274842 -2954120 -574197 -556216 -2094796 -2243744 140967 2591465 1831969
13616 1831969 -1992628 -5184591 -5139484 -3595527 -3657067 -5006819 -4846673 -2907639 -1932731
13607 -1932731 -2752990 -2707603 -436490 1413519 518111 -1473277 -2432445 -3631183 -6472400
13598 -6472400 -8199011 -5463424 -393705 1756968 153868 -1200078 -305140 474438
13590 474438 -524320 -1540431 -1199232 -990166 -2027266 -2753241 -1972332 -1293682 -2396492
13581 -2396492 -4241333 -5022364 -4808616 -4391636 -3500868 -2012004 -1077258 -1225082 -1051747
13572 -1051747 451775 2005500 2257028 2109679 2836190 3571382 2991487 2081119 2696233
13563 2696233 4322673 4792404 3702991 2758072 2911059 3318235 3149699 2532171 1560288
13554 1560288 123543 -1011871 -554038 1394491 3042646 3062136 2042087 1324867 1216922
13545 1216922 876257 -542386 -3007970 -5523355 -6685639 -5641644 -2761142 625752
13537 625752 3176730 4357556 4595823 4626099 4498544 3494255 1399224 -652085 -1434227
13528 -1434227 -1250833 -1096123 -622771 1306301 4032128 5155846 3871346 2322517 2581641
13519 2581641 4030780 5064913 5731838 6913620 8050643 7516021 4675458 325612
13511 325612 -4118327 -6830582 -6276523 -3207902 -742654 -785485 -1575653 -608874 1424725
13502 1424725 2041397 1124641 744686 1410191 1610962 1055635 1245477 2387980 2798668
13493 2798668 2272050 3113278 6395027 9717748 10355926 8485390 5642324 2150353 -1865503
13484 -1865503 -4781144 -5217655 -4263539 -3744046 -3344584 -1718982 458057 1074726 -159017
13475 -159017 -1403530 -1582445 -1409220 -1417766 -1096504 -413335 -325362 -1150480 -1937248 -1942387
13465 -1942387 -1381613 -484710 629487 948233 -630810 -2969266 -3237834 -745042 1769492
13456 1769492 1902979 703677 431706 1073100 1181326 725448 700225 884590 467760
13447 467760 290472 1907719 4616832 5908006 5026017 3772114 3480942 3539933 3444523
13438 3444523 3917578 4941797 4780980 2374598 -767953 -2289866 -1485584 691366 2855240
13429 2855240 3828547 3483267 3374501 4828708 6202020 4551107 616923 -1112096 1143417
13420 1143417 3398266 1883479 -1232991 -1761172 -346588 -721838 -2780197 -2667939 447159
13411 447159 2778889 1983878 363995 475941 1399978 1385080 1019197 1518640 2284170
13402 2284170 2192492 1387481 261279 -1314372 -2444117 -1299680 1690151 3246744 1721279
13393 1721279 -290753 35370 1599845 1861768 1177859 1468408 2314364 1933037 981532
13384 981532 1761394 3992489 4835359 3361479 1873519 2075880 2659931 1799839 -102338
13375 -102338 -1434658 -1621484 -1203386 -677701 -141946 501566 1399856 2334147 2521274
13366 2521274 1515571 71991 -705459 -741179 -661503 -653649 -712338 -1307948 -2406015 -2520852
13356 -2520852 -528325 2025623 2426366 492021 -1236108 -1115386 -146458 302526 412310
13347 412310 679700 582865 -314241 -1243024 -1445586 -1589639 -2793283 -4711303 -5527408
13338 -5527408 -3832815 -228256 2882704 3333115 1382325 -609809 -1185688 -1474209 -2800682
13329 -2800682 -3906149 -2642690 333312 2181696 2062849 1896951 2511288 2002932 -778631
13320 -778631 -3715811 -4212466 -2546213 -630905 845544 2121191 2692655 2068793 1157214
13311 1157214 952504 763736 -318528 -1099746 325617 3322800 5125475 4501922 2958277
13302 2958277 1986621 1060508 -793322 -2837364 -3196301 -1112196 2074131 4165544 4209015
13293 4209015 3322353 3150337 3635890 3252320 1613952 362732 567206 833516 -355788
13284 -355788 -1765081 -1158079 824879 1203441 -875935 -2770017 -2095966 397180 2701340
13275 2701340 4186842 4903354 4038053 1143049 -1977553 -2612283 -298519 2704241 4037725
13266 4037725 3274990 1513981 176562 353044 2203256 4489678 5419727 4476889 2971403
13257 2971403 2362002 2475476 1987838 468653 -784239 -234014 1981455 4048970 4280659
13248 4280659 2595145 309800 -1108844 -1049372 -13941 827493 636001 -253133 -655180
13239 -655180 147373 1656522 2838352 3199458 2999577 2726011 2536070 1960337 248574
13230 248574 -2460485 -4561366 -4629806 -3597859 -3731514 -5026339 -4591976 -895793 3270748
13221 3270748 4132024 1828106 -509375 -1528105 -2448959 -3470241 -2878503 -507210 1097768
13212 1097768 476835 -388553 684210 2730037 3586148 3289293 3228441 3417824 3059902
13203 3059902 2683482 3165712 3398051 1585694 -1427318 -2730102 -1393357 421476 838051
13194 838051 546138 912472 1709614 1868066 1191846 256424 -539153 -1016593 -1005863 -693062
13184 -693062 -603617 -817146 -726960 130251 1466756 2588728 2936296 2360914 1281901
13175 1281901 295791 -727481 -2468563 -4527317 -5093182 -3336533 -935409 258369
13167 258369 746994 1608712 1706329 -370020 -2602138 -1522575 2202747 4098987 2459728
13158 2459728 648334 1484664 3284750 3633431 3400127 4103985 4448379 2875052 1043429
13149 1043429 1185525 2047780 1172964 -472340 -59084 2173751 3548638 3615530 4045687
13140 4045687 4414835 2629694 -168892 250200 4781910 8618264 7249757 1810381
13132 1810381 -3376766 -5835257 -5585000 -3274173 -23674 2461785 3562664 4344490
13124 4344490 5271273 5001898 2916683 1052891 1533834 3291371 3396570 1058820 -1438910
13115 -1438910 -1685427 116629 1442716 126322 -3056571 -4728346 -2655910 1283858
13107 1283858 3318121 2541744 1416293 1668601 2369392 2643317 3412913 5071068 5883146
13098 5883146 4411986 1580033 -1108566 -3295646 -4325951 -2665225 1167906 3556147
13090 3556147 2299700 131373 873177 3860694 5322387 3915769 1594480 -37168
13082 -37168 -873414 -492169 1363849 2771327 1517125 -920955 -664553 2898879 6099407
13073 6099407 6371688 5265414 4829938 4363547 2830278 1706803 2792281 5101290 6507154
13064 6507154 7007308 7732533 7868360 5631661 2080513 890528 3473160 6710749 7005705
13055 7005705 4850348 3489994 4087075 4489529 2782600 -87179 -2067645 -2697020 -2746301
13046 -2746301 -2445779 -1730252 -1420725 -2309068 -3496645 -3496905 -2684471 -2620719 -3145510 -2532190
13036 -2532190 -660562 646839 974082 2050709 4098638 4560894 2212009 -466426
13028 -466426 -1282078 -1797475 -3921090 -5723322 -4331071 -1063316 345306 -472058 -472165
13019 -472165 1583863 3658571 4138393 3569031 2527623 934067 -241638 438762 2217993
13010 2217993 2715851 1361798 -230278 -1103967 -1412461 -450848 2466933 5330182 5171269
13001 5171269 2573913 849674 691032 -261706 -2231623 -2375239 -109157 1405345 833293
12992 833293 1023823 3520560 5351688 4228275 2563098 2817318 2917826 364728 -2722381
12983 -2722381 -3176726 -2306866 -3013723 -4007350 -2177433 1163036 1992765 566420 1098736
12974 1098736 4478450 6563326 4632392 996910 -1158801 -1713100 -1896390 -1871490 -1588170
12965 -1588170 -1568610 -1697616 -1375802 -1376573 -3020342 -5090778 -4563044 -1226656 1470870
12956 1470870 1376770 376994 587882 840658 -644194 -2482181 -1940879 788806 2832111
12947 2832111 2648083 1710122 2239142 4655428 7278865 7841164 5663750 2709690 1603173
12938 1603173 2278527 2061167 -206245 -2023090 -799599 2090622 3161190 1803542
12930 1803542 797737 1906033 3538684 3612389 2598059 2247159 2658626 2376595 885743
12921 885743 -569924 -708765 433954 2066094 3482921 3970450 2924440 855556 -463204
12912 -463204 186658 1906679 2801818 2280926 1279580 573829 137444 62710 682314
12903 682314 1500324 1356059 162525 -738312 -557140 -211969 -764987 -1814510 -2322965
12894 -2322965 -2096043 -1537977 -771330 123914 732373 921646 1101803 1294777 909986
12885 909986 34616 -249874 416312 956921 732550 648225 1296767 1608981 793409 50405
12875 50405 641168 1728290 2043954 2240621 3375406 4426338 3866081 2578228 2421746
12866 2421746 2801355 1732010 -277724 -753794 452616 874748 -178243 -471180 905170
12857 905170 1578677 -18906 -1569944 -309900 2533561 3388143 1322569 -979506 -908257
12848 -908257 1167895 2825568 2424178 765001 71239 1240298 2591288 2097097 193327
12839 193327 -1056546 -1050478 -937498 -1058617 -510551 432709 68630 -1630860 -2150509 -136563
12829 -136563 2162030 1956961 -258195 -1825853 -1522133 -164094 1279875 2249688 2008348
12820 2008348 358903 -1439666 -2034152 -1907016 -2462782 -3491895 -3221399 -1097656 997958
12811 997958 1107439 -153543 -425532 1066411 2237322 1031692 -1292899 -1614225 302053
12802 302053 1020531 -1247663 -3172314 -1004085 3161081 3779973 -149506 -3829821 -3842453
12793 -3842453 -2247105 -2042323 -2602358 -2056504 -860249 -146981 793920 2499116 3176428
12784 3176428 1627506 214018 1577152 4103776 4195886 1831077 238610 762844 1627933
12775 1627933 1519977 889740 -431102 -3443445 -7061122 -8026553 -4995116 -483290 2278314
12766 2278314 2531921 1308520 -339610 -1356875 -796634 745159 1154365 -506594 -2383602
12757 -2383602 -2093338 155572 1830902 1114043 -1196175 -2739640 -1992961 495490 2964911
12748 2964911 4138921 3864091 2564535 919190 -122482 -183246 -331926 -1696071 -3144268
12739 -3144268 -2350294 328511 1476666 -647557 -3466881 -3950444 -2699676 -1888172 -1502712
12730 -1502712 -547094 97240 -609580 -1042509 492116 1903788 304124 -2339868 -1429985
12721 -1429985 2768440 5081543 3413922 1499463 2193941 3147804 1711560 -293883
12713 -293883 20348 1877850 2842020 2824717 2886922 2367375 432551 -1340069 -996743
12704 -996743 576461 1157148 569512 60784 -369703 -1507722 -2921574 -3723655 -4234416
12695 -4234416 -4806770 -4289915 -1809281 1236231 3018673 3624145 3558804 1992691 -894730
12686 -894730 -2074195 344455 3106112 1811380 -2341062 -4170139 -2191171 -33509
12678 -33509 -98365 -560323 224383 710754 -498986 -1843612 -1523111 -305132 382200
12669 382200 828621 1712284 2521416 2932991 3697126 4662295 4183486 2162878 1288126
12660 1288126 3140732 5296081 4801978 2652818 1947628 3007548 3489217 2691555 2524925
12651 2524925 3860260 4595293 2482500 -1666438 -4691060 -4368272 -1439920 1362481
12643 1362481 2099459 1322195 760210 859028 814747 682530 1335839 1973494 286428 -3575849
12633 -3575849 -5833156 -4053938 -1013932 -768024 -2789688 -3456557 -1987129 -855134
12625 -855134 -813526 120987 2177485 2587472 365031 -1431249 -416718 1373248 1181087
12616 1181087 228889 1329092 3643094 3643909 736526 -1603740 -711003 2083791 4015914
12607 4015914 4381837 4219187 4073307 3570835 2581758 1722149 1785710 3048124 4884450
12598 4884450 5904663 4879812 1862946 -1709892 -4118589 -4589662 -3712435 -2797265 -2533673
12589 -2533673 -2225430 -900341 783143 790346 -1576111 -4308983 -5012709 -3657188 -1880027
12580 -1880027 -532002 491931 771009 -209936 -1343170 -727114 1495174 3028054 2603437
12571 2603437 1410611 780204 460105 146698 664539 2141013 2850646 1766418 702337
12562 702337 1645648 3172309 2260499 -858569 -2601626 -1066851 1587980 2731533 2742583
12553 2742583 3303687 4138463 3630548 1790864 549746 1176618 2827346 3742135 2986657
12544 2986657 1182670 303205 2203645 6175710 8517479 6296176 1471178 -816798
12536 -816798 1314751 3948799 2742867 -1144123 -3039893 -1564764 -184683 -1661605
12528 -1661605 -4144870 -4429594 -2658516 -1309328 -970785 16390 2102386 3432107 2699465
12519 2699465 967621 -175207 -581874 -755486 -572883 80259 502068 96893 -718434
12510 -718434 -1418008 -2318672 -3741641 -5089311 -5703074 -5815846 -5707671 -4819815 -2808901
12501 -2808901 -620347 677619 1283275 1654882 1165228 -582889 -2037288 -1394891 485147
12492 485147 1084008 -63169 -998040 -771090 -637662 -1111181 -446486 2355604 5048400
12483 5048400 4695652 1594505 -1228352 -1784415 -728693 427902 1119913 1609139 2236984
12474 2236984 3239134 4765395 6696022 8410175 8798125 6983389 3652368 1242642
12466 1242642 1624958 3599304 4008723 1606623 -1559603 -3060552 -2855420 -2356108 -2207696
12457 -2207696 -2217839 -2401678 -2791709 -2874933 -2226775 -1149533 -56868 980415 1643323
12448 1643323 1500857 1186874 1861046 2896701 2182218 -217665 -1177810 875514 2940273
12439 2940273 1637281 -1705569 -3320103 -2556147 -1506845 -469204 1922897 4626019
12431 4626019 4867478 3225681 3477287 6311718 7653976 5106419 1914106 1892068 3919634
12422 3919634 4559508 3336653 2161328 1665434 1250598 1041779 938247 -523540 -3511948
12413 -3511948 -5025597 -2886026 292175 839440 -35555 1404054 4307844 3918096 -378257
12404 -378257 -3230452 -1287502 1983271 2186723 424016 184371 1218749 959650 -84492
12395 -84492 830044 3188160 3247463 133621 -2232854 -923980 1620867 1401318 -1347639
12386 -1347639 -3070074 -2291635 -989638 -720587 -372446 1186014 2570767 1920092 126058
12377 126058 -216075 1293464 2228996 1054182 -489050 106053 2553875 4291953 3912821
12368 3912821 2539615 1861686 2132542 2488567 2375815 2114412 2317359 2960217 3064461
12359 3064461 1690835 -561467 -1798779 -1240437 -589907 -1839349 -4277798 -5297002
12351 -5297002 -4111751 -2833138 -3190764 -3925889 -2890713 -591957 375988 -726381 -1497052
12342 -1497052 20527 2104692 1634883 -1039125 -2007879 684247 3810554 3276835 -5783
12333 -5783 -1534566 148889 1774272 869176 -695201 -571291 -97198 -1570040 -3679188
12324 -3679188 -3286700 -517468 1546691 1692786 1566040 1943909 1623819 577743 778684
12315 778684 2717846 4113814 3593994 3039832 4522149 7071111 8310662 7619456 6093471
12306 6093471 4835227 4517646 5102505 5043206 2716304 -419585 -684886 2283630 3789516
12297 3789516 354800 -4923442 -6601453 -4434911 -2793970 -3689305 -4609739 -3351926
12289 -3351926 -1107849 238318 760965 1086581 801190 -217300 -733571 50113 948979
12280 948979 442880 -1014957 -1571321 -431050 1133444 1139866 -1058876 -3969705 -5245760
12271 -5245760 -3968822 -1307081 1294228 3648167 5841617 6897809 5900934 3712101
12263 3712101 1943538 800085 -306479 -613174 1176908 3973638 4773295 2804770
12255 2804770 909203 1498644 3048420 2388432 -736697 -3332218 -2962170 -317501 2035148
12246 2035148 2279234 519872 -1707454 -2626509 -1517009 581944 1708804 1065462 90383
12237 90383 674587 2360637 2678693 903242 -300029 1210049 3070982 1421003 -2846980
12228 -2846980 -4819365 -3053365 -1851685 -4060032 -6083293 -3767421 413127 993973
12220 993973 -1948257 -3341602 -1191262 1378461 2226734 2966730 4481109 4612069 2494008
12211 2494008 1171935 3245035 6873202 8650787 8137457 7223856 6838185 6346167 4901206
12202 4901206 2001701 -1971341 -5002947 -5034495 -2961599 -1902039 -2861757 -3687910 -3087271
12193 -3087271 -2647160 -3531135 -4197235 -3191990 -1528124 -528318 98775 471723 -265578
12184 -265578 -1356796 -383576 2279514 2717818 -338718 -2668568 -1178509 861583 -430125
12175 -430125 -2521957 -758699 3346723 4430266 2096130 955177 2581374 3742191
12167 3742191 2754713 1568230 801354 -1477805 -4717105 -5139169 -1853417 1317703 2033448
12158 2033448 2451691 3885089 3760804 1048355 -383038 1988819 4151171 1631252
12150 1631252 -2708826 -2637870 1877437 4998877 4030966 2249999 2249129 1939352 -811885
12141 -811885 -3854365 -4001665 -1876492 -537715 -834695 -918091 245919 1357498 1025877
12132 1025877 -301440 -1365587 -1834252 -2077906 -1964492 -1064095 71128 -4772 -1776510
12123 -1776510 -3723754 -3754560 -1351468 2015732 4120131 3427686 248796 -2983037 -3542068
12114 -3542068 -1315648 1050128 1635130 1420244 1737301 1440210 -930314 -3538534 -3130565
12105 -3130565 -199594 1181507 -730590 -2874923 -2114472 455704 1827430 1463235
12097 1463235 1181253 2083915 3493273 4042287 2634085 -509773 -2870629 -1507969 2791091
12088 2791091 5286518 3079947 -844831 -1793807 217886 1371671 235005 -703804
12080 -703804 236206 1302419 650448 -570585 -364427 849595 1181451 262919 -721457
12071 -721457 -1343793 -2290453 -3466484 -3573985 -2155052 -646346 -459694 -1036754 -1029881
12062 -1029881 -699744 -1471449 -3187125 -3716090 -2093781 -358680 -766209 -2374858 -2361083
12053 -2361083 -148645 1923416 2114020 1395180 1458829 2399685 3362079 4093032 4677241
12044 4677241 4693286 3798125 2584686 1921579 1815896 1642454 1209759 1045408 1731423
12035 1731423 3100240 3922830 2734306 -392502 -3332432 -4204303 -3778205 -4195029 -5646223
12026 -5646223 -6274119 -5438677 -4761887 -5157689 -5088710 -3164952 -589966 691607 808468
12017 808468 1097827 1573516 1189201 -67870 -1137541 -1584884 -1881680 -2296727 -2729266
12008 -2729266 -3276401 -3843029 -3635485 -2165131 -314185 664609 733112 664426 719604 858800
11998 858800 1531765 2879413 3775925 3206277 2121894 2257982 3422916 3840104 3204194
11989 3204194 3333685 5099663 6549753 5461438 2650037 1117666 2197624 4014644
11981 4014644 4194846 3005323 2755175 4464459 6424757 6474943 4617140 2519176 1304635
11972 1304635 990109 1342837 1779809 1000367 -1401844 -3264756 -1999133 1490093 3412993
11963 3412993 2155250 247275 339279 1794148 2797344 3374925 4181530 4327897 2924266
11954 2924266 1374081 1692789 3559404 5192472 6066167 6521233 5820165 3239487 391881
11945 391881 -278449 890839 1144210 -748511 -3212400 -4578279 -4797866 -4187877 -2661534
11936 -2661534 -818957 51846 -157296 101918 1946355 4511917 6000542 5593725 4117156
11927 4117156 3197766 3501862 3605976 1640396 -1457094 -2042296 1593357 6440326 8453284
11918 8453284 7277876 5045725 2356200 -1297242 -4368089 -4346449 -1775245 275875
11910 275875 787347 1514346 3029874 3644069 2903716 2628998 3369487 3141027 1085921
11901 1085921 -697202 -594464 114636 51885 219754 1650808 3006739 2763084 1785310
11892 1785310 1530161 1453349 473334 -416253 703726 3729365 6480623 6967623 4666779
11883 4666779 623049 -2780394 -3508922 -2246285 -1571418 -2109558 -1686256 663980 2520625
11874 2520625 1722399 -310543 -1178514 -1157775 -1617556 -1802288 -253670 1991833 2684889
11865 2684889 1829100 1057934 589131 -268580 -547590 1157566 3432185 3360282 1029210
11856 1029210 -524256 -85464 269136 -864844 -1921170 -1274499 159647 737170 458490
11847 458490 78404 -482926 -1423802 -2030596 -1592422 -434545 720069 1453185 1279885
11838 1279885 -146232 -1968199 -2667043 -2203694 -2089911 -2721029 -2465538 -457957 1542552
11829 1542552 1671798 838004 1139968 2472494 2957218 2358466 2691672 4852989 6545389
11820 6545389 4967644 786124 -2009604 -444900 4091950 7463117 7334031 5156201
11812 5156201 3517891 2842198 1792771 -6594 -1424904 -1775631 -1490064 -643100 1244502
11803 1244502 3274224 3142090 481942 -1524935 101073 3945027 5957775 4669889
11795 4669889 2275982 879336 347759 248898 1153019 2780956 3167735 1430424 -368151
11786 -368151 -34206 1495242 1816969 823973 337025 677573 345659 -937012 -1564806
11777 -1564806 -871886 -60705 422768 1802203 4006541 4381688 1323260 -2840052 -4738185
11768 -4738185 -4024162 -2357117 -127711 2946231 5259990 4686053 2127968 735050
11760 735050 1642020 3195221 4201934 4893090 4625801 2119077 -1281297 -2043537 480356
11751 480356 2622607 1749792 -59570 103360 1354518 1182927 -79617 -287846 520124
11742 520124 522952 -248105 158183 2112408 3454058 2371990 -569596 -3392116 -4382001
11733 -4382001 -3173058 -1326099 -1037297 -2138507 -1854116 867220 2830587 1047985
11725 1047985 -2177314 -2229859 960519 3192402 2659391 1796156 2009760 1303137 -1194129
11716 -1194129 -2649262 -1103877 849697 52467 -2198042 -2306950 360861 3447340
11708 3447340 5334269 5949427 5010920 2416030 -313735 -1571414 -2005817 -2951576 -3468746
11699 -3468746 -1789028 991641 1918996 766868 317796 1669199 2584195 1527258 160973
11690 160973 166644 372911 -759082 -2031881 -1451311 288022 937785 443458 947617
11681 947617 3240140 5457550 5630365 3866153 1619304 47472 -545423 -545837 -598551
11672 -598551 -868092 -897812 -539096 -280872 -78625 967847 2748596 3433000 2262490
11663 2262490 1437920 2761867 3891500 1450829 -2881809 -3742587 -34495 3028272
11655 3028272 1595510 -1362668 -1151435 1743772 3593212 3484142 3174115 2729325 833713
11646 833713 -1398362 -1302009 721092 1460707 97705 -608984 987077 3080709 3793248
11637 3793248 3650452 3428722 2491242 741063 -341486 -62625 327395 -8508 -275224
11628 -275224 -149628 -520410 -1072612 -3898 2496957 3519678 1896474 313119 862217
11619 862217 1596836 136096 -2193523 -2860708 -2241394 -2040367 -1936457 -1143616 -1031120
11610 -1031120 -2488416 -2855847 267932 3935611 3293589 -1033562 -3949547 -3688426 -3377789
11601 -3377789 -4617097 -4895000 -2730603 -475439 101503 819056 3233369 5393930 5121451
11592 5121451 3510208 2493032 1627359 130044 -322220 1945825 5054729 5718932 3949288
11583 3949288 2630520 2934183 2965475 1094226 -1678937 -3271794 -2933150 -1571766 -598192
11574 -598192 -763153 -1628918 -2149419 -2007558 -2006447 -2855406 -4124602 -4757645 -4082452 -2138735
11564 -2138735 243869 1565273 865949 -917924 -1881732 -1668529 -1760464 -2922724 -3944871
11555 -3944871 -3661456 -2657759 -1919197 -1220836 -149796 505539 -140575 -1508231 -2517790
11546 -2517790 -3270193 -4203865 -4290962 -2019241 1849064 4328328 3693946 1665844 1144522
11537 1144522 2524497 3567825 2936764 2323459 3838300 6229669 5943412 2234084 -1247475
11528 -1247475 -1393884 112097 -110501 -1661160 -1345364 1229876 2814359 1480412 -1036938
11519 -1036938 -2666272 -3409374 -3467825 -2234628 -511417 -558451 -2300232 -2651120 -526800
11510 -526800 851689 -808603 -2731361 -1564810 952466 995191 -881064 -967947 1107682
11501 1107682 1950104 273265 -1329603 -1123953 -688506 -1447002 -2237658 -1892238 -1356775
11492 -1356775 -1575774 -1630387 -597135 766241 1701687 2913833 4745159 5593009 3966393
11483 3966393 906908 -1314747 -1959100 -1782926 -1242237 -484910 -473361 -2109515 -4162399
11474 -4162399 -3843657 -210654 4124201 5675273 3941003 1572542 847207 1213434 929626
11465 929626 -14872 -103217 1010157 1834014 1427474 719166 603323 344092 -817575
11456 -817575 -1823007 -1196217 656923 2176515 2903888 3359652 3383426 2468623 1373539
11447 1373539 1547668 3003518 4281323 4416737 3601133 2249631 870374 391630 1036567
11438 1036567 1443197 627497 1835 1216755 2813557 1935596 -973059 -2520567 -1692645
11429 -1692645 -1238467 -2694476 -3650692 -1987897 311447 330546 -1137236 -1165334 542392
11420 542392 1477099 307861 -1479870 -1821310 -159313 2530593 4482175 4362463 2868807
11411 2868807 2321092 3586127 4607236 3339592 663395 -1404359 -2719813 -3764240
11403 -3764240 -2995879 1094568 6028020 7346403 4893367 3285471 5033296 6932052
11395 6932052 5360283 1849915 336419 1223297 1724328 800259 86559 220856 -233058
11386 -233058 -1587906 -1836517 28713 1930001 1642375 -6079 -749457 -321765 -183564
11377 -183564 -666135 -638677 159049 557552 66794 -273410 174812 407875 -570218 -2047701
11367 -2047701 -2650306 -2264474 -1853523 -1902982 -1960243 -1299769 604483 3582014 5990842
11358 5990842 5416192 1440136 -2995517 -4525783 -3211161 -1819565 -1697383 -1555281 -516641
11349 -516641 214221 -70422 364422 2947680 5637146 5177370 2032791 332334 2357346
11340 2357346 5457389 5814961 3527082 1930749 2673675 3710429 2552842 -305236
11332 -305236 -2361499 -2500073 -2016273 -2455186 -3632893 -4168107 -3268804 -1514942 -139550
11323 -139550 208065 43279 241522 463814 -977599 -4717901 -8239268 -7876842 -3397780
11314 -3397780 1080516 1872363 7078 -911708 8468 185495 -2101146 -5129820 -6375312
11305 -6375312 -5779814 -4975393 -4586296 -4027009 -3307670 -3235857 -3794214 -3867642 -3064982 -2516261
11295 -2516261 -2960641 -3035249 -881776 2833823 5039489 3825603 663308 -1655305 -2096611
11286 -2096611 -1304456 286198 2273955 2906688 472901 -3534940 -5109495 -2690535
11278 -2690535 645463 1372051 -90702 -1062366 -921043 -1184926 -2258215 -2728989 -1684930
11269 -1684930 393044 2826259 4856142 4935074 2153110 -1683405 -3605608 -3200108 -2626977
11260 -2626977 -2907862 -2697849 -1195359 261270 410675 -282273 -1063341 -1880396 -2139441
11251 -2139441 -796919 1240956 1237871 -1410917 -3672467 -3073171 -1152812 -608214 -1051170
11242 -1051170 -252497 1805379 2872993 1765192 -493019 -2369798 -2902535 -1778370
11234 -1778370 -25159 240552 -1572302 -3244796 -2874845 -1921452 -2835867 -4985779 -5773443
11225 -5773443 -4809129 -3731826 -2479799 512108 4124933 4412410 67533 -5020326
11217 -5020326 -6511821 -4622882 -2591841 -2130274 -2450679 -2484647 -2045280 -1361287 -860472
11208 -860472 -1026536 -1631363 -1694115 -785268 448747 1537667 2833823 4244299 4568625
11199 4568625 3108305 966001 -248049 -208043 416394 1078842 1298512 524640 -806447
11190 -806447 -1008124 690277 2394147 1552888 -1484631 -3527886 -2553663 -341150 -108710
11181 -108710 -2184407 -3450022 -1512463 1828368 2785529 771238 -868134 64730 1350256
11172 1350256 153255 -2122241 -1995846 341045 1344673 12214 -692135 797943
11164 797943 1902552 408934 -1796603 -2033145 -954529 -606705 -814753 -396296 155328
11155 155328 109485 576671 2143825 2580809 341998 -1759109 -405063 2568591 3009467
11146 3009467 1396408 1482342 2810578 958741 -4076999 -6301708 -2804011 1528454
11138 1528454 1709977 -238891 -134646 1056012 46249 -2002508 -1386896 1395118 2541148
11129 2541148 1691981 2192760 4520627 4852797 1502708 -1827512 -1340639 1871175 4447788
11120 4447788 5489310 6055452 6001222 4142484 739410 -2409345 -4169325 -4923410 -5322456
11111 -5322456 -5236562 -4090015 -1801317 676345 1900050 1448935 693361 1383750 3617427
11102 3617427 5848319 6521867 4896514 996709 -3811071 -6776525 -6186398 -3670238
11094 -3670238 -2184734 -1862916 -265941 3011112 4953408 3658313 1551012 1865889
11086 1865889 3892190 4396660 2616702 958866 952444 1204072 86856 -1529716 -1479267
11077 -1479267 750121 3307026 3884785 1784306 -1679487 -4413687 -5251202 -4657346 -3869360
11068 -3869360 -3489782 -3028733 -1672770 705832 3285119 4927597 5067096 4010630 2520442
11059 2520442 1338723 973235 1340003 1502804 536348 -1045724 -1678736 -1070163 -868989
11050 -868989 -2029899 -2945333 -1869018 76851 585483 -86500 115087 923356 -256685
11041 -256685 -3642529 -5648405 -3692586 242840 2708788 3158763 3092405 2811009 1683591
11032 1683591 553939 1256755 3875457 6313344 6650528 4797774 2045080 -85020
11024 -85020 -810069 -588902 -371231 -288712 31917 40063 -1161436 -2695033 -2576506 -1046560
11014 -1046560 -691106 -2280951 -3403488 -2798575 -2817032 -5008562 -6351604 -3503829 1465053
11005 1465053 3730022 2697013 1999715 3078452 3202337 545391 -2526579 -2741450 -64188
10996 -64188 2732983 3148856 1008450 -1410509 -1366058 1206480 3351767 3107661 2187157
10987 2187157 2615936 2849140 592940 -2229594 -1665252 1896277 4168868 3783230 3851303
10978 3851303 5905800 7090975 5244840 2546525 1635699 1630152 757978 38014 1328245
10969 1328245 3746977 4838099 4021002 2740537 2258859 2907492 4423962 5757372 5662474
10960 5662474 4358736 3306530 2895279 2172293 1249620 1630548 3450742 4884596 5108622
10951 5108622 5204847 5310903 4018140 1816958 1639563 4076283 5527946 3614496 1104607
10942 1104607 1360585 2857714 2004055 -790401 -1916930 -217391 1891202 2374738 1499409
10933 1499409 105114 -1285359 -1720546 -445418 1685479 2971352 2753969 1495256
10925 1495256 -103077 -1013094 -263913 1466909 2265732 1981804 2529528 3947975 3255433
10916 3255433 -511144 -3332534 -1598573 2187273 2941237 226747 -2059370 -1695428
10908 -1695428 234439 2563629 4787645 5326340 3050970 158146 -176533 1435018
10900 1435018 1845350 780449 881422 2589478 3383426 2529502 2359412 3918411 5226406
10891 5226406 5010698 4579910 4686364 3856949 1329415 -1237529 -2331066 -2284476 -1487859
10882 -1487859 302704 1994586 1561294 -464956 -984279 923286 2419732 1593368 414111
10873 414111 970933 1916622 1293716 267965 1058070 3045062 3879576 3171283 2409318
10864 2409318 2101480 1358912 -228493 -2211127 -4273281 -6103676 -6939418 -6581981 -6062415
10855 -6062415 -6035450 -5537392 -3759619 -1929586 -1647285 -2233605 -1745224 -152764 589870
10846 589870 -278639 -986840 328374 3212340 5665803 6328787 5111812 2522054 -454608
10837 -454608 -2186492 -1602544 61747 154294 -1787725 -2767872 -486536 2470225 1557581
10828 1557581 -2905267 -5513544 -3368896 -75956 76232 -1691916 -1756466 -483660 -1011018
10819 -1011018 -3240816 -3768057 -1436544 1189257 2001021 1362386 -87055 -2057655 -2949555
10810 -2949555 -1201442 1472535 1784374 -66635 -898102 -185877 -646429 -2548039 -2495953
10801 -2495953 479086 2589833 1477961 73093 1228577 2862251 2191707 972256
10793 972256 2100735 4003267 3180053 280569 -1154853 -763978 -1440214 -3731513 -4659750
10784 -4659750 -2757460 -541153 -664392 -2321109 -2943285 -1680316 162907 1145408 1118831
10775 1118831 1000123 1616302 2803801 3728925 3912893 3367590 1994287 13540 -1073520
10766 -1073520 433632 3938222 6599762 6451416 4193795 1638175 -34276 -218657
10758 -218657 967001 1986144 1271214 -212980 139022 2676290 4829898 4892752 3861989
10749 3861989 2808923 1332405 -259601 -214459 1721091 3360942 3505964 3464800 3783131
10740 3783131 2772212 156268 -1260490 32607 1479276 730188 -491390 198308
10732 198308 1599919 1479562 715782 1403506 3057097 3979219 4220192 4119234 2445997
10723 2445997 -730292 -2091649 374017 3713554 4798146 5542130 8595891 11097396
10715 11097396 8750552 3808221 2320856 4645542 5457321 2860116 728251 1475141
10707 1475141 3002507 3972891 5816771 7788403 6167364 851632 -2865113 -1969850
10699 -1969850 -2482 -555572 -1661863 -568318 630850 -1008027 -3323813 -2425860
10691 -2425860 422693 663130 -2091497 -3528983 -1398113 1610386 2331094 955261
10683 955261 -484826 -681656 831252 3852041 6777020 7425512 5540922 3221443 2270862
10674 2270862 2356212 2304216 1865705 1356313 646945 -450849 -1469092 -1870346 -1861408 -1816170
10664 -1816170 -1398906 -213925 1088516 1506533 1267515 1413030 1856728 1419884 48171
10655 48171 -818201 -696414 -830285 -1531309 -1286724 -312960 -2065721 -7963992 -13089926
10646 -13089926 -11666939 -5409893 -1258214 -1295512 -812553 2759258 5338675 3415403
10638 3415403 194956 304089 2534448 2583873 98715 -1742859 -1742798 -1376485 -1231868 -723935
10628 -723935 -528535 -1728512 -3039787 -2006457 1311909 4331779 5231645 4303202 2781660
10619 2781660 1983637 2508561 2992721 1429045 -1070161 -604156 3562169 6709783 5150067
10610 5150067 1672497 906857 2370929 2559723 1412282 1645473 3195314 3392565 2059793
10601 2059793 1845632 3532795 4922478 4522218 3097374 1546454 15444 -1009453
10593 -1009453 -1008470 -426174 277135 1447827 2802818 3220332 3328490 5325008 8464536
10584 8464536 8550402 4434382 747067 929597 2153504 1126839 31403 1737976 3913143
10575 3913143 3599957 3104374 5067615 6169857 2733036 -1583312 -1267443 1663275 1751718
10566 1751718 -15402 992170 3537864 2983210 747039 1867644 5072935 4827353
10558 4827353 1706026 1061297 2702889 1866734 -611151 556622 4431390 4915784 2267901
10549 2267901 2705449 6325934 6616339 2836459 1529726 4180790 4677738 1164597 -700558
10540 -700558 1183819 1913213 -92226 12721 3433527 5076252 3740523 4479973 8079829
10531 8079829 8824524 5499743 3934511 6002494 6889276 5439920 5909283 7724385 5739655
10522 5739655 2144782 4682429 11426251 12039709 6173407 4627557 9607544 11138391
10514 11138391 6718733 6172358 12238334 15319534 12825724 13848199 19057193 17518929
10506 17518929 9663898 9796063 18709856 19977873 11708005 12354243 24458603 26311054
10498 26311054 13824039 12808081 30512216 37555626 24002009 25242134 55666525
10491 55666525 71073124 52215139 70047993 183223348 307011332 290444364 123034543
10484 123034543 -38443258 -72650744 -27630455 -10349848 -32619175 -37626944 -15456661
10477 -15456661 -6724432 -20733262 -26108960 -13744558 -7780375 -15445249 -16812101 -6661373
10469 -6661373 -3295743 -11450654 -13807213 -4767199 91147 -5865125 -9834610 -5398560
10461 -5398560 -2924205 -7843370 -11560053 -9965929 -10193743 -13649892 -11854546 -4189557
10453 -4189557 -1310185 -5925553 -7680977 -2107107 2091446 -194242 -2341628 -83960
10445 -83960 1110133 -1675312 -2886223 -307549 64072 -3909589 -5874199 -3368682 -2846902
10436 -2846902 -7235523 -10071493 -7441322 -4766019 -6060885 -6821039 -3552351 -844647
10428 -844647 -2775664 -5665440 -5308893 -3994306 -4871531 -5970853 -4692453 -2354010 -417347
10419 -417347 2027411 4026391 2207386 -2736253 -5242712 -3173620 -752741 -1021062
10411 -1021062 -1802977 -1361758 -1494821 -2757360 -3043064 -2870521 -5457442 -9766540 -10482947
10402 -10482947 -6790813 -3929700 -4060242 -3226758 257623 2346739 1132516 360112
10394 360112 1714171 1316707 -2275650 -4208517 -1863401 -23209 -2632205 -6066220
10386 -6066220 -5801959 -3723579 -3438871 -3791326 -2472012 -1317401 -2697946 -4653947 -4391185
10377 -4391185 -2973425 -2434807 -1971249 -754395 -559845 -1921666 -1833867 929986 2469445
10368 2469445 -179895 -3711988 -3644910 -1110042 -127115 -1246282 -2197274 -2211911 -1790269
10359 -1790269 -560640 1179788 1201224 -1234219 -3138271 -1905095 848577 2239204
10351 2239204 2218496 2036396 1360613 -286215 -1726279 -2266592 -3115321 -4480046 -4133873
10342 -4133873 -1203814 1531491 1558711 79529 -693402 -832071 -1113847 -1112890 -1058346 -2586201
10332 -2586201 -5429791 -6397577 -3884374 -423411 1327740 1955087 2529754 1928183 -507185
10323 -507185 -2672429 -2630766 -1242557 86412 1431845 2436616 1624271 -576210 -1433586
10314 -1433586 -196597 728008 248816 132218 651359 -454261 -2740544 -2184153 1718419
10305 1718419 3587878 518062 -2726834 -1365758 1729389 1382211 -1349145 -2023969
10297 -2023969 -755980 -958109 -2414241 -1759141 1211108 3062794 2122018 38799 -1568831
10288 -1568831 -2368663 -1882071 -163825 744160 -961636 -3797539 -4660424 -2750649 168761
10279 168761 2259830 2631456 1362985 -38607 44165 697416 -254889 -1766204 -289226
10270 -289226 3814335 5474500 2820546 649472 2611327 5199232 4075655 1541744
10262 1541744 2089791 4365774 3679764 -145997 -3339751 -4673550 -5894582 -7081041
10254 -7081041 -6596405 -4654296 -2746701 -917036 679016 -215409 -4106739 -6428735
10246 -6428735 -3067553 2881557 5062010 2708840 166260 -789070 -2230822 -4496594
10238 -4496594 -5190858 -3942927 -3141333 -3547915 -3445533 -2263742 -1159289 -186118 1399783
10229 1399783 2537412 1736985 221268 -21581 -50609 -1716452 -3113355 -1137340 2578859
10220 2578859 3559500 1653624 909315 2522190 3441681 2378878 1800539 2959305 3846971
10211 3846971 3320361 2837876 2873312 1735591 -823738 -2665385 -2996212 -3348058 -3900437
10202 -3900437 -2656142 505054 2565405 1643696 -450936 -1162008 -122308 1606862
10194 1606862 2833550 2488784 901983 445349 2349312 4001168 2763802 932692
10186 932692 2312423 5133357 4165204 -384284 -2540865 -137234 1847585 -184864
10178 -184864 -2840921 -2206643 -473399 -1479898 -3773760 -3233839 -4753 2065567 1522218
10169 1522218 593123 1001171 2069389 2941667 3765429 4292392 3513536 1353869 -639360
10160 -639360 -940838 241363 1246785 789352 -604246 -1204670 -299799 732057 133482
10151 133482 -2005144 -3974219 -4381060 -3187460 -1507197 -996536 -2494996 -4642550 -5074424
10142 -5074424 -3551170 -2200403 -2073459 -1901770 -1261351 -1832586 -3691838 -3798816 -911021
10133 -911021 1402078 166833 -1793114 -318528 3236712 4471109 2983799 1727300
10125 1727300 1072077 -854442 -2906325 -1771248 1967538 3876042 2192877 -260262
10117 -260262 -1015082 -587338 -11172 273387 -840922 -3664614 -5504136 -3875114 -966165
10108 -966165 -566048 -1888389 -1519399 -83210 -940523 -3156008 -2424951 1097219 2667052
10099 2667052 1074504 87249 1003677 792323 -1001579 -645779 2459980 3815952 1676495
10090 1676495 97947 1247285 1406988 -1762177 -4320992 -2610832 804215 1959618
10082 1959618 1361115 1141993 1052301 966080 2690753 5677872 5741279 1712192 -1590686
10073 -1590686 -866487 410851 -1438587 -3798569 -2999829 -1213850 -2237961 -4342922
10065 -4342922 -3417354 -236131 1326011 1065305 1843921 3825800 4393153 2840541 1043151
10056 1043151 365188 1035619 3081327 5098450 4177462 -122398 -3976177 -4074899 -1636761
10047 -1636761 636344 2191161 2629110 240600 -4017102 -5313705 -1832146 1287237
10039 1287237 -466495 -3609668 -2432565 1551440 2372400 -676772 -2701435 -1318374
10031 -1318374 984665 2076463 2360914 1919515 314950 -742716 1135942 4726867
10023 4726867 6108553 3984089 875542 -893800 -1471374 -1837390 -2378631 -3004486 -3089309
10014 -3089309 -2024782 -768453 -1003829 -1869894 -496323 2813885 3742435 515882 -2845227
10005 -2845227 -2813448 -1543802 -1970373 -2039722 1322012 6043902 7890506 6807518 5403784
9996 5403784 3845755 1267195 -374408 844631 2321004 590412 -2404299 -1968140
9988 -1968140 1951527 5062174 5143719 3493332 1254133 -1165496 -2172373 -703170 1248686
9979 1248686 1417124 948359 1927045 3469643 3830134 3759864 4040674 2709977 -1179646
9970 -1179646 -4283455 -3774589 -1973956 -1715745 -1135791 1762258 3716392 1594451 -851049
9961 -851049 1418696 5749467 5758704 1642425 -819737 432773 2395225 3236965 3391775
9952 3391775 2165245 -675858 -1976124 422810 3051669 2234245 598619 2025945
9944 2025945 4282531 3631646 2328048 3802517 4952426 1698462 -2296376 -1538947 1135737
9935 1135737 -90922 -3046881 -2160255 531647 -119558 -1395008 2123878 6826778 5809938
9926 5809938 1981699 2587667 5284225 3446712 409811 3285769 7563768 4436994
9918 4436994 -1369566 921171 7711467 7729348 4137598 8023382 14756822 11651665 4667021
9909 4667021 9241091 18548695 13851822 3662646 12990737 33146479 30764522 15058287
9901 15058287 37415210 98740620 119121694 48011332 -46608129 -63415068 -7310600
9894 -7310600 28865295 3968572 -28752018 -21759439 116121 -1634599 -15494294 -12526874
9886 -12526874 882471 2297052 -4471584 -2630175 3065343 -2311351 -13206609 -13494267
9878 -13494267 -5768453 -4728729 -9998485 -9295519 -2337384 122186 -3130432 -3462665
9870 -3462665 238479 953605 -1827072 -1958171 587961 259922 -2455554 -2200358 242870
9861 242870 -509932 -3739890 -4256288 -2857537 -4654487 -8516191 -8353279 -3892321 -746940
9852 -746940 -618972 -216155 955144 145370 -2006614 -2242368 -1341339 -2719490 -5439381
9843 -5439381 -5725982 -4142568 -4125539 -4867390 -3084110 -471439 -1566915 -5029557 -4966252
9834 -4966252 -758924 2114237 1357003 504408 1455377 1439820 -1000713 -3176599 -3165848
9825 -3165848 -2415469 -2056814 -1233328 -72373 -50799 -847042 -848818 -682452 -1962642 -3107782
9815 -3107782 -1340623 1574349 982241 -3290334 -6665667 -7100841 -6984218 -7267625 -5735885
9806 -5735885 -2436439 -952362 -2218754 -2457609 317620 2808415 2293340 1301580 2951380
9797 2951380 5486524 5319567 2748949 905605 808605 804580 -40609 -681153 57543 1991488
9787 1991488 3767613 3889415 2084593 -241317 -1706694 -2604871 -3540466 -3449141 -1311958
9778 -1311958 965731 455085 -2252130 -3709225 -2959219 -2560219 -3548705 -3348813 -565199
9769 -565199 1627423 -314471 -4980364 -7698379 -6308803 -2954600 -831734 -958615 -1880936
9760 -1880936 -1494332 624483 2425401 1669698 -1001309 -2624777 -1717424 104347 732025
9751 732025 60163 -853586 -1478825 -1680638 -1239896 -473874 -235973 -535050 -296590 782687
9741 782687 1389701 508335 -956627 -1538882 -1312649 -1468316 -2264570 -2482140 -947828
9732 -947828 1962985 4468491 4899604 3099516 324856 -2065477 -3379047 -3279326 -1929852
9723 -1929852 -878929 -2328894 -6304388 -9642738 -9291047 -5865908 -2527475 -1120059
9715 -1120059 -1086972 -1523521 -2254091 -2904572 -2713922 -1710694 -970250 -1400310 -2824080
9706 -2824080 -4066919 -3621568 -1038148 1917526 2797096 1768039 1527908 2952131 3353639
9697 3353639 1021025 -1191992 91395 3233491 3864518 1442969 -406947 443823 2421376
9688 2421376 3564061 3508402 2188128 -3143 -778315 1728142 5127085 5017176 1306912
9679 1306912 -1704030 -2013674 -2199976 -3852112 -4413990 -1858471 1540893 2883953 2737084
9670 2737084 2728865 2073519 -410644 -3233608 -4249883 -3877257 -3627447 -3248554 -1965357
9661 -1965357 -851967 -1278857 -2445180 -3010769 -3768647 -6001218 -8310132 -7862136 -4260126
9652 -4260126 70964 2852262 3411590 1927178 -686327 -2461762 -1740238 1090220 4069560
9643 4069560 5393391 4230124 1130232 -1607502 -1560326 806764 2360593 1446414 -198638
9634 -198638 -743123 -942822 -1845004 -2422009 -1767531 -1282265 -2102835 -2556178 -978315 1008548
9624 1008548 1069150 42700 2589 352718 -461206 -1054023 883849 3786988 3809837 750662
9614 750662 -1797135 -2014330 -1474982 -1236967 -539220 264229 -340162 -1506032 -576144
9605 -576144 2060444 2877727 1022585 -213115 768366 1210482 -513047 -1304033 1495667
9596 1495667 5208403 5887481 4161044 3023323 2421419 435548 -1985517 -2049681 -46948
9587 -46948 921669 -119916 -1083078 -815012 -552367 -1070749 -1602457 -2103089 -3521029 -5041140
9577 -5041140 -4045580 -73376 3733470 4621077 3557797 3082535 3723068 4311137 4402397
9568 4402397 4480338 4567964 4240361 3544596 2712943 1473939 -278098 -1659606 -1731813 -840092
9558 -840092 -17773 518846 1204570 1799030 1449895 95752 -1219220 -1579010 -942480
9549 -942480 369718 2004423 3178997 2889419 1072980 -967070 -1774081 -1103381 77976
9540 77976 536107 -358687 -2083003 -3106321 -2319251 -606012 -119222 -1505224 -2925191
9531 -2925191 -2785335 -2352346 -3961611 -7093274 -8306737 -5599432 -1154086 1315264 864766
9522 864766 -236437 228904 1947752 2894713 1829518 -369652 -1715446 -1259887 100978
9513 100978 1171780 2118946 3650844 5075651 4790382 2809325 1050087 508851 -62107
9504 -62107 -1612047 -2707901 -1670510 540973 1566609 953786 264190 389484 725297
9495 725297 822440 994343 1183305 770220 -379675 -1895410 -3617185 -4997659 -4499654
9486 -4499654 -1569115 1338344 1184687 -1290954 -2307127 -375403 2009217 2689473 2657513
9477 2657513 3104041 2844010 1057938 -53971 1640543 4358582 4855057 3422638 3051343
9468 3051343 4289540 4526006 2581266 622235 489686 973770 322863 -708479 -215326
9459 -215326 1811914 3593622 3982406 3320619 2347221 1552416 1461709 2452635 4083975
9450 4083975 5249697 5259116 4568169 4405589 5640824 7698627 8555798 6456801 2123767
9441 2123767 -1247118 -1061019 1632738 3087918 1319037 -1183972 -295977 4407330 8622383
9432 8622383 8312194 4485067 1624879 2110733 3984416 4134803 1769177 -1798328 -5049869
9423 -5049869 -6930283 -6908049 -5483447 -3813804 -2227152 -247979 1462236 1070499 -1409334
9414 -1409334 -3058914 -1759514 863909 2292399 2974209 4436291 5188611 2441498 -2588314
9405 -2588314 -5218676 -3690726 -1184161 -384061 73252 1762575 2718724 594078 -2978565
9396 -2978565 -4528891 -3643013 -2541849 -1962493 -769764 884514 1338118 575802 687094
9387 687094 2438565 3838724 3185447 1599500 1272360 2578221 4115433 4654205 4024675
9378 4024675 2732677 1493543 744072 257899 -238853 -66795 1740304 4513969 6042276
9369 6042276 5377020 4306121 4723725 5440364 3474327 -1475712 -5683284 -5529499 -1928384
9360 -1928384 770759 12009 -2319353 -2937322 -1450867 -228934 -656297 -1458148 -1146097
9351 -1146097 -355902 -499371 -1260992 -1103060 192218 1136349 780477 -61533 -246645
9342 -246645 183339 534863 661748 919899 1445147 2118343 2940745 3876692 4437615 3908550
9332 3908550 2174236 187039 -645497 199069 1714369 2512877 2601605 3221540 4679850
9323 4679850 5520991 4726968 3548444 3625029 4226122 3486697 1938418 2140415 4362113
9314 4362113 5450273 3451222 889886 1123875 3227167 3480718 1168097 -342191 1291975
9305 1291975 4018650 4465675 2395106 384955 227077 1325754 2160928 1880478 502906
9296 502906 -1352994 -2751533 -3094886 -2573991 -1652570 -482881 613828 697995 -648375
9287 -648375 -2054265 -1682029 23359 463166 -1592075 -4171150 -4988790 -4704990 -5381412
9278 -5381412 -6651664 -6005923 -2923285 -110248 294383 -515892 -505034 -94816 -925175
9269 -925175 -2657900 -3371279 -2539194 -1441317 -864624 -428522 -112175 -457240 -1171919
9260 -1171919 -1466700 -1818905 -3204700 -4401798 -2795993 1170654 3147893 367145 -4187124
9251 -4187124 -5437938 -2577878 661012 1220337 -163161 -777282 1017803 4495487 6971945
9242 6971945 5890032 1741605 -1749724 -1692629 659626 2235291 2475368 2911989 3414370
9233 3414370 2100696 -907544 -2774998 -1894306 -19063 534373 -452589 -2212820 -4391063
9224 -4391063 -6015210 -5344646 -2415888 232116 1104233 2020027 4747178 7293521 6357598
9215 6357598 2336720 -976052 -1209372 618738 2576563 3623523 2996391 554335 -1726998
9206 -1726998 -1110781 2175047 4800688 4911541 4505807 5730395 7096539 5823863 2463050
9197 2463050 274150 458258 873561 -82720 -939440 228665 2654037 4175590 4440529
9188 4440529 4772207 5396218 4886099 2553270 -341937 -2242048 -2705515 -1700815 880456
9179 880456 4104947 5888110 5213030 3258908 1289794 -940539 -3230917 -3486229 -818804
9170 -818804 1630600 469657 -2352739 -1860395 2198703 4564222 2424076 -601261 -607650
9161 -607650 1013570 1411087 1536381 3161360 3984907 1126317 -2597563 -1809433 2747701
9152 2747701 4606067 1167815 -2721515 -2384478 588249 2344594 2553794 2972642 3478087
9143 3478087 2949393 1963453 1627965 1359627 327988 -491363 -89948 343873 -558808
9134 -558808 -1558776 -666688 1350127 1989387 786956 -449507 -683493 -588627 -720668
9125 -720668 -802805 -644120 -118420 1221442 2813518 2296132 -1659887 -6315261 -7221341
9116 -7221341 -3616968 789850 2508345 1498227 -491023 -2420083 -3942750 -4735122
9108 -4735122 -4909942 -5049217 -5338452 -5630919 -6329214 -7768233 -8675128 -7003973 -2851596
9099 -2851596 947106 1875259 332785 -1357324 -1640792 -979667 -993356 -2454771 -3867605
9090 -3867605 -2834923 422149 2362791 651928 -2074009 -1613792 1665696 3508819
9082 3508819 2299204 1037757 2065757 3640559 3443590 2172169 1485691 1225355 1014196
9073 1014196 1978056 4237424 5153726 3155104 1174090 2708761 6045076 6389270 2995283
9064 2995283 62670 391857 2044313 2293898 1468172 1147254 1147589 364892 -957254 -1554489
9054 -1554489 -795472 1115584 3630551 5676225 6040059 4803185 3372715 2362769 753284
9045 753284 -1814649 -3362332 -1950906 1113328 2503925 1242666 -92951 835295 2748085
9036 2748085 2556962 -263134 -2881304 -2964014 -1786327 -2283438 -4803673 -6532866 -5343259
9027 -5343259 -2622979 -1329408 -2303502 -3752994 -3802364 -2295432 -293280 1086219 1313974
9018 1313974 787180 489840 688838 368043 -1167098 -2693958 -2439728 -727886 375842
9009 375842 105127 -88973 888698 2079224 2289397 2043089 2382696 2902329 2504500 1343749
8999 1343749 447220 -164498 -1394441 -3169548 -4113310 -3485983 -2343159 -2223170 -3349284
8990 -3349284 -4504141 -4189155 -1747731 2060118 5375519 6704410 6367456 6080444 6934072
8981 6934072 8290320 8861614 8284493 7238679 6442034 5932403 5097144 3224712 358457
8972 358457 -2344551 -3664223 -3778128 -3812006 -3756623 -2200315 1001695 3283344 2430366
8963 2430366 217683 573222 4040724 6535516 4591652 -202658 -3531589 -3584715 -2160009
8954 -2160009 -1563311 -2397231 -4063785 -5658143 -6222301 -5363478 -3744098 -2187250 -728930
8945 -728930 520442 498072 -1174341 -2454224 -1090207 1609748 1827719 -1424970 -4621059
8936 -4621059 -4571144 -2579126 -1893706 -2928706 -3444786 -2383748 -917823 106755 1401580
8927 1401580 3342399 4588001 3633517 909770 -1547505 -2279472 -1740588 -1443935 -2055700
8918 -2055700 -2683197 -2238997 -1080967 -577445 -1171002 -1793239 -1379621 -81512 1336539
8909 1336539 2463214 3205047 3486200 3295599 2485783 661942 -1839635 -3288931 -2452713
8900 -2452713 -902579 -1271583 -3038492 -2758145 559343 3229314 1986862 -1254395 -2335744
8891 -2335744 -521913 1764654 3345825 4987367 6407981 6042872 3897452 1665154
8883 1665154 -303821 -3282442 -6805868 -7924571 -5224125 -1398760 -76713 -1410787
8875 -1410787 -2393180 -839196 2213604 3942332 2929938 787203 427081 2636265 5101025
8866 5101025 5372458 3756771 2222032 1557481 1168520 770998 470611 -142068 -1098708
8857 -1098708 -961821 1265056 3714360 3453519 382714 -2917955 -4859257 -5929164 -6475618
8848 -6475618 -6151753 -5491006 -5263205 -4350902 -1328954 1868383 1533463 -1910178 -3402110
8839 -3402110 -35204 5131112 7709467 7061014 4791075 1604334 -1694805 -2962975
8831 -2962975 -1417610 647775 1380182 2182676 4340301 5546850 3328961 -232464 -1171020
8822 -1171020 436293 1224722 240319 -309773 291977 66693 -1640556 -2628789 -1456239
8813 -1456239 421110 1330770 1565221 1588986 521311 -1880951 -3591204 -2552466 501556
8804 501556 2945222 3274460 2136960 1052308 1157121 2724080 4900644 6047117 5092736
8795 5092736 2717997 876871 977971 2505329 3463141 2361863 -190359 -2137738 -2238375
8786 -2238375 -1207555 -467976 -378879 -110625 1149857 3241407 5027142 5312123 4176105
8777 4176105 3216965 3762343 5064440 5222265 3621201 1206523 -1361169 -4096882 -6252162
8768 -6252162 -6476884 -4849074 -2943830 -1535886 -178899 715771 -122373 -2162629 -3129311
8759 -3129311 -2585938 -2521538 -3274278 -2349566 874244 2954275 1624425 -240376 668812
8750 668812 2594325 2066648 109198 285251 2331416 2794011 1088938 -38685 226782
8741 226782 -75239 -1072060 -400984 1967182 2713640 434726 -1944377 -1691064 145443
8732 145443 1341157 1620015 1365389 -16089 -2390889 -3712870 -2527352 -208334 733904
8723 733904 -576518 -3043832 -4693747 -3779696 -488748 2224981 1403384 -2151474 -4876158
8714 -4876158 -5119064 -4362837 -3853297 -3066688 -2064282 -2264157 -3797696 -4817406 -4527173
8705 -4527173 -4333239 -4925287 -4796112 -2879935 -344783 1297854 1719574 849527 -1036514
8696 -1036514 -1918408 166241 3329623 3363225 -41088 -2473629 -1480221 278661 546765
8687 546765 1532358 5234995 8787073 8535532 5717163 3901255 3208493 1330990 -1470082
8678 -1470082 -2594765 -1345963 586205 2030733 2741105 2052993 110034 -842896 545078
8669 545078 1753268 -344618 -4438130 -6417102 -5061435 -2616393 -531849 1662638
8661 1662638 3629035 4061558 3393947 3468743 4363333 4478020 3731117 3568705 3719278 2223146
8651 2223146 -730528 -2036082 262813 4481509 7636538 8266876 6499698 3384247
8643 3384247 642076 -670221 -1385060 -2523806 -2989698 -1270592 1176247 1250525 -1094717
8634 -1094717 -2550143 -1260679 976927 1953801 1677071 945265 -56901 -828782 -668206
8625 -668206 -500436 -2083487 -4681419 -5354232 -3505868 -2027831 -2462865 -2306920 552857
8616 552857 3597456 2987493 -751570 -3550628 -3300852 -1605510 -488092 -127638 -139071
8607 -139071 -784141 -1952044 -2350398 -882510 1582609 2690533 1216770 -1050230 -828465
8598 -828465 2757925 6580819 6875887 3614228 80799 -1455751 -1747512 -2260612 -3033211
8589 -3033211 -3507036 -3657794 -3386810 -2271941 -720202 57072 -110620 -123298 96347
8580 96347 -954212 -3456685 -4834758 -3061690 114289 1377027 286470 -702256 -208123
8571 -208123 331452 -778570 -2897050 -3830530 -2361216 623163 3085659 3495914 1753814
8562 1753814 -1059628 -3499217 -4389520 -3317009 -1066643 829961 1626275 2050096 2852028
8553 2852028 3451910 3109254 2532038 2656178 2590025 990066 -945499 -576356 1919754
8544 1919754 3346945 2356648 1428545 2394704 2944121 163647 -4586584 -7337159 -6845977
8535 -6845977 -5430770 -5099511 -5530164 -5808313 -5761023 -5143376 -3395231 -913701 674746
8526 674746 194335 -1695335 -3013364 -2084734 1005039 4163718 5032270 3408585 1237394
8517 1237394 -93873 -1156136 -2558304 -3378266 -2912985 -2402811 -3063943 -3628280 -2120810
8508 -2120810 682460 1957143 674537 -1451849 -2646581 -2484573 -770691 2474362
8500 2474362 5513082 5782877 3178462 550974 137320 1287237 2481114 3586472 4911847
8491 4911847 5796975 5628784 4969811 4438097 3764260 3095690 3612638 5289928 5710995
8482 5710995 3299608 491629 1069590 4882048 7821293 7015960 3587399 57014 -2364860
8473 -2364860 -3179815 -1910778 515501 1721354 853342 -54212 727496 1852726 1329496
8464 1329496 -29190 -252403 12232 -1379602 -3786958 -4211608 -2190037 -561479 -443186
8455 -443186 678198 3868362 5514204 2492733 -2210331 -3185901 -376247 1202414 -881144
8446 -881144 -3446934 -3171666 -1245711 -679350 -1724802 -2291910 -1348729 105920 681934
8437 681934 -122852 -1676732 -2429105 -1066694 2020998 5197179 7576197 9276563 9695485
8428 9695485 7631139 3857693 1398220 1844441 3258616 3338600 2828381 3637890 5092467
8419 5092467 4791108 2538436 688599 484629 447873 -1011168 -3311620 -4835029 -4847457
8410 -4847457 -3483832 -1101692 1395712 2586241 1964303 818810 791353 1919295 2901107
8401 2901107 3012737 2840745 3080420 3516503 3652008 3688437 4121166 4629613 4206154 2474533
8391 2474533 203839 -1579376 -2252520 -1369177 1009317 3319613 3289979 796351 -1337244
8382 -1337244 -776624 1258758 2061915 1373319 966908 1207714 890843 252203 993692
8373 993692 2844851 3222754 1419623 214888 1672029 3854736 3736106 1388273 -747423
8364 -747423 -1171001 -105772 1486982 1999439 -57742 -3620107 -5131573 -2962773 16372
8355 16372 412312 -1027107 -1312297 -59215 642037 18209 -930262 -2050186 -3969399
8346 -3969399 -5748772 -5582605 -3797614 -2502975 -2346170 -2132960 -1408735 -758656 157606
8337 157606 1992453 3390708 2440434 350972 207343 1849593 1851045 -617798 -2025639
8328 -2025639 -250689 1798582 859385 -1655557 -2321944 -903784 258658 250345 -77206
8319 -77206 -477474 -1197087 -1457527 -653125 -246880 -1908832 -4368425 -4687961 -2425309
8310 -2425309 -154733 121623 -1131984 -2762902 -4362067 -5403118 -4945814 -3164563 -1795478
8301 -1795478 -2070935 -3091858 -3086327 -1686129 -163491 395912 514047 1571859 3684651
8292 3684651 4873526 3109583 -933495 -4202822 -4613366 -3032727 -1535538 -937563 -802770
8283 -802770 -610427 157313 1910755 3704470 3337528 326948 -2324067 -1397891 2166276
8274 2166276 4412063 3593571 1877577 1641470 2564850 3291464 3750646 4316336 4306792 3122284
8264 3122284 1839840 1844855 2463333 1848807 129429 -307625 1649217 3697989 2959624
8255 2959624 1150 -1834063 -1033109 136004 -828377 -2901171 -3198223 -1473429 -501615
8246 -501615 -1812877 -3443058 -3015525 -1139370 -159820 -932756 -2585610 -4341425 -5562279
8237 -5562279 -4812820 -1274465 3073388 5010198 4099711 2976290 3072172 2446045 -744832
8228 -744832 -4578478 -5308215 -2113629 2015151 3955061 3498550 2597753 2761478 3700435
8219 3700435 4013390 2824729 776118 -646449 -707752 -2121 491811 322518 -464915
8210 -464915 -1416720 -1604361 -526410 682418 282526 -1379319 -1941863 -721707 -225775
8201 -225775 -2149073 -3987069 -2643824 56886 -531986 -4503774 -6531419 -3621896 386345
8192 386345 551567 -2367733 -4176268 -3732637 -3171447 -3105423 -1871402 645578 2257286
8183 2257286 2049669 1509634 1440689 795324 -562514 -945537 56972 384355 -1040201
8174 -1040201 -2273348 -1565447 -166754 116041 -132677 245139 351041 -918928 -2231050
8165 -2231050 -1909113 -1058860 -1442230 -1682797 672554 4165909 4669594 1692344 -667236
8156 -667236 19683 1131604 -441476 -3600008 -5122570 -4066467 -1876947 91917 1140222
8147 1140222 796792 -283530 -233789 1541927 3000023 2179716 76533 -930171 -426985
8138 -426985 122863 24157 59515 961592 2598492 4212947 4396169 1841472 -2415717
8129 -2415717 -4666318 -2448038 2010874 4470294 4158356 3917825 5009562 4969182 1889288
8120 1889288 -1811024 -2208148 833494 3517500 2979935 299025 -1791616 -2543971 -3259680
8111 -3259680 -4472947 -4828916 -3326015 -1354381 -1088962 -2378352 -2949478 -1873621 -974020
8102 -974020 -1830014 -3040992 -2205503 358565 1945583 1317777 225670 583457 1795122
8093 1795122 1952388 649129 -695526 -983537 -717278 -867052 -1317244 -1186301 -404844
8084 -404844 -67853 -915081 -2170150 -2457104 -1338982 625240 2623573 3541866 2149899
8075 2149899 -1135656 -3443598 -2473882 66211 517941 -1309943 -1854508 385286 2239853
8066 2239853 932861 -1507961 -1762069 -494920 -559797 -1723127 -1118839 1840657 4716708
8057 4716708 5937851 6042964 5192736 2968549 882871 1506111 4339804 5899969 4849850
8048 4849850 3697205 4165436 4420578 2833209 1143801 1210561 1391783 -654589 -3599620
8039 -3599620 -4252440 -2471588 -933545 -608228 287176 2657891 4700393 4551309 2754969
8030 2754969 1095705 319127 -29594 -307479 -209903 610866 1780413 2356876 1974480
8021 1974480 1477640 1709271 2060412 1517931 911433 2144019 4838186 6042230 4289560
8012 4289560 1658560 352384 -306156 -1352871 -1213726 1482060 3940260 2110346 -2978435
8003 -2978435 -5764878 -3449551 819435 2949284 2695391 1865143 748572 -1194872 -2934796
7994 -2934796 -2663177 -290735 2501396 4160643 4130990 2661404 874671 241484 889720
7985 889720 1151513 -211583 -2154264 -2861749 -2350364 -2161851 -2867197 -3282176 -2212250
7976 -2212250 79603 2311715 3359406 2943318 1799373 1202241 1704470 2244926 1062315
7967 1062315 -2254484 -5937696 -7493234 -5928380 -2575402 82434 355238 -1561324
7959 -1561324 -3948410 -4835631 -3372972 -600785 1220456 787530 -644942 -689767 985786
7950 985786 2102662 937317 -1384361 -2837356 -3297069 -3719783 -3731619 -2239432 189494
7941 189494 1826068 2349382 2715888 2800425 1717923 396060 910497 2869639 3493679
7932 3493679 2065749 1106075 1866817 2026179 -164525 -2660586 -3139406 -2795308 -3484446
7923 -3484446 -3693585 -1156974 2406886 3282875 1340361 -384593 -880535 -1736607 -2865257
7914 -2865257 -2123918 256751 1124032 -525109 -1777896 -670251 808742 609845 207739
7905 207739 1672898 3783849 3968531 2335141 1011108 646836 37309 -1480307 -3221845
7896 -3221845 -4257828 -3988457 -2392358 -751855 -962152 -3011883 -4538243 -4040453 -2826994
7887 -2826994 -2364184 -1729848 237335 2122491 1814978 -201127 -2000099 -3343282 -4888124
7878 -4888124 -5548524 -3948204 -1722519 -1780603 -3480495 -3219845 -178119 2249987 1713099
7869 1713099 14023 -556772 -616474 -1282640 -1390521 109149 1315527 75245 -2092061
7860 -2092061 -2009280 211312 1607103 1439818 2287720 5237167 7103293 4434566 -1535119
7851 -1535119 -6073776 -6311109 -3630670 -1024902 190217 590636 914930 1193020 1189003
7842 1189003 807835 -1080 -1184469 -2362435 -3173794 -3876098 -4927807 -5822427 -5248834
7833 -5248834 -2948490 -533481 386042 140343 78725 482019 706062 754216 1064759 1144438
7823 1144438 292102 -538929 153909 1319505 40729 -3754552 -6014571 -3796909 564322
7814 564322 2873226 2651641 2330986 2349097 794984 -2313945 -4178392 -3543743 -2677829
7805 -2677829 -3514240 -4554484 -3665800 -1767392 -1196529 -1879948 -1908766 -1193741 -1679876
7796 -1679876 -3811453 -5432840 -5076650 -4196759 -4738903 -6006860 -5631600 -2899484 449615
7787 449615 2502572 2945369 2508498 1762166 875729 -72281 -966197 -1607961 -1719512 -1219425
7777 -1219425 -420479 303152 820367 891851 -25630 -1934544 -3635209 -3876179 -3006670
7768 -3006670 -2410270 -2352371 -1716978 -113255 1271495 1592717 1631270 2066443 1811826 -397305
7758 -397305 -3675276 -5871962 -6187504 -5386350 -4087305 -2661990 -2260616 -3618022 -4854987
7749 -4854987 -3005967 1548002 4535779 3008047 -828425 -2630499 -1233893 984483
7741 984483 1972135 1970158 1841185 1471556 445629 -860598 -1570075 -1321480 -735265 -887756
7731 -887756 -2067038 -3080995 -2562958 -1150744 -1178329 -3479140 -5731889 -5218647 -2241231
7722 -2241231 683140 2189729 2823825 2996824 2396982 1586990 2041050 3773608 4609878
7713 4609878 2916286 -158012 -2295793 -2921193 -3224744 -3798426 -3568718 -1285352 2646191
7704 2646191 6181288 7379266 6067838 3718507 1690161 55225 -1486055 -2293895
7696 -2293895 -1551364 -43800 302491 -1013876 -2240710 -1668031 345486 2232710 2965580
7687 2965580 2201687 -54042 -2706505 -3449422 -962473 3050817 5274487 4186328 1241851
7678 1241851 -1001730 -1040801 848696 2888136 3020991 964173 -1115780 -1000177 778115
7669 778115 1693709 479414 -1815035 -3796838 -4948915 -4654960 -2008217 2425125 6115768
7660 6115768 7006635 5565151 3700813 2662124 2637596 3196736 3283870 1974706 96067
7651 96067 -205637 1577808 3289587 3139795 2051083 1551672 1277363 610080 887166
7642 887166 3252008 5832519 6187206 5361717 6037167 7639068 7397092 5781331 6094063
7633 6094063 8192031 7762635 3475048 -176614 221436 1968962 1539909 459881 1483594
7624 1483594 2765184 1231757 -1139776 -460501 1575093 -52438 -4602311 -5736565
7616 -5736565 -1712060 1362731 -969421 -4683470 -3838212 604252 3194551 2244513 857478
7607 857478 1155527 1829350 1326097 186163 -302737 332414 1908495 3854445 5117875
7598 5117875 4809775 3079557 965895 -314833 93862 1940541 3553421 3494815 2618249
7589 2618249 2943754 4459605 5156180 4570532 4699233 6416742 7641172 6590101 4437388
7580 4437388 2978193 1989803 888232 680833 1924290 2840067 2004399 1001530 1740514
7571 1740514 2996517 2556827 1091341 638325 683253 -703732 -2801406 -2936186 -771812
7562 -771812 1459837 2672142 3636342 4331561 3905805 3074745 3232908 3390862 1535522
7553 1535522 -1128340 -1284789 910246 1665009 -166339 -1073996 1192242 3898879 3825341
7544 3825341 1784456 29267 -1492446 -3300972 -3740790 -1520968 1329789 2242149 1913173
7535 1913173 2264495 2580805 1188124 -633154 -322379 1285569 923161 -1716730 -3446175
7526 -3446175 -2876781 -2542505 -4490966 -6882530 -6849049 -4539559 -2369495 -1658207 -1746000
7517 -1746000 -1573375 -708706 674863 1799084 1672381 260840 -1153497 -1426936 -920452
7508 -920452 -815224 -1544283 -2589451 -3410138 -3716765 -3047077 -1143588 958771 1219526
7499 1219526 -1128571 -4043222 -4551747 -2271651 48547 -15833 -1718192 -2746785 -2628933
7490 -2628933 -2830199 -3891298 -4519415 -3928191 -3199955 -3313151 -3302217 -1792177 543687
7481 543687 1550834 314623 -1837463 -2991856 -2496275 -1205345 -498541 -1025145 -2060905
7472 -2060905 -2270758 -1318128 -324081 -466614 -1611443 -2647917 -2676631 -1599479 -190558
7463 -190558 94778 -1771917 -4859205 -6588125 -5346841 -2285060 138980 816844 473861
7454 473861 112084 -14081 -69657 -162096 -275572 -200687 457850 1883122 3700524 5147192
7444 5147192 5473442 4390569 2629403 1794732 2756010 4253305 4191992 2333315 352990
7435 352990 -869024 -2164376 -3664430 -3622923 -1182956 1425617 1512597 -415704 -1795127
7426 -1795127 -1930506 -2317745 -3387059 -3596167 -2231913 -708622 -21963 1071686 3754002
7417 3754002 6445920 6394140 3474795 570670 -110793 399608 -188426 -1918239 -2583944
7408 -2583944 -1214442 49516 -1336129 -4667525 -6662763 -5595414 -3068190 -1315490
7400 -1315490 -488099 371164 1142164 976946 -43400 -1172546 -2362815 -3793341 -4430012
7391 -4430012 -2892724 73542 1731007 635158 -1557951 -2449080 -1925790 -1603772 -1974800
7382 -1974800 -1761524 -299550 906150 45074 -2292307 -3558731 -2315157 440529 3293150
7373 3293150 6179757 8984099 9745000 6475636 615107 -3436529 -2966289 199473 2173419
7364 2173419 1261319 -956082 -1963077 -1032385 88612 -816881 -3434205 -4777389 -3209383
7355 -3209383 -1420248 -3023767 -6861765 -7970235 -4556052 -477964 489473 -640273
7347 -640273 -1201559 -1414070 -2742398 -4257488 -4088199 -2782204 -1927961 -934463 1392414
7338 1392414 3382523 2398692 -576878 -2072687 -1422678 -1027749 -1466307 -641135 1526006
7329 1526006 1877430 -829353 -3279551 -2390316 189506 829458 -1089052 -3375243 -4523854
7320 -4523854 -4636046 -3949194 -2521045 -855318 487264 1400072 1741490 1368947 1083871
7311 1083871 1982497 3299260 2830805 350196 -1620944 -1683442 -1751968 -3506840 -5094742
7302 -5094742 -4090664 -1865267 -1665533 -3321049 -3355731 -344275 3075798 4248601 3778050
7293 3778050 3506229 3475972 2716797 1645975 1672519 2828796 3471085 2568131 1078190
7284 1078190 419967 365371 -515201 -2472997 -3831115 -3152861 -1193131 278597 834207
7275 834207 1231166 1459965 731683 -630466 -1188535 -632122 -121357 158913 1588528
7266 1588528 4134546 5073302 2635553 -899408 -2170537 -1446299 -1540186 -2757762 -2213300
7257 -2213300 1337857 4933773 5191348 2734805 1034913 1822516 3413479 3470735 2038674
7248 2038674 1124189 1729738 2341655 1137937 -837083 -418501 3114968 6057147 4700827
7239 4700827 515889 -1699268 -463173 653534 -1279705 -4117652 -3963460 -834571
7231 -834571 1725861 1719061 569142 -31245 -549375 -1988664 -3706793 -4186639 -3038131
7222 -3038131 -1211261 177123 511662 -232020 -1431546 -2344353 -3032166 -3962350 -4374427
7213 -4374427 -2404534 2177714 6646728 8230129 7379347 6469760 6170123 5284296 3626197
7204 3626197 2398557 1591396 -314487 -3416520 -5749245 -6483658 -7053333 -7737345 -6066831
7195 -6066831 -935039 4227723 5335276 2910419 495861 -559401 -1282836 -1299110 992576
7186 992576 4522548 5774568 3777105 1644553 2017682 3752077 4435254 3811700 3279899
7177 3279899 3771162 5207182 6570640 6031120 2775093 -1091795 -2647715 -2216563 -2561736
7168 -2561736 -3866814 -3144014 357063 3122733 2779226 1766035 2804267 4139497 2959340
7159 2959340 803229 1227779 3699688 4243938 1689075 -714972 -272800 1707904 2198619
7150 2198619 89556 -2958396 -4093464 -2066884 613406 -235980 -4816122 -7990082
7142 -7990082 -5949993 -1687220 -273889 -1165053 -202556 2288122 1674179 -2461614 -4436676
7133 -4436676 -1224934 2623468 2158316 -711636 -1444371 -557924 -1888098 -5304488 -6556183
7124 -6556183 -4045114 -1190573 -1297753 -3524168 -5078172 -4857948 -3667825 -2627112 -2451083
7115 -2451083 -3060371 -3174263 -1394615 1730737 3761613 3068827 641908 -1291525 -1637175
7106 -1637175 -863094 212194 1228540 2080450 2577884 2593736 2431638 2743020 3746314
7097 3746314 4613081 4199224 2555334 1033635 500833 219450 -798182 -2134308 -2790814
7088 -2790814 -3023897 -3746704 -4298630 -2841943 373296 2186963 594183 -1875419 -1187998
7079 -1187998 2479575 4843618 3630820 1644133 2232784 4315420 4524273 2543367 1012981
7070 1012981 871448 402266 -839712 -843028 867651 1522744 -408625 -1985700 -6017
7061 -6017 3777410 5050037 3060482 739361 -427505 -1757647 -3637808 -4293032 -3145129
7052 -3145129 -2042362 -1904180 -1205715 641882 1359859 -571980 -2824067 -2422367 -362916
7043 -362916 -241853 -3152432 -6445489 -7277619 -5450917 -2903049 -1887908 -3324373 -5597803
7034 -5597803 -5554117 -2119298 1772813 2573136 745035 -161955 1248025 2467405 1117526
7025 1117526 -1652554 -3133877 -2714109 -1895279 -1668193 -1635227 -1481393 -1739051 -2626973
7016 -2626973 -3089013 -1813883 914008 2985456 2518065 72916 -1656013 -645945 2303693
7007 2303693 4564440 4419168 2301083 -211159 -1699840 -1417326 309050 1847962 1454451
6998 1454451 -674353 -2220846 -1260551 1558527 3872630 4041943 2154428 -628482 -2730795
6989 -2730795 -2755783 -752589 1227417 1073935 -813758 -2039936 -1314228 313514 1463430
6980 1463430 2002682 2080705 1398947 398957 332427 860977 -331174 -3614213 -5375183
6971 -5375183 -2904905 572327 -153942 -4291750 -5899964 -2988166 -397898 -1740454
6963 -1740454 -3702047 -1963319 1485476 1747742 -1067673 -2550214 -1178668 276309
6955 276309 177091 110007 1058150 1617807 1027724 516985 581491 6055 -1361287 -1780836
6945 -1780836 -661478 326990 260583 313771 922947 465324 -1631474 -3090426 -2004349
6936 -2004349 287787 1366004 903631 21145 -751820 -1259757 -1059376 -349972 -47440
6927 -47440 -3294 928597 2296365 2074080 277017 -537850 127438 -798035 -4449693 -6687436
6917 -6687436 -3841997 1173730 2688144 35461 -2833940 -3795068 -3932781 -3533189 -1609318
6908 -1609318 645103 540899 -1390955 -1499073 1328784 3973880 4136888 3310072 3181498
6899 3181498 2655141 633746 -1177336 -808569 712220 1076830 214356 -107791 808849
6890 808849 2028503 2714474 2821322 2357432 1208006 -284238 -1248003 -939432 495536
6881 495536 1757962 1416444 -161860 -602696 1659600 5058115 6796893 6375587 5436346
6872 5436346 4692815 3231198 775602 -1518818 -2754357 -2947137 -2003362 50083 1907586
6863 1907586 2119539 1305493 1150247 1502430 908379 -335779 -579542 -76574 -585547
6854 -585547 -1723232 -1413062 -276128 -1377418 -4703285 -6415450 -5174216 -4431200 -6013064
6845 -6013064 -6322670 -2522932 1926235 2470177 640590 993891 3616498 5015600 4489245
6836 4489245 4071264 3407352 453077 -3073707 -2693819 1681370 4818729 3703406 1257677
6827 1257677 736113 925271 -344624 -1578513 2313 3569829 5403615 3688313 381145
6818 381145 -1363583 -307639 2035532 3032423 1733251 -92607 -506550 -216249 -1133814
6809 -1133814 -2896858 -3429897 -2713432 -2833999 -3812019 -2818459 1027364 4271254 3770554
6800 3770554 1212728 372897 1707600 2545002 1617362 536366 789439 1501107 840757
6791 840757 -1458775 -3587518 -3566721 -1773125 -1137389 -3747584 -7530533 -8171687 -4631872
6782 -4631872 -529932 857737 509930 854643 1409458 52631 -2632659 -3423889 -867223
6773 -867223 2844625 4897696 4924428 4387377 4277973 4319112 3852241 2889917 2255168 2568034
6763 2568034 3139135 2542464 556134 -1334157 -1847427 -1330910 -644482 141669 888749
6754 888749 478440 -1668699 -3980120 -4313561 -2702072 -1001898 -255805 -61558 -219924
6745 -219924 -1053982 -1930904 -1388897 580949 1941632 1230883 -429473 -1012529 -361865
6736 -361865 6613 -521742 -665022 810726 3071653 3970090 2622806 478800 -444825
6727 -444825 171156 943758 635441 -678929 -2053688 -2510029 -1552205 327495 1688528
6718 1688528 1506322 442155 -83136 194607 552763 980162 1952423 2606348 1407815
6709 1407815 -843477 -1189905 1050619 2487143 310549 -3320550 -4168686 -1753132 673170
6700 673170 1262135 1528858 2919832 4243218 3672273 1495418 -367160 -606554 542928
6691 542928 1934416 2501553 2062475 1452046 1614468 2538976 3214492 2425311 -258092
6682 -258092 -3507464 -4453352 -1409553 3361254 5578308 4365249 3342960 4923482 6375460
6673 6375460 4286902 512261 -162155 2980698 5942649 5987071 4370855 2880314 1436476
6664 1436476 82470 917 1172996 1699717 701080 -468313 -827312 -1032569 -1049193
6655 -1049193 615094 3856881 5802985 4590341 2194689 1639838 3212680 5118758
6647 5118758 6093024 5687672 3703742 1039773 -438702 -336119 -387537 -1440672 -1902630
6638 -1902630 -762510 199234 -691999 -2124524 -2208424 -1657319 -1895534 -2052433 -999256
6629 -999256 -541000 -2779024 -5449346 -4082975 1305468 5625237 5431570 2812658 1513854
6620 1513854 2170811 2878412 2207952 121445 -2453604 -3704384 -2023137 1800778 4589218
6611 4589218 3987649 903580 -1815992 -2267281 -655801 1402884 2204645 1328187 69806
6602 69806 7171 1212381 2531818 3190743 3108144 2211171 911337 798759 2996115 5899854
6592 5899854 6509747 4243619 1551747 397002 131738 -497724 -1329622 -1908443 -2814884
6583 -2814884 -4359694 -5224859 -3960303 -1089053 1502114 2679632 2620253 1896278 935079
6574 935079 -58307 -1234137 -2581500 -3009130 -1109262 2514121 5007610 4433384 2004108
6565 2004108 -44862 -1481439 -3178753 -4321318 -3125578 -289710 909354 -1079438
6557 -1079438 -3747288 -3974594 -2245772 -1409643 -2075819 -1729403 1116037 3998956 3280462
6548 3280462 -1155614 -5638369 -6969081 -5494615 -3671196 -2943844 -2939311 -2859397 -2436098
6539 -2436098 -1680636 -700898 47314 36534 -529862 -736261 -133042 552307 420137 -168899
6529 -168899 1620 1006944 1208762 -403115 -2070034 -1134980 2010653 3903954 2668135
6520 2668135 499090 -24045 218502 -596005 -907491 1985820 6185589 6494059 2208213
6511 2208213 -1086540 513256 3793488 3914201 1475920 121327 52239 -1331492 -3984200
6502 -3984200 -5118429 -3973275 -2555504 -1840634 -990547 -233719 -842857 -2192349 -2418376
6493 -2418376 -2051759 -3238314 -5214715 -4740757 -1652969 417783 56646 236529 2559239
6484 2559239 3884202 1667734 -1285473 -1093829 1211130 1858810 274237 -993568 -697308
6475 -697308 303959 1418794 2222181 1217390 -1918201 -3941526 -1558874 3289823 5378493
6466 5378493 3263329 694473 653100 1710970 1429309 109773 -507544 188326 2006733
6457 2006733 4745689 7115257 6839069 3609807 379986 -91450 1328805 2016547 1674261
6448 1674261 2166729 3732126 3955652 1299263 -2192887 -3125025 -853575 2001778 2974099
6439 2974099 2411123 2246808 3054433 3401106 1973651 -681547 -2867718 -3409838 -2134687
6430 -2134687 565394 3727249 5680630 5006084 2066257 -907717 -1775024 -540439 790437
6421 790437 524179 -770095 -1040924 524984 2305946 2294176 666655 -631825 -453693
6412 -453693 537128 1178783 832134 -845223 -3598124 -5781187 -5533482 -3408424 -2205897
6403 -2205897 -3199745 -4164176 -2657740 105986 748205 -1518698 -3772667 -3267667 -785815
6394 -785815 605067 -817355 -3769506 -5519771 -4574365 -1859475 451010 975380 -43939
6385 -43939 -1370279 -1650114 -186062 2161993 3208267 1843219 -110361 -127684 1130830
6376 1130830 522077 -2572994 -4782431 -3737956 -1805880 -2378005 -4584612 -4877005 -2618260
6367 -2618260 -597326 -248050 196790 2072983 3762157 3278164 1329648 110966 237926
6358 237926 430426 -294931 -1328790 -1357434 63250 1988005 3092038 3072646 2580498
6349 2580498 1724493 -266734 -3178803 -4831112 -3447731 -262613 1923435 2317526 2433809
6340 2433809 3094856 3326952 2627607 2242210 3181008 4508057 4734222 3819367 2783092
6331 2783092 2218806 2112329 2354403 2559186 2068890 975985 467713 1269491 2398319
6322 2398319 2512377 1953939 2116910 2971398 2800554 930766 -689376 84982 2352143
6313 2352143 3026952 1009941 -1220466 -1036527 810133 1672238 1002589 634016 1223715
6304 1223715 903236 -1606006 -4557750 -5393484 -4065118 -2583773 -2218015 -2724928 -3644436
6295 -3644436 -4648377 -4899523 -3647652 -1515509 44690 631576 1134424 2042425 2653010
6286 2653010 2324933 1643342 1719839 2642062 3137039 2037421 -11664 -969635 -87161
6277 -87161 600190 -1200204 -4525706 -6129454 -4938527 -3171601 -2509847 -1960828 -893573
6268 -893573 -1241545 -4135541 -6630405 -5041985 -316452 3066156 2914443 1164321 235454
6259 235454 344663 603323 499491 -4161 -283233 685887 2406943 2353231 -535421 -3321790
6249 -3321790 -2943425 -1176793 -1899249 -4367962 -4004618 -24521 2875835 1888239 193306
6240 193306 1128423 2713751 1653184 -694323 -745884 1088545 1180522 -1240246 -3042858
6231 -3042858 -2366872 -1172133 -1685557 -3170461 -3659181 -2887366 -1884692 -891037 608650
6222 608650 2177061 2335246 689415 -841322 23208 3032646 5689082 6568410 6793697
6213 6793697 7375445 6928347 3994923 304806 -971606 310227 1392300 1159275 1443167
6204 1443167 3109901 4011230 2444620 67712 -678026 -122415 -278266 -1676521 -3277179
6195 -3277179 -4384497 -4779339 -3897506 -1728229 101814 -181964 -2239334 -4043417 -4178959
6186 -4178959 -2817735 -1056826 -184658 -853795 -2066600 -1764379 684142 3421852 4395251
6177 4395251 3737363 2864203 2214881 1211671 -160994 -1001175 -514171 1309754 3716553
6168 3716553 5514897 5931790 5307018 4206737 2124134 -1431778 -4665384 -4559131 -927470
6159 -927470 2738222 3602844 2691250 2487085 3386228 4259678 4715086 4735961 3487025 651208
6149 651208 -1989608 -2294204 -463530 1527358 2417648 2174596 1007623 -509907 -1112164
6140 -1112164 -191496 1083722 1222789 343692 -316751 -22959 1033353 1822119 561817
6131 561817 -3512048 -7885272 -8640907 -5609456 -2910403 -2957608 -3211018 -1135595 1174974
6122 1174974 773103 -839014 -437789 1237464 1132912 -558891 -1307359 -1340892 -2675707
6113 -2675707 -3977301 -2052223 1658724 2027946 -1482300 -3403582 -860295 2151592
6105 2151592 1718115 -198473 -514783 -649770 -2716977 -3990717 -714606 4834387 6605174
6096 6605174 3224384 -714404 -1677331 -963873 -829437 -990490 -586535 -421224 -1192667
6087 -1192667 -1684387 -766039 308567 -390697 -2397297 -3467359 -2918524 -2384297 -2887965
6078 -2887965 -2997529 -1153508 1389724 1902424 183902 -982416 -61679 770756 -834760
6069 -834760 -3193073 -2714630 421435 1863637 -1077027 -5897731 -8454566 -7818943 -5905460
6060 -5905460 -4041654 -2139454 -420880 262811 -67480 -250907 365704 959574 347476
6051 347476 -1434450 -3055592 -3331899 -2578877 -2266362 -3154492 -4233625 -4129839 -3104498
6042 -3104498 -2550203 -2630716 -1828620 709278 3583597 4665251 3391266 863295 -1595955
6033 -1595955 -3218986 -3711659 -3268050 -2512157 -1902770 -1309268 -456757 435162 770272
6024 770272 307969 -292951 210260 2343226 4807699 5452651 3848215 1947880 1347558
6015 1347558 1080491 -362724 -1971760 -1474009 914422 2699980 3147245 4197045 6612013
6006 6612013 8202718 7465521 6238935 6447364 6544112 4214943 987229 511044 2758082
5997 2758082 3688377 1365125 -1057695 -224224 2327008 2694212 622277 -269524 1922810
5988 1922810 4673720 4974357 3515418 2941442 3543981 3282557 1576081 438358 1416442
5979 1416442 3601331 5410336 6255673 5481993 1984563 -3374765 -7031251 -6715270 -4635585
5970 -4635585 -4198488 -5036821 -4382865 -2294221 -1694386 -3235698 -3981929 -2174297 85543
5961 85543 413957 -511851 -992232 -1185517 -1928711 -2709870 -2820767 -2818272 -2998926 -2178850
5951 -2178850 34012 1542141 692287 -614848 545797 3487086 4623337 2433889
5943 2433889 -860447 -2524627 -1861115 572810 3901988 6403311 6053539 2816315 -689312
5934 -689312 -1717927 -50915 2222498 2943479 1648341 -349365 -1386523 -1110300 -474898
5925 -474898 -10103 966016 2750849 3996055 3386405 1860359 1585446 3022800 4498954
5916 4498954 4585265 3493953 2107486 972038 375204 216855 -284717 -1625494 -2823804
5907 -2823804 -2494953 -1042119 -226336 -451748 -268393 926506 1535996 107983 -2517757
5898 -2517757 -4630474 -5882349 -6658469 -6371846 -4289448 -1576774 -583452 -1823069 -3084675
5889 -3084675 -2070360 1015935 3944794 4790135 3396617 1153230 -244595 -188169 359608
5880 359608 -15355 -1556250 -3224836 -4099648 -4137984 -3442186 -1758743 685023 2638933
5871 2638933 3038061 2351404 1880051 2010820 2079533 1807756 1827964 2561765 3398302 3369670
5861 3369670 2180422 403039 -962742 -1210964 -721301 -771893 -1836276 -2483656 -1144602
5852 -1144602 1316127 2349215 1071201 -900930 -2242851 -3443505 -4740041 -4849408
5844 -4849408 -3343845 -2255655 -3202048 -4566373 -4000818 -2390634 -2426104 -4037161 -4470644
5835 -4470644 -2840701 -1366955 -1456856 -1637243 -714772 -269043 -1919451 -4003121 -3410517
5826 -3410517 97708 3562036 4690531 4287280 4320971 4816330 3874603 728168 -2400683
5817 -2400683 -2633257 -277747 1295929 73457 -2111927 -2640154 -1778802 -1349481 -1338172
5808 -1338172 -509478 601962 344445 -745849 -298233 2133677 4494148 5576875 6012098
5799 6012098 5637038 3224600 -336956 -2004511 -1096666 -611955 -2343324 -3926766 -2982020
5790 -2982020 -1085109 -753115 -1112036 93928 2144919 2533615 1272958 624648 1234216
5781 1234216 1681472 1471129 1416050 1088851 -1112642 -4805322 -7086779 -6143874 -3512413
5772 -3512413 -1720216 -1113764 -164894 1894976 3856733 3948700 1994844 -198123 -804964
5763 -804964 27919 783948 755544 467820 200698 -299557 -637847 -202773 43706 -1497003
5753 -1497003 -3848066 -3889862 -1045362 1379281 1166440 459311 1697327 3267242 2576421
5744 2576421 1161798 2649136 6713199 9057343 7321469 3690763 1328649 958465
5736 958465 1451935 1621946 937283 -83016 -213128 682499 1092115 409726 450197 2335415
5726 2335415 3624939 1501796 -2496348 -4311479 -3116639 -1697938 -1527206 -1197603 91806
5717 91806 1189324 1783399 3113308 4926562 4933878 2567670 370224 148219 377382
5708 377382 -838040 -2515539 -2550395 -1136718 -408028 -1394675 -2810702 -2684464 -561672
5699 -561672 1820250 2224946 608167 -728801 -410712 75366 -801649 -1741014 -1062869
5690 -1062869 -245958 -1489992 -3022578 -1232943 2835023 3937972 371624 -3438230
5682 -3438230 -3754110 -2509483 -2944664 -4183983 -3589302 -1696461 -1059816 -1746026 -1382011
5673 -1382011 886368 3112318 3202609 1238216 -847042 -1188507 32592 534202 -1062907
5664 -1062907 -2597162 -867015 3352505 5686945 4095431 1251408 -83004 -604507
5656 -604507 -1526260 -1512090 635947 2942166 3078112 2163760 2528940 3315833 1790098
5647 1790098 -1787091 -3890544 -2358187 1156412 3530026 3236202 1094471 -745983
5639 -745983 -776505 175297 28135 -1303929 -1526597 190325 1401549 402459 -323460
5630 -323460 2298206 6494829 7385115 3707905 -509345 -1391093 431563 1803058 1286988
5621 1286988 113584 -57021 887059 1795521 2077534 2551597 3803880 4434279 2727807
5612 2727807 -79521 -643523 1761217 3967657 3560923 2042151 1470195 634193 -2661057
$$ [...]
##END NTUPLES=NMR SPECTRUM
##END=
