##TITLE=31Pdec_LR-763-RM1
 , 64 sc
 18.4.2023
##JCAMPDX= 6.0         $$ Bruker NMR JCAMP-DX V2.0
##DATA TYPE= NMR SPECTRUM
##DATA CLASS= NTUPLES
##ORIGIN= UXNMR, Bruker Analytische Messtechnik GmbH
##OWNER= root
$$ XWIN-NMR		Version 3.5
$$ Tue Apr 18 15:37:44 2023 Russian Standard Time (UT+4h)  she@DPX200
##.OBSERVE FREQUENCY= 81.013821
##.OBSERVE NUCLEUS= ^31P
##.ACQUISITION MODE= SIMULTANEOUS
##.ACQUISITION SCHEME= undefined
##.AVERAGES= 64
##.DIGITISER RES= 16
##SPECTROMETER/DATA SYSTEM= spect
##.PULSE SEQUENCE= zgpg30
##.SOLVENT NAME= CDCl3
##.SHIFT REFERENCE= (INTERNAL, CDCl3, 0, 248.564)
##AUDIT TRAIL= $$ (NUMBER, WHEN, WHO, WHERE, WHAT)
$$ ##TITLE= Audit trail, XWIN-NMR		Version 3.5
$$ ##JCAMPDX= 5.01
$$ ##ORIGIN= Bruker BioSpin GmbH
$$ ##OWNER= she
$$ F:/spectra/data/she/nmr/P31/1/pdata/1/auditp.txt
$$ ##AUDIT TRAIL=  $$ (NUMBER, WHEN, WHO, WHERE, WHAT)
(   1,<2023-04-18 15:36:51.42 +0400>,<she>,<DPX200>,
      <continue with go, POWCHK disabled, PULCHK disabled
       configuration hash MD5:
       00 E9 B6 7A A2 85 ED C7 34 08 36 98 17 FE 4E 26
       data hash MD5: 32K
       0D 94 E2 28 1A A7 12 A3 7B 62 76 C0 DE 7C 84 8C>)
(   2,<2023-04-18 15:36:53.50 +0400>,<she>,<DPX200>,
      <Start of raw data processing
       efp BC_mod = 2 LB = 1 FT_mod = 6 PKNL = 1 PHC0 = -11179.72 PHC1 = 535.8849 SI = 64K 
       data hash MD5: 64K
       D7 F1 CC 64 23 44 21 72 BF 0B 35 C2 CC D5 FA A9>)
(   3,<2023-04-18 15:37:06.56 +0400>,<she>,<DPX200>,
      <pk PHC0 = -4.279466 PHC1 = 0 
       data hash MD5: 64K
       31 EF 83 26 F9 3B 3A BD F9 24 2B 13 DC AE AD 57>)
(   4,<2023-04-18 15:37:11.12 +0400>,<she>,<DPX200>,
      <abs ABSG = 5 
       data hash MD5: 64K
       2E 3A E5 88 91 54 EC A6 E3 F2 D7 D9 02 36 28 94>)
$$ ##END=
$$ 
$$ hash MD5
$$ 66 B9 FF 25 08 66 F8 A4 E1 07 42 CF 09 30 4D 7B
##$RELAX= 
##$RELAX= 
##$RELAX= 
##$RELAX= 
##$RELAX= 
##$RELAX= 
##$RELAX= 
##$RELAX= 
##$RELAX= 
$$ Bruker specific parameters
$$ --------------------------
##$DU= <F:/spectra>
##$EXPNO= 1
##$NAME= <P31>
##$PROCNO= 1
##$TYPE= <nmr>
##$USER= <she>
##$AMP= (0..31)
100 100 100 100 100 100 100 100 100 100 100 100 100 100 100 100 100 100 
100 100 100 100 100 100 100 100 100 100 100 100 100 100 
##$AQSEQ= 0
##$AQ_mod= 1
##$AUNM= <au_zg>
##$AUTOPOS= <>
##$BF1= 81.014009
##$BF2= 200.13
##$BF3= 200.13
##$BF4= 200.13
##$BF5= 200.13
##$BF6= 200.13
##$BF7= 200.13
##$BF8= 200.13
##$BYTORDA= 1
##$CFDGTYP= 0
##$CFRGTYP= 5
##$CHEMSTR= <none>
##$CNST= (0..31)
1 1 145 1 1 1 1 1 1 1 1 1 1 1 1 1 1 1 1 1 1 1 1 1 1 1 1 1 1 1 1 1 
##$CPDPRG= <waltz16>
##$CPDPRG1= <>
##$CPDPRG2= <waltz16>
##$CPDPRG3= <>
##$CPDPRG4= <mlev>
##$CPDPRG5= <mlev>
##$CPDPRG6= <mlev>
##$CPDPRG7= <mlev>
##$CPDPRG8= <mlev>
##$CPDPRGB= <>
##$CPDPRGT= <>
##$D= (0..31)
0 1 0 0 0 0 0 0 0 0 0 0.03 2e-05 3e-06 0 0 0 0 0 0 0 0 0 0 0 0 0 0 0 0 
0 0 
##$DATE= 1681817731
##$DBL= (0..7)
120 120 120 11 120 120 24 19 
##$DBP= (0..7)
150 150 150 150 150 150 150 150 
##$DBP07= 0
##$DBPNAM0= <>
##$DBPNAM1= <>
$$ [...]
##$SUBNAM3= <"">
##$SUBNAM4= <"">
##$SUBNAM5= <"">
##$SUBNAM6= <"">
##$SUBNAM7= <"">
##$SUBNAM8= <"">
##$SUBNAM9= <"">
##$SW= 501.771253377433
##$SWIBOX= (0..15)
0 1 3 0 0 0 0 0 0 0 0 0 0 0 0 0 
##$SW_h= 40650.406504065
##$TD= 32768
##$TD0= 1
##$TE= 0
##$TE2= 300
##$TE3= 300
##$TEG= 300
##$TL= (0..7)
0 120 53 12 22 120 120 120 
##$TP= (0..7)
150 150 150 150 150 150 150 150 
##$TP07= 0
##$TPNAME0= <>
##$TPNAME1= <>
##$TPNAME2= <>
##$TPNAME3= <>
##$TPNAME4= <>
##$TPNAME5= <>
##$TPNAME6= <>
##$TPNAME7= <>
##$TPOAL= (0..7)
0.5 0.5 0.5 0.5 0.5 0.5 0.5 0.5 
##$TPOFFS= (0..7)
0 0 0 0 0 0 0 0 
##$TUNHIN= 0
##$TUNHOUT= 0
##$TUNXOUT= 0
##$USERA1= <user>
##$USERA2= <user>
##$USERA3= <user>
##$USERA4= <user>
##$USERA5= <user>
##$V9= 5
##$VALIST= <valist>
##$VCLIST= <CCCCCCCCCCCCCCC>
##$VD= 0
##$VDLIST= <DDDDDDDDDDDDDDD>
##$VPLIST= <PPPPPPPPPPPPPPP>
##$VTLIST= <TTTTTTTTTTTTTTT>
##$WBST= 1024
##$WBSW= 4
##$XGAIN= (0..3)
0 0 0 0 
##$XL= 0
##$YL= 0
##$YMAX_a= 4838
##$YMIN_a= -8056
##$ZGOPTNS= <>
##$ZL1= 120
##$ZL2= 120
##$ZL3= 120
##$ZL4= 120
##$ABSF1= 248.5645
##$ABSF2= -253.2056
##$ABSG= 5
##$ABSL= 3
##$ALPHA= 0
##$AQORDER= 0
##$ASSFAC= 0
##$ASSFACI= 0
##$ASSFACX= 0
##$ASSWID= 0
##$AUNMP= <proc_1d>
##$AZFE= 0.1
##$AZFW= 0.5
##$BCFW= 0
##$BC_mod= 2
##$BYTORDP= 0
##$COROFFS= 0
##$CY= -3
##$DATMOD= 1
##$DC= 0
##$DFILT= <>
##$DTYPP= 0
##$F1P= 0
##$F2P= 0
##$FCOR= 1
##$FTSIZE= 65536
##$FT_mod= 6
##$GAMMA= 0
##$GB= 0
##$INTBC= 1
##$INTSCL= 6.047779e-11
##$ISEN= 30
##$LB= 1
##$LEV0= 0
##$LPBIN= 0
##$MAXI= 10000
##$MC2= 0
##$MEAN= 0
##$ME_mod= 0
##$MI= 50
##$NCOEF= 0
##$NC_proc= -8
##$NLEV= 6
##$NOISF1= 182.463
##$NOISF2= 159.3651
##$NSP= 0
##$NTH_PI= 0
##$NZP= 0
##$OFFSET= 248.5645
##$PC= 4
##$PHC0= -11184
##$PHC1= 535.8849
##$PH_mod= 1
##$PKNL= yes
##$PPARMOD= 0
##$PSCAL= 0
##$PSIGN= 0
##$REVERSE= no
##$SF= 81.0140089999694
##$SI= 65536
##$SIGF1= 159.3651
##$SIGF2= -187.1042
##$SINO= 113.3802
##$SIOLD= 16384
##$SREGLST= <1H.CDCl3>
##$SSB= 0
##$STSI= 65536
##$STSR= 0
##$SW_p= 40650.406504065
##$SYMM= 0
##$S_DEV= 0
##$TDeff= 32768
##$TDoff= 0
##$TI= <>
##$TILT= no
##$TM1= 0
##$TM2= 0
##$TOPLEV= 0
##$USERP1= <user>
##$USERP2= <user>
##$USERP3= <user>
##$USERP4= <user>
##$USERP5= <user>
##$WDW= 1
##$XDIM= 65536
##$YMAX_p= 307168945
##$YMIN_p= -44244127
$$ End of Bruker specific parameters
$$ ---------------------------------
##NTUPLES= NMR SPECTRUM
##VAR_NAME=  FREQUENCY,     SPECTRUM/REAL,   SPECTRUM/IMAG
##SYMBOL=    X,             R,               I
##VAR_TYPE=  INDEPENDENT,   DEPENDENT,       DEPENDENT
##VAR_FORM=  AFFN,          ASDF,            ASDF
##VAR_DIM=   65536,         65536,           65536
##UNITS=     HZ,            ARBITRARY UNITS, ARBITRARY UNITS
##FACTOR=    0.620285442955139, 1,           1
##FIRST=     20137.2065510682, 0,            0
##LAST=      -20513.1999529968, 0,           0
##MIN=       -20513.1999529968, -44244127,   0
##MAX=       20137.2065510682, 307168945,    0
$$ Real data points
##PAGE= N=1
##DATA TABLE= (X++(R..R)), XYDATA
$$ [...]
38431 -9907526 -11894330 -6204201 1663407 2063262 -4468480 -6871325 814171 10438754
38423 10438754 10473662 1017355 -7297967 -7164779 -1684048 2518201 3661269 3291195 538683
38414 538683 -6360231 -13556330 -13060342 -3672179 4574137 2134740 -6950263 -10254502
38406 -10254502 -4023386 2741800 2539781 -619515 -85492 1686928 -2121551 -10272655
38398 -10272655 -14289204 -10619493 -4291025 803 3154854 6129543 5981548 1237674
38390 1237674 -3864807 -4971853 -3906643 -4966231 -7658880 -7930003 -5134761 -2966251
38382 -2966251 -3539447 -4732715 -4230867 -2781658 -1940857 -1118353 1177852 4459424 6283749
38373 6283749 4841472 846215 -2803065 -3185847 -58856 3436097 3772674 999836
38365 999836 -1413535 -968537 1103407 2160770 1545768 259387 -1213743 -2566319 -2135951
38356 -2135951 1428446 5917384 6935250 3540936 -128953 -410866 1362094 2194699
38348 2194699 2585321 4589766 6578047 4996569 1262874 1361498 6711118 10664983 7807595
38339 7807595 2443198 2466056 7389846 8977641 3609900 -2400298 -2059199 2785668 4822301
38330 4822301 980340 -5242226 -9488563 -10601895 -9114463 -5041781 1401757 8208824
38322 8208824 11881072 9809392 3256730 -1960752 129535 8913457 16444053 15711637
38314 15711637 8514919 2557942 1921419 4026936 5601898 6903450 8467929 8100667
38306 8100667 4396421 288657 -505088 1516480 3604834 5413797 7402291 6866271
38298 6866271 1702411 -2610621 2654987 16085462 24338224 18391778 5819333 718151
38290 718151 5734131 11559359 11758896 9465044 9089805 9748354 9777704 11041328 14501095
38281 14501095 16438105 13656938 8895508 6641036 6406968 4651339 1145296 -1310773
38273 -1310773 -2149126 -3229037 -4213427 -2397494 2111813 4827346 1874686 -5960499
38265 -5960499 -15034783 -22243119 -25578688 -23666561 -16803721 -7965647 -1657428 -1201288
38257 -1201288 -6256170 -12471931 -14812286 -12437012 -9269212 -8661358 -9215172 -7623652
38249 -7623652 -3680967 139093 2430723 3163702 1726450 -1902199 -5241275 -6225767
38241 -6225767 -6767512 -9237952 -10875416 -7188895 -184252 3420331 2725936 4061376
38233 4061376 9683590 12719306 7731173 -490454 -4578346 -5297944 -7486954 -9739246
38225 -9739246 -6620488 752689 4541913 759019 -6463930 -11407810 -11794057 -7449143
38217 -7449143 -230719 4249679 1145895 -6301197 -9885187 -7650253 -5263495 -5128519
38209 -5128519 -2551435 3900201 6987864 1949436 -4232116 -2678179 3668225 5111088
38201 5111088 372594 -2944702 -1454859 290061 -450211 -746632 -100259 -3104589 -9607435
38192 -9607435 -10504773 -139753 12997306 15860205 7843435 305745 445482 3618195
38184 3618195 2819694 -1535100 -5153512 -8014511 -13368988 -20523188 -24081658 -21175087
38176 -21175087 -15377628 -11320444 -8497483 -3893056 1075563 1214908 -4197718 -8767922
38168 -8767922 -7347889 -2923185 -1113814 -1488127 -73885 2196286 1010944 -2328775
38160 -2328775 -2129168 375134 -3372924 -14303111 -20199495 -12644399 -1187097 -302694
38152 -302694 -8174230 -10870798 -4553910 540158 -1025785 -1494693 4505919 8802872
38144 8802872 2849536 -7490531 -10696673 -6500933 -3024138 -1478558 3943381 11854137
38136 11854137 11739938 -354868 -13738099 -16063091 -8010133 449848 3623427 3795813
38128 3795813 4064091 3941116 2598821 2010601 4803890 10771592 16880576 19889134 18042064
38119 18042064 10956787 -318219 -12212035 -19109370 -17531523 -10114171 -3086789 741088
38111 741088 3645783 6895856 7449205 3762563 530152 2454955 6406622 6065142 2309844
38102 2309844 1564091 4387608 3999654 -2390511 -8925945 -10731577 -10363302 -10426719 -7641362
38093 -7641362 -531709 3962083 -195299 -7218483 -6908016 338881 5284330 4685728
38085 4685728 4400588 7525319 9255694 6006884 1378720 -322098 288824 1638315
38077 1638315 4236418 6327249 3009271 -5874943 -12547018 -10722752 -3606217 1741981
38069 1741981 3153862 2012138 -1637562 -7005035 -9846904 -7636775 -3972412 -2770346
38061 -2770346 -2295577 -389569 -361533 -4470579 -6737713 -1488384 4932261 1686734 -9564472
38052 -9564472 -16608043 -14960855 -12261814 -13362822 -13472743 -9502670 -6302847 -6406060
38044 -6406060 -4586730 970199 2593160 -3897272 -9740348 -6049313 2243054 5386967
38036 5386967 4270723 5352203 6321868 79658 -10343982 -14227327 -9662965 -5261815
38028 -5261815 -5080655 -4067256 -436032 -514799 -6760243 -11082831 -6198022 3633372 8879878
38019 8879878 6394583 219000 -4743029 -6034797 -4354921 -3616005 -6910786 -11407104
38011 -11407104 -11575530 -7480617 -3881337 -1249685 4190588 10333545 8845792 -1224453
38003 -1224453 -8867629 -6003543 1190959 2716406 -715533 -1617629 1466384 3670758
37995 3670758 2644784 -78990 -3785439 -7786558 -8590909 -4386550 171127 -81300
37987 -81300 -2651438 -1533775 2971361 5227973 3186519 -53156 -2187577 -3522603
37979 -3522603 -4422437 -5927754 -10257973 -15540253 -14174460 -3446355 6425785 3812476
37971 3812476 -7692872 -14022091 -10106546 -3718450 -330992 3739185 10554989 14410776
37963 14410776 11751725 8240363 9808827 13467024 12904106 7819779 2115752 -2874059
37955 -2874059 -8051538 -12379403 -13271889 -9441439 -1563846 7094256 10216747 3661896
37947 3661896 -7267076 -11512637 -6003751 -137734 -2948715 -11102247 -14363618 -8988802
37939 -8988802 -739703 2969237 -15382 -5787179 -7910737 -3515031 3012782 5119331
37931 5119331 2810850 1457121 1681283 -2248991 -11211503 -16202257 -10168258 1021466
37923 1021466 6098355 2980624 -596861 1529335 7837035 13036615 13436563 9207117
37915 9207117 4286037 2692116 3431857 2136455 -1078243 -606397 5362113 10836790
37907 10836790 11388522 11010805 13999817 16259241 12024374 4272839 462449 1625496
37899 1625496 3445126 4703800 6617100 7045033 4146646 3150138 10023234 20070958
37891 20070958 22697868 16923087 12082652 12601479 12448746 7069051 1201366 878940
37883 878940 5258555 10097864 12765806 10831841 2553110 -7805814 -11626690 -6608384
37875 -6608384 -45379 1644972 513990 909625 2322212 2772613 3443134 5173428 5409280
37866 5409280 3045372 1424237 2517383 3472768 3013303 5075194 11031318 14833310
37858 14833310 12270950 8691213 9741043 10453917 3347152 -7016031 -8967729 -1695168
37850 -1695168 3112994 -1326589 -8068863 -8015156 -1855914 3450186 3541345 -1676830 -9580746
37841 -9580746 -14558088 -11212174 -1295126 6679029 7220267 2851379 -2312896 -7679445
37833 -7679445 -11769724 -9778261 -1133585 6232021 5736842 1638991 1693310 4733939 4113605
37824 4113605 284841 -256333 2297870 332783 -7257059 -10970652 -5215785 2143532
37816 2143532 1324934 -5416713 -8823883 -5971850 -363302 6886209 16483006 23729822
37808 23729822 21778201 12742790 6915007 8825747 11592780 8030222 582560 -3910531
37800 -3910531 -4060528 -3952414 -6664948 -11283590 -13841226 -9435909 2791801 15088217
37792 15088217 16692746 7057419 -1921476 -967691 4903192 5460249 652618 -1165968
37784 -1165968 2614969 5539217 2921706 -1904345 -4001163 -3309004 -2229875 -1307950
37776 -1307950 167075 2216050 4306119 5221963 3014813 -1785885 -3806043 1562420
37768 1562420 10127993 11960028 4031074 -5206255 -6301464 393271 7160621 8374249
37760 8374249 4248109 -1889935 -6417632 -7094276 -4878743 -3300353 -4280154 -5743086
37752 -5743086 -4797613 -1825575 157944 -945501 -4693059 -8992302 -11634988 -11832510
37744 -11832510 -10780950 -9946421 -9064495 -7100825 -4422215 -2085412 -6770 1541803
37736 1541803 -43452 -6309490 -13190291 -14597255 -10641121 -7132040 -6207174 -3418904
37728 -3418904 3647989 9804797 9186665 3148444 -2839325 -6074971 -6029226 -969112 8937099
37719 8937099 17419759 16987166 7793024 -2409346 -6607195 -3582339 3737965 10752380
37711 10752380 13069935 10403001 8219213 11365609 16489798 15614296 7690442 1385347
37703 1385347 4146244 12642065 17367936 14163511 7660403 4493841 6464400 10663360
37695 10663360 13643190 13869556 11328692 6889620 2600627 1164897 3635773 7933172
37687 7933172 10818012 11187664 10371526 9593892 8660751 6953588 4115751 19079 -4153572
37678 -4153572 -5417596 -2283813 1689835 1043452 -4331344 -8670978 -8261561 -6123198
37670 -6123198 -6744051 -9716658 -11570677 -11171833 -10025048 -9053349 -7996447 -6695657 -4799439
37661 -4799439 -1726136 1396428 2035162 385718 316221 3620346 6438953 4810451 796881
37652 796881 -1252352 -2077210 -5756144 -11521224 -12903790 -6228233 3915472 9431128
37644 9431128 6970046 527134 -3047998 -897675 3191166 3890506 1609092 1397046
37636 1397046 4060266 3629068 -3085197 -9539797 -7525997 1462166 9088675 11671836
37628 11671836 12005636 11553695 8602791 4321025 3290353 6303559 8558567 6866824
37620 6866824 3604542 1986787 2260882 3887454 6535096 7627154 4154877 -1542717
37612 -1542717 -3305950 -245577 1712187 -91140 -74416 5996181 12293088 10047945
37604 10047945 -18774 -8320283 -7776536 -14233 8231852 10869222 6113737 -1632934
37596 -1632934 -4563936 542910 8063301 9935836 4769459 -2245239 -6410623 -6772733
37588 -6772733 -3925707 1006600 5400280 6765078 5598653 4045966 2253663 -1038337
37580 -1038337 -4893702 -6609062 -5747897 -4362825 -2797934 1191665 7863007 13268000
37572 13268000 13947172 11767373 11363880 13565864 14047630 9220738 1720391 -1742207
37564 -1742207 1979737 8318794 9475509 2536337 -7869229 -14552446 -14033382 -8179089
37556 -8179089 -1776200 681193 -2345355 -8113752 -11315648 -8337596 -201853 8456975
37548 8456975 12744534 10325067 2536235 -6649539 -13544196 -16899043 -16897031 -13241785 -6118365
37539 -6118365 1715248 6477134 7284811 6411952 5678260 5123112 5260279 7352274 10546926
37530 10546926 11904799 10655378 9503047 10154498 10544582 8510672 5335838 3077109
37522 3077109 858388 -3092656 -7368677 -8510988 -5586591 -1091598 2660663 6188371
37514 6188371 11341019 17725577 21233580 17482588 7743205 -502927 -1568130 1574167
37506 1574167 2093856 -776139 -1877013 897002 4437752 7325478 11045614 12716498
37498 12716498 5602033 -8805042 -17666313 -12243983 214182 6766182 4717731 -31017
37490 -31017 -4288368 -8198098 -9478123 -6761685 -5145189 -8852905 -11857032 -6392625
37482 -6392625 2077969 680237 -10812078 -18397719 -13974135 -5180035 -1890939 -3641137
37474 -3641137 -4870838 -3488840 261774 5587831 8477664 5365224 1763042 7238395
37466 7238395 18658588 20329038 6630245 -7540412 -7493655 1032095 3178797 -2585019
37458 -2585019 -5953806 -2601332 2340899 5319477 7329859 7737504 5233009 3442873
37450 3442873 6494031 10793720 10127733 6785765 8025650 13136326 14235449 9445177
37442 9445177 5165668 4694005 4177484 1188638 -1488247 -2186811 -2486985 -1927376 1497654
37433 1497654 4811564 2316783 -4831448 -9859873 -11664757 -15143152 -19235347 -15869739
37425 -15869739 -4010482 6264609 8396442 7693415 9612245 10086662 4701861 -1847620
37417 -1847620 -3871358 -4500781 -8764895 -13460795 -12645647 -7690562 -3575526 -475181
37409 -475181 2657095 1582100 -6692543 -15161430 -14431159 -6211077 27421 1301685
37401 1301685 2503717 5244204 5194237 858819 -3387786 -4044305 -1827466 1658806 4670625
37392 4670625 3883138 -1394435 -5073627 -1254232 6329723 9234170 6735468 4815639
37384 4815639 4328540 172421 -7591497 -11891095 -9533164 -4765994 -393287 5040592
37376 5040592 9023065 4673664 -6920873 -13693945 -8109351 2148081 5314813 505489
37368 505489 -5130009 -8188123 -10444606 -12361383 -12029114 -8783121 -3510046 2460571
37360 2460571 6103097 4231501 -906419 -2527001 747631 1589559 -4633737 -11005161
37352 -11005161 -8246077 1541062 7694037 5231653 -597102 -3137676 -1769430 -63378
37344 -63378 -614762 -2701366 -3532030 -2065932 -1342652 -4362767 -8108238 -6603252 -476167
37335 -476167 2845125 192944 -3256349 -3638558 -3917506 -5608201 -4122713 1386963 2969324
37326 2969324 -2783355 -5567494 3069720 12939038 8251155 -7561670 -15887635 -10174821
37318 -10174821 -2929707 -3765726 -6413768 -3407953 60050 -3788001 -10810433 -10623820
37310 -10623820 -1919022 6309068 6819971 1576187 -2068868 750695 7866799 12436031
37302 12436031 10869670 6955162 5072002 2332574 -6092463 -15886010 -16864769 -8047987
37294 -8047987 -199581 -622794 -4133733 -3168137 1336315 4404190 5181743 4692372 1541829
37285 1541829 -3918411 -6377277 -2930079 664438 -2532474 -10306427 -14380700 -11058981
37277 -11058981 -3593989 3222374 6028739 3612365 -592748 -241918 4874873 5966282
37269 5966282 -2494289 -12300538 -11413020 -965114 6995149 7124757 5820396 7806966
37261 7806966 8242994 2492912 -4694338 -6169321 -3133953 -2335096 -5639651 -8651352
37253 -8651352 -8421075 -6806691 -5710440 -3750772 301046 3918285 3525939 -353397
37245 -353397 -3213999 -1932783 1907434 4776251 5678001 6447370 8479963 10900971 11908002
37236 11908002 10681503 8016969 6063364 7093750 11361718 16457604 19684478 20223470
37228 20223470 17967829 12167440 3725610 -2826190 -3373653 187300 2108314 700365
37220 700365 242139 3957572 8701701 8855796 3443772 -2722462 -4459903 -1947872 -776171
37211 -776171 -5286278 -12179930 -13980368 -9733427 -7121499 -10804101 -14916309 -13257560
37203 -13257560 -10698580 -15065797 -22319796 -21716650 -13661238 -9361226 -12414501 -14367762
37195 -14367762 -10938376 -8466851 -9574974 -6878340 1601238 4688471 -4098642 -13206534
37187 -13206534 -9625581 1443498 6523029 4602469 3755497 4185894 10155 -6604287
37179 -6604287 -8158720 -5898751 -6943479 -9630489 -6202974 1333235 3209000 -177180
37171 -177180 2093458 11722260 16469122 9755300 1046018 339850 4243051 4575588 795303
37162 795303 -3321449 -7007744 -9910425 -9395525 -6096285 -5359533 -8509011 -9954595 -7323682
37153 -7323682 -6189110 -9502217 -10913378 -5228217 2267184 4310808 2821881 4014553
37145 4014553 8030390 10767776 11137183 9770551 5419121 -807922 -2772781 2176488
37137 2176488 7080319 5150766 774467 2519770 9319158 12555326 9111482 3529795
37129 3529795 -948341 -4719230 -6022278 -1444239 6860557 11472128 8738574 2442154
37121 2442154 -2077021 -2910543 -888983 1507888 802082 -3780941 -8012472 -7884529 -5334433
37112 -5334433 -4361171 -4096147 -1681847 341571 -2926984 -9148644 -10167465 -3983761
37104 -3983761 1990926 1569535 -2806230 -5660442 -5509324 -3421129 51461 3074979
37096 3074979 2169350 -2744756 -6432839 -4701732 338926 4048300 5021867 4215289 1726979
37087 1726979 -1847694 -3589836 -1855467 312423 -400074 -1299794 3154283 11992661
37079 11992661 16760119 11884902 1935118 -4672479 -6194158 -7242554 -9214618 -6931926
37071 -6931926 2753425 13407267 14998379 6273744 -3426714 -5368718 -657094 3365803
37063 3365803 2820018 560925 1160677 5310403 9438406 9666704 5685970 622537 -2977132
37054 -2977132 -5957784 -10202498 -14743686 -16587872 -14984771 -12445914 -11459481 -12007868
37046 -12007868 -11870079 -7945606 710613 8909931 8192326 -1443288 -6965115 2058154
37038 2058154 15918080 14478822 -4691434 -20874910 -17875580 -4505854 1495514 -1028973
37030 -1028973 -152082 7151591 11425083 7507431 1571903 -432268 -851038 -3516834
37022 -3516834 -6688539 -6530215 -2659639 2156802 4347647 1172345 -6219676 -11828092
37014 -11828092 -10892821 -5959420 -3005033 -3657201 -5669095 -7764846 -8237788 -2891021
37006 -2891021 7817271 13665123 6715398 -4585148 -5228372 3953752 7334583 -1190406
36998 -1190406 -9754463 -8544259 -3631586 -3396165 -4435571 -1178623 1493422 -2758045
36990 -2758045 -8466844 -6869825 -1730594 -3461131 -10948613 -12569669 -4688417 3157891
36982 3157891 3233120 -779596 -2285185 -1200749 -659057 -805767 -368623 -132093 -1172024
36973 -1172024 -2489291 -2837436 -2417947 -1156801 1974732 6163881 7682921 3785070
36965 3785070 -3376755 -8209229 -7028786 -1838626 1352092 -1005370 -5259637 -4603633
36957 -4603633 1498033 5434066 1277565 -6997155 -10795136 -7737859 -2990395 -1630112
36949 -1630112 -4054628 -7773055 -9589889 -6903363 -710465 3671314 2626985 -513761
36941 -513761 -522588 1417556 289336 -2950644 -1349447 6900118 13863843 11649825 2248543
36932 2248543 -5643217 -6415136 -1526272 3626102 4582305 1658746 240588 4965711
36924 4965711 12998418 16186615 10628683 514882 -8272036 -13765202 -15460434 -11602983
36916 -11602983 -2799751 5411897 7919530 5819683 3723974 3737606 5080660 6780166
36908 6780166 7226241 3999007 -1754366 -3633653 2382876 10936555 13483023 9760892
36900 9760892 6769438 7215347 6415176 1899191 -1257212 1836702 8475906 12777290
36892 12777290 13148468 11314632 7931693 3800173 2015078 3644487 3866826 -1896646
36884 -1896646 -9864218 -12224585 -8797115 -7417841 -11771024 -15866286 -13639415 -7964982
36876 -7964982 -5453379 -6777643 -7808260 -7677848 -9572424 -13815370 -15442548 -10268904
36868 -10268904 -375903 7910018 10003591 6518325 1902604 -316570 -1435966 -5565480
36860 -5565480 -13066414 -18692867 -18558288 -15986493 -16406467 -18748538 -17419571 -11870519
36852 -11870519 -7722764 -7436083 -6526819 -2149799 494034 -4543294 -14099787 -19127146
36844 -19127146 -16048670 -9670479 -5379875 -3507613 -2374781 -2727356 -6582062 -13356593
36836 -13356593 -19094816 -19543498 -13992466 -6560994 -3021158 -5144097 -8618439 -7797956
36828 -7797956 -2047158 4012536 6170581 4885632 3751840 5101944 7734112 8470399
36820 8470399 5703411 1381946 -1053183 -876678 -1181568 -5005477 -11225881 -15391773
36812 -15391773 -14295391 -9077008 -4191335 -3564046 -6952470 -9795794 -7707005 -1461042
36804 -1461042 3700136 4027919 954120 -1578160 -1409233 1117445 4491766 6527321
36796 6527321 5409652 2050347 -143631 527876 1760872 869703 -1211228 -1833562 -931908
36787 -931908 -779272 -2421599 -4715149 -6162861 -5688136 -2509491 2681477 7255619 9255184
36778 9255184 9532385 9607426 8866690 6095845 2487125 688614 1738391 4858179 9020672
36769 9020672 12818957 14363388 13272376 10976071 7483996 924763 -7416699 -11791184
36761 -11791184 -9676924 -6570099 -7694067 -8989710 -3644323 5338097 7928900 1684158
36753 1684158 -5220159 -6177977 -2873295 1488950 6719582 10662145 8475217 1157089
36745 1157089 -3048232 -473388 2325766 -90613 -3186694 -1850576 -796654 -6334647
36737 -6334647 -13850590 -14241110 -9083601 -8132993 -13147673 -15371481 -9990592 -2881113
36729 -2881113 -300739 -622578 -89611 370980 -1669060 -5574829 -9822345 -13931973 -15425895
36720 -15425895 -10279063 75223 7437732 6724929 2359445 252314 -1500071 -7520427
36712 -7520427 -14611799 -14448777 -6068957 1805792 2337528 -1667426 -4117148 -4569163 -6634820
36703 -6634820 -10579951 -12502915 -10560644 -7956993 -8105893 -9136694 -5776560 3514551
36695 3514551 13483334 17513801 15201456 12684830 15142094 20582819 22455771 17791553
36687 17791553 11021627 8887334 12418794 15631033 12893937 6189076 2861436 6311115
36679 6311115 11728525 12420504 7728887 2111912 -1464080 -3503454 -4538206 -4105959
36671 -4105959 -3300200 -4064982 -5163085 -3281546 458435 175830 -5712590 -10189484 -7062618
36662 -7062618 -471086 1125434 -2615084 -4961788 -4217160 -6026186 -12047064 -14871038
36654 -14871038 -8799199 911387 5475033 4376312 3088184 2552002 -1195464 -7948149
36646 -7948149 -11609089 -8872116 -3616678 -820275 -1144404 -3268913 -6339892 -7668053
36638 -7668053 -3281479 5602844 11154903 8170975 985573 -3161135 -3924767 -5833579
36630 -5833579 -9672860 -12030689 -11489553 -9172871 -4670267 2007011 5499478 -208511
36622 -208511 -11580736 -17563516 -13654698 -6890748 -4551347 -5441176 -6023822 -7502990
36614 -7502990 -10983274 -11893179 -6276758 1684347 5179990 4311303 3626990 3525802 1359961
36605 1359961 -1448141 -1262377 -55625 -3684884 -12242793 -18976693 -19385755 -15284479
36597 -15284479 -9521250 -3011745 2242464 3494778 1905888 1275339 1467924 -796753
36589 -796753 -4108115 -2705492 3566473 7261309 4369628 119142 -253348 348584 -2892054
36580 -2892054 -8068123 -9739115 -6405199 -5592 7655525 13369098 12265672 4576287
36572 4576287 -1630807 -187342 4548756 4536929 -374124 -4164411 -4687286 -5112288 -7427657
36563 -7427657 -10810214 -14790949 -18483620 -18784341 -14740706 -10883273 -10377911 -8539779
36555 -8539779 -498989 8293717 8467443 1575016 -1449170 3692364 9979964 11052143
36547 11052143 8191016 3881700 -1931332 -6699197 -5714355 -739712 937210 -765534
36539 -765534 2922019 13885781 20540104 14410914 3776160 1354151 6012380 7323487
36531 7323487 2689728 -1543866 -2915607 -5368983 -9509625 -10495040 -6963029 -3990396
36523 -3990396 -5426516 -9583940 -13433227 -15024762 -11384624 -889307 10892395 14522375
36515 14522375 8400705 1366515 878105 4152822 4542466 1508755 -633724 -309809
36507 -309809 452709 1166667 3845399 8602495 12062331 11375785 7601923 3897478 1723809
36498 1723809 80692 -2199315 -4762580 -6580725 -7553261 -8503083 -9885370 -11072832
36490 -11072832 -10616736 -6893759 456117 8787055 13539112 12780151 9184529 5365981
36482 5365981 -219073 -8449624 -13035832 -6198153 8513786 17052433 12106876 2627340
36474 2627340 972052 6531544 8949595 3285582 -5787307 -12583737 -15594474 -14694847
36466 -14694847 -9848646 -3127764 2850876 8275733 13655976 15663574 11214600 4498441
36458 4498441 3220004 7798382 10933659 8625625 4873227 3797774 3817345 2613164
36450 2613164 2028704 4061617 6330871 5635852 3129212 2334172 3737033 4098073 507481
36441 507481 -5850782 -9409989 -4759855 6501099 15349552 15282814 10468215 8950783
36433 8950783 10252448 7465200 826073 -671962 6166995 12154397 9267822 2910221
36425 2910221 3035737 8625165 10014617 4388798 26232 3755901 10869003 11381187
36417 11381187 3304209 -4708968 -4655653 168273 -176196 -7710618 -13076684 -9646486
36409 -9646486 -3736651 -3452479 -4095828 3437585 13683566 11557826 -2906835 -11402790
36401 -11402790 -4393000 4861033 2777485 -3294281 -305898 6485845 2797220 -8798774
36393 -8798774 -11776325 -2426525 4744371 402674 -7275863 -8531434 -6123860 -6345288
36385 -6345288 -7194523 -4153382 -62544 -717938 -5030410 -6498458 -2278381 3723829
36377 3723829 5382458 -41405 -8814998 -13109640 -9802086 -5758003 -8821579 -14964432
36369 -14964432 -12871310 -1779541 5616866 1661284 -5320302 -5178557 -1579704 -3761692
36361 -3761692 -9433894 -7765221 3065429 12567578 12906606 7838634 4396885 3567264
36353 3567264 3070768 3349108 5800092 8545933 8484703 5754849 2751309 347093 -1481506
36344 -1481506 -810459 3817291 8089408 4475024 -6926248 -14387583 -6905030 11032823
36336 11032823 23110596 20280728 10196466 5207074 7180262 9476781 9227474 9981602
36328 9981602 13507265 16391899 16108564 14833412 15096242 15812626 14826031 12158136 8679287
36319 8679287 4159777 -1278464 -5499113 -5964195 -2485013 2221042 4649434 4025690
36311 4025690 3912563 8071051 14014879 14559564 7960060 1580083 1382020 3131139 268690
36302 268690 -4780801 -5831827 -5072041 -8880869 -13867404 -9958397 2014180 9099273
36294 9099273 5724874 1371921 3467631 5396253 -425971 -8836695 -11270684 -9640886
36286 -9640886 -10203594 -11261975 -8351991 -5310072 -7945631 -11301740 -5957666 5436036
36278 5436036 10282408 4134133 -4420962 -7199464 -4605357 164203 5276793 7261645
36270 7261645 2731866 -5140607 -9332218 -8749765 -7911677 -7681060 -5501697 -4281336 -9895408
36261 -9895408 -18597623 -18801157 -8758527 -917077 -3726702 -10052992 -9862814 -4090756
36253 -4090756 1449898 6308941 11141747 11986328 7990685 6806469 12331702 14913927
36245 14913927 5472276 -7442058 -8480797 1163480 6418466 2677621 1491560 9582066
36237 9582066 17099451 13051174 1010794 -7956797 -9614500 -6730487 -1714051 3826457
36229 3826457 6874528 6334301 5021766 4207709 689252 -6563570 -11985137 -10667401
36221 -10667401 -5393875 -1286234 1886080 6360242 9966560 9625697 7336820 5964335
36213 5964335 3189954 -2557569 -4486192 3889051 14912402 13947230 1363182 -5097968
36205 -5097968 5578306 22272075 27514008 19641028 10145527 5576286 2801171 -894630
36197 -894630 -3814698 -6130758 -10865663 -16443026 -16016693 -7795421 299462 1087329 -1468874
36188 -1468874 1847437 11898722 19931333 19651457 14336213 9935360 6734393 2356133
36180 2356133 -1001639 954425 6072892 7097402 3075169 2079603 8493336 14433412
36172 14433412 10622069 517411 -5190738 -4836938 -6077946 -10814323 -11552970 -5604065
36164 -5604065 -1790787 -7037476 -15238768 -16947266 -13077808 -10649652 -10253236 -6828264
36156 -6828264 48418 5078569 5314686 2790600 203140 -751389 1322193 4868069
36148 4868069 4790623 -316872 -4076430 -1458958 2526478 878645 -3391518 -3047146 -594238
36139 -594238 -4657087 -13998501 -17786830 -12587103 -6826081 -6103308 -6193815 -4345511 -5399947
36130 -5399947 -10884038 -13086513 -7364077 -824236 -635081 -2085650 2627829 10587381
36122 10587381 12951293 8873809 5140989 4758923 4518726 2555789 1066560 1845868
36114 1845868 4340874 7467109 9673588 9019703 6341306 5499088 7417659 7715908 3744390
36105 3744390 -543039 -882328 962840 1863050 3138074 5989954 6166113 100710 -7522367
36096 -7522367 -9445421 -6107678 -3564792 -3877298 -4250337 -3554704 -3310109 -3750536 -4203975
36087 -4203975 -5408018 -7064449 -6386689 -3538680 -3827643 -9015733 -11971323 -6833237
36079 -6833237 1240396 4630937 5655820 10405938 15409814 12406464 3327972 -1762005
36071 -1762005 -142820 2109078 3047160 6523337 10611349 7470991 -2661310 -9121414
36063 -9121414 -5905473 1156035 5219135 6221614 5042012 554723 -3808469 -986059
36055 -986059 8013522 13301304 11022980 8624039 10785408 11442289 5817557 -803418
36047 -803418 -3615236 -6778608 -12944746 -14866222 -7632526 89036 -1544854 -7731621
36039 -7731621 -7580099 -1826413 744823 -740440 -465041 424105 -4363228 -11813717 -10932793
36030 -10932793 48645 10323682 13020307 13273064 15682547 15001540 6243533 -4474717
36022 -4474717 -7437698 -2642529 1696506 865886 -2436653 -4019964 -2371876 2379912
36014 2379912 8793803 13054723 11536576 5624956 1247972 2216578 6027088 7695667
36006 7695667 5799696 2468915 -939983 -4359260 -5452092 -582656 8292172 12471633
35998 12471633 6926775 -1674411 -3483953 420155 237736 -6747405 -11694617 -8286373
35990 -8286373 -2775167 -4262052 -10977622 -13145996 -6388313 3829471 9744844 8664885
35982 8664885 3508842 -794693 -1924584 -2405928 -5436960 -8528965 -5855290 1951867
35974 1951867 6517726 3375463 -1460600 -1359657 712892 -1524399 -6443895 -7751572
35966 -7751572 -5430177 -4548130 -4864555 -851791 7392367 11785549 7361759 -907342
35958 -907342 -5587655 -5901916 -5811368 -6874483 -7194477 -5840425 -4731125 -5605360 -6826427
35949 -6826427 -4760626 1087185 5677688 3652778 -3334351 -7930169 -6403957 -2598617
35941 -2598617 -973144 -460104 1541109 3502926 2662733 391770 25272 1607119 2825342
35932 2825342 2920340 2059520 -433449 -3601952 -3931473 -886932 466162 -2991650 -6564401
35923 -6564401 -5095382 -1759793 -2433027 -5124195 -3326989 2721781 6873667 7414498
35915 7414498 7455917 5980914 -1428919 -11951648 -15478722 -8221088 1776145 5970361
35907 5970361 4838768 2692240 223282 -3138855 -5230399 -4540228 -3679789 -5474276
35899 -5474276 -8721865 -10708595 -10757715 -9061092 -5438006 -1235177 1064557 1702285 3196020
35890 3196020 4723394 1847849 -5747215 -10884484 -6636275 5505941 17423442 21586207
35882 21586207 15572879 3461823 -5862561 -6012448 -320706 2170811 -1453291 -5521532
35874 -5521532 -5940872 -5630618 -7074280 -7111212 -4146614 -3656798 -9627552 -15724610 -13030886
35865 -13030886 -3652603 1441996 -2570829 -8592913 -7732612 193665 7957445 9200593
35857 9200593 4008261 -1750792 -2128042 2653818 6383359 4551551 2229 -1439689
35849 -1439689 862046 1987367 -1325823 -6351359 -7873664 -4099779 1543009 3757018
35841 3757018 621067 -4276884 -5821139 -3476866 -1592150 -3226660 -6201068 -6600174
35833 -6600174 -3895539 -751988 537502 -275009 -1871509 -2196236 -157245 2706592
35825 2706592 3994133 4239994 6218308 9638815 9988273 4626301 -3052191 -8004210
35817 -8004210 -9359449 -9155547 -7917804 -5038497 -1946374 -1278133 -3262121 -5526470
35809 -5526470 -6324598 -6127137 -6386860 -8045790 -10515314 -11081436 -6722415 1852790 9138252
35800 9138252 9729248 3965869 -2484918 -4364473 -1493061 1801462 1519370 -1550899
35792 -1550899 -2864108 -323789 2212793 -191323 -6679885 -11735637 -12094866 -8879031
35784 -8879031 -3835840 1878244 5414156 4058934 302338 68863 4462590 8005608
35776 8005608 6539037 1945228 -2529205 -6168614 -7964369 -5909007 -2183910 -3120737
35768 -3120737 -10067022 -15902356 -15058879 -11312164 -10249460 -9659877 -4538761 2508870
35760 2508870 3945752 -1410395 -6978437 -7813503 -5411316 -3070954 -1574172 -272024
35752 -272024 903928 1089341 -1116899 -5420030 -7401877 -2419671 6350913 9554747
35744 9554747 4765255 1108647 5232653 10105920 6408312 -1414473 -1938876 4352700
35736 4352700 5920423 -946816 -6946196 -5094557 759915 5890494 11514786 16737392
35728 16737392 14773256 4564217 -2964135 1021079 9743202 10355746 1903204 -5325037
35720 -5325037 -4786292 1033978 7990895 13622948 13785154 5277365 -6519401 -10723686
35712 -10723686 -4734465 1705780 -157850 -6754557 -9023400 -5447169 -1725159 -515818
35704 -515818 905255 3072485 1890424 -3803239 -8283604 -6698257 -2419387 -1665310
35696 -1665310 -3952557 -3899296 -911703 -218719 -3621260 -5788233 -2430837 3144283 5258853
35687 5258853 3498007 1123124 -841935 -3502680 -6287990 -7645023 -8344610 -10303110
35679 -10303110 -12885428 -13643277 -12034054 -9414523 -5975921 -645523 6049380 11310977
35671 11310977 12535145 9624301 5516532 4391166 7186331 8999424 4684546 -2540964
35663 -2540964 -3466442 4257876 11998674 12539997 9766492 10184933 11513276 8108398 2661209
35654 2661209 2364846 6086985 5713771 -412719 -5251670 -4737597 -2329217 -559742 2826694
35645 2826694 7832839 9675741 6552880 2795291 1315255 -218166 -2786297 -2599901
35637 -2599901 2246475 7918074 10813433 11548437 10715166 7423443 4279860 5929974
35629 5929974 9824141 7405319 -1578175 -5985134 -324982 5663993 2853123 -2002872
35621 -2002872 1930706 10881887 13135704 8737508 7793799 11801755 11830078 5686602 2292901
35612 2292901 5861563 9013410 6629555 4388438 6716145 7304451 732137 -5488638
35604 -5488638 -1617115 7512183 8524171 -139830 -5937188 -1208066 6507417 7091775
35596 7091775 1766060 -2100480 -3740060 -8063246 -14420485 -14911977 -5621116 6607767
35588 6607767 11961775 8481289 1843397 -2681170 -4088739 -3241641 -1114060 412840
35580 412840 -503874 -3062184 -4514162 -3973410 -3380262 -4287851 -5693391 -5398755 -1982942
35571 -1982942 4033591 9111235 8336737 1492810 -4018344 -1104491 6907950 9968694
35563 9968694 5361696 1060737 2992151 6517347 5183583 1242150 730633 2762100
35555 2762100 1374654 -4245635 -8557306 -8025388 -4780480 -2092439 -1190240 -2399618
35547 -2399618 -4872338 -5390049 -1683732 3460092 5530350 4857321 5115887 6091842 3762331
35538 3762331 -1859381 -4779855 -984589 6195700 10993271 11839468 10823734 9588018
35530 9588018 8240158 6435853 3711941 -5705 -3451425 -5044413 -5183139 -5879849
35522 -5879849 -7995637 -10382976 -11496504 -10421679 -7249917 -3975602 -3237516 -4231754
35514 -4231754 -2733418 1799540 2918949 -4008028 -13148597 -15032173 -9416133 -3556513
35506 -3556513 180129 5145683 9335973 5182088 -6600056 -14156493 -11012003 -5488168
35498 -5488168 -6638595 -10108827 -7193233 -268235 1958590 -283074 1078589 7735352
35490 7735352 12741442 12277550 10000327 8756647 6630871 2955583 619613 228419
35482 228419 -1408392 -4865164 -6274395 -3992421 -1369379 -779119 -329417 1427673 2824259
35473 2824259 3118826 3908509 4643126 2458285 -1405868 -1336329 3550941 6497314 3186019
35464 3186019 -1491813 -1416973 1969013 4221251 5495145 7320858 7114027 3257297 1196712
35455 1196712 6280833 13860090 15125359 10396934 7586418 8984398 9241021 6241256
35447 6241256 3977591 3427700 670495 -3352646 -1433633 7111395 11931026 6210423
35439 6210423 -2671382 -4542053 -1234199 -1415441 -6614486 -12017492 -16780179 -23057871
35431 -23057871 -27216566 -22887913 -12599842 -6138698 -6055647 -4514456 2893925 9678131
35423 9678131 9190079 4536758 1911335 736713 -2803196 -7378408 -8725036 -7015174
35415 -7015174 -5444772 -3746357 567601 5943052 7880030 5744986 3051235 1326334
35407 1326334 -881450 -2905948 -1562516 3201515 7476725 9552163 11793998 14630577
35399 14630577 14198850 9172531 4891602 6075480 9153481 7270010 809958 -2651600
35391 -2651600 1434171 9038930 12654052 8407949 -2010194 -12834688 -17103391 -11791780
35383 -11791780 -1434271 6190853 8765248 10487287 13655197 14136495 8542331 1635050
35375 1635050 951842 5906910 8537707 5663827 4090729 10207611 18798027 18045826
35367 18045826 5090785 -8800127 -11124668 -3017147 2811322 -1668980 -10166550 -11015030
35359 -11015030 -2459320 5575845 4356907 -3863261 -10468380 -10778700 -6725581 -2214874
35351 -2214874 352670 431811 -334333 998970 4754641 7156801 5823801 4312660 6439483
35342 6439483 8270584 2820794 -7290962 -9990618 295265 13627876 16435506 7540229
35334 7540229 -2836830 -6132270 -1892937 5829645 12322955 13574795 9097289 3333186
35326 3333186 851627 1414928 2921415 6149338 11345597 12906522 4871446 -8659733
35318 -8659733 -15860075 -11234257 -1233452 5536985 7360283 6412992 3281268 -1274026
35310 -1274026 -3781985 -1884911 2160954 5017960 6190447 5583409 1163166 -6684299
35302 -6684299 -11659765 -7626740 2998484 11056456 10315672 2522649 -5869229 -8915784
35294 -8915784 -4464451 4151084 9904466 8257160 1566611 -4039438 -4896053 -1377263
35286 -1377263 4407895 9655179 11402615 9174765 5916038 3897978 1853650 -901458
35278 -901458 -757199 4614452 9281101 4587206 -8171847 -17396074 -15558408 -8072907
35270 -8072907 -4554825 -6216900 -6625539 -1921172 4846513 8931498 9585842 9780166 11907443
35261 11907443 14298628 12273218 4019013 -4909394 -6031324 2145973 11992227 16191797
35253 16191797 15370877 13460417 10129947 3520422 -2555782 -1747618 4545645 7302253
35245 7302253 2380338 -3418917 -2156726 4863066 11038303 14165506 16301085 16915770
35237 16915770 12949721 5189952 -1204089 -3231770 -2643289 -1622633 -402710 171539
35229 171539 -1523408 -4040390 -3257002 1558013 6229026 8157884 9920099 13820682
35221 13820682 17260559 16865384 13268782 8287417 1625304 -5227469 -6374945 857487
35213 857487 8796199 7267020 -2620781 -9724922 -7939298 -2733938 -832597 -170389
35205 -170389 5494940 15900501 23115387 20695185 11519241 5532758 9353280 18558685
35197 18558685 22469247 16989863 8818755 4984971 3601469 -270521 -4785869 -4607673
35189 -4607673 -404802 3171537 6382273 12192773 17086565 14513832 7123149 4484265
35181 4484265 7776139 8548001 4773129 4980761 11870311 15393317 9626128 3791239
35173 3791239 6679386 11628386 8780288 2150367 803704 1351349 -5252436 -15097095
35165 -15097095 -15918005 -7693308 -2632144 -5038252 -6730800 -3917343 -3269490 -7384700
35157 -7384700 -8426845 -2172168 3823391 2889701 -477835 -159634 1232666 -666460
35149 -666460 -2856832 -1184084 987289 -1306395 -5308460 -5167554 -1596206 674991
35141 674991 1382427 3275331 5389900 5140917 4415908 6049894 6393898 -393191 -11318017
35132 -11318017 -16096570 -11013479 -4077397 -3826911 -8974479 -12736644 -12806220 -12283163 -12947054
35123 -12947054 -12412523 -8488725 -3255273 -816693 -1954067 -3102484 -1255732 1870229
35115 1870229 2275124 -1031711 -5770441 -10653083 -16287998 -21260258 -21095548 -13261545
35107 -13261545 -818343 10626379 17432724 18305309 13581935 6789538 4046297 8078095
35099 8078095 13812726 13065165 3621844 -8124220 -13381275 -8870651 527622 6192645
35091 6192645 3992963 -1464234 -2544564 1568458 4187452 1204382 -2793870 -1738976
35083 -1738976 2621465 3792572 807797 -309108 4472081 11597162 14917272 12911785
35075 12911785 8942768 6457133 6040608 6334689 6033822 4529592 1363827 -3649997
35067 -3649997 -8845267 -10300803 -5517066 2097319 5173533 577717 -6372166 -8025361
35059 -8025361 -3167742 2674060 4404527 1983393 -1672449 -4464045 -5982706 -6534571
35051 -6534571 -6552889 -6391414 -6022235 -4879844 -2021074 3063647 8793449 10955145 5908239
35042 5908239 -4606241 -13469511 -14589084 -8540493 -868682 3968288 5518158 5377127
35034 5377127 4546791 3018019 766173 -1428238 -2157828 -695753 1932953 3913602
35026 3913602 4612395 4508825 3178082 -1028055 -8439003 -16139031 -19411247 -15221351
35018 -15221351 -5131040 4419456 6378554 109057 -6824307 -6948129 -2203327 -889828
35010 -889828 -5306331 -7843200 -1793668 8678175 13573902 9216936 938462 -4902013
35002 -4902013 -7058186 -7315238 -5996972 -1620869 6013254 13908955 17860878 16590512
34994 16590512 12947389 9890088 6572192 771885 -5884436 -8805873 -6710550 -3373659
34986 -3373659 -2425860 -3927113 -6707681 -9963696 -11450174 -8682958 -3696560 -1959126
34978 -1959126 -4545888 -6515455 -5439006 -5286548 -7911056 -7485678 273350 9218797
34970 9218797 11048084 7781940 6567796 5359708 -4529209 -21229857 -29648488 -20855178
34962 -20855178 -5102967 1475382 -2742918 -5618919 333963 8261535 7219754 -2987090
34954 -2987090 -10977306 -6883220 6529841 17271981 17327767 9709741 2299865 -1284751
34946 -1284751 -2083674 -740970 3013317 7257055 9195412 9589578 11736688 15782414
34938 15782414 17879332 15438612 9732600 3135377 -2463531 -4423171 -1005869 4825349
34930 4825349 7564058 6360021 5882492 8826200 12547521 15289386 20094949 28151622
34922 28151622 32772790 26210887 10800794 -2157304 -4499951 1952431 10385530 16300432
34914 16300432 18762623 18318872 16233243 13916819 11218121 6636796 763998 -2129664
34906 -2129664 1535226 9275337 14389305 13833316 11617724 12658227 15735990 15892158
34898 15892158 12505949 10359071 11736437 12060326 6604724 -1546464 -4679747 -581143
34890 -581143 4694044 4655077 -366423 -5081916 -5891291 -3744334 -1562279 -729148 -360820
34881 -360820 909819 3211101 5469333 6330664 4600935 35860 -4963995 -6020452
34873 -6020452 -1923499 1932635 -799949 -8459658 -12841122 -10564862 -7392537 -8590574
34865 -8590574 -10879655 -8830446 -4408996 -3549677 -5971317 -5355390 928624 8099589
34857 8099589 10349901 6766474 965394 -1885739 1099248 6301764 5659747 -2618401
34849 -2618401 -8657143 -2715463 10239291 16043750 10521288 4032244 5785541 12824419
34841 12824419 17765619 18918570 17641296 12717897 3894674 -3479666 -3527376 2837426
34833 2837426 9941071 14118056 14719897 11385345 4903454 -807953 -1682311 1752565
34825 1752565 4812204 3462775 -1991284 -6780371 -5534874 1345187 6232762 3212104
34817 3212104 -2702661 -1351651 7815829 14616760 13417210 10718824 13314218 17381245
34809 17381245 15801738 9246187 2560272 -3741707 -10067020 -11228304 -3132154 7342108
34801 7342108 9136637 2160732 -3652882 -3425623 -1780450 -2048039 -1207841 1910888 2597992
34792 2597992 -1192179 -3481547 1443765 10406162 15483525 13034001 5153227 -4119449
34784 -4119449 -10572985 -11055434 -6494762 -1687588 156203 526346 2059466 5015802
34776 5015802 8621505 12172793 13183436 8838957 1719229 -683830 4220548 9264480
34768 9264480 7211837 1464063 1095241 7561458 13039121 11747749 6827598 4602166
34760 4602166 6797681 10532840 12579800 11551065 8277836 5645829 6144810 8566990
34752 8566990 9130031 6422027 2533656 -1395818 -6882696 -13112798 -14302249 -6591890
34744 -6591890 4635900 9691301 6533625 2650448 4135279 8248077 9521649 8332539
34736 8332539 8557065 9789015 7833029 2193609 -2590089 -3941833 -4567639 -6842336
34728 -6842336 -8309457 -5885907 -1272517 1481868 1724575 1889697 2716573 2298134 -524226
34719 -524226 -4754487 -8949719 -11637471 -10415751 -3874660 5007872 10226597 8756845
34711 8756845 3424910 -853212 -1729818 186433 2897280 3321566 -1584500 -11173618
34703 -11173618 -19508005 -20342728 -14161840 -8047765 -7439721 -9719470 -7932175 -112319
34695 -112319 7847780 9755900 7264800 7578285 13532667 19376492 17980165 9781140
34687 9781140 1948053 -153990 2178719 4447661 4349443 2585918 379602 -1774225
34679 -1774225 -3356203 -3383994 -1157700 3093240 8506463 14092688 18593706 20259980
34671 20259980 17845913 12403303 7267248 5128726 5482299 6117570 6557265 8073927
34663 8073927 10407725 11100672 9110178 6711781 6273280 7417158 9365435 13473412
34655 13473412 19981309 24107783 20216226 10097480 2446312 2192771 4187653 669744
34647 669744 -7603767 -11849093 -6250812 5419869 15024582 18582181 17475336 13760746
34639 13760746 8166050 2554787 416938 2776705 6106513 7123884 7910196 12569412
34631 12569412 19642829 22648449 19192168 14591115 13605417 13325204 9331525 5325090
34623 5325090 9167961 19840351 26291344 22091070 14599592 14560954 21436358 25628473
34615 25628473 22530084 16711338 12203208 6578045 -1979130 -8130268 -5956410 1121829
34607 1121829 3525886 -1768957 -7482468 -6495582 -1331199 -2269 -5140476 -10898024
34599 -10898024 -10088873 -1879340 7899776 12739521 11336017 7778974 5987468 5045746
34591 5045746 1753570 -3165989 -4999957 -2026173 1224905 25529 -4345334 -7287303
34583 -7287303 -6828425 -3504165 2611690 10010644 13225492 8076925 -1311296 -6440407
34575 -6440407 -5234470 -3016977 -2440834 449920 7653659 13488876 12161028 6439401
34567 6439401 3744216 6520907 10968403 13093168 11901693 8282907 4483134 3432708
34559 3432708 5407410 6603463 3840301 -712170 -2128657 1446606 7906104 14131321
34551 14131321 17370168 16122602 12718814 12611036 17728219 23029140 23365888 20802939
34543 20802939 20155526 19937588 14402259 3879062 -3704341 -2860043 3332858 8767980
34535 8767980 11280698 12149893 12665370 13379482 13854714 11871356 5969538 -428394 -1386543
34526 -1386543 3586526 8056659 7320931 4478468 4728463 7263278 7269055 3955635 1784299
34517 1784299 3647955 6571803 5608787 142318 -5148700 -5409551 -1276047 1019424
34509 1019424 -3994345 -14573898 -22817931 -22555204 -15120970 -6921418 -2561446 -1245628
34501 -1245628 866902 5713134 10728046 11223031 5598857 -2467244 -7785426 -8663360
34493 -8663360 -6941982 -4330185 -1010541 2698278 5839729 7945823 8409667 5135635
34485 5135635 -3070635 -12448001 -16109314 -11498082 -3444512 1711506 2517782 1276668
34477 1276668 -499568 -2300242 -2008701 2916423 11044436 16488830 14594477 7323957
34469 7323957 1585161 1940937 5923935 7637183 5403588 3477004 5274682 7884190
34461 7884190 6469761 2281447 1630544 6726294 12248399 12933725 10530662 9995091 11643573
34452 11643573 11190951 6515905 594680 -2555732 -2042504 384267 2660412 3319971
34444 3319971 1980980 305859 1235710 5705222 10793339 12803380 11932448 11837071 13983502
34435 13983502 14782065 10415878 2906308 -1732284 -969803 1951427 3545816 4074240
34427 4074240 4488419 3448653 655352 5865 4968586 12365256 15282240 11839169
34419 11839169 7034005 5647591 7088244 8109992 7244415 5011812 2256790 37118
34411 37118 -265147 1887316 5329794 7800419 7352479 4291646 2295104 5384716 12046465
34402 12046465 15003990 9870539 1605345 -1641168 927505 3228198 1780572 -1221823
34394 -1221823 -4047913 -8100609 -12776950 -13385516 -7295768 1499022 6419537 4382253
34386 4382253 -2836241 -9823337 -9931382 -1295189 8619427 9812506 2631040 -1929358
34378 -1929358 2948876 11187477 13635391 10256277 6995552 5638168 3523967 275834
34370 275834 -1677356 -1816439 -1678742 -1695722 -1997820 -4051815 -7040770 -5528420 3588328
34361 3588328 14148350 17201450 12994846 9767780 11376165 13569424 13151929 12972668
34353 12972668 15100899 16010337 12877393 9388190 10398677 14621592 17441779 18002578
34345 18002578 18427418 18203202 15013058 10496320 9619110 13491143 17608654 18693801
34337 18693801 18567058 18804230 16506492 9925731 4288209 5354010 9047347 5475311
34329 5475311 -5864770 -13211187 -8659815 344241 1968631 -3454455 -6076012 -1925356
34321 -1925356 3764012 7188357 10168754 12894198 11893170 8021612 7970084 13693000
34313 13693000 17795257 14419060 8198527 6753946 9898298 12437823 12968613 13259076
34305 13259076 12418460 8401948 3192268 563246 127366 -1398702 -4350558 -5869570
34297 -5869570 -4201156 66590 4975413 6663299 1382743 -8484285 -14525676 -12447938
34289 -12447938 -7550902 -5618488 -4110706 1351828 7657003 9574962 9629050 13491711
34281 13491711 19497566 22325542 23282065 26098530 26017252 16058330 2549757 47743
34273 47743 9691157 16871639 13336883 7187232 6049459 5129484 -2042 -2427661 3410077
34264 3410077 9102052 4692933 -4724517 -7418478 -3284652 -566653 583336 6978351
34256 6978351 16889573 19761063 12715710 5395237 5392374 8709004 8437457 4921377 3124878
34247 3124878 5749436 12246986 19943037 24013693 21023123 14104042 10037849 10335986
34239 10335986 10581537 9326246 10813253 16526227 20856228 19123773 14286766 11424883
34231 11424883 10771470 11030267 14468305 22180215 27820407 23727936 12581920 6061093
34223 6061093 10503893 19075712 20595311 12753606 3808328 2611286 9149448 15220769
34215 15220769 13906524 7432468 4062900 7294731 11346523 9452566 3461961 1063174
34207 1063174 5238177 11538365 15595181 17891558 19645771 19200727 15699016 12311556
34199 12311556 11793034 11769142 8919643 5751693 8034311 16087289 23658471 26028728
34191 26028728 24631685 22360206 18883894 13338642 8181792 6843482 9228110 12282790
34183 12282790 13967205 14779140 16540953 21008703 27885531 32930670 30752101 21768693
34175 21768693 13772671 13580654 19350963 24314897 25590243 25118578 23998181 21270515
34167 21270515 17855331 16693890 18526205 21409537 24166587 26202013 24904353 18896465
34159 18896465 13506242 15968800 23958592 26556383 19723507 13070780 15988896 24136003
34151 24136003 27212772 24728890 24637982 28980243 31037828 27428811 23892774 25736989
34143 25736989 29431881 28261408 21890031 15924998 14676483 17880961 22523315 24817594
34135 24817594 22147478 16103816 12360910 14633490 19643975 21045876 17794174 15079173
34127 15079173 16297353 17964816 15538274 11682577 13761527 22740840 29842716 27749325
34119 27749325 21198176 20435348 25779153 26588513 17593076 8311651 10273903 20517945
34111 20517945 26119619 22593505 18619227 21810181 28437057 30772134 27832483 23882787
34103 23882787 21094318 19139864 19047349 22267701 27555297 32787687 37968267 42579520
34095 42579520 42746491 36603216 30640560 33794651 44892215 52683896 50164169 42493450
34087 42493450 37668846 35737294 32574195 29233570 30118464 34188956 35717713 33810764
34079 33810764 33845334 37582093 38852787 33330105 27062901 29051825 38194909 44259139
34071 44259139 41241615 33424985 27083532 22573987 18392447 17988690 26052336 39340657
34063 39340657 47495099 44705451 36284864 31175743 31316058 32004112 30658257 30486510
34055 30486510 34942885 42150721 46773501 45823560 41330184 38224378 40100336 45915050
34047 45915050 50731689 51117656 49297908 49521972 51162692 49998467 46820836 48314857
34039 48314857 55917714 60455728 54674970 46012217 47512710 58570099 65621018 62415503
34031 62415503 57968227 60679142 65965827 66842537 66945907 72895638 80728564 81682661
34023 81682661 77471615 77625322 83134015 85065973 80438187 77325528 80476676 82958159
34015 82958159 78390446 72412701 73892223 81157557 85689396 85593489 86806626 92417182
34007 92417182 98361983 100106156 97962202 94988455 93767675 95824098 100929349 106602616
33999 106602616 110506990 112562451 112677605 108915007 101819444 98238455 105117833 119878445
33991 119878445 132383935 136840006 136471049 135878035 135180762 134150736 135827270 141512296
33983 141512296 146978399 148827904 150605298 156551837 162746542 162352629 158202642 160932185
33975 160932185 172922212 183074535 182145770 175635470 174668186 180115950 184606766 186620746
33967 186620746 192169213 202632129 211008779 213034063 213586349 217889046 223504615 226168345
33959 226168345 227516248 231180498 236073300 239574747 243278592 249413977 255222576 257307419
33951 257307419 258281550 262466885 268281049 272196401 276852183 286272777 295328337 294304864
33943 294304864 283920159 275790595 276795228 282551826 287942638 293761794 299837457 301939183
33935 301939183 300258909 301394326 306517475 307168945 299375405 292214978 293648439 296570979
33927 296570979 289661383 275414641 265657723 263647216 262626875 259559867 258193936 258962116
33919 258962116 257209647 252611921 250175716 250102703 246497953 238965052 235790978 240810751
33911 240810751 245462138 240374128 228767955 221206375 220858670 221292773 217438182 211638052
33903 211638052 207309819 202137724 191852127 178529575 169817767 168616536 168367714 162789114
33895 162789114 156372698 157911655 165200125 165806777 154910552 142155812 136029816 131942430
33887 131942430 123876583 117839886 121756515 129316559 128094863 119528988 115843247 119014413
33879 119014413 118760719 112292187 109405196 113486523 113464621 102738087 92303211 94388794
33871 94388794 103837753 107616171 104779280 104471570 109235023 112724006 111884771 110356208
33863 110356208 109683826 106205508 98068307 88694563 81858475 78057380 76368463 76007626
33855 76007626 75906531 75775876 76926860 79498029 80636099 78401138 75332044 74783505
33847 74783505 75972336 76322873 76445965 78514480 81190964 80329402 74244481 65547483
33839 65547483 58579093 56615749 59564929 63064105 63009449 62154643 67176674 76873583
33831 76873583 79992759 69951169 55574902 49941692 53150839 54580972 49340564 43227304
33823 43227304 41650385 42097745 39704644 34551474 31118804 33553681 41892731 50705061
33815 50705061 52963176 47973979 42844860 42905909 44649333 42625585 38501785 36900019
33807 36900019 36850469 35241910 34681149 38731580 42629350 39134276 31470809 29252539
33799 29252539 32686200 33016747 28854208 28757298 35189671 39434057 37128348 35802690
33791 35802690 40306996 43065113 37548328 30558496 30743144 33849262 30747079 23248385
33783 23248385 20280474 23182350 26057356 27307080 30089914 33677614 34491432 34193376
33775 34193376 37354850 42265696 42830847 38318243 32751129 26606623 18584947 13660172
33767 13660172 18197421 27409661 29446745 23227516 20232999 25834542 31237002 28982966
33759 28982966 24428845 24299047 24474926 18802820 11656883 10885880 14087272 12872155
33751 12872155 6992203 3513056 4207623 4367314 3478880 6746954 14842388 21441158
33743 21441158 23207799 23837645 25296180 23335788 16328781 11283488 14563685 21382438
33735 21382438 21462930 12930023 4421989 3763708 9403481 14061757 13798331 11735412 13242253
33726 13242253 18165087 19658411 13016337 4020886 3468790 12908448 21817356 21522895
33718 21522895 15747559 12733996 12767674 10482078 5415550 2038731 1333744 551196 364680
33709 364680 3798673 8126231 7027276 2177715 2947484 11322238 17117585 13864627
33701 13864627 9991518 15738484 26368410 28734070 20108113 10060537 5851515 5891266
33693 5891266 6988565 8625999 9285144 6867729 3989238 5323852 8782953 7345640
33685 7345640 1089175 -1243287 4544850 11837141 14157990 14231210 16762076 19619157
33677 19619157 18896135 16755408 17013232 17636051 14920794 11286516 11502982 14296615 15275527
33668 15275527 15643930 19820554 25735911 25998291 19098491 11691656 8340904 6107605
33660 6107605 1712995 -2199384 -1421858 3602637 9123810 12695084 14313881 15391878
33652 15391878 17704365 21007299 21774747 17488938 11440968 8743978 8260568 4584688
33644 4584688 -1630742 -2737724 4130653 11703380 13114743 10991102 10434885 9189396
33636 9189396 2428709 -6875386 -10946498 -8724236 -6249161 -5966661 -3652723 2745770
33628 2745770 8602782 9829213 8646046 8622676 8892797 7504966 6651055 9584853 14404209
33619 14404209 15610546 11290603 5078501 1132727 311552 1462762 3506846 5360827
33611 5360827 6017755 5767508 5881055 6512166 6514165 5864029 6206388 7791461 8001538 5113836
33601 5113836 1930936 2558566 6072653 6998395 3014043 -1350480 -1091955 2102205 2922286
33592 2922286 1145330 2307481 8814106 15037652 14436775 8653879 5358865 8033547
33584 8033547 12198299 12514817 9629054 7408848 6342208 3967431 1177096 3182359
33576 3182359 11888947 20713900 21032119 12725696 4378195 2731225 5742292 7413876
33568 7413876 5790666 3426887 2713701 4288570 8345437 13582614 15494972 9800822
33560 9800822 -1536248 -10612345 -11232859 -4799869 1748511 2481387 -2720798 -8191305
33552 -8191305 -7751695 -1449844 4287206 4989161 3857488 5638276 8178189 6301037
33544 6301037 1850561 1603443 5445430 6107901 2516420 2883893 9868514 13541673 7343942
33535 7343942 1272273 7537067 20209516 23134020 14370207 7665763 9899959 12519502
33527 12519502 8851699 5236877 7766372 10283997 5250609 -2756882 -4948961 -2713278
33519 -2713278 -2942518 -3949130 1873240 13234385 19445515 15619123 8429997 4520077
33511 4520077 2133289 -1883411 -4351977 -693319 6980066 12038370 11391269 7694847
33503 7694847 5274509 6716337 11859774 17419972 18673906 13927769 6913222 3164532
33495 3164532 4356248 7337833 8451975 7818707 8947568 14043936 20303475 22516266
33487 22516266 19731517 16729421 17083932 17759056 14112388 7725207 4204528 4614809
33479 4614809 5169890 5360846 9373555 17254486 21391878 16221977 6597840 1579807
33471 1579807 3435487 7634692 10611437 11900483 10489911 5112881 -1741318 -4945660
33463 -4945660 -2860012 764553 1414409 -1933323 -6557990 -7526612 -814002 11797236
33455 11797236 22039627 22989380 16693268 10580881 8040572 7224856 7398718 9883390
33447 9883390 12804862 11945099 8123516 6778813 8136646 5393370 -3571364 -10418901
33439 -10418901 -8223744 -2393435 -2140531 -6474115 -7705779 -5086689 -4561576 -6416067
33431 -6416067 -4241125 2444420 5186488 154251 -4598718 -1378833 5144842 5584669
33423 5584669 218756 -2333064 2005917 8795936 12881129 13389495 10960604 6098133
33415 6098133 1397568 465325 3018720 4779839 3493022 1752295 2770276 6459110
33407 6459110 10830721 14399243 16046318 15096587 12550966 9980082 6849063 1761520
33399 1761520 -3495846 -4955410 -2424378 -326503 -862713 -422937 4633328 12305724
33391 12305724 18056200 20333563 19959762 17352146 13898005 12858121 14825106 15229944
33383 15229944 10685858 4707602 2151659 1369561 -1627484 -4077071 188752 9271167
33375 9271167 13883734 10510738 5640055 4933071 6248313 6157058 5189387 2935509 -3540731
33366 -3540731 -11336245 -10461877 1950887 14092072 14798902 9484481 10502483 17439519
33358 17439519 19322236 13141558 6930141 4900092 2525988 -1778015 -2342559 2725814
33350 2725814 7119278 7533649 9350882 15929819 21595011 21173116 17693805 14422421
33342 14422421 8425845 -475434 -3820475 2548352 7853437 528270 -13102663 -17266960
33334 -17266960 -10028366 -4478850 -7899949 -13262854 -12948922 -8622972 -4100841 1010086
33326 1010086 6289843 8117611 6685759 7553223 12227380 15003719 13318182 12925500
33318 12925500 17247057 19606580 13502232 4293582 2312352 8543690 15223869 17685440
33310 17685440 17576050 16139055 12656766 9825056 12966975 21457037 26703682 22320665
33302 22320665 12944460 9241841 15435024 24871642 28276453 24006532 18165337 15730491
33294 15730491 15223967 13417158 11233385 11152865 11896616 11059689 10824312 14436098 18306564
33285 18306564 15729605 8806189 7637738 15297122 22776966 22950042 20389314 21493974
33277 21493974 23803292 22962146 22260539 25657490 28086439 23778493 18967559 23730389
33269 23730389 34225018 36588098 28169783 21191126 22791853 24728706 18779796 11143693
33261 11143693 12797340 22925193 31155926 32329746 30657479 30555487 30535472 27497282
33253 27497282 22622670 20514703 23688518 29607678 34033324 36732585 41418283 49057728
33245 49057728 54858672 55148552 53771610 56483195 61497431 61955741 56500191 50601207
33237 50601207 47793459 46691541 46901423 50096742 53817059 52234843 45873353 42925145
33229 42925145 47259635 52556984 52955358 52111432 55347817 59180869 56672750 49216659
33221 49216659 44930246 47270838 52403477 56827849 60685868 63125726 60685316 52638733
33213 52638733 44188003 41949710 47649130 56893884 63065203 62777267 58834095 57180581
33205 57180581 59765450 61757494 57741129 49519702 45024767 49057249 57053129 59610902
33197 59610902 53059676 43817604 40401824 42235552 40694439 32454433 25961933 29696421
33189 29696421 38852083 41459377 35170190 28881516 28098135 28525909 26280736 24862110
33181 24862110 27543885 30975390 31927637 33668686 39528198 45609251 46192171 42214501
33173 42214501 38681778 37263010 36597301 36456853 36757017 35799806 33787762 34133450 36992403
33164 36992403 36355320 28988771 21442609 21491928 26481173 27533020 22787580 18972095
33156 18972095 20741393 25091096 26774665 24542517 21435975 21434053 25011706 26853310
33148 26853310 21204765 11056067 6781636 12506590 19781739 19510722 14174059 12146234
33140 12146234 15386485 19879097 23694099 27055714 27977984 25072626 21763623 21522057
33132 21522057 22533871 22807759 25297123 30984369 32911740 26016153 17713324 18941057
33124 18941057 28959837 38619435 43931843 45880349 41882491 30056676 18450303 16988456
33116 16988456 22661268 25329435 25058695 29294933 35520700 33515716 24680199 21616544
33108 21616544 26344567 26480457 17383803 10871172 15379723 23527918 27284970 30377212
33100 30377212 36434015 38968674 33831363 29295898 32648399 37571664 35780485 30929483
33092 30929483 29657163 28507085 21896392 14720353 14740661 19590729 23078528 27140140
33084 27140140 35004252 39323745 31341284 17515520 12961593 20486580 28804872 30176811
33076 30176811 27811580 26297864 26044375 27810738 32838969 37591958 36853718 32433922
33068 32433922 31022277 33674265 35151276 33194672 30709581 29267856 28094892 28763273
33060 28763273 32940013 36166864 32392890 24678131 22654111 28311845 32686962 28728906
33052 28728906 20103648 14636091 15077876 18835559 22058834 22375883 21438397 24549612
33044 24549612 33144337 39020919 32729648 17375573 6669280 8244339 16122747 21549348
33036 21549348 23891984 27045535 30922254 31540784 26796014 18818751 12256140 11495272
33028 11495272 17153477 24303156 26643421 23129625 18183451 15493312 14713092 14341771
33020 14341771 14255745 14357497 13566497 11544397 9878352 10802345 15261522 21583187 25603329
33011 25603329 23945564 18113398 13078247 11109257 10278103 9614110 10569395 11741875
33003 11741875 8781213 2945834 2320813 9058161 13113965 6656583 -2203004 -351472
32995 -351472 10663809 17529760 14993698 10694245 10607981 11587682 10473798 10179396 12932913
32986 12932913 15570340 15448871 14855829 16370642 18814106 19981079 19298058 17117654
32978 17117654 15425035 18149921 25488425 29886933 24776486 15704979 14285788 21613852
32970 21613852 26904406 23291497 15611750 10693711 9090665 9309607 11735445 14805356
32962 14805356 14715618 12206255 12666037 16769588 18420850 14936287 11524377 12073371 13177281
32953 13177281 11546419 9939576 10752783 10440371 5969100 1524989 3384760 11802655
32945 11802655 21578707 26945417 24082530 14249302 6196894 8601329 17542657 19222746
32937 19222746 8766028 -1976267 -662917 9434228 16488756 16677615 15608376 17554519
32929 17554519 21134492 23656164 23740775 20896972 16480843 13372623 12250901 11076069
32921 11076069 9827840 11072883 13886444 13218146 8368044 5683284 8761323 12348179
32913 12348179 10847765 6812529 5545764 6988843 8782735 11957294 17270893 20686712
32905 20686712 18923525 15425892 14859798 15776667 14611870 12742541 13405956 15508053
32897 15508053 16544352 17782241 20528198 21388941 17698044 13603857 13854805 15321518
32889 15321518 12166254 6361679 5330813 11103269 18874021 24664091 27870431 27861836
32881 27861836 24352604 19818416 16226920 11654150 5353231 2418361 6472166 11296278
32873 11296278 8300751 79411 -2832108 1915412 5316031 1528367 -3532008 -2160261
32865 -2160261 3476900 5290726 1304531 -1909827 1148877 6701886 6070882 -2160020
32857 -2160020 -8600136 -5213696 2658656 3566270 -2487374 -3631832 5284221 14661852
32849 14661852 15209344 10208606 6080802 1654671 -3830857 -2516099 9684064 20505412
32841 20505412 15461317 -547765 -9915926 -6987660 -1543485 124560 2282999 7296939
32833 7296939 10292198 8799420 5930206 2050270 -5395155 -12522254 -11723907 -5675868
32825 -5675868 -5853981 -14031060 -18329204 -12140832 -3825799 -1397706 -392779 4636053
32817 4636053 8042728 2987079 -5258748 -6859071 -2420878 -378312 -3391254 -6323903
32809 -6323903 -5183624 -603607 5598456 11292009 13464434 11735826 10152545 11406903
32801 11406903 12384555 9518126 4938034 2786463 2905029 2928834 3463100 6172493 9034763
32792 9034763 8049049 2337322 -5210129 -10283430 -8588283 1032040 12540856 16433140
32784 16433140 10652275 3202137 886371 1150990 -721644 -2598084 44339 5500078
32776 5500078 8552534 8305421 6800111 3065744 -4413873 -11464692 -11478698 -4221848 4085123
32767 4085123 8530977 8679077 5825129 2217063 1220989 3214777 3471167 -673670 -3693870
32758 -3693870 254129 6293153 4528419 -4367591 -9168841 -4924003 32167 -2526915
32750 -2526915 -9032090 -11197113 -7750172 -2766714 2243378 7550843 10252302 7409379
32742 7409379 2360223 1303374 4267512 5393200 2062213 -1962995 -3041355 -1792227
32734 -1792227 419418 3647907 5920325 2931805 -5451001 -12672035 -13243075 -9513245
32726 -9513245 -7148521 -7710608 -9833028 -13277449 -16024658 -11730110 1864568 14958392
32718 14958392 15774421 7491951 4405276 10523838 14155196 7502284 -988703 -1247709
32710 -1247709 2889291 3231205 2922533 9417430 17861828 16062642 4014223 -5187434
32702 -5187434 -4493806 -710741 -1037545 -2951558 -1418189 2760900 6106020 7257883
32694 7257883 5611077 1224846 -2144458 -453054 3108459 1572717 -3718353 -3519314
32686 -3519314 4354035 10164858 6816641 147689 -1340447 914769 291403 -3971042
32678 -3971042 -7834688 -9914413 -11048705 -9973171 -5461417 -30036 3295049 4996655
32670 4996655 5916109 3886385 -2078135 -7800326 -8656265 -5386086 -1644941 961771
32662 961771 2309772 2147953 2184730 5588697 11479581 14585176 13044366 10918793 10230590
32653 10230590 7674832 3168920 3395399 10720947 16425312 12617585 4050173 -181290
32645 -181290 -145918 -968252 -1268923 3363397 9518150 9911776 5931907 5630228 10524209
32636 10524209 14296631 13591897 10555166 5826665 -935235 -4423377 1524354 12167530
32628 12167530 15912685 11417235 9347515 14531730 18262782 13555398 7132805 8487109
32620 8487109 15350540 18873755 17689213 17867534 21525025 23322046 18288885 8152779
32612 8152779 -503628 -1826072 4691474 13047187 15434669 9918032 2261151 -824676
32604 -824676 1598884 5496690 6977205 5377206 3152665 3604470 7289745 10930731
32596 10930731 11709630 11250131 12180281 12602557 8976121 3350860 1401396 3203949 3143891
32587 3143891 342822 1026412 6896036 9414583 2283661 -6985898 -6796296 1124950
32579 1124950 3971593 -3114125 -10132127 -7233175 1487592 4836115 33125 -5441862
32571 -5441862 -5588988 -2790189 -2034733 -3611945 -4455953 -3324596 -1096792 1970712 5333842
32562 5333842 5627462 -232996 -8618332 -10376085 -1416316 10488598 13057593 3246616
32554 3246616 -8920848 -11020963 -1516035 9010569 10380568 4837255 3145259 8829280
32546 8829280 12565300 6427582 -2710119 -2762765 4480541 5726980 -2406442 -7592077
32538 -7592077 -1764692 5751657 3426207 -4496935 -6162991 -1049913 1395234 -1746349
32530 -1746349 -3446961 1060320 8316020 13145236 13599737 9478635 2391861 -3055857
32522 -3055857 -3416614 -388132 3483369 9094083 15429381 15804494 7584337 103233
32514 103233 2921523 11065606 13264909 10334916 11961415 18306027 19962032 15463197
32506 15463197 13191739 14706518 12128635 5145253 4416723 12662020 17765081 11842112
32498 11842112 2873370 -604175 -2340170 -6704324 -8111386 -3352763 -1514994 -8397604
32490 -8397604 -12671956 -2854982 11395421 12006747 206626 -6146787 -41166 7137975
32482 7137975 6079043 2037235 3368111 9797657 16509984 20857264 21431943 17681159
32474 17681159 12803397 10798259 9889112 5570476 24735 261294 6100755 8989499
32466 8989499 5311992 2335154 6704417 14313600 17111310 14632057 12660194 13492792
32458 13492792 13509526 9946547 5409421 3912306 4683466 2750510 -3742149 -9582469
32450 -9582469 -9127691 -5192876 -5741772 -11393244 -13229015 -5966962 3758919 7224090
32442 7224090 5041634 2290999 -1223477 -7024136 -9451905 -1989138 10148613 14470816
32434 14470816 8021092 -98696 -3448286 -5507345 -10194998 -14557985 -14810335 -12467457
32426 -12467457 -10658966 -9862581 -9788679 -10010139 -7151211 2035722 12847456 15124777
32418 15124777 6786683 -1897646 -1498069 5229204 9364351 7310150 1355150 -6000460
32410 -6000460 -12458551 -14213209 -9461853 -1877579 3340412 5232849 6196233 7641374
32402 7641374 9064473 9191288 6225042 -241795 -6185966 -5864495 518586 5954604
32394 5954604 5644773 2587012 1851327 4167484 8213217 14061495 20219297 21936340
32386 21936340 17211047 10639081 6902992 4426734 -9080 -4749388 -6609107 -6471291
32378 -6471291 -5847580 -2333381 4763235 8753735 4026370 -3188911 -2319859 5061172
32370 5061172 7159084 842533 -2911374 3819755 13603506 14845296 7402938 -401332
32362 -401332 -4544990 -6817303 -7063478 -2652356 4513763 7591489 3362876 -3150689
32354 -3150689 -4638414 421049 6908269 8704499 4434303 -1609918 -4213448 -2994858
32346 -2994858 -2105768 -3924619 -5828296 -4891025 -2642315 -2061263 -2622968 -2521197 -3576813
32337 -3576813 -8509860 -14265678 -14160469 -7470993 -1207153 -640981 -3517668 -5983890
32329 -5983890 -8313260 -10684149 -8877817 -430662 8527978 9595291 3725755 -107169
32321 -107169 2404132 5957035 4370191 -1568651 -7213777 -10410633 -11832110 -11875909 -9744994
32312 -9744994 -4408449 3981427 12217904 15073793 11540607 8212644 11208093 16018277
32304 16018277 12525936 399170 -8872962 -7891119 -3001374 -3472167 -8518653 -11225415
32296 -11225415 -9201488 -4518318 1887727 8743499 11745371 9361219 7230075 9616491
32288 9616491 10891308 3911216 -7004110 -11144358 -7031729 -3048270 -3788247 -5807344
32280 -5807344 -6572211 -7541737 -7726622 -3890020 1809350 3786530 3359540 6961737 13208319
32271 13208319 13438898 7394495 5561229 11481166 14714685 8056763 -719053 -2808663
32263 -2808663 -2264577 -5543438 -7928935 -2901191 3604551 2061911 -3751409 -2562968
32255 -2562968 6114954 13097814 15556126 18111047 20087906 15976445 8236811 5539446
32247 5539446 7190614 3346806 -6664659 -10328440 -1186395 10709304 14221956 11842715
32239 11842715 11335613 12493492 11276200 9797100 12812658 18746494 21915855 20365323
32231 20365323 15601277 8316262 -111843 -5604965 -6017696 -4295226 -3039231 -716965
32223 -716965 2640311 2334344 -2653324 -4909000 287844 5488447 2207256 -3899961
32215 -3899961 -684822 10710404 16677677 11790632 5652064 6054076 7501871 2790107
32207 2790107 -3955400 -4440431 130802 1652603 -2100381 -5723869 -5900826 -5285866 -6077139
32198 -6077139 -5945846 -2446612 2835693 6905775 9164795 10329910 9790774 6737748
32190 6737748 2913273 1522084 2990457 3734507 281667 -6539659 -12954209 -16934891
32182 -16934891 -19291951 -20046928 -16927684 -9748654 -3871780 -5159353 -11583188 -13995301
32174 -13995301 -6994032 4213363 10466229 9536922 6487415 4717021 2093479 -2814605
32166 -2814605 -5996485 -3643250 664843 -156481 -6511043 -11278552 -9838495 -5548983
32158 -5548983 -3105707 -1715790 1286374 4541117 5613590 6515443 10172813 13468201
32150 13468201 10495879 2050395 -4748567 -6333205 -5447908 -3598554 1495129 8774934
32142 8774934 12041656 9242474 6616057 8705386 10620148 6165751 -1804668 -5907286
32134 -5907286 -4955014 -3484348 -3841236 -5133796 -7224333 -9672996 -9499862 -5778692 -3076349
32125 -3076349 -4307596 -4566398 578223 5635408 3620610 -538107 2982766 11212862
32117 11212862 11709820 3605258 266963 7407876 13186672 7032299 -4370647 -8768889
32109 -8768889 -5458670 -985984 3255653 8455437 10721544 7246840 4506007 8838043
32101 8838043 13355106 6675605 -7695143 -13663372 -4791839 7562950 11088833 7245498
32093 7245498 4701345 6328586 8689157 9319861 8801354 7901230 6630478 5176749 3708617
32084 3708617 1998890 3069 -1980051 -3481677 -3346931 -433842 3770072 5427131
32076 5427131 3373379 1185634 1514432 1753750 -724348 -2691117 76933 4990505
32068 4990505 6195730 4027796 3998512 7318164 9543135 8614181 7226246 6513940 4157146
32059 4157146 76118 -2286623 -1859844 -1179533 -494616 2972131 8166109 9304375 4551029
32050 4551029 -541692 -1347149 -235936 -1102643 -3260639 -4300186 -4055708 -2397248 1886945
32041 1886945 6635947 6179096 -237017 -5086577 -2363604 3912135 5974612 2804097
32033 2804097 -938423 -2471667 -1527121 3297457 12384763 21015642 23164541 18649405
32025 18649405 12309419 7510665 4529638 3533307 4565591 5716019 5319879 4849115
32017 4849115 6244002 8257363 9021636 9816212 12068745 13166979 10232719 5849515
32009 5849515 4598337 5829385 5827430 5404263 8180607 11828299 9024899 -1066152 -9422545
32000 -9422545 -8627843 -2091355 2079281 1882993 1541925 3732752 6337227 6063279 2148792
31991 2148792 -3235311 -6460719 -5095011 -649290 2113812 -33539 -5346295 -9310634
31983 -9310634 -9230293 -5705628 -994068 2383541 2299890 -1446355 -5866765 -6808083 -3456436
31974 -3456436 114276 -584163 -4832297 -7522032 -5808606 -2283184 -149470 1454982
31966 1454982 3857362 3427548 -4348711 -15808590 -20598176 -14197205 -3552186 2408978
31958 2408978 2577123 561023 -2443352 -5981879 -5986549 546158 8480055 9454875 3772375
31949 3772375 545676 4502949 8802590 4470848 -7124755 -15718808 -14773444 -8858402
31941 -8858402 -7367744 -12883382 -18249395 -15650676 -6099101 2623029 5634774 4411185
31933 4411185 1345540 -3490020 -8892042 -11560098 -11270885 -11773286 -13492352 -11230137
31925 -11230137 -3419418 2602977 794627 -3622887 -2010877 4324864 7383649 5982794
31917 5982794 6342331 10287888 12485729 10154778 6869811 5044162 2402292 -1879030
31909 -1879030 -4501272 -4021153 -3376020 -4008230 -3046730 1181478 5617720 6531717 3244380
31900 3244380 -2824944 -8649097 -9838750 -5839056 -3546233 -8714875 -15331519 -12884610
31892 -12884610 -3588565 -560770 -6860979 -9562351 -434508 10135600 9145073 574032
31884 574032 -2418395 2456888 6596835 6048073 4909039 4869977 2344235 -3381027 -7781732
31875 -7781732 -7938451 -5114585 -422747 5712697 9993041 8738384 4297024 2941518
31867 2941518 5948892 8380724 6911668 3109411 -1335262 -6501407 -10368694 -9022416
31859 -9022416 -2620965 3586438 5563988 3478824 -1726647 -8803700 -12467862 -6552495
31851 -6552495 6152571 14247196 12426753 9224016 13701956 20295197 16139891 765429
31843 765429 -11973973 -12771360 -7950479 -7334224 -9370867 -6205695 1332906 3614676
31835 3614676 -3152063 -10787080 -10333342 -2710776 5636844 11882784 15996554 15087655
31827 15087655 5983936 -7413363 -15704239 -14031048 -6568595 -710408 -497687 -5639035
31819 -5639035 -12666919 -16369519 -13841412 -7885720 -3448821 -1107163 2195281 6745953
31811 6745953 9170883 7655319 3196789 -3716223 -11929436 -15938959 -10860127 -1490899
31803 -1490899 1922925 -1390744 -1057705 8176558 18155616 20334502 17612263 16083322
31795 16083322 13728150 6556071 -825726 -1196728 3112636 3950332 123071 -2858757
31787 -2858757 -3129894 -3166820 -2163271 2691117 8330987 8579759 4500380 2873102 4135397
31778 4135397 1155901 -8488149 -17608844 -19067867 -13086448 -3277366 7180332 13617993
31770 13617993 11859549 4809653 184853 -533435 -3487802 -10442071 -14089690 -9889026
31762 -9889026 -4404487 -5359956 -9962382 -10762130 -8408459 -10048099 -16927065 -21537507
31754 -21537507 -18027608 -9874596 -5121404 -7026252 -11428953 -12378397 -8955541 -5571250
31746 -5571250 -5424530 -6000284 -3573182 8415 -263677 -4141743 -5880046 -3280642 -992093
31737 -992093 -2372025 -3791016 -1020318 3358529 3878405 327681 -3258067 -5878897
31729 -5878897 -10392785 -16948188 -20293298 -15934087 -6876284 -1582692 -4722373 -11497561
31721 -11497561 -13215207 -8159816 -3469680 -4655164 -7571934 -5118688 1547149 4852012
31713 4852012 2327293 -667017 79091 2518287 3294530 1720833 -2404592 -8860325
31705 -8860325 -13576112 -11635933 -5351609 -2471763 -4489432 -4587479 69525 3044626
31697 3044626 328233 -1841486 2295118 7805621 7961373 5919297 7660958 9589080
31689 9589080 4701216 -3245354 -4338203 835320 2104175 -2687966 -4296750 937448
31681 937448 3608624 -3190496 -11573837 -10520444 -2224900 2310110 -674964 -4878250
31673 -4878250 -4837878 -1606650 2163181 6101383 9904282 12007079 11945773 10883743 8970544
31664 8970544 4992850 -630130 -5109329 -6476384 -5474041 -3616952 -1454417 510544
31656 510544 1421736 1772615 3363095 5988384 6408391 3054197 -243290 1096558 4949325
31647 4949325 4233495 -3129055 -10593619 -11678874 -8244537 -6588868 -8632599 -11514153
31639 -11514153 -13505819 -14970466 -14726847 -11238848 -7291013 -7693088 -11583661 -12760406
31631 -12760406 -9051676 -5312973 -4683779 -3206962 2572351 8104332 6778492 25060
31623 25060 -4299709 -1854124 4717324 10867329 14126330 13726943 10261296 5754908 1801809
31614 1801809 -1352688 -2399813 1157433 7706197 9955136 3706116 -4663484 -5457081
31606 -5457081 1473931 7729802 9328313 11041455 16367797 20466282 17140341 8107636
31598 8107636 772671 -773219 1129049 2209984 974492 -754446 -399108 2195566
31590 2195566 4135746 3204079 1775976 4336009 10370361 12847831 6348487 -5044281
31582 -5044281 -11353418 -8459731 -3175018 -4318390 -10640886 -12091133 -4243485 3544160
31574 3544160 -590054 -14387441 -23307607 -19152784 -9241764 -4405773 -5405267 -6415656
31566 -6415656 -5431149 -3834804 -112454 7635061 15074178 15502869 9654101 4629926
31558 4629926 3458329 2578266 -320711 -3021940 -4141230 -5029942 -4952604 -737167 6816124
31549 6816124 11828117 10697263 5865831 1256526 -969686 1061128 7085129 10696174
31541 10696174 4894128 -6492087 -11128934 -4981178 1782837 209550 -4890735 -4529153
31533 -4529153 112292 1654251 -563909 -715686 3439628 8800162 13006642 15173452
31525 15173452 12965325 6136121 702444 2145190 6515464 6170914 2408703 3239360
31517 3239360 9212775 11470799 5628525 -1586375 -2628059 1944106 8200869 14652154
31509 14652154 19005792 16670911 8301399 2601921 5190636 9872201 7920370 1542005
31501 1542005 -998 5118025 9366261 7836535 4021264 2454260 2720434 3177065
31493 3177065 4653089 7220109 7936230 5247654 2099374 1503931 2065507 936046 -1600169
31484 -1600169 -3514727 -4230166 -3301011 1005514 7826420 11332307 7299281 -74819
31476 -74819 -3520914 -3117742 -4625899 -8326549 -7992507 -2549886 208831 -4030357 -8199254
31467 -8199254 -5012437 717968 -398561 -7318502 -11180332 -10408743 -12058150 -17596006
31459 -17596006 -18429174 -9322670 2953803 9681858 11319275 12362458 11599728 5439519
31451 5439519 -2931287 -5999223 -2496312 1245570 735804 -1307875 -98736 4523192
31443 4523192 7814390 4848202 -4130002 -11958881 -10529891 -710324 6904347 4603704
31435 4603704 -2743773 -5602507 -3475026 -3047119 -4860515 -1692507 8236879 15678211
31427 15678211 12304083 1186496 -9490981 -16757966 -20986961 -19650691 -11107732 -1229589
31419 -1229589 2426951 1931947 6077135 15811620 21260317 16092164 7036309 4077861
31411 4077861 7312204 9910419 9626568 9599563 9875731 6544704 9702 -3548918 -1738549
31402 -1738549 -390734 -3958325 -6820376 -608255 12470505 20573970 16791286 7288560
31394 7288560 3108765 7518134 13614245 12377217 1624039 -11607942 -16949528 -10436265
31386 -10436265 1452699 8950995 9421521 8022157 8952881 10587246 10261621 9081827
31378 9081827 8827558 7416743 1542212 -7393372 -13307067 -11534693 -3461846 4503232
31370 4503232 6051061 593967 -5533677 -5528333 -491095 1517186 -3867995 -11171465 -12348067
31361 -12348067 -7083121 -2080642 -2094832 -5525391 -7834716 -6044988 -762446 3472409
31353 3472409 1241691 -7327882 -14813212 -14594816 -9035980 -5597525 -6478653 -7236000 -5077939
31344 -5077939 -2923926 -4274989 -8742597 -13899870 -17388890 -16197381 -8554006 1632432
31336 1632432 6767021 4511422 643970 265024 610598 -3147742 -8665855 -8854416 -2218257
31327 -2218257 4886998 6887823 5142711 3671821 2559337 -1099110 -7315764 -11656723
31319 -11656723 -10030278 -3042884 5277347 11601968 14718896 13948924 8773005 863347
31311 863347 -5396915 -6227156 -1999464 3238711 5292503 2700772 -2525304 -6296305
31303 -6296305 -5946719 -3229576 -2455691 -5020842 -7808342 -7970012 -6654673 -6281191 -6854848
31294 -6854848 -7304244 -7779483 -7938041 -5771245 -1231174 2101957 2691063 4755352 11262627
31285 11262627 16812683 14400801 6907545 3824692 7276271 9736347 6482817 1864111
31277 1864111 746772 1615787 1898125 3174225 6378928 7445620 2827064 -4598619
31269 -4598619 -9265688 -9187197 -5597178 -444091 2958718 1355739 -3412527 -5514521
31261 -5514521 -3857652 -3869067 -7525016 -8937482 -4876071 -2073057 -6756612 -13447336
31253 -13447336 -12977501 -6611692 -2595567 -2418676 -907965 2091994 968407 -4732424
31245 -4732424 -8883634 -9867822 -13579027 -22240196 -28590719 -25828917 -17123400 -10385163
31237 -10385163 -7999634 -6443636 -3458869 -1405027 -3714960 -9695917 -13361364 -8838374
31229 -8838374 2029034 10248711 10391612 7171305 7264279 8844577 5763205 -1388004
31221 -1388004 -6790896 -9952967 -15305504 -21655838 -22092747 -15940318 -11045491 -11235837
31213 -11235837 -10746641 -5036443 1731849 4934678 6876929 10105721 11054847 7216171
31205 7216171 3932771 6393216 10267490 8249260 1705554 -2155454 -1615471 -1152617
31197 -1152617 -2867666 -4528937 -5065087 -5460515 -4805995 -1367302 2637799 2554336 -2266926
31188 -2266926 -7647773 -10049972 -9596757 -8447895 -8987262 -12101488 -14750418 -11922986
31180 -11922986 -3981839 1472378 -1031587 -7332731 -10031101 -8362362 -6283463 -4825773
31172 -4825773 -2884879 -1987262 -3126960 -2320008 2814074 5629443 -931787 -11211838
31164 -11211838 -13472348 -8195363 -7039121 -12674488 -13570382 -3341186 7907137 9210962
31156 9210962 4605118 3721374 5485787 2533679 -4097927 -6624095 -3992455 -2677414
31148 -2677414 -4924966 -6429464 -6345102 -9777933 -17397417 -20929056 -13963402 -1716743
31140 -1716743 5181474 3310050 -1778944 -4285084 -3868265 -2796578 -1573867 462827
31132 462827 2161232 1170641 -1936134 -2621958 2109053 8262249 8327564 771738 -7352327
31123 -7352327 -9111580 -6002478 -4749958 -8115340 -12534412 -13920311 -12203695 -9796162
31115 -9796162 -8189215 -6914833 -4617129 -1017491 1632949 298641 -4430205 -7518442
31107 -7518442 -5279318 -288041 2291883 1643264 868094 814991 -936830 -4740317 -7385604
31098 -7385604 -7326206 -6789420 -6357246 -2050585 8123002 18033140 18973088 10080791 -1334516
31089 -1334516 -9207318 -13610854 -15932572 -14708637 -9299053 -3883298 -3357175 -6520763
31081 -6520763 -7310937 -3156584 971344 -1545365 -10393530 -17337553 -14247342 -1927674
31073 -1927674 9664365 10940982 2336573 -6877075 -9347710 -6665423 -4581590 -4686627
31065 -4686627 -4398061 -3014636 -2867557 -4638860 -6080496 -6037266 -5478651 -3700884 1562287
31056 1562287 8332304 9903301 3626820 -4267670 -6746818 -4746828 -3040178 -1498627
31048 -1498627 2873054 7961869 8396734 4726163 3265228 6110451 8272253 6127486
31040 6127486 1953159 -1900844 -6357522 -10202421 -8525088 -1148612 3875318 1055216
31032 1055216 -3766376 -2237014 3483940 4517560 -877713 -5870057 -6385485 -5272921
31024 -5272921 -4618569 -2346902 1164888 829078 -4707249 -8654212 -5260003 1279657
31016 1279657 2685807 -1902745 -6201143 -6829644 -7138054 -10657754 -15393965 -16149503 -9975489
31007 -9975489 1296359 11761848 14660744 7581994 -4762909 -14679658 -18505975 -17963401
30999 -17963401 -15686824 -12736201 -10284438 -9672879 -9723515 -7757777 -4664450 -4773340 -8508671
30990 -8508671 -9867407 -4965608 1359498 2771563 1420047 3726716 8720931 9161430
30982 9161430 4072564 984229 3463285 5365578 1943207 -1562738 999448 5768401
30974 5768401 5136828 127315 -2309705 -1219823 -1553622 -3539164 -1623382 5272012
30966 5272012 10898434 10752401 6598779 539548 -7376502 -13311172 -10207740 1132271
30958 1132271 9190037 5910752 -2525048 -5501345 -2745181 -1552192 -3692316 -4225947
30950 -4225947 -1620397 -133065 -1526133 -2044373 405843 2379831 994223 -1119291
30942 -1119291 -377319 1874314 1841773 -383030 -724327 2797349 6669539 5903327 442317
30933 442317 -4214764 -3518300 529799 2441856 976587 193912 2401287 4666268 4771309
30924 4771309 6044232 11662343 17330649 15400138 5114933 -6488446 -13334069 -14762184
30916 -14762184 -11584168 -3973949 5003412 9454671 7562864 4453776 5011215 7478159
30908 7478159 7919997 7749529 11667691 19391338 24520396 22325245 14983591 7979493
30900 7979493 4298781 3699365 5184243 7781920 9876141 9753452 6897871 2228174
30892 2228174 -2232036 -3667365 -280698 5954617 10286394 10932329 11704665 15728526
30884 15728526 18746366 13993655 3073569 -4785649 -5927543 -7426861 -14952840 -22608150
30876 -22608150 -21967962 -15939323 -14571662 -19772953 -23588104 -20895109 -14631535 -8100224
30868 -8100224 -1455715 2719769 64941 -6341188 -6864299 378352 5312413 1304250
30860 1304250 -4502017 -3268208 1782381 2464772 -837779 -2646960 -3478448 -6709628
30852 -6709628 -8730110 -3569479 5089549 7601387 3048707 -185835 1650291 3198063
30844 3198063 68220 -5917577 -12420748 -18541822 -20336309 -13850972 -4036571 -898906
30836 -898906 -4609329 -4495320 3963633 11619987 10183465 4363949 2586619 4012338
30828 4012338 3075681 516129 899009 3093099 1764149 -3294084 -6313220 -3835062
30820 -3835062 868878 1660720 -4520210 -14142382 -18267729 -10615369 3925297 13291973
30812 13291973 12825586 10162168 12395611 15377740 11916827 4643048 2252653 6083269
30804 6083269 8926212 6226115 802657 -3871811 -8058937 -11658862 -11578003 -6389830
30796 -6389830 -69539 2268979 946994 1334715 6547066 12256316 11115427 2882142
30788 2882142 -3139431 788846 9860533 12506575 5891401 -1697143 -4284793 -5067981
30780 -5067981 -6806867 -4933926 3249157 10499308 9357219 4104366 3689420 7128119
30772 7128119 6207855 141163 -3458953 -2115045 -2366540 -7788519 -12315079 -9695693
30764 -9695693 -2762868 1336733 326040 -2947543 -5770974 -7041091 -5677745 -1100231
30756 -1100231 5026401 9024261 7335331 -752572 -11222416 -17415606 -16129337 -10606704
30748 -10606704 -5695207 -2170535 1669675 5783786 9601142 14467014 20004078 20950408
30740 20950408 13821257 4555161 2351975 6946665 9543721 6145524 1899464 1374277
30732 1374277 2834165 4225832 6672862 8986787 6819184 1429576 1346735 9717523
30724 9717523 17264862 14765585 6391306 2652057 4957293 6276768 4127390 3080668
30716 3080668 4738838 4473849 134228 -3581586 -2717867 -248368 -875551 -3782633 -4456249
30707 -4456249 -1174164 3601394 6662470 6359932 2796453 -2180874 -6149475 -8592003
30699 -8592003 -10744155 -11905492 -8634796 -333980 6733678 5307859 -3581162 -11498221
30691 -11498221 -13097877 -11111059 -9551099 -7495997 -3520217 -1417696 -5092389 -10471493
30683 -10471493 -10033230 -4697617 -3043494 -7393232 -9474534 -4032262 1594340 -1428172
30675 -1428172 -9082902 -10222198 -2986364 3959384 5212035 4223059 4438142 3744290 371020
30666 371020 -3108317 -5018122 -7473615 -10499781 -9283510 -1639351 6988516 10736078
30658 10736078 10986250 11854078 12491045 10126074 7332354 8834886 12495388 11067962
30650 11067962 3560866 -2139298 -287211 5095234 7295090 6674265 8068028 11406836
30642 11406836 11386357 6420883 1810489 1453252 1202445 -4912337 -14428910 -17987611 -11134723
30633 -11134723 235126 7395852 7351642 2056696 -6079821 -13959702 -16587613 -11331790
30625 -11331790 -2348077 3241814 2978684 -78708 -2563993 -3235287 -1667381 1285646
30617 1285646 2566827 427203 -2081261 -1139161 1734969 2432156 1605523 3232395 6629605
30608 6629605 6965690 4197416 3906629 7259085 7693192 1198825 -6787853 -9203983 -6332024
30599 -6332024 -2320084 1663641 5216899 4625551 -2223859 -10058842 -11950234 -8756629
30591 -8756629 -6729435 -7429828 -6617267 -2729147 63240 -1442216 -4881688 -6383236
30583 -6383236 -5317618 -2902859 776966 5662005 9420587 9166230 5446636 2276193
30575 2276193 1863974 822097 -5360457 -13941873 -15512394 -6098318 5467812 8058212
30567 8058212 3297732 2238049 7886848 10718538 4061431 -5485052 -8281156 -4424708
30559 -4424708 306243 4560770 9432911 11343582 5904563 -3335325 -7848877 -4934771
30551 -4934771 559442 4017502 4856963 3959346 2655166 2791511 3259280 -665016 -9340862
30542 -9340862 -14289843 -8926415 101356 1406839 -3956886 -4486123 3071873 8349926
30534 8349926 3264228 -6574016 -10636442 -6024440 3014299 11637752 16156944 14428209
30526 14428209 8462668 2972634 -700300 -5067537 -10173269 -12481007 -11168391 -9202248
30518 -9202248 -6879171 -1491536 4885841 5688841 1060372 -98188 5954177 10508399
30510 10508399 5491055 -4004047 -8055755 -6151828 -4400082 -3863513 -1198819 2546327
30502 2546327 3323703 2644645 6060157 13432131 18070552 15667617 8173926 -505942
30494 -505942 -6930777 -7661650 -2945164 103107 -5213013 -15187738 -19766605 -16106118
30486 -16106118 -10676095 -7728526 -4111006 2313557 7129347 6332086 2676297 644334
30478 644334 -172570 -2415334 -5534668 -7174584 -7180116 -6795786 -6213874 -5564421 -5805558
30469 -5805558 -6362250 -4874048 -1591447 -364040 -2179313 -1773037 4626131 11444996
30461 11444996 9930511 1046939 -4388203 185526 8363798 9326542 1326211 -7421211
30453 -7421211 -9435802 -5223604 199575 4016129 6801194 9426877 11465340 11800960
30445 11800960 8826408 1179379 -9087886 -15201512 -11565669 -1344335 5926880 5449737
30437 5449737 1649882 26451 6109 -484576 1009688 6630081 11235969 7886803 -1525326
30428 -1525326 -8677966 -10978973 -13272898 -17150680 -17573867 -12948691 -10129949 -14250365
30420 -14250365 -19984120 -18932467 -11275175 -4308720 -2549990 -4543841 -7097375 -7903549
30412 -7903549 -5762845 -2217992 -1220092 -3917691 -6254701 -4995300 -2787359 -3144949
30404 -3144949 -4170412 -2758480 -1655072 -5307170 -10592950 -9465061 -933314 6838303
30396 6838303 7728517 4354412 1438538 -1140202 -4905007 -7463701 -5744509 -2011764
30388 -2011764 -1850091 -6529529 -10850258 -9471497 -3446340 1199628 1161286 -71193 1986598
30379 1986598 4687442 1112423 -8017246 -11903766 -3692081 8772698 13115923 9028653
30371 9028653 6034104 7502098 7480502 3581590 2093376 7029194 13312126 15128442
30363 15128442 13081726 8780213 599231 -9665102 -13940552 -8708462 -1998543 -2191898
30355 -2191898 -5993421 -5540414 -1590789 -261289 -1346536 -248500 1550771 -1399066
30347 -1399066 -7623624 -10540501 -10485743 -14072791 -20957964 -22410106 -15633868 -9075958
30339 -9075958 -9414926 -12523496 -12078491 -8581782 -4408633 1968574 10172893 13426939
30331 13426939 7608610 -427389 -1395798 3289907 4414447 -1639474 -9466677 -13059710
30323 -13059710 -11435204 -6885851 -2911512 -2761251 -5367336 -4519764 3032157 11057537
30315 11057537 11462695 6450680 5858543 12977778 20695438 22681004 20730126 18314717
30307 18314717 14011084 6081631 -1715466 -4595297 -3856237 -4012834 -4725805 -1430730
30299 -1430730 5931563 10411261 6839824 -535129 -3055469 1096471 4737825 1395220
30291 1395220 -6565121 -11867736 -11400849 -7582116 -2706962 2779803 6616672 5291469
30283 5291469 106297 -2666094 -362482 2606859 3194310 5402280 11861264 15573670
30275 15573670 8591245 -4458905 -11104073 -8243050 -4872592 -6685882 -7916905 -2227457
30267 -2227457 6917156 12393793 13469884 13490600 12300456 7596594 1140163 -2387918
30259 -2387918 -1726674 94971 406105 -814944 -2282195 -2578604 -1333412 -812960 -3851170
30250 -3851170 -8608453 -9081254 -3279300 3287965 5387904 4374592 2410479 -3745465
30242 -3745465 -15855812 -25493793 -21768573 -6739544 5757023 7347808 3183932 1362861
30234 1362861 2239409 1386162 -3274834 -10830925 -18735271 -22024976 -16422938 -5072976
30226 -5072976 2984590 3736308 1963757 1563630 -447061 -5615124 -7741736 -2541525
30218 -2541525 2858404 -360277 -7929075 -8130108 159478 6628479 6817480 8131117
30210 8131117 15118724 19893434 14094292 2376997 -4043579 -2224008 1773960 3529142
30202 3529142 4034566 4350004 3363422 1111451 -673973 -1573535 -2229365 -1758164 543737
30193 543737 1939554 -405492 -3370527 -865028 6558080 11186927 9304507 6738736
30185 6738736 9374654 13653276 12644775 7899554 7364860 12176651 13937011 8017681
30177 8017681 2198302 5739380 14393935 14832108 3490515 -7636028 -7235812 572990
30169 572990 3857709 151239 -2235162 1689106 7232526 9137793 8774230 8528135 6152148
30160 6152148 271324 -3974578 -1491607 4166258 5471654 1649951 -1987848 -3307302
30152 -3307302 -4465629 -4998076 -2209941 1087558 -1950799 -10541805 -14503820 -8493190
30144 -8493190 -612423 -913575 -7242983 -9590912 -4613948 1481883 2597475 -1284928
30136 -1284928 -6988111 -11258134 -10999614 -5225497 2653259 7786571 8811179 7008733
30128 7008733 2364398 -5181569 -11886791 -12877142 -8651035 -4267494 -2131362 -522165
30120 -522165 733408 -802518 -4149818 -4036025 828101 3999439 103004 -6941770
30112 -6941770 -9558832 -7249348 -6065490 -9102623 -13368365 -15876496 -17123202 -17225015
30104 -17225015 -13882977 -7133096 -2065182 -2739221 -5930258 -5517009 -1778212 -969292
30096 -969292 -5163748 -8275381 -5131923 497342 1984262 363676 1989763 7192941
30088 7192941 9178321 5289795 1360710 1470021 1061439 -3974062 -8088139 -4082826
30080 -4082826 4236115 6737219 1872182 -2853016 -4392220 -7306634 -11776262 -9749644
30072 -9749644 1648912 12162589 11156347 1605292 -6082386 -8489200 -9237233 -9353809
30064 -9353809 -7189760 -5471876 -8546588 -12970470 -10432936 -1382313 3522946 -1283260
30056 -1283260 -8093326 -8062994 -4068935 -4318584 -8350052 -8107412 -1345090 4169652 1313159
30047 1313159 -7306187 -13535129 -13324330 -9343350 -5777219 -3227718 774341 7050336
30039 7050336 12003339 11524361 7625293 7542740 13635828 17580692 9722163 -7222092
30031 -7222092 -19827858 -19950104 -13054813 -8379298 -6869221 -3672893 1862783 5359970
30023 5359970 5251591 5501771 9701925 16426559 21342121 21191047 15589415 7579656 2159617
30014 2159617 1457987 1895852 -897096 -5535761 -7263914 -5714807 -4992448 -6355235 -6996706
30005 -6996706 -6786009 -9205345 -13287418 -11896455 -2377669 7276597 8195097 1537042
29997 1537042 -5564444 -9857335 -11748794 -10094151 -4419807 1203795 3460882 5446158
29989 5446158 10023808 12124728 6796798 718603 3965832 12412947 11670164 -740677
29981 -740677 -10973393 -10148855 -6569395 -10287290 -17719814 -20540626 -19889697 -21333371
29973 -21333371 -23028083 -19454668 -11800883 -5023791 1043406 8571716 14063646 13247443
29965 13247443 9810264 9526821 9371433 3339461 -3786812 -1029411 10713351 17529961
29957 17529961 11422051 -510761 -8342865 -10280816 -8035199 -1712640 5664913 7674903
29949 7674903 4040092 2510329 5923137 6097936 -2640225 -12325468 -12521313 -5967982
29941 -5967982 -3332584 -6972577 -9802218 -7465786 -2184271 3859125 9975535 12683403
29933 12683403 8776562 2821017 3244992 10094185 14674157 12744969 9912525 11405236
29925 11405236 14528608 15271190 15131782 16041407 14632661 8213575 2232495 4510467
29917 4510467 13735563 20078338 17172180 8554870 1860433 737301 3323507 5396780
29909 5396780 3787811 -1208137 -5868980 -6656058 -3776596 -98125 2490537 3751656
29901 3751656 3294754 1023386 -927605 134818 3336303 4751478 3021731 1383290
29893 1383290 2219388 2561933 -1609663 -8308983 -11158311 -8415834 -6141061 -9931626
29885 -9931626 -16669484 -18541780 -13883221 -9001926 -8383870 -8294106 -3582274 3236528 5333857
29876 5333857 2240170 803467 4939530 10476652 12420617 11819035 11770973 11391941 8656770
29867 8656770 5657744 5388251 5700336 2529047 -2210403 -2446818 2250056 5104903 1950041
29858 1950041 -2952927 -3410693 769851 5022780 5778402 2662897 -2144515 -4955497
29850 -4955497 -3657553 -672696 345646 681193 4305369 9103523 7672514 -370165
29842 -370165 -4805358 1096437 10145989 12298331 9908673 12324202 19277099 20778122
29834 20778122 12937870 3599703 618035 3153782 6816224 9593387 9815690 5358049
29826 5358049 -1631387 -5175360 -3778992 -2685319 -5151131 -7722871 -7431306 -6974337
29818 -6974337 -8357429 -7960702 -3490509 241384 -889422 -2138822 2660900 9585422
29810 9585422 9371896 1583411 -4697479 -3810520 1048672 5777784 10562987 15042150
29802 15042150 15707315 11831294 8345949 8876510 10446802 9050726 6246082 5294425
29794 5294425 4056494 -1947011 -10299890 -12146477 -4121593 5166437 4986645 -3676391
29786 -3676391 -9476140 -5815790 1221522 2806600 -226049 -888394 1417931 227101
29778 227101 -6142238 -10910527 -10049080 -8948055 -12409411 -15148253 -10083478 -1041416
29770 -1041416 1860431 -3198091 -8784334 -10482731 -10755870 -10321867 -5441861 3368895
29762 3368895 8388605 4898163 -2042134 -5379782 -5060390 -4649230 -3964669 -567495 4540421
29753 4540421 7698634 7452462 5321808 3297502 2567059 2481080 -188002 -7207624 -13356118
29744 -13356118 -10833017 -1444090 2755853 -4484233 -13977635 -13907178 -5635345 1493652
29736 1493652 5136975 9125901 11752098 7445784 -641698 -2257164 4090685 8736003
29728 8736003 7303841 7152340 11800259 11450429 -1171779 -15386266 -15540352 -3623942
29720 -3623942 4126465 669749 -4661695 -2854009 3015784 6132153 6058171 5279508 3210217
29711 3210217 -613146 -3059621 -2813423 -4649461 -12335808 -20651512 -20764352 -11975902
29703 -11975902 -2662250 -238848 -4749509 -11648979 -16050317 -14045029 -4754315 6882397
29695 6882397 12334514 6722295 -6861241 -20228156 -26019419 -21910895 -11950399 -3922737
29687 -3922737 -2858820 -6680930 -9886390 -10462458 -10067395 -8578692 -3774910 2562381
29679 2562381 3923391 -2077780 -8501632 -7652129 -2224236 -2204634 -11028194 -20172698 -19386683
29670 -19386683 -8792586 1797743 4041969 -689149 -4034139 -340415 7129186 10199114
29662 10199114 5656111 -873146 -2309853 685301 1135281 -4359552 -11194233 -13335708
29654 -13335708 -10635440 -7021759 -4201920 -938416 2511550 3280869 94513 -4128538
29646 -4128538 -5316672 -2481953 1909323 4518155 3484686 -401754 -4129531 -5129563
29638 -5129563 -3717733 -1460795 2339620 9274769 16492239 17445644 10852609 4474082
29630 4474082 5147818 8668750 6120455 -2158085 -7322299 -6520420 -6999159 -12609903 -15480849
29621 -15480849 -7677622 5574497 12180526 8456720 644690 -5377149 -7786499 -4567699
29613 -4567699 5335700 16337616 19577916 13527971 5116915 -445649 -4390416 -7858585
29605 -7858585 -7949346 -3327906 2033538 4145642 3723269 3193906 3235040 4155957 6100932
29596 6100932 6231160 1041200 -6529737 -8286226 -1944022 4936852 5733365 3250245
29588 3250245 2822217 3016493 -601338 -7030747 -11725043 -13698593 -14655711 -13669475 -8740086
29579 -8740086 -1889182 2679471 4205744 4746707 4683953 3146911 1079030 -169869 -1261405
29570 -1261405 -2211488 -352065 4617291 6877483 1339770 -8337873 -14307370 -14876145
29562 -14876145 -14407237 -14954953 -14582889 -12988683 -12259756 -11962419 -9190139 -3996861 -7073
29553 -7073 820479 124105 -101965 635267 1996022 2552017 663042 -1806802 -61417
29544 -61417 5968124 9329357 6344956 3596900 7552619 12750419 9821938 1166642
29536 1166642 -2521279 692098 2178857 -1940605 -5289929 -3154205 489721 1185565
29528 1185565 491693 750540 593671 -1508027 -5317601 -11437866 -19079727 -21580388 -12932174
29519 -12932174 950459 7253387 3450415 -934558 -869402 -2112683 -8172452 -13555003
29511 -13555003 -14738175 -15791370 -17486812 -13080801 -1922435 4750033 -2471 -7942724
29503 -7942724 -9770043 -8907002 -11195296 -12073091 -6250867 -528807 -3601584 -10835094
29495 -10835094 -12385491 -9305658 -8046809 -6101196 1695984 8632807 4775973 -3784420
29487 -3784420 -2224173 7913819 9360076 -3318629 -14481517 -10662781 2355244 12121477
29479 12121477 15626015 15313498 10812564 3505506 415411 5021791 10927051 11701448
29471 11701448 10453473 12505973 14754918 10622310 1710491 -3517170 -1284076 3427266
29463 3427266 4046545 -673145 -7002839 -10575363 -9786323 -5955922 -816253 4752051
29455 4752051 8755681 7883494 2197414 -2987058 -3964575 -4065709 -7103054 -9539330 -6617518
29446 -6617518 -2514840 -4589393 -9763884 -7998185 1099075 7487727 7876866 10220515
29438 10220515 16887942 17051834 3793329 -12522596 -17562046 -10956379 -1526997 7199724
29430 7199724 15876162 20256586 15422546 6000986 1422193 2520092 2042098 -2894722
$$ [...]
##END NTUPLES=NMR SPECTRUM
##END=
