##TITLE=31Pdec_LR-762-i
 H2O, 24 sc
 10.4.2023
##JCAMPDX= 6.0         $$ Bruker NMR JCAMP-DX V2.0
##DATA TYPE= NMR SPECTRUM
##DATA CLASS= NTUPLES
##ORIGIN= UXNMR, Bruker Analytische Messtechnik GmbH
##OWNER= root
$$ XWIN-NMR		Version 3.5
$$ Mon Apr 10 14:33:47 2023 Russian Standard Time (UT+4h)  she@DPX200
##.OBSERVE FREQUENCY= 81.013821
##.OBSERVE NUCLEUS= ^31P
##.ACQUISITION MODE= SIMULTANEOUS
##.ACQUISITION SCHEME= undefined
##.AVERAGES= 24
##.DIGITISER RES= 16
##SPECTROMETER/DATA SYSTEM= spect
##.PULSE SEQUENCE= zgpg30
##.SOLVENT NAME= DMSO
##.SHIFT REFERENCE= (INTERNAL, DMSO, 0, 248.564)
##AUDIT TRAIL= $$ (NUMBER, WHEN, WHO, WHERE, WHAT)
$$ ##TITLE= Audit trail, XWIN-NMR		Version 3.5
$$ ##JCAMPDX= 5.01
$$ ##ORIGIN= Bruker BioSpin GmbH
$$ ##OWNER= she
$$ F:/spectra/data/she/nmr/P31/1/pdata/1/auditp.txt
$$ ##AUDIT TRAIL=  $$ (NUMBER, WHEN, WHO, WHERE, WHAT)
(   1,<2023-04-10 14:32:10.10 +0400>,<she>,<DPX200>,
      <created by zg, POWCHK disabled, PULCHK disabled
       configuration hash MD5:
       00 E9 B6 7A A2 85 ED C7 34 08 36 98 17 FE 4E 26
       data hash MD5: 32K
       9D 92 D8 0E DC 71 65 F6 D7 F8 78 A5 31 19 EA 47>)
(   2,<2023-04-10 14:32:45.09 +0400>,<she>,<DPX200>,
      <Start of raw data processing
       efp BC_mod = 2 LB = 1 FT_mod = 6 PKNL = 1 PHC0 = -10542.11 PHC1 = -115.7153 SI = 64K 
       data hash MD5: 64K
       13 4B B0 48 9F 2C 42 0D B5 63 1F A0 C8 1E EB F3>)
(   3,<2023-04-10 14:33:05.31 +0400>,<she>,<DPX200>,
      <pk PHC0 = -0.5310699 PHC1 = 0 
       data hash MD5: 64K
       4A 5C 6E F2 FD AB 53 4E A7 28 3B 8B 1F 23 25 F4>)
(   4,<2023-04-10 14:33:08.71 +0400>,<she>,<DPX200>,
      <abs ABSG = 5 
       data hash MD5: 64K
       6E 93 50 0D B6 FE 70 EB 45 54 B0 14 50 92 C2 82>)
$$ ##END=
$$ 
$$ hash MD5
$$ 2A E9 1B A4 F3 A1 A7 19 D5 3F 71 45 49 AE 2E D3
##$RELAX= 
##$RELAX= 
##$RELAX= 
##$RELAX= 
##$RELAX= 
##$RELAX= 
##$RELAX= 
##$RELAX= 
##$RELAX= 
$$ Bruker specific parameters
$$ --------------------------
##$DU= <F:/spectra>
##$EXPNO= 1
##$NAME= <P31>
##$PROCNO= 1
##$TYPE= <nmr>
##$USER= <she>
##$AMP= (0..31)
100 100 100 100 100 100 100 100 100 100 100 100 100 100 100 100 100 100 
100 100 100 100 100 100 100 100 100 100 100 100 100 100 
##$AQSEQ= 0
##$AQ_mod= 1
##$AUNM= <au_zg>
##$AUTOPOS= <>
##$BF1= 81.014009
##$BF2= 200.13
##$BF3= 200.13
##$BF4= 200.13
##$BF5= 200.13
##$BF6= 200.13
##$BF7= 200.13
##$BF8= 200.13
##$BYTORDA= 1
##$CFDGTYP= 0
##$CFRGTYP= 5
##$CHEMSTR= <none>
##$CNST= (0..31)
1 1 145 1 1 1 1 1 1 1 1 1 1 1 1 1 1 1 1 1 1 1 1 1 1 1 1 1 1 1 1 1 
##$CPDPRG= <waltz16>
##$CPDPRG1= <>
##$CPDPRG2= <waltz16>
##$CPDPRG3= <>
##$CPDPRG4= <mlev>
##$CPDPRG5= <mlev>
##$CPDPRG6= <mlev>
##$CPDPRG7= <mlev>
##$CPDPRG8= <mlev>
##$CPDPRGB= <>
##$CPDPRGT= <>
##$D= (0..31)
0 1 0 0 0 0 0 0 0 0 0 0.03 2e-05 3e-06 0 0 0 0 0 0 0 0 0 0 0 0 0 0 0 0 
0 0 
##$DATE= 1681122729
##$DBL= (0..7)
120 120 120 11 120 120 24 19 
##$DBP= (0..7)
150 150 150 150 150 150 150 150 
##$DBP07= 0
##$DBPNAM0= <>
##$DBPNAM1= <>
$$ [...]
##$SUBNAM3= <"">
##$SUBNAM4= <"">
##$SUBNAM5= <"">
##$SUBNAM6= <"">
##$SUBNAM7= <"">
##$SUBNAM8= <"">
##$SUBNAM9= <"">
##$SW= 501.771253377433
##$SWIBOX= (0..15)
0 1 3 0 0 0 0 0 0 0 0 0 0 0 0 0 
##$SW_h= 40650.406504065
##$TD= 32768
##$TD0= 1
##$TE= 0
##$TE2= 300
##$TE3= 300
##$TEG= 300
##$TL= (0..7)
0 120 53 12 22 120 120 120 
##$TP= (0..7)
150 150 150 150 150 150 150 150 
##$TP07= 0
##$TPNAME0= <>
##$TPNAME1= <>
##$TPNAME2= <>
##$TPNAME3= <>
##$TPNAME4= <>
##$TPNAME5= <>
##$TPNAME6= <>
##$TPNAME7= <>
##$TPOAL= (0..7)
0.5 0.5 0.5 0.5 0.5 0.5 0.5 0.5 
##$TPOFFS= (0..7)
0 0 0 0 0 0 0 0 
##$TUNHIN= 0
##$TUNHOUT= 0
##$TUNXOUT= 0
##$USERA1= <user>
##$USERA2= <user>
##$USERA3= <user>
##$USERA4= <user>
##$USERA5= <user>
##$V9= 5
##$VALIST= <valist>
##$VCLIST= <CCCCCCCCCCCCCCC>
##$VD= 0
##$VDLIST= <DDDDDDDDDDDDDDD>
##$VPLIST= <PPPPPPPPPPPPPPP>
##$VTLIST= <TTTTTTTTTTTTTTT>
##$WBST= 1024
##$WBSW= 4
##$XGAIN= (0..3)
0 0 0 0 
##$XL= 0
##$YL= 0
##$YMAX_a= 14604
##$YMIN_a= -13766
##$ZGOPTNS= <>
##$ZL1= 120
##$ZL2= 120
##$ZL3= 120
##$ZL4= 120
##$ABSF1= 248.5645
##$ABSF2= -253.2056
##$ABSG= 5
##$ABSL= 3
##$ALPHA= 0
##$AQORDER= 0
##$ASSFAC= 0
##$ASSFACI= 0
##$ASSFACX= 0
##$ASSWID= 0
##$AUNMP= <proc_1d>
##$AZFE= 0.1
##$AZFW= 0.5
##$BCFW= 0
##$BC_mod= 2
##$BYTORDP= 0
##$COROFFS= 0
##$CY= -3
##$DATMOD= 1
##$DC= 0
##$DFILT= <>
##$DTYPP= 0
##$F1P= 0
##$F2P= 0
##$FCOR= 1
##$FTSIZE= 65536
##$FT_mod= 6
##$GAMMA= 0
##$GB= 0
##$INTBC= 1
##$INTSCL= 6.047779e-11
##$ISEN= 30
##$LB= 1
##$LEV0= 0
##$LPBIN= 0
##$MAXI= 10000
##$MC2= 0
##$MEAN= 0
##$ME_mod= 0
##$MI= 50
##$NCOEF= 0
##$NC_proc= -3
##$NLEV= 6
##$NOISF1= 182.463
##$NOISF2= 159.3651
##$NSP= 0
##$NTH_PI= 0
##$NZP= 0
##$OFFSET= 248.5645
##$PC= 4
##$PHC0= -10542.64
##$PHC1= -115.7153
##$PH_mod= 1
##$PKNL= yes
##$PPARMOD= 0
##$PSCAL= 0
##$PSIGN= 0
##$REVERSE= no
##$SF= 81.0140089999694
##$SI= 65536
##$SIGF1= 159.3651
##$SIGF2= -187.1042
##$SINO= 113.3802
##$SIOLD= 16384
##$SREGLST= <1H.CDCl3>
##$SSB= 0
##$STSI= 65536
##$STSR= 0
##$SW_p= 40650.406504065
##$SYMM= 0
##$S_DEV= 0
##$TDeff= 32768
##$TDoff= 0
##$TI= <>
##$TILT= no
##$TM1= 0
##$TM2= 0
##$TOPLEV= 0
##$USERP1= <user>
##$USERP2= <user>
##$USERP3= <user>
##$USERP4= <user>
##$USERP5= <user>
##$WDW= 1
##$XDIM= 65536
##$YMAX_p= 388594325
##$YMIN_p= -5449216
$$ End of Bruker specific parameters
$$ ---------------------------------
##NTUPLES= NMR SPECTRUM
##VAR_NAME=  FREQUENCY,     SPECTRUM/REAL,   SPECTRUM/IMAG
##SYMBOL=    X,             R,               I
##VAR_TYPE=  INDEPENDENT,   DEPENDENT,       DEPENDENT
##VAR_FORM=  AFFN,          ASDF,            ASDF
##VAR_DIM=   65536,         65536,           65536
##UNITS=     HZ,            ARBITRARY UNITS, ARBITRARY UNITS
##FACTOR=    0.620285442955139, 1,           1
##FIRST=     20137.2065510682, 0,            0
##LAST=      -20513.1999529968, 0,           0
##MIN=       -20513.1999529968, -5449216,    0
##MAX=       20137.2065510682, 388594325,    0
$$ Real data points
##PAGE= N=1
##DATA TABLE= (X++(R..R)), XYDATA
$$ [...]
##PAGE= N=2
##DATA TABLE= (X++(I..I)), XYDATA
39091 188246 204194 264881 287980 217227 129699 159408 293671 369775 312823 242091 277626
39080 277626 373144 425198 424381 396464 308657 160288 77076 176590 391572 546226 565547
39069 565547 503077 412311 312409 247092 251781 274204 238834 179106 193146 272491 294769 204362
39057 204362 89235 45765 67506 111481 182841 291442 389541 415430 361391 261199 155025
39046 155025 97086 136296 238051 279620 189883 56508 23390 105206 180262 162496 103137
39035 103137 102168 182415 284429 339457 312777 214906 110269 82223 144811 216129 227314
39024 227314 227460 309528 446465 492222 368999 173194 53722 55938 136758 257764 381076
39013 381076 432601 377021 304036 333587 442174 492064 442653 413696 492918 589272 558926
39002 558926 404515 257804 204193 212682 227006 244530 284589 330612 340087 300258 248817
38991 248817 226115 216486 169033 86243 43760 84299 145308 158291 164730 229423 281547 190207
38979 190207 -468 -77191 51283 224486 272474 237954 241972 265167 218933 138805 136799
38968 136799 213775 275594 300317 339822 379861 347767 252920 184521 173823 184104 221430
38957 221430 315442 402802 387288 320413 357305 511847 626931 625675 608525 632264 583831
38946 583831 396234 229601 275217 477692 606319 546854 393369 286658 269902 287316
38936 287316 254223 148916 65263 113280 245771 291096 202851 137044 195297 246054 142167
38925 142167 -21034 -48883 53650 131558 158169 239411 371118 427766 409308 469588 640128
38914 640128 738080 644599 489241 437431 455947 434935 409734 484760 616215 653044 571800
38903 571800 508194 536031 552582 442231 257485 151008 165928 180462 82671 -56867 -53072
38892 -53072 154044 397869 466273 329889 125868 -34855 -144407 -208205 -205270 -162034 -155002
38881 -155002 -194980 -202329 -144376 -101268 -133102 -174421 -140517 -56652 11188 83223 214995
38870 214995 368338 447029 437447 407721 377908 296356 156278 44292 41488 132133 229379
38859 229379 254455 195110 124370 140436 243194 310204 259613 182270 208836 292183 269208
38848 269208 132851 71843 187408 329014 310525 161909 41200 -4254 -39228 -64607
38838 -64607 -6399 121873 191674 132818 30436 5619 77956 185488 271166 304622 273775
38827 273775 203979 153919 160143 209815 279106 358090 425746 450860 439501 434112 444947 435000
38815 435000 394639 366289 358997 308901 182912 61876 48448 133519 222590 258231 250030
38804 250030 223146 209975 251286 324572 318445 178410 31627 39550 159795 208542 147935
38793 147935 126074 200186 227049 126497 60061 186191 385630 426194 301937 196852
38783 196852 170519 113162 11835 21089 193868 343635 299253 150041 92940 140054 141317
38772 141317 47269 -18969 35452 140931 198241 242341 372659 558287 623300 460471 187666
38761 187666 24098 42884 124013 147459 139443 186866 285491 346928 317576 227394 146710
38750 146710 141039 229995 342846 366023 290371 242123 290501 312913 178709 -8139 -26918
38739 -26918 128269 233470 175178 107031 190699 356162 434984 394862 312782 221920 121834
38728 121834 65051 99278 168870 186430 162580 162920 177930 142548 56364 -16643 -47967 -52795
38716 -52795 -19524 76106 197025 268749 272233 245915 215219 191844 215304 305069 383558 340190
38704 340190 181850 44563 42224 161763 311296 413016 440151 411853 366717 322825 276202
38693 276202 246823 274633 339630 352031 272947 175834 128444 96821 44279 26306 74555
38682 74555 88352 -5200 -73180 44248 234669 228609 15243 -101143 74887 369290 508323
38671 508323 460928 375497 325243 274347 203889 132297 68746 41743 100512 203467 202239
38660 202239 42763 -111661 -80965 90227 222639 256750 265575 270693 218020 122786 76897
38649 76897 97349 108114 94784 137751 247218 295920 193161 31238 -27641 48134 150225
38638 150225 186499 174405 181934 224231 240505 172256 55507 3947 76690 199658 268158
38627 268158 291368 352544 439961 425975 250438 35206 -47448 37258 189518 313869 386013
38616 386013 419298 443353 498892 579494 590830 454709 259735 207291 362476 550561 578464
38605 578464 482256 441645 496721 501460 373847 238178 236167 311165 298387 165184 39686
38594 39686 26825 104401 194887 245596 237056 197936 214742 345772 522441 613691 585765
38583 585765 517070 467698 436826 442129 514102 591649 553910 398838 269793 257675 300346
38572 300346 329660 374679 438461 422586 295629 205038 272055 382436 351542 219091 190675
38561 190675 322733 457391 481062 473457 543958 650988 665359 546646 392795 332913 393389
38550 393389 474038 477749 449035 505394 626838 646651 510043 389402 428279 519525 496470
38539 496470 404629 378580 368353 240418 73063 67921 193044 207199 61593 -13879 111405
38528 111405 285399 362536 404632 468469 458236 352330 329021 468130 550294 381441 125952
38517 125952 65646 183596 254646 226886 228704 273780 247509 161340 154508 237737 276495 245975
38505 245975 270514 376134 430667 386883 369719 440115 470983 366209 232470 206443 244525
38494 244525 214778 100991 -3333 -32393 19099 135052 259256 295355 212825 109359
38484 109359 93560 147641 176684 153678 137937 169061 212644 216969 184490 176419 248752 372736
38472 372736 435091 358648 209421 122512 129755 143956 120836 129727 216070 293934 260820 156183
38460 156183 115517 200031 348871 475161 533284 504191 393203 257873 182555 200403 267671
38449 267671 324180 352237 366578 371742 349708 285932 199968 147159 180339 296779 422758
38438 422758 465546 395762 278247 207890 211720 235098 234170 243090 308827 393865 414019 358483
38426 358483 288270 217442 102048 -30037 -63406 27437 106850 82593 71197 225630 478620
38415 478620 609606 524661 329576 157190 60421 50357 99183 120795 80712 96148 277787
38404 277787 505456 543044 367211 186836 126744 105030 62560 86126 214907 329726
38394 329726 346733 341652 370903 351049 242694 173822 229734 286407 217046 109271 99751
38383 99751 140055 121349 95168 155481 221552 172138 96447 159894 293821 285690 134898
38372 134898 40980 49295 2221 -118447 -99068 144543 368470 324863 99926 -37081 12061
38361 12061 128520 188201 171406 114083 68990 91827 188688 295710 350181 348856 318533
38350 318533 283040 272236 297912 310845 255338 170314 151076 211211 282950 350808 455942
38339 455942 553273 514237 325669 151581 126946 204854 271412 291215 267194 183228 80605
38328 80605 77466 207732 338640 349439 293149 272193 256424 161435 27784 -28280 5258
38317 5258 49341 96381 215398 396061 518899 510632 435848 403421 447570 523621 570843
38306 570843 559625 504711 440239 378408 314819 269808 266197 258632 171861 42419 19409 156547
38294 156547 302835 297825 193364 163945 255063 347444 343466 272165 213445 208292 242300 257137
38282 257137 204062 137392 191363 386804 541366 490064 327545 283682 400691 501536
38272 501536 473834 411866 433976 505919 520788 455661 375526 338528 343739 337030 259191 127744
38260 127744 50294 96705 193950 230511 220063 248201 297416 273518 194790 192741 301407
38249 301407 396246 378412 278846 147078 -8041 -121077 -82668 75333 168701 124545 94210
38238 94210 194524 306933 286843 222639 295513 487886 632808 685766 748888 862403 961596
38227 961596 1024048 1077574 1064035 879167 574351 349336 297005 302461 246248 166400 153412
38216 153412 211301 298106 396361 472976 475111 438414 485953 627003 670892 470216 162143
38205 162143 12603 69342 138404 98216 55541 128628 234154 219907 121328 130535 318117
38194 318117 521259 556363 446600 363912 406868 522625 612174 613605 493424 270090 71269
38183 71269 52440 196026 291745 202258 57233 69795 235590 358257 328256 213369 88023
38172 88023 -43713 -126809 -48827 160606 292316 238906 166574 255264 396988 356337 157050
38161 157050 71760 217378 383941 348306 180136 105586 183538 268502 245118 158099 102608
38150 102608 92500 78651 40174 15635 63674 208244 402519 539200 528373 392918 269838
38139 269838 281682 406458 509669 514616 493866 550816 649924 642975 468550 251473 171290
38128 171290 283349 496971 671456 696331 544501 313158 167193 174558 232167 214067
38118 214067 143890 138809 222754 295546 274450 177016 70569 19376 65367 175323 230244
38107 230244 165708 93361 159619 310689 359093 284406 275228 418247 540748 472952 301640
38096 301640 219652 251716 285109 273757 251872 216319 148378 96285 95380 69974 -32915 -80674
38084 -80674 85362 365295 484026 365708 220890 220699 285526 278882 224676 202192 168150
38073 168150 43132 -106670 -131179 -12175 112487 143520 134372 182902 285698 352071 329801
38062 329801 262586 216121 191938 156148 128112 167682 264144 319456 281093 211495 172172
38051 172172 132084 72549 80478 210849 341400 321848 208381 174268 228115 221420 126743
38040 126743 88023 156338 190910 102119 1114 7293 75396 119700 152609 189875 174655
38029 174655 116643 148107 300669 385548 270647 133225 223365 476919 596012 467762
38019 467762 279462 219312 261849 283823 234005 140981 65952 78461 189846 303394 313646
38008 313646 244492 204025 230019 279308 338094 423891 494292 473721 369768 259936 173115
37997 173115 86780 23171 33691 97211 143382 164541 196417 211908 158624 82987 83832 155121
37985 155121 209076 236503 292286 339614 289505 200907 243452 421906 535578 477852 382113
37974 382113 380413 410052 382251 361257 416965 452970 367465 268782 326254 477550 494855
37963 494855 324377 165768 185117 309357 367711 320819 267109 280035 313803 271728 141010
37952 141010 34941 70735 211497 292102 226134 115837 107474 208729 323239 404968 479691
37941 479691 543935 544871 465400 354636 264943 213829 208094 251775 326153 403184 474132 529266
37929 529266 531445 463336 382890 365534 394423 378116 290796 226208 275091 399366 477804
37918 477804 448731 355007 259336 178862 126071 152811 283504 426706 443764 330392 246028
37907 246028 306994 427066 449441 374264 337588 396934 471997 501592 526984 587982 654540
37896 654540 703845 758898 812877 828362 848849 979904 1216023 1449265 1714870 2206085
37886 2206085 2881242 3273424 2975449 2204545 1578003 1362721 1266087 1001462 709927 655165
37876 655165 783732 844581 778331 726710 743498 742803 701494 685734 670216 542330 325834
37865 325834 202436 235433 253293 123031 -15273 57041 311489 512399 531802 459821
37855 459821 413868 393926 354484 292526 218031 132940 78588 116957 227967 310187 320241
37844 320241 323719 367443 398071 365028 310591 287409 273461 244235 240050 274526 267736 175917
37832 175917 100457 144198 239575 262079 242384 297329 402401 425885 370229 374030 456258
37821 456258 467790 355334 271222 320175 376901 294233 151984 136879 265846 390687 430183
37810 430183 446822 501564 562362 586684 604947 667048 738715 705763 513842 289087 244286
37799 244286 415917 572978 489756 244774 103262 148339 223117 235398 283517 406601
37789 406601 444334 294263 123240 141021 299234 399113 387399 352413 312854 217237 108710
37778 108710 94753 164766 204320 181656 164966 163810 112710 20916 -10109 60338 169269
37767 169269 271205 373401 437525 382810 222067 78649 34537 63093 127391 223682 298053
37756 298053 249528 77364 -74425 -77849 55187 247152 451111 614302 645619 512526
37746 512526 317831 203026 205164 259145 301863 319262 320247 319789 338679 381800 419520 414829
37734 414829 369552 330714 344407 400367 431421 387520 300703 240721 221349 215974 251790 375292
37722 375292 505860 475454 291382 198342 340159 510350 440363 218002 158647 314465
37712 314465 407114 278018 114467 119075 207322 201007 129390 142366 251034 344652 389010
37701 389010 441199 513712 561837 570282 541102 443366 285192 183515 240869 390960 483006
37690 483006 482392 465912 453264 388355 286196 254328 332535 426492 447185 421683 412598 406351
37678 406351 348253 244884 173336 198898 305961 401901 395323 294746 212114 230497 296923
37667 296923 306878 262104 248379 269883 233027 126223 82541 184072 318551 344566 308541
37656 308541 352764 466689 501944 422329 356239 365843 349374 260196 247118 425696 640936
37645 640936 647982 455701 291678 259133 241209 162467 128242 221066 337443 345193 271839
37634 271839 220288 210940 228289 317314 489901 617133 572268 433885 394575 492687 583089
37623 583089 569487 518147 512574 521821 469850 355343 251653 227746 285642 347577 325729
37612 325729 245396 249254 405962 571436 552114 369736 232234 252879 339772 381374 398287
37601 398287 454260 531928 573359 571185 557891 554057 562465 566571 523938 423432 347651 389622
37589 389622 497900 511508 383672 263778 296756 433104 516458 492697 444871 450936 482280
37578 482280 454082 351503 289311 406514 666617 821706 673718 343704 155188 241465
37568 241465 403237 400049 253740 179845 312539 591257 861586 1006859 1014843 973602 977107
37557 977107 1007457 953057 761764 514712 322705 216354 170833 171450 212059 277978 357809
37546 357809 431341 453382 416876 406849 484443 540394 416484 177000 70504 170416 258599
37535 258599 169690 42391 61362 136378 71138 -78077 -85659 55117 107340 -23178 -136274
37524 -136274 -61401 83887 98593 1212 -42252 425 -1830 -111622 -215416 -182427 -26878
37513 -26878 137446 230359 237939 174534 89990 78883 189746 330543 360531 289209 272948
37502 272948 372978 448001 381113 284648 326222 450300 474962 414011 464563 658250 769783
37491 769783 659097 485993 448251 487821 430441 283915 205041 246165 316330 359058 407982
37480 407982 471800 496210 450312 353675 217861 48281 -97881 -138831 -64618 50417 134409
37469 134409 174620 195430 219646 249885 270939 279352 300995 345806 372394 363528 398143 535920
37457 535920 659125 589570 370790 248064 321193 416922 390130 338428 380734 426589 353954
37446 353954 248988 257910 336854 369596 412124 574620 752559 741454 574188 486461 560297
37435 560297 643975 626894 556068 462739 312334 172181 203594 415766 619269 687512 680574
37424 680574 655109 557017 390811 299334 355801 438521 431293 398565 432790 465673 384307
37413 384307 236771 166498 196390 214000 149582 63439 55068 145846 250481 245882 99000
37402 99000 -65189 -73499 108128 348402 503010 521741 422209 263458 153559 177331 292559
37391 292559 378408 379669 313013 176940 3545 -43837 164423 458346 506565 272837 82891
37380 82891 139982 247230 182706 82052 179464 368891 355810 147866 53412 195178 340279
37369 340279 288647 164301 183120 321835 384234 292154 159301 112003 147747 180231 169113
37358 169113 178094 292183 475899 567333 468570 292184 224806 275187 279023 157210 33072
37347 33072 41631 144172 222213 263249 334109 419478 420620 320604 233673 245697 298335 301758
37335 301758 286772 336385 403020 336341 127485 -8413 107022 361772 490237 415723
37325 415723 308845 310927 360116 343161 275737 234764 216614 178459 149420 177183 207599
37314 207599 148937 46057 58038 229943 399760 398609 262905 161513 159982 162819 92964
37303 92964 23684 68592 206491 310998 332167 338670 362124 323376 187636 81223 126209
37292 126209 233197 219940 104846 97681 274215 447130 443145 346434 340448 430472 475068
37281 475068 418161 336029 287287 253812 220871 197530 159420 80774 27210 106021 300547
37270 300547 452954 451612 356657 294447 291213 265620 151871 -14071 -122696 -93733 38966
37259 38966 158449 203200 238754 336501 423635 359722 162404 34738 116404 308752 423889
37248 423889 423325 405768 416943 401354 335414 286243 303670 344557 349978 327583 311085 300690
37236 300690 294738 320834 375345 389648 331811 290392 364046 507568 597137 619270 658013
37225 658013 698331 612080 395648 254554 334857 500287 524145 407030 333053 370660 410906
37214 410906 396032 413332 508827 572182 498777 349908 256422 249503 278919 326224 396139
37203 396139 440498 397010 293914 228684 235771 250859 230522 238917 353639 513254 542338
37192 542338 366839 145655 104338 253849 379215 333522 224905 230718 332851 373248
37182 373248 311029 264968 308340 370957 372264 326382 275595 227061 198692 233822 326744 410926
37170 410926 447472 447551 403025 301377 218864 266893 411892 484268 415306 325280 316450 333465
37158 333465 315934 326360 400217 421233 307729 193289 230597 317082 239480 39940 -2188
37147 -2188 226225 497146 538658 352001 154925 123691 261179 433051 476400 340979
37137 340979 159554 112788 211793 303781 305152 306461 398260 520747 577566 592830 634435
37126 634435 657766 569556 412735 337626 383460 434663 432813 480941 644447 782442 730709
37115 730709 571427 534111 650415 708712 588375 435439 408578 441644 416040 406376 539043
37104 539043 713813 713428 544202 417509 398854 336300 179434 103721 213950 361712 400105
37093 400105 412157 515493 618604 570996 425301 350257 374785 400488 393008 393673 410422
37082 410422 448893 568240 748633 802154 601605 308823 173697 194599 208220 226930
37072 226930 389029 603548 584100 306791 120355 255872 491185 497160 308922 215645
37062 215645 309344 394587 320776 197806 231799 463938 734426 863705 828881 750507 712333
37051 712333 649255 472076 251809 166232 270089 433416 519367 512440 459338 405973 415367
37040 415367 521542 639405 650863 595839 614588 676504 580145 302164 113427 199315 379489
37029 379489 405976 346370 410785 547076 525693 361458 316960 464786 561792 454210 331807
37018 331807 421414 637105 720845 593809 394622 262507 237643 307452 408367 427417
37008 427417 324422 215567 234947 362502 488108 578702 657430 682338 603990 508832 534880
36997 534880 648379 672826 555443 433068 400645 398484 389790 449102 562668 539677 298411
36986 298411 80875 160047 435613 561557 426613 259897 253990 327225 328531 271219 251445
36975 251445 281148 315945 351064 397776 434122 437783 407619 336537 246282 235305 360789
36964 360789 487230 434390 284339 308624 529403 620598 386967 82341 37843 197981
36954 197981 294306 298417 381214 532456 566546 480310 478479 609848 672314 554790 416900
36943 416900 425075 521186 562665 518661 427526 312264 227683 252423 356336 406902 367441
36932 367441 346523 394857 414397 342600 265045 259183 285597 326472 462171 690278 828366
36921 828366 742129 541687 413578 383233 386459 444958 593657 731905 733465 645759 613766
36910 613766 653817 659350 591075 509858 451271 411027 426776 529712 634348 621906 527641
36899 527641 503303 584778 635420 553132 414869 361645 421147 499772 513920 498190 581333
36888 581333 825479 1084172 1105417 832982 515451 423734 542645 658059 669276 657585
36878 657585 686065 702094 649776 544621 419627 304126 250513 268020 246969 85134 -118455
36867 -118455 -151440 13465 166404 146905 29311 -35904 -15226 56883 180729 330203
36857 330203 390485 281329 87554 -30899 -19436 51300 97740 87586 36280 1076 39293
36846 39293 126561 167292 126546 81900 92943 102779 47720 -12544 20679 121535 173015 141534
36834 141534 112502 152897 231820 293368 332650 372543 416076 446004 443194 399345 335131 297579
36822 297579 311786 348433 366541 365050 357003 324242 252638 190694 204404 271640 285107 183804
36810 183804 39089 -18371 63446 211467 306648 295401 223447 169404 166763 207781 291914
36799 291914 410111 488519 432859 263034 127795 130340 204686 230818 205705 206758 233882
36788 233882 204365 98637 7825 17181 116784 243618 349344 412174 430155 408357 325771
36777 325771 153642 -43598 -96499 73351 296853 335685 192511 89262 142004 235668
36767 235668 251952 230249 226370 194533 123679 127485 256440 358482 286393 132904 95726
36756 95726 202687 334627 429068 482200 436143 272321 156023 263556 493753 574882
36746 574882 446725 303957 255875 203392 107458 113755 291040 468863 482870 403327 375469
36735 375469 391951 373005 333652 322993 317402 306669 361149 483567 533648 444133 362333
36724 362333 409265 454906 341042 182636 195835 336277 387963 340335 373122 487527 471443
36713 471443 278330 139907 198567 290743 236010 120376 127277 259046 392577 475453 505945
36702 505945 433405 247492 88026 104653 250079 349136 343279 340264 429320 557650 611857
36691 611857 553242 446755 383170 383948 388776 351633 316863 340131 366138 291724 150258 105027
36679 105027 219260 355517 371485 307494 291800 345799 382401 345647 267372 214301 229581
36668 229581 292396 312851 227780 116565 130252 278488 399655 390427 338491 350622 377612
36657 377612 323661 226052 194369 238843 278826 270168 222225 143631 69180 82065 209166
36646 209166 347878 388440 346528 286670 200102 74430 2561 82563 263361 415642 495663
36635 495663 513628 423330 210211 24500 33444 169058 213313 123236 74836 171239 308227
36624 308227 378251 421584 494767 542389 493037 372268 248815 163782 156504 247574 350590
36613 350590 324107 169510 54824 74378 109672 18186 -150412 -232575 -162975 -7450 150786
36602 150786 261360 291953 253548 214472 225666 257536 255848 225860 219156 264769 337694 368568
36590 368568 290888 132361 39184 119237 272178 292777 148761 17182 16870 64461 62881
36579 62881 68185 151099 225606 161524 -15367 -167836 -231087 -239993 -232691 -235887 -292345 -400128
36567 -400128 -474243 -461272 -433646 -474689 -533967 -505370 -399012 -330947 -378639 -525966 -699785
36556 -699785 -795812 -750918 -662093 -723791 -958964 -1151307 -1162800 -1152521 -1315187 -1587804 -1842936
36545 -1842936 -2165296 -2580684 -2649966 -1810495 -180286 1389775 2209013 2361103 2299400
36536 2299400 2213455 2057180 1894533 1856585 1892478 1851630 1731627 1627760 1536701 1417490
36526 1417490 1338826 1350694 1321338 1140365 982112 1091279 1365093 1440848 1197222 891679
36516 891679 763952 764869 752595 719916 711256 697578 656093 645986 712419 818385 923675
36505 923675 1018247 1050311 965272 847826 858976 982887 1014916 867974 699550 643240 619613
36494 619613 547501 537048 679482 814456 742742 560083 530604 681266 765979 636278
36484 636278 432097 357761 437239 554555 614070 600095 557733 551732 594840 627279 622947
36473 622947 662187 799829 921134 874526 712314 626774 650648 616568 460437 364842 485856
36462 485856 696103 759054 663521 613360 715352 836508 805275 643231 526262 563025
36452 563025 684202 760788 780069 844489 996157 1117685 1065812 857626 645615 530950
36442 530950 489490 477268 507003 585800 657982 663741 609654 543208 493801 467407 466406 489180
36430 489180 530519 589388 655384 700562 718786 747624 798427 797564 679873 522827 486599
36419 486599 609893 757921 792813 709990 589266 505558 512923 616431 721348 706957 592752
36408 592752 530253 583007 632425 576745 503872 552827 696346 795842 812266 819222 833070
36397 833070 776303 630387 505833 507686 604355 681287 682141 652144 660548 716864 771268 782294
36385 782294 761407 742488 736675 747704 797312 875331 891429 765413 563269 443844 453957
36374 453957 484713 464385 468455 563825 662625 647338 559069 529989 574399 580444 502972 447404
36362 447404 531358 733686 912523 944201 838546 728272 725271 786505 774613 657959 562114
36351 562114 582961 647086 631262 533180 433572 368582 344343 404582 556911 682545 654513
36340 654513 521536 448614 489819 545774 544529 536512 584075 662439 708422 694075 627338 537901
36328 537901 470704 441990 412510 357603 330615 382265 456270 463647 431837 466385 576212
36317 576212 655059 640806 578441 510580 420578 316856 272150 331573 448374 536526 534411
36306 534411 428199 289041 262491 412105 587762 580591 414352 336728 485970 712617
36296 712617 797934 717834 601749 537807 522329 530656 542762 539421 535300 573812 649683 696820
36284 696820 692015 699682 767036 846688 875210 859991 834818 795293 732672 670588 618982 553686
36272 553686 486213 484010 571926 681944 748255 780781 800996 791055 761322 775242 837079 848220
36260 848220 761061 687281 746111 873201 896989 766922 602281 534075 578350 648547 637843
36249 637843 521672 417372 477713 677698 798979 704478 532912 512349 663777 817975
36239 817975 861739 826036 769244 712414 674064 650193 578244 429113 300856 302128 383713
36228 383713 424921 447662 572382 769694 845644 717653 541042 493509 566092 636396 634754
36217 634754 568899 478238 419761 415055 379114 203433 -61594 -228040 -211521 -116304 -31096
36206 -31096 99179 304135 447437 400892 251033 178889 202432 182295 43218 -134076
36196 -134076 -218334 -135409 88868 315047 382706 304694 292039 482099 730709 806464 703646
36185 703646 596257 552910 498000 422399 414795 469793 473669 424708 465609 623007 708411
36174 708411 590365 400983 337915 394238 431576 417553 432579 503642 578949 636957 697175
36163 697175 740714 724283 662034 609193 579223 549326 524787 526603 538665 533580 525499 536362
36151 536362 540692 502770 433911 362129 296909 276976 375204 573320 708694 651673 473572
36140 473572 332796 266559 221267 210437 276986 353898 349171 337966 466657 673168 728664
36129 728664 590870 481439 533860 599268 533505 458549 547052 713955 746736 637527 559650
36118 559650 572386 572610 525175 525015 596542 622817 547606 493064 576586 722979 771808 702396
36106 702396 637918 654291 692770 676505 627014 611823 622062 572545 425818 258089 173438
36095 173438 194740 277504 389916 518588 622658 658959 649131 650568 660309 624161 547761
36084 547761 510750 543373 571963 529969 454787 428175 474026 552170 605560 590174 511310
36073 511310 443157 449327 482312 446465 360004 339396 407361 455153 438760 459992 573332
36062 573332 662484 622916 535303 523833 557426 541673 508359 543277 598192 556820 450797
36051 450797 431855 533230 619678 594997 523333 509218 562484 621047 638406 626027 648869
36040 648869 763335 920935 983964 897676 783643 779693 850255 853187 737718 572295 430939
36029 430939 361247 410530 563817 698239 712380 659168 647570 673477 663151 615825 574701
36018 574701 525907 460759 459045 562814 657955 648563 642705 758865 859929 746579 534469
36007 534469 522417 709969 789374 657281 580085 729612 882486 777844 517044 381435
35997 381435 435419 528740 564762 568472 568943 568652 571625 547167 449042 337051 354653 509435
35985 509435 622662 591779 545400 619859 741506 777399 757478 778610 806267 749486 646380
35974 646380 604966 621756 611638 567373 552475 577506 599487 600694 574194 495147 399055 406578
35962 406578 562383 728304 750757 661063 598385 612201 660576 728095 813916 860345 817940
35951 817940 737576 695159 678484 641960 605183 600661 598081 575199 576634 605126 563755 427232
35939 427232 354456 479259 689980 781122 735198 683256 671966 660350 676406 768588 844095
35928 844095 765530 592574 526721 613223 687221 631322 509394 419809 381058 395032 472652
35917 472652 560134 570780 516506 490302 515279 539257 568311 651803 735754 703265 583629
35906 583629 548763 659179 777873 789034 740717 706312 666810 618002 643425 767293 854625
35895 854625 780427 617021 544899 632988 790127 885981 858423 750220 680533 721504 783630
35884 783630 715847 543105 473793 606248 765609 744020 587292 498913 542009 604513 625357
35873 625357 682022 829274 989464 1055386 1005508 873570 697075 550680 536412 650726
35863 650726 728162 629707 454341 436777 630622 829540 852282 768616 739507 756226 704926
35852 704926 619197 660454 840747 963094 896572 740615 639324 598697 589689 663306 814361
35841 814361 875354 731166 535628 518060 651360 723086 684069 686391 771772 771105 595441
35830 595441 423061 465896 679480 831777 782137 590976 409365 346160 410443 521769
35820 521769 594195 631786 699307 788346 791158 655788 499914 492605 646208 794105 782794
35809 782794 639011 518579 515384 574902 613863 658046 777175 916474 922112 761988 594197
35798 594197 551767 580772 583330 597004 693547 793566 750534 577040 435308 424852 510961
35787 510961 633040 744433 771186 680254 578289 601142 716447 778268 758574 760920 813531
35776 813531 833084 809160 830049 881254 817459 618669 491614 596308 812490 902670 799676
35765 799676 619584 485911 455727 542623 699280 824435 870642 898835 965838 1023804 998401
35754 998401 901060 794051 705507 645973 648054 719258 805321 857608 884084 889339 841221 759875
35742 759875 757405 896910 1068261 1099983 965066 795462 713425 719682 738161 712384 653286
35731 653286 618849 642474 684604 691462 691833 761951 882257 919899 798124 605326 483918
35720 483918 482582 570187 711626 850836 890277 788720 643450 586578 624551 662462 665303
35709 665303 700422 811146 931375 965689 909294 845711 838491 860226 843599 783636 748791
35698 748791 778978 823312 825563 826568 902816 1024143 1067694 983772 860023 796160 795933 814833
35686 814833 834138 842506 816276 771924 778098 859933 941007 933015 840188 729455 646348 612820
35674 612820 656738 770270 867241 857964 766599 716818 789228 931422 1022239 997026 891499
35663 891499 779983 703601 674318 720631 870839 1071446 1176251 1075657 826192 610226
35653 610226 567667 683451 817852 826907 687173 529879 515411 650248 779253 783104 706798
35642 706798 651647 637826 646702 697174 777135 794930 723296 700159 838019 1017057 1044035
35631 1044035 949541 923770 996633 1007784 897078 796562 789539 789637 732795 704073 784351 921713
35619 921713 1031377 1086350 1054739 902840 723719 700565 862536 1025384 1045752 977932
35609 977932 909166 820858 711808 677579 741592 773042 706610 679785 799189 928960 893732
35598 893732 761686 730092 827455 923361 960862 989241 1013782 989886 940964 932341 951235
35587 951235 940636 917287 932531 958351 938284 909045 944299 1016529 1038884 1006860 982564
35576 982564 987172 1027512 1161893 1391105 1543692 1447248 1189225 1032332 1075888 1174050 1197666
35565 1197666 1190751 1218445 1233977 1188861 1146238 1182055 1261441 1306086 1318902 1354506 1413534
35554 1413534 1454138 1486343 1571750 1719838 1847674 1874424 1819280 1766928 1758522 1767416 1769595
35543 1769595 1758879 1677076 1436937 1083911 825512 777553 775482 605105 344206 252433
35533 252433 352833 386395 214435 -13869 -188166 -442542 -861726 -1234885 -1333482 -1242319
35523 -1242319 -1174553 -1126083 -977539 -797964 -747885 -764883 -647449 -414800 -291609 -335441
35513 -335441 -359927 -263447 -171747 -184585 -210972 -147382 -32773 59566 128928 180344 192555
35502 192555 193747 225587 220047 90971 -42418 48370 332400 497208 394435 253292 298165
35491 298165 404606 359168 248411 296797 450193 446179 261261 168159 295721 417899
35481 417899 315116 125521 143436 395797 626708 663840 609317 630832 714751 725775 632028
35470 632028 551481 581426 679340 747442 763744 767228 755744 682800 560680 491708 550893
35459 550893 675280 727304 666248 604800 665487 814984 897436 832321 713789 675992 716599
35448 716599 725492 657996 589242 590820 637362 666020 664668 665776 700545 786037 913304 1027911
35436 1027911 1067079 1030452 969550 909901 847339 812857 847826 904598 876324 754803 655949
35425 655949 653804 697774 733795 783413 844500 845265 778305 752566 816186 856163 787995 715567
35413 715567 760597 850838 847669 793262 842668 1000357 1103793 1048710 879570 678880 509684
35402 509684 442467 494540 561297 541535 499780 560745 682365 706741 618952 568159 616696
35391 616696 650147 580346 476344 435815 464237 538353 661768 795790 848218 795345 724393
35380 724393 707598 722927 736518 766930 822376 861293 859521 842464 820797 768944 687334 609019
35368 609019 538148 472071 480748 641263 872605 969615 858383 706894 713833 875605 1028117
35357 1028117 1047891 952460 855049 860580 964204 1044603 1011982 940581 962239 1055251 1073901
35346 1073901 983966 906985 901181 872953 771863 697725 709666 693748 562872 449606 527614
35335 527614 739469 883123 903227 911249 953919 957588 910573 915223 1006901 1073439 1024841 918681
35323 918681 842324 786940 731224 743117 872007 1013001 1023194 937129 913940 974959 965382
35312 965382 826989 735551 843308 1016032 1001337 793041 637782 683356 803497 819689
35302 819689 737206 673635 675343 710362 760920 821333 858566 860844 880711 954768 1022513 997361
35290 997361 887289 786205 773103 857163 977991 1027494 934713 771341 706916 817300
35280 817300 1009595 1169096 1277883 1337955 1303611 1180277 1075398 1045758 1004563 895019
35270 895019 833536 928300 1066389 1070220 987073 1009811 1144759 1183550 1030320 855902 856466
35259 856466 1014234 1183477 1293099 1360252 1376379 1293151 1123020 985089 1006542 1181495
35249 1181495 1365989 1439241 1426776 1414194 1408708 1394291 1449497 1625906 1748342 1582256 1223980
35238 1223980 1049330 1191095 1359243 1318291 1230860 1307263 1413310 1330560 1167791 1172416
35228 1172416 1313868 1400572 1457069 1622746 1801709 1792675 1676319 1693141 1810082 1802828 1713623
35217 1713623 1804504 2063855 2184880 2071193 1961201 2000987 2088647 2196065 2439706 2761590
35207 2761590 2947092 3031895 3267836 3620064 3774977 3719941 3727812 3592939 2573398 513715
35197 513715 -1556499 -2503522 -2363293 -1997019 -1853003 -1712884 -1426305 -1187218 -1082768
35188 -1082768 -939804 -704392 -544468 -511092 -465478 -384622 -393343 -455841 -373618 -141936 9359
35177 9359 -11317 -44979 -2023 7105 -56435 -49065 81727 175731 141455 123834 245589 386375
35165 386375 381782 282330 254272 339528 454420 536007 567524 530638 439833 371487 372090 381905
35153 381905 324549 238399 248428 411855 633515 747332 679361 522537 429896 445816 496616
35142 496616 537539 604097 689014 697949 604440 525908 545286 581794 562026 583472 739371
35131 739371 904815 908276 821057 834490 914234 856350 678289 652688 880836 1110326 1110454
35120 1110454 993375 983875 1057196 1026126 876653 784191 818478 831532 686172 462422 359290
35109 359290 455500 639596 761572 793798 815246 875333 939133 968936 976762 954021 839512
35098 839512 646713 546137 685921 963502 1122328 1074925 977693 960182 953847 876076 823830
35087 823830 926756 1099893 1124703 959103 800640 806172 892964 902674 854869 904849 1084194
35076 1084194 1219360 1146406 916479 726776 701205 802084 922132 990627 994914 958931
35066 958931 916895 881847 843192 811383 832011 917243 1000084 1012238 976967 964560 988677
35055 988677 1015055 1034029 1040297 983245 846475 742829 795782 937226 971374 854041 753749
35044 753749 794107 891043 919370 900113 921512 983145 1024972 1031337 1012147 948783 843900
35033 843900 766129 770740 828245 887337 942938 987030 969267 876726 789523 791179 873968 974500
35021 974500 1037438 1012772 882832 740054 737270 893245 1037603 1018484 879821 765322
35011 765322 736100 759455 795962 817482 804181 784868 813103 863335 841208 736361 656000
35000 656000 662313 701739 746326 856933 1031992 1151482 1169065 1200508 1305072 1345805 1214771
34989 1214771 1036903 972032 960130 871369 785929 878947 1094223 1182117 1055460 892140
34979 892140 862576 939674 1017256 1060869 1084715 1088294 1064728 1009076 911662 797388 742344
34968 742344 781727 843043 851153 849983 926190 1060401 1158936 1195881 1221038 1257727 1288999 1316510
34956 1316510 1345223 1341909 1290129 1246614 1262287 1291185 1259200 1180285 1128379 1136039 1182412 1230208
34944 1230208 1230090 1163668 1116101 1193401 1328820 1330829 1195179 1171611 1387603 1608586 1568109
34933 1568109 1358599 1252780 1282173 1276131 1224596 1287673 1460579 1526638 1393067 1228579
34923 1228579 1195257 1244640 1256341 1210348 1145741 1087718 1082272 1183823 1350955 1457234 1451495
34912 1451495 1416200 1431940 1470130 1455123 1366531 1255796 1204629 1263914 1399968 1530723 1636568
34901 1636568 1758191 1851555 1779718 1544436 1385253 1497692 1765562 1940669 1983682 2031899
34891 2031899 2117146 2143751 2105117 2099383 2141773 2167387 2213623 2388048 2638943 2766494 2708700
34880 2708700 2633015 2685594 2811205 2891634 2931316 3033573 3279996 3670455 4107090 4429620
34870 4429620 4539158 4468619 4265167 3883507 3321810 2776536 2472932 2379245 2280032 2110433
34860 2110433 2008660 2025953 1997453 1758985 1321246 778845 215579 -238641 -426580 -341938
34850 -341938 -175068 -96374 -84803 -34699 62938 126718 112380 64279 58964 122149 189571
34839 189571 168002 62839 2074 84916 258766 406084 489119 534421 548150 543168 582428
34828 582428 687869 762145 704525 553674 426529 380004 415022 529022 671269 744271
34818 744271 743318 778288 866537 866483 741618 694557 852251 1009646 925691 708252 631372 708009
34806 708009 744798 717246 770778 907120 980908 980665 1023070 1089256 1049371 932695 896167
34795 896167 941619 941247 918800 1009438 1157640 1170672 1074512 1088433 1219793 1222843 1023225
34784 1023225 854192 877449 975045 1024987 1091842 1216726 1279713 1203671 1074775 963634
34774 963634 848254 785978 909827 1164724 1300381 1226937 1132860 1154609 1188606 1144525 1122272
34763 1122272 1192561 1237941 1166280 1077685 1077912 1113539 1116192 1128314 1176360 1196986 1177296 1184042
34751 1184042 1191091 1092941 948177 959441 1133243 1229087 1146954 1079247 1144333 1163998 990790
34740 990790 790026 774274 871136 878347 782721 722372 760516 855566 939498 921717 759387
34729 759387 597789 653731 888661 1023430 959825 921117 1053301 1173966 1095967 936305
34719 936305 890082 922959 907349 869906 891215 928758 932242 974508 1093802 1166634 1097567
34708 1097567 975868 909421 882117 889870 995388 1121700 1049327 776980 613643 727122
34698 727122 885548 864385 809839 921821 1058882 992917 830783 829462 961061 1004053 935391
34687 935391 908175 948143 974406 1019753 1140097 1206677 1080765 903583 920439 1096996 1202399
34676 1202399 1201533 1257505 1383310 1401466 1266656 1159032 1206803 1323246 1365695 1301598 1192258
34665 1192258 1125076 1153347 1224082 1224118 1159324 1162786 1245361 1222708 1023493 864495 934126 1103349
34653 1103349 1169194 1181475 1265140 1310925 1158776 945844 937515 1105011 1196451 1162504 1187665
34642 1187665 1330770 1446589 1464515 1461342 1445357 1331494 1154125 1065359 1093736 1115054 1079023
34631 1079023 1066462 1109940 1142607 1134702 1122943 1119420 1133473 1227599 1394499 1464939 1328167
34620 1328167 1151532 1160616 1287890 1287974 1132851 1023941 1052762 1123295 1194721 1326448 1468450
34609 1468450 1467129 1318795 1193401 1175675 1189860 1195211 1238988 1291745 1242586 1094875 980204
34598 980204 956223 966044 993609 1067253 1121334 1066566 991659 1068189 1250640 1312867 1208041
34587 1208041 1141607 1231493 1343303 1351833 1338308 1408858 1505757 1527132 1489526 1460708 1450560
34576 1450560 1457155 1509715 1589851 1613629 1556281 1498463 1497730 1509845 1481348 1426920 1377319 1340050
34564 1340050 1341897 1421312 1547922 1626608 1603885 1509498 1398002 1317257 1313262 1385343 1459139
34553 1459139 1481773 1506202 1596866 1703281 1727547 1665327 1574487 1464634 1338324 1281672 1376339
34542 1376339 1560114 1694820 1726753 1675875 1550586 1406357 1392278 1568939 1758144 1753000
34532 1753000 1604062 1506402 1480463 1391265 1233161 1148373 1172909 1202187 1218639 1316969 1471878
34521 1471878 1517102 1421426 1369325 1476509 1614706 1626344 1552907 1529360 1573947 1605653 1593029
34510 1593029 1581702 1613945 1686337 1758652 1772683 1698257 1582089 1518758 1557998 1653474 1694627
34499 1694627 1591591 1376872 1226803 1299944 1531444 1689380 1670475 1613265 1660604 1760873
34489 1760873 1803659 1804435 1822033 1819386 1747640 1658025 1596772 1506761 1371409 1325414 1460182
34478 1460182 1639346 1680879 1616333 1599887 1665915 1747532 1830381 1917518 1946681 1903630 1896339
34467 1896339 1958353 1932876 1735897 1558795 1586310 1691090 1668231 1598395 1673448 1815020
34457 1815020 1812700 1729542 1801340 1998335 2061861 1953628 1896333 1951358 1922659 1744473 1623601
34446 1623601 1689143 1791071 1767300 1667960 1599699 1555622 1507695 1497846 1550752 1629849 1718023
34435 1718023 1811112 1837361 1739269 1614250 1601364 1661427 1660327 1626736 1703286 1867473 1936934
34424 1936934 1849880 1720230 1623684 1550065 1547241 1670978 1803236 1771649 1648999 1676531 1880506
34413 1880506 2030020 2000639 1911842 1861842 1796973 1712742 1724933 1846852 1926970 1906873 1926504
34402 1926504 2062010 2153486 2030677 1774635 1626660 1706919 1901451 1997046 1911816 1800856
34392 1800856 1870417 2071813 2131417 1953270 1778729 1803705 1883819 1844092 1825427 2007649
34382 2007649 2212553 2167848 1995973 2018675 2198853 2225744 2077986 2030813 2126200 2112462
34372 2112462 1941501 1862873 1953482 1997067 1923471 1933977 2073613 2104941 1954162 1876507 2009338
34361 2009338 2144278 2122949 2088630 2151545 2165704 2056324 2028533 2209125 2385494 2349123
34351 2349123 2227905 2231878 2312708 2316933 2261475 2227220 2170885 2055501 1994876 2076408 2198269
34340 2198269 2244099 2257430 2301555 2318544 2260481 2186856 2116703 1974762 1791539 1739849 1848437
34329 1848437 1903207 1773599 1614829 1591686 1622022 1573289 1514534 1574679 1703995 1762426 1733773
34318 1733773 1708840 1751788 1875843 2040738 2120299 2018216 1854636 1857181 2028404 2133558
34308 2133558 2065848 1978343 1976293 1944289 1804843 1698269 1743235 1830070 1821624 1781197 1834017
34297 1834017 1947446 2002746 1977050 1938644 1952745 2058824 2239413 2378924 2373426 2287801 2264782
34286 2264782 2299174 2276355 2202717 2188089 2225220 2215500 2185985 2230897 2270799 2155140 1983237
34275 1983237 2008118 2217222 2337643 2282566 2253329 2353547 2448198 2472650 2536583 2635821 2598627
34264 2598627 2416712 2308444 2361333 2426705 2440989 2512857 2618253 2573421 2404275 2370286
34254 2370286 2515537 2578059 2461866 2398350 2495002 2533659 2396550 2294748 2372417 2467601
34244 2467601 2474536 2557636 2774644 2868109 2691945 2489185 2474965 2485777 2331936 2175178
34234 2175178 2239229 2417723 2481485 2449396 2468878 2524597 2519295 2474789 2451844 2436972 2449304
34223 2449304 2559362 2699390 2702820 2615176 2662537 2827735 2824969 2615595 2537989 2745082 2930509
34212 2930509 2843568 2671931 2650453 2681226 2634008 2649967 2826318 2942349 2833337 2725905
34202 2725905 2868189 3117680 3234812 3318943 3604893 4044249 4410737 4642300 4810997 4930414
34192 4930414 5011906 5117505 5183097 5031239 4721758 4600956 4823776 5133120 5289321 5373126
34182 5373126 5464631 5402823 5119850 4856881 4779593 4718745 4544673 4433651 4488805 4473149
34172 4473149 4226182 3986790 3985725 4062537 4000438 3895061 3876882 3822901 3666928 3631372 3812055
34161 3812055 3906338 3717900 3554459 3720233 3972272 3925674 3689459 3640196 3808604 3924736
34151 3924736 3878146 3756658 3608253 3480739 3503556 3667477 3753278 3694573 3711097 3877663
34141 3877663 3942555 3813365 3784066 3983677 4068718 3822973 3591397 3704518 3929848 3947408
34131 3947408 3919840 4087656 4222163 4036339 3782139 3873814 4204551 4364366 4279979 4156464
34121 4156464 4043454 3913607 3904960 4061731 4124519 3970303 3911392 4155737 4378678 4277711
34111 4277711 4111199 4186654 4277498 4115726 4001341 4277678 4623880 4564241 4306731 4351286
34101 4351286 4600359 4616117 4472286 4557736 4754258 4621005 4263166 4224144 4565754 4797371
34091 4797371 4719702 4650734 4770143 4864792 4805315 4740596 4741513 4696820 4603307 4587923 4661597
34080 4661597 4763644 4937671 5163314 5217908 5033045 4919747 5079022 5219912 5079805 4944678
34070 4944678 5151060 5450458 5439342 5264327 5281056 5344616 5109736 4758539 4739716 5000169
34060 5000169 5139093 5128060 5229642 5389858 5356139 5231033 5291865 5432343 5376515 5250196
34050 5250196 5346543 5540330 5534504 5454764 5589025 5787541 5749261 5636968 5757047 5910316
34040 5910316 5749968 5505124 5623419 5955728 6040516 5945195 6052140 6246474 6125893 5824799
34030 5824799 5815066 6043138 6070363 5936452 6077126 6478227 6689322 6609347 6536399 6529667 6419539
34019 6419539 6327452 6481510 6662985 6528067 6301128 6441360 6820479 6958148 6860860 6882853
34009 6882853 6982001 6883310 6750245 6908003 7136562 7033826 6822554 6973843 7304385 7310924
33999 7310924 7125352 7236449 7530186 7539047 7390367 7549645 7863096 7832277 7608694 7721525
33989 7721525 8042833 8036476 7812602 7897822 8174785 8114922 7861468 7994688 8408468 8516375
33979 8516375 8383928 8534759 8824466 8675950 8272141 8320180 8755348 8875612 8654784 8715477
33969 8715477 9085581 9189992 9011145 9070340 9333900 9316065 9160470 9425270 9926347 10009144
33959 10009144 9805534 9968123 10354337 10293973 9961000 10095752 10554428 10567044 10252544 10393377
33949 10393377 10885222 10959342 10777212 11176401 11955185 12099745 11657151 11668209 12254217 12501533
33939 12501533 12259448 12302775 12678867 12665401 12402935 12756838 13518003 13603075 13093379 13157501
33929 13157501 13884194 14179980 13915173 14112657 14854473 15106875 14826563 15105887 15993621
33920 15993621 16337574 16037563 16241978 17053157 17315911 16953913 17164413 18004781 18219653
33911 18219653 17775461 18038073 19088367 19488140 19097717 19396090 20571638 21137265 20918796
33902 20918796 21455290 22870481 23442042 22938372 23188374 24593842 25376907 25111526 25577013
33893 25577013 27189792 28124817 27971182 28597754 30347505 31216707 30929651 31768210 34129000
33884 34129000 35543329 35456111 36435553 39148884 40971775 41251843 42802585 46309106 48754269
33875 48754269 49468929 51812852 56545140 60004851 61488429 65272669 72263654 77631253
33867 77631253 80388136 86294814 96751241 105139647 109986060 119769293 136908527 151137638
33859 151137638 159685714 175973841 197967639 184329841 94996177 -46325608 -161982986
33852 -161982986 -200886389 -184131254 -161622648 -151267605 -140127381 -122773473 -109436490
33845 -109436490 -103800053 -97556268 -87366100 -79578083 -76668208 -73074685 -66431441 -61289008
33837 -61289008 -59595512 -57379902 -52947885 -49743018 -49066272 -47605863 -44122460 -41702075
33829 -41702075 -41524596 -40677198 -37943626 -35971611 -35922731 -35331324 -33046668 -31347177 -31384097
33820 -31384097 -31095700 -29370673 -28052067 -28136358 -27915364 -26496004 -25486711 -25658065 -25398380
33811 -25398380 -23955616 -22925900 -23106151 -22996466 -21796158 -20891602 -21031938 -20905230 -19845296
33802 -19845296 -19189844 -19615342 -19748220 -18756230 -17843903 -17876877 -17874314 -17122859 -16542127 -16718734
33792 -16718734 -16719159 -16036289 -15662214 -16090436 -16239401 -15468874 -14750543 -14771147 -14745117 -14151240
33782 -14151240 -13806341 -14162433 -14312269 -13726553 -13270894 -13493279 -13581354 -13014354 -12595030
33773 -12595030 -12834553 -12926592 -12342545 -11877152 -12082036 -12184708 -11611803 -11119529 -11341300
33764 -11341300 -11603660 -11259822 -10884266 -11070183 -11275520 -10924809 -10511685 -10585880 -10718159
33755 -10718159 -10438664 -10177396 -10348810 -10482118 -10138168 -9756015 -9777664 -9848115 -9631772 -9494987
33745 -9494987 -9665926 -9656949 -9214863 -8901879 -9059954 -9153263 -8804659 -8515250 -8674724 -8821354
33735 -8821354 -8578301 -8378145 -8557368 -8656442 -8321878 -8006333 -8083321 -8148552 -7877356 -7696622
33725 -7696622 -7923015 -8094785 -7837689 -7553532 -7591447 -7585711 -7277791 -7135553 -7462074 -7724561
33715 -7724561 -7479554 -7164018 -7257179 -7436372 -7286361 -7100026 -7243909 -7422205 -7281621 -7096226
33705 -7096226 -7176963 -7230176 -6947048 -6622689 -6587058 -6621256 -6492501 -6444230 -6623510 -6668302
33695 -6668302 -6383839 -6167548 -6261514 -6281281 -5991224 -5810695 -6014667 -6182557 -6003283 -5866961
33685 -5866961 -6063296 -6159422 -5815769 -5478695 -5594209 -5842306 -5820110 -5778837 -5993779 -6104456
33675 -6104456 -5808008 -5538265 -5707803 -5915842 -5676405 -5319187 -5364983 -5566693 -5397035 -5010301
33665 -5010301 -4911178 -5070915 -5123510 -5073679 -5118913 -5128623 -4947892 -4855645 -5105836 -5380451 -5281824
33654 -5281824 -4989939 -4878037 -4883037 -4801110 -4774453 -4935719 -5013615 -4833031 -4736870 -4969593
33644 -4969593 -5154362 -4957090 -4727873 -4853931 -5023820 -4827212 -4558085 -4666646 -4889790
33635 -4889790 -4724583 -4357809 -4311081 -4502293 -4471314 -4263691 -4294531 -4540728 -4619785 -4513451
33625 -4513451 -4521252 -4632285 -4580604 -4396129 -4321685 -4327636 -4239461 -4162312 -4265482 -4368070 -4253865
33614 -4253865 -4141792 -4307320 -4512084 -4382724 -4089693 -4048297 -4189075 -4145159 -3953185 -3939781
33604 -3939781 -4078449 -4069191 -3924430 -3902385 -3981340 -3940343 -3833589 -3869446 -3962782 -3907848 -3825054
33593 -3825054 -3927910 -4037800 -3868540 -3608290 -3654618 -3929327 -4025487 -3897661 -3833964 -3861428
33583 -3861428 -3761711 -3596701 -3645261 -3859164 -3920127 -3806373 -3787244 -3883881 -3847810 -3671984
33573 -3671984 -3626885 -3757014 -3793978 -3622117 -3440376 -3419140 -3524838 -3683553 -3821831 -3796011
33563 -3796011 -3569259 -3367548 -3379470 -3449470 -3372448 -3291128 -3430317 -3637614 -3614765 -3440940
33553 -3440940 -3422513 -3560155 -3616468 -3597119 -3701804 -3875900 -3864916 -3672983 -3550749 -3565082
33543 -3565082 -3570248 -3559994 -3665448 -3840267 -3904790 -3862435 -3852826 -3873746 -3870378 -3978431 -4322070
33532 -4322070 -4691603 -4798795 -4742113 -4837893 -5101870 -5292934 -5361885 -5438160 -5457098 -5233650
33522 -5233650 -4865201 -4654444 -4654621 -4660900 -4610860 -4620357 -4658472 -4555599 -4313712 -4074553 -3826209
33511 -3826209 -3472132 -3122121 -2965269 -2920524 -2765972 -2541864 -2459466 -2485722 -2411718 -2281570
33501 -2281570 -2346703 -2607826 -2792247 -2793564 -2767302 -2780302 -2725762 -2611948 -2591859 -2666460 -2670893
33490 -2670893 -2587324 -2573035 -2646617 -2631738 -2455305 -2255602 -2166810 -2204601 -2348816 -2533575
33480 -2533575 -2602987 -2488043 -2357905 -2384384 -2463267 -2409220 -2301009 -2349187 -2524970 -2615828
33470 -2615828 -2567943 -2492593 -2418343 -2314177 -2266575 -2355001 -2445571 -2379722 -2258982 -2270867 -2362586
33459 -2362586 -2372995 -2339990 -2367502 -2346558 -2150709 -1954963 -1990701 -2123990 -2068801 -1893281
33449 -1893281 -1898856 -2095976 -2229575 -2254983 -2352173 -2506020 -2508405 -2374605 -2340392 -2426444 -2402560
33438 -2402560 -2217429 -2085642 -2103489 -2134278 -2121872 -2178146 -2306871 -2357846 -2304294 -2273395 -2273706
33427 -2273706 -2183825 -2031069 -1987552 -2064439 -2090417 -2014060 -1959515 -1970727 -1958691 -1903262 -1861107
33416 -1861107 -1794853 -1642312 -1516257 -1579094 -1763905 -1870013 -1868434 -1859440 -1827596 -1722276 -1667548
33405 -1667548 -1778363 -1886421 -1790639 -1654590 -1764727 -1999305 -1974565 -1666274 -1438727 -1460543
33395 -1460543 -1529250 -1506266 -1499774 -1547982 -1516903 -1403119 -1384347 -1486435 -1530666 -1480746 -1514024
33384 -1514024 -1675797 -1782127 -1746631 -1706498 -1747728 -1782489 -1762715 -1751470 -1735080 -1623789 -1474593
33373 -1474593 -1458670 -1581288 -1677892 -1693580 -1723395 -1789874 -1826798 -1849527 -1894237 -1857963 -1673076
33362 -1673076 -1545881 -1703662 -1995965 -2095235 -2004974 -1987666 -2068728 -2037501 -1897421 -1866372
33352 -1866372 -1929025 -1841441 -1620538 -1580447 -1799295 -1972570 -1906259 -1765034 -1710789 -1663656
33342 -1663656 -1559756 -1515094 -1588323 -1654943 -1628942 -1569890 -1510452 -1417894 -1350566 -1406151 -1519687
33331 -1519687 -1559710 -1572601 -1658984 -1703031 -1550314 -1348839 -1345760 -1455611 -1434118 -1355786 -1455214
33320 -1455214 -1612130 -1524154 -1308232 -1348765 -1585808 -1578656 -1294800 -1177496 -1343545 -1392278
33310 -1392278 -1178027 -1096492 -1348721 -1555699 -1426060 -1232957 -1270515 -1354271 -1242240 -1093355
33300 -1093355 -1118701 -1175498 -1080870 -975923 -1031440 -1116671 -1077340 -1029700 -1087005 -1108428 -998545
33289 -998545 -938386 -1041432 -1093171 -910939 -666078 -583781 -607985 -606527 -620333 -680767 -668076
33278 -668076 -558436 -519106 -584793 -559851 -389766 -265083 -220202 -51125 221814 293048
33268 293048 154613 210949 585052 874239 872283 934689 1290961 1624509 1737407 1972282
33258 1972282 2503505 2922958 3097552 3602756 4437012 4095696 1203060 -3272673 -6709831
33249 -6709831 -7723142 -7257591 -6758225 -6471363 -5978092 -5346649 -4973707 -4847975 -4663533
33240 -4663533 -4384120 -4197213 -4106810 -3965790 -3775331 -3647965 -3576386 -3472602 -3355161 -3318919
33230 -3318919 -3374872 -3432541 -3391991 -3210505 -2956909 -2806024 -2866765 -3016691 -3032186 -2870893
33220 -2870893 -2685864 -2579106 -2506117 -2429963 -2406234 -2473313 -2570194 -2595893 -2492577 -2292674
33210 -2292674 -2131567 -2141776 -2277014 -2348401 -2298702 -2283330 -2382834 -2434811 -2311145 -2160481
33200 -2160481 -2161267 -2215462 -2139970 -2010188 -2034617 -2199655 -2316835 -2335974 -2338234 -2293174 -2104086
33189 -2104086 -1849288 -1712026 -1701660 -1688738 -1671605 -1751639 -1882767 -1917081 -1885639 -1964197 -2148767
33178 -2148767 -2225636 -2103230 -1941165 -1894569 -1924844 -1913766 -1805473 -1612569 -1426342 -1408326
33168 -1408326 -1611876 -1838514 -1848518 -1686191 -1604312 -1690529 -1782608 -1757059 -1685474 -1665248 -1681855
33157 -1681855 -1693108 -1704490 -1721222 -1740469 -1794211 -1886294 -1917154 -1808846 -1666350 -1654067 -1742981
33146 -1742981 -1754756 -1638314 -1520498 -1483453 -1474815 -1459746 -1490903 -1583930 -1659551 -1649339 -1558518
33135 -1558518 -1419422 -1284816 -1249094 -1356347 -1502296 -1545802 -1497488 -1478626 -1523227 -1555087
33125 -1555087 -1539519 -1519499 -1509338 -1480211 -1446953 -1454824 -1488807 -1497840 -1487312 -1491264 -1492744 -1475534
33113 -1475534 -1502433 -1620522 -1734582 -1703980 -1535506 -1367258 -1296803 -1326372 -1423144 -1523679
33103 -1523679 -1537301 -1455386 -1392348 -1416200 -1434314 -1371338 -1342852 -1479724 -1676677 -1715887 -1580656
33092 -1580656 -1448037 -1408610 -1391393 -1354713 -1363763 -1455249 -1565449 -1615347 -1577209 -1476013 -1401311
33081 -1401311 -1455654 -1602156 -1651061 -1502766 -1297975 -1205729 -1191406 -1149097 -1127043 -1223635 -1370201
33070 -1370201 -1428457 -1416486 -1435256 -1462124 -1427988 -1404802 -1488127 -1580202 -1529649 -1407508 -1395419
33059 -1395419 -1475500 -1493768 -1457380 -1482376 -1509136 -1385796 -1201835 -1206717 -1395286 -1508854 -1473823
33048 -1473823 -1491400 -1629221 -1682601 -1561835 -1477252 -1567393 -1644518 -1517678 -1317109 -1272233
33038 -1272233 -1367590 -1441463 -1461543 -1481348 -1453691 -1312822 -1163073 -1181535 -1365499 -1533875
33028 -1533875 -1559997 -1479809 -1385721 -1318802 -1269833 -1220367 -1173236 -1159405 -1196418 -1244378 -1244993 -1192128
33016 -1192128 -1113475 -1017779 -934193 -948184 -1081324 -1185136 -1107762 -937792 -904806 -1039142
33006 -1039142 -1125691 -1031476 -882697 -841268 -883755 -907756 -910984 -942861 -983792 -986147 -961357
32995 -961357 -937165 -894001 -819748 -769899 -807004 -922103 -1055155 -1147805 -1158493 -1087585 -1003831
32984 -1003831 -982416 -1009418 -1012563 -975190 -935548 -890870 -810502 -737580 -757016 -853186 -917780
32973 -917780 -912992 -907725 -935655 -943757 -910765 -895018 -928372 -973683 -1016124 -1080867 -1133656 -1093230
32961 -1093230 -984188 -947083 -1037819 -1137062 -1126244 -1042450 -983494 -961771 -941024 -935213 -971513
32950 -971513 -1004047 -956259 -836284 -748013 -779448 -902385 -989796 -941840 -797399 -691914 -700945
32939 -700945 -784461 -895362 -1035893 -1155095 -1124488 -927234 -750874 -746093 -799889 -719060 -538911
32928 -538911 -445184 -474081 -533945 -673101 -1041148 -1562372 -1920593 -1948762 -1809230 -1703216
32918 -1703216 -1616014 -1460434 -1284653 -1202224 -1241725 -1363184 -1510524 -1584418 -1494661 -1301394
32908 -1301394 -1172774 -1156506 -1144439 -1102726 -1143824 -1291140 -1372696 -1272904 -1117446 -1069347 -1094772
32897 -1094772 -1080763 -1046680 -1068145 -1094184 -1014960 -852755 -736337 -720561 -749718 -770614 -785142
32886 -785142 -810926 -853306 -889614 -855282 -708184 -524643 -437697 -456785 -464949 -422660 -426222
32875 -426222 -510053 -557210 -495020 -414711 -383985 -308553 -128167 7449 -52175 -192032 -180252
32864 -180252 -5796 135049 143280 112159 133692 187592 226314 215754 83233 -233247 -670073
32853 -670073 -1094426 -1473317 -1857011 -2204996 -2395283 -2440930 -2533445 -2791154 -3094309 -3270397
32843 -3270397 -3346659 -3503846 -3829159 -4214087 -4473996 -4493001 -4274498 -3932436 -3634992 -3483364
32833 -3483364 -3419477 -3295788 -3052796 -2785524 -2615528 -2546466 -2488263 -2387494 -2275126 -2199128
32823 -2199128 -2169147 -2168627 -2166406 -2112256 -1982292 -1840776 -1788116 -1823209 -1831019 -1745062 -1644181
32812 -1644181 -1629909 -1681629 -1710328 -1693937 -1669316 -1636395 -1569222 -1500170 -1503508 -1598326 -1727521
32801 -1727521 -1817661 -1816677 -1716212 -1589498 -1547962 -1596096 -1602640 -1495355 -1392310 -1422345 -1503341
32790 -1503341 -1457803 -1295187 -1205070 -1282813 -1421506 -1481193 -1424170 -1279432 -1112842 -1040965
32780 -1040965 -1137424 -1307372 -1373866 -1294807 -1181570 -1120101 -1106568 -1138308 -1213075 -1248853 -1167718
32769 -1167718 -1052921 -1051868 -1134057 -1140890 -1072822 -1098262 -1247782 -1346099 -1318813 -1318651 -1434449
32758 -1434449 -1511543 -1414636 -1261083 -1212449 -1207623 -1100936 -934799 -878522 -984370 -1171417
32748 -1171417 -1370469 -1529792 -1555098 -1403991 -1191194 -1070272 -1061351 -1099936 -1173303 -1281169
32738 -1281169 -1341341 -1283328 -1185380 -1179357 -1253757 -1276400 -1188460 -1067770 -1017826 -1075715 -1197437
32727 -1197437 -1268513 -1186726 -1003240 -904865 -977494 -1082926 -1073665 -1024429 -1103892 -1294188 -1408119
32716 -1408119 -1355870 -1239769 -1183152 -1190763 -1191346 -1125879 -988801 -847407 -799824 -856954 -914987
32705 -914987 -908549 -913716 -1005939 -1102508 -1079522 -981911 -965005 -1060447 -1151264 -1168118 -1165032 -1191918
32693 -1191918 -1222981 -1232110 -1229296 -1207780 -1156916 -1131779 -1199002 -1303718 -1308369 -1189157 -1078739
32682 -1078739 -1072983 -1103950 -1065556 -975619 -936128 -987938 -1076490 -1134706 -1145687 -1133482 -1126947 -1132557
32670 -1132557 -1128190 -1083291 -988340 -872056 -802793 -854802 -1025003 -1188629 -1211148 -1119783 -1074687
32659 -1074687 -1137603 -1184535 -1119311 -1044673 -1091138 -1181989 -1144112 -993120 -916580 -988651 -1088998
32648 -1088998 -1118887 -1112887 -1097046 -1020734 -899717 -853000 -901758 -894729 -754393 -644039 -733579
32637 -733579 -925259 -997576 -934159 -907509 -982081 -1043199 -1020936 -984304 -975299 -933319 -852190
32626 -852190 -847149 -970460 -1096819 -1099126 -1025109 -988476 -987235 -955789 -915168 -935818 -1004324 -1050149
32614 -1050149 -1061352 -1066122 -1057335 -1048961 -1128968 -1308013 -1394290 -1214011 -909796 -796655 -928581
32603 -928581 -1046014 -984498 -882973 -900599 -969349 -965934 -924977 -921651 -912436 -852582 -817392 -848204
32591 -848204 -834098 -717983 -659597 -792550 -968398 -971063 -855402 -818567 -843977 -761612 -598575
32580 -598575 -562334 -677021 -728367 -616650 -504947 -542199 -661513 -737861 -755123 -734168 -664458
32569 -664458 -586099 -590168 -668507 -699400 -636697 -577927 -597819 -650373 -681439 -705167 -724343 -699436
32557 -699436 -633726 -576623 -530414 -471656 -450194 -521453 -602860 -569706 -472953 -465220 -526175 -488493
32545 -488493 -341593 -259992 -294442 -293838 -200316 -161967 -251754 -317390 -233297 -86924 4674
32534 4674 59752 100429 62041 -45761 -81058 12483 115257 154507 218937 363958 515997
32523 515997 649298 823948 984361 1000459 977072 1185455 1597146 1885920 2010069 2266258
32513 2266258 2501017 1875025 -41401 -2370802 -3774776 -3949467 -3663319 -3524060 -3434223
32504 -3434223 -3225081 -3071747 -3075782 -3014801 -2766634 -2544483 -2485369 -2404212 -2184336 -2033208
32494 -2033208 -2089816 -2121226 -1909637 -1654767 -1662454 -1850019 -1902498 -1778142 -1719049 -1818540 -1889120
32483 -1889120 -1783424 -1602138 -1511307 -1518114 -1512682 -1437054 -1335795 -1276259 -1272774 -1294720 -1321852
32472 -1321852 -1351324 -1344198 -1235572 -1056000 -970778 -1090308 -1286019 -1326820 -1183540 -1058631
32462 -1058631 -1103193 -1243006 -1321098 -1288349 -1199500 -1121029 -1099364 -1144147 -1196028 -1165997 -1031698
32451 -1031698 -853390 -708530 -668655 -797886 -1072140 -1327012 -1401698 -1322646 -1236776 -1192784
32441 -1192784 -1124246 -1026202 -983867 -1014705 -1039884 -1036384 -1063301 -1111404 -1094732 -1036571 -1085842
32430 -1085842 -1270331 -1402447 -1339703 -1193974 -1152693 -1209794 -1219708 -1140071 -1074373 -1106107 -1208231
32419 -1208231 -1306697 -1347405 -1306067 -1197152 -1074476 -989808 -962649 -998991 -1092135 -1182409 -1175477
32408 -1175477 -1045753 -881913 -793221 -805635 -873782 -945826 -982362 -960157 -904338 -886004 -945425
32397 -945425 -1035012 -1068363 -1013235 -918467 -863437 -891923 -979025 -1051747 -1050987 -977949 -881132 -812116
32385 -812116 -796141 -818211 -828586 -794124 -750579 -757676 -795805 -777658 -688849 -636652 -708390 -851935
32373 -851935 -953301 -968391 -926213 -874273 -874660 -971368 -1101016 -1126748 -1025365 -936277 -951646
32362 -951646 -982233 -926753 -837997 -797961 -766673 -701850 -687835 -772404 -817222 -716738 -630221
32351 -630221 -752100 -967347 -1012861 -895110 -844513 -910349 -928515 -875828 -908883 -1014864 -974176
32340 -974176 -759119 -633175 -721808 -802826 -694608 -555301 -581749 -673838 -651611 -595287 -692270
32329 -692270 -892052 -984216 -928185 -858799 -823386 -745166 -629207 -601970 -723633 -900305 -1000293
32318 -1000293 -967514 -834694 -703373 -679147 -754238 -796892 -721262 -608474 -592129 -691004 -824369
32307 -824369 -920642 -941176 -874766 -780786 -758598 -810997 -834103 -803971 -841385 -993089 -1090662
32296 -1090662 -979011 -778644 -743692 -915565 -1084294 -1072325 -915466 -767546 -741486 -846170
32286 -846170 -990999 -1053491 -1002057 -929156 -919681 -944732 -941593 -920492 -913166 -894482 -848951 -839664
32274 -839664 -905409 -957357 -892968 -757554 -677818 -680635 -688726 -655909 -601063 -546418 -519701 -570321
32262 -570321 -683899 -736973 -648083 -518368 -500579 -581803 -630967 -616730 -627416 -696278 -756866
32251 -756866 -771817 -770627 -753421 -682724 -580370 -517846 -504517 -492695 -485858 -524058 -573408 -563930
32239 -563930 -533198 -586411 -708197 -775727 -781214 -858107 -1022460 -1075101 -882601 -608658 -516042
32228 -516042 -635826 -780182 -813373 -760037 -684860 -616231 -590372 -643164 -731961 -759662 -698874
32217 -698874 -610985 -528189 -413440 -275994 -227801 -341932 -514746 -566068 -456069 -311659
32207 -311659 -237143 -196672 -122358 -47915 -50073 -105931 -109595 -27039 55471 59380 15235 520
32195 520 39318 110359 203429 312266 407518 474617 558482 721447 970358 1259203 1531398
32184 1531398 1710159 1686072 1400544 946924 518986 237188 70962 -63666 -195483 -311938
32174 -311938 -416677 -521875 -621575 -722341 -869864 -1088319 -1312834 -1449150 -1500998 -1568477
32164 -1568477 -1697918 -1803117 -1787042 -1686864 -1621860 -1624220 -1609117 -1516982 -1400833 -1340840 -1340859
32153 -1340859 -1353311 -1351891 -1332746 -1292183 -1253864 -1270932 -1340605 -1359160 -1237294 -1037166 -919176
32142 -919176 -958683 -1079696 -1166377 -1178949 -1156689 -1159178 -1210098 -1263716 -1241080 -1138118 -1065097
32131 -1065097 -1117714 -1239119 -1287151 -1218717 -1122278 -1078392 -1081844 -1106780 -1155159 -1219072 -1273153
32120 -1273153 -1321143 -1375699 -1387804 -1290384 -1126882 -1029802 -1037878 -1046105 -991250 -969636 -1077707
32109 -1077707 -1231805 -1270960 -1184405 -1104736 -1091513 -1057889 -945960 -853499 -893081 -991877 -959340
32098 -959340 -764031 -618432 -701728 -885820 -887873 -677620 -548743 -712184 -986960 -1047768
32088 -1047768 -869138 -729754 -813553 -997360 -1056963 -931890 -740626 -640898 -703877 -840001
32078 -840001 -854839 -679441 -512667 -588791 -830829 -931302 -791321 -652033 -714740 -860339
32068 -860339 -888121 -832890 -847177 -911099 -883868 -769050 -713343 -764621 -820119 -821054 -830286 -883123
32056 -883123 -903070 -822893 -688320 -588001 -556735 -591007 -687198 -809777 -878448 -853025 -802844
32045 -802844 -829295 -928015 -990705 -956209 -890721 -868223 -837399 -713678 -576596 -624432 -886853
32034 -886853 -1131460 -1157118 -1048629 -1001796 -1021173 -986686 -927378 -979769 -1099847 -1081233 -900024
32023 -900024 -789257 -880369 -1000372 -954594 -812548 -756827 -809568 -875701 -928208 -980361 -974144
32012 -974144 -863873 -741731 -731745 -812514 -871757 -880616 -890924 -908879 -890045 -828535 -761077
32001 -761077 -718283 -733348 -833857 -967210 -1026661 -1017857 -1081373 -1259277 -1373105 -1262906 -1025395
31990 -1025395 -861026 -791193 -702693 -590612 -562598 -636789 -710671 -723915 -712056 -707049 -704497
31979 -704497 -715850 -750419 -770924 -756717 -767120 -855544 -981892 -1092815 -1197289 -1266019 -1180511
31968 -1180511 -924135 -702200 -696930 -808907 -829511 -759532 -734137 -733699 -640429 -525195 -582481
31957 -582481 -779566 -858083 -729006 -600265 -641343 -768039 -850232 -901409 -947993 -916561 -781669
31946 -781669 -658291 -626710 -609910 -524069 -405980 -304766 -205777 -150542 -254230 -490441
31936 -490441 -638904 -588255 -520166 -627500 -808479 -837509 -710433 -602127 -573982 -553813
31926 -553813 -553963 -671404 -866811 -957133 -870968 -734982 -653924 -572012 -438216 -364522 -486384
31915 -486384 -737602 -893159 -827477 -642516 -529021 -566748 -691435 -810683 -890125 -924122
31905 -924122 -885532 -760763 -615034 -559108 -632980 -758307 -818913 -762352 -626778 -509940
31895 -509940 -508607 -634183 -782878 -845512 -846859 -899797 -1013097 -1051428 -938785 -799678 -802753
31884 -802753 -929828 -1008476 -943041 -810748 -735031 -752655 -814533 -847051 -805123 -725333 -722562
31873 -722562 -863033 -1045427 -1098595 -1010278 -953747 -1042476 -1162875 -1132340 -940176 -728397
31863 -728397 -595344 -538156 -548293 -624276 -698218 -692528 -663825 -744467 -913147 -991140 -925077
31852 -925077 -881618 -949834 -955904 -763141 -568777 -628622 -811874 -763164 -468799 -303733 -463452
31841 -463452 -702726 -773628 -790064 -936190 -1090938 -1031904 -825739 -716416 -742796 -752372 -715169
31830 -715169 -739695 -815594 -817308 -763330 -808418 -945417 -964255 -777510 -569135 -530080 -632018
31819 -632018 -753130 -849261 -891668 -803666 -603932 -486424 -598384 -814375 -878686 -730865
31809 -730865 -555739 -524416 -610593 -686609 -698959 -685410 -672875 -640930 -590987 -579471 -630804
31798 -630804 -664916 -596411 -488263 -496131 -639432 -750981 -715365 -635410 -660581 -755305 -772714
31787 -772714 -687799 -610113 -596635 -585833 -512885 -391467 -289841 -290940 -429396 -603733 -637938
31776 -637938 -520468 -468572 -625856 -823354 -822973 -681206 -636935 -719802 -742475 -653973 -616362
31765 -616362 -700453 -768163 -720294 -630517 -570135 -520308 -514616 -632845 -784657 -753590 -553461
31754 -553461 -476731 -653204 -827345 -760245 -603663 -633111 -809132 -879936 -788675 -704730 -722160
31743 -722160 -773383 -806329 -833358 -822385 -724875 -603002 -571489 -624097 -652629 -615466 -563961
31732 -563961 -537197 -548080 -621238 -722571 -722506 -572237 -437652 -486737 -619387 -616939 -508199
31721 -508199 -539722 -777465 -992882 -1014417 -962987 -1018032 -1132760 -1134124 -986790 -813106 -722952
31710 -722952 -740653 -844606 -975070 -1040880 -1005137 -937566 -920172 -940329 -937098 -904133 -872829
31699 -872829 -837234 -782957 -760089 -825458 -915108 -879888 -682353 -471481 -404615 -461371 -508129
31688 -508129 -498965 -513010 -599044 -685995 -685803 -607758 -518199 -450583 -418992 -460657 -576336 -668061
31676 -668061 -641016 -553231 -552700 -657052 -714509 -625448 -489990 -459693 -533379 -600912 -628283
31665 -628283 -677339 -754676 -760172 -628007 -442462 -350246 -389636 -466597 -495647 -500899 -542350
31654 -542350 -592841 -567729 -470823 -417651 -474185 -554788 -548457 -478943 -452585 -498178 -553786 -571049
31642 -571049 -533516 -418050 -259343 -209202 -376689 -626205 -709077 -607662 -556415 -672154
31632 -672154 -773584 -683964 -524655 -529261 -690668 -792726 -734626 -634170 -611591 -630515 -595437
31621 -595437 -502413 -438180 -472934 -581399 -662252 -650312 -610209 -664636 -813406 -904427 -830498
31610 -830498 -671159 -569944 -550598 -546235 -544269 -589320 -671114 -710361 -654082 -524120 -391668
31599 -391668 -350784 -465874 -676453 -807261 -758489 -641191 -631863 -735470 -802759 -758409 -690403
31588 -690403 -700944 -771160 -806522 -748204 -615969 -492162 -471251 -573734 -706462 -756032 -715296
31577 -715296 -663442 -634381 -583426 -498785 -467936 -578944 -787891 -936630 -911962 -766111 -657091
31566 -657091 -667414 -715097 -676192 -559755 -490094 -527477 -599965 -634013 -655898 -711036 -763817
31555 -763817 -749095 -673414 -608308 -620420 -734245 -902074 -991051 -892534 -680420 -553746 -576156
31544 -576156 -604542 -544665 -511343 -604656 -689642 -593967 -406157 -348052 -421672 -428273 -313859
31533 -313859 -243362 -305271 -383458 -390659 -407892 -487098 -509003 -374747 -191719 -126762 -183201
31522 -183201 -251637 -287400 -312265 -321100 -310201 -329509 -387154 -367886 -177453 77970 188162
31511 188162 89679 -95871 -244546 -320606 -300322 -157320 38708 132138 54439 -90953
31501 -90953 -165263 -149407 -123371 -158195 -272372 -434942 -566981 -595651 -549728 -544285 -627432
31490 -627432 -709531 -701443 -649844 -653859 -712230 -755779 -779966 -821356 -833105 -728278 -552574
31479 -552574 -468438 -530591 -613351 -615161 -598762 -648338 -719481 -741520 -753809 -807079 -825275 -719762
31467 -719762 -571006 -530066 -584050 -593851 -542305 -555688 -663333 -726710 -669656 -611737 -674653
31456 -674653 -783259 -775098 -632710 -504163 -524903 -681059 -827945 -822874 -675497 -560961
31446 -560961 -623009 -783693 -841971 -742370 -617824 -565781 -537385 -485587 -463026 -501060 -535430
31435 -535430 -536033 -573759 -665498 -692092 -585665 -469817 -483057 -580479 -651352 -713941 -818970
31424 -818970 -859673 -692949 -409516 -270372 -361417 -497455 -511030 -468239 -516652 -648218
31414 -648218 -726927 -690838 -621823 -617716 -667043 -687349 -659343 -659694 -731396 -784834 -713843 -574819
31402 -574819 -527835 -598725 -641881 -576733 -509157 -542545 -617886 -651337 -690782 -791978 -857634
31391 -857634 -772655 -618712 -574117 -647260 -684493 -620847 -554037 -563356 -604125 -608039 -570981 -515677
31379 -515677 -459292 -433656 -465638 -540379 -640679 -782420 -937421 -987018 -867651 -711678
31369 -711678 -706140 -835567 -903466 -806351 -653656 -595268 -641412 -689109 -655021 -557758 -501397
31358 -501397 -559243 -657149 -650819 -557654 -578795 -791526 -969492 -876221 -610037 -445176 -430463
31347 -430463 -399432 -320453 -346648 -502760 -601738 -547682 -484861 -548907 -672961 -743545 -767463
31336 -767463 -775882 -724918 -604453 -510004 -506735 -543429 -575863 -636995 -710713 -693059 -574075
31325 -574075 -503543 -568222 -655213 -652827 -627324 -656980 -649000 -506818 -354502 -384615 -560282
31314 -560282 -674752 -660166 -632706 -649123 -627068 -538973 -499582 -585341 -703001 -724867 -659819
31303 -659819 -605822 -600842 -608292 -613779 -648764 -712908 -740504 -683663 -596639 -581564 -647133 -684141
31291 -684141 -623734 -562766 -645106 -839126 -938553 -809180 -545947 -342869 -285973 -332566 -424227
31280 -424227 -532674 -622493 -651780 -621777 -580253 -561144 -544884 -492732 -412977 -375355 -439211
31269 -439211 -570851 -670023 -689813 -678094 -673868 -638139 -552906 -512228 -606493 -764213 -833396
31258 -833396 -795976 -770970 -813575 -852759 -842953 -832788 -841616 -803189 -693297 -594958 -568672 -564499
31246 -564499 -532385 -514120 -543776 -555244 -488330 -410925 -428785 -519846 -557116 -479472 -366983
31235 -366983 -347344 -462939 -623852 -690335 -630675 -575447 -650551 -787675 -812773 -711569 -657678
31224 -657678 -745926 -858529 -870886 -838612 -868718 -931741 -937074 -904752 -926562 -1013326 -1092897
31213 -1092897 -1110344 -1044607 -899270 -765146 -792403 -980648 -1098656 -968132 -741360 -710115
31203 -710115 -895519 -1041583 -1006886 -939089 -1008770 -1168201 -1269645 -1269431 -1208283 -1113844 -1035975
31192 -1035975 -1075615 -1253990 -1426938 -1451404 -1381595 -1379075 -1475844 -1563101 -1588600 -1611905 -1654819
31181 -1654819 -1656759 -1628909 -1698076 -1904712 -2093424 -2130003 -2111021 -2202641 -2369621 -2447813 -2386862
31170 -2386862 -2164977 -1531461 -216946 1488329 2728128 2921526 2390583 1888939 1712801
31161 1712801 1605231 1371537 1144526 1031576 909248 700017 544042 540841 569555 523115
31151 523115 498994 585873 657119 569352 412092 365423 426072 455297 401832 308432 185047
31140 185047 43367 -16020 84236 253077 341694 339403 318941 261068 106329 -65429 -94795
31129 -94795 16167 83856 -8234 -167217 -231970 -163503 -63043 -57264 -172186 -288470 -259171
31118 -259171 -110935 -49456 -187306 -357612 -325026 -116346 13077 -80372 -272680 -369486
31108 -369486 -330716 -260312 -262674 -349914 -441359 -437844 -323710 -179819 -77323 -14947 6053
31097 6053 -62024 -209442 -318794 -322903 -322279 -419799 -525753 -483021 -320341 -208517 -205872 -223533
31085 -223533 -218374 -237544 -277638 -282476 -286092 -371135 -471385 -420490 -238256 -153173 -260006
31074 -260006 -365560 -295635 -162024 -162532 -272285 -323924 -287707 -275983 -328420 -374838 -385734
31063 -385734 -398040 -398706 -330507 -224929 -199170 -295492 -427976 -506879 -516560 -459007 -337603
31052 -337603 -233486 -280658 -493599 -706218 -759197 -679279 -593684 -532128 -418299 -225525
31042 -225525 -32810 76583 87209 17981 -98892 -193898 -204579 -173606 -218100 -359998 -470991
31031 -470991 -443132 -333814 -268179 -271854 -289148 -299777 -311060 -290526 -230266 -236910 -414460
31020 -414460 -670941 -788036 -691695 -511135 -356220 -202169 -42706 18441 -67690 -179326
31010 -179326 -196917 -185052 -272114 -432899 -530778 -525819 -507354 -538016 -576988 -561161 -486319
30999 -486319 -405276 -385440 -442760 -490280 -412195 -230934 -123547 -209765 -401794 -535845 -566830
30988 -566830 -545272 -494583 -430763 -427984 -525241 -614749 -562024 -410212 -331393 -385248 -452868
30977 -452868 -418544 -308852 -230488 -246389 -324366 -362463 -290155 -184576 -215906 -408595 -553768
30966 -553768 -472947 -272553 -181102 -215568 -207324 -116411 -95208 -222309 -381452 -457781 -470144
30955 -470144 -442180 -321342 -125008 -14440 -100136 -278760 -372855 -347965 -294984 -278054 -302172
30944 -302172 -368137 -455000 -484646 -396399 -243585 -148233 -163950 -228566 -250894 -216843 -202388
30933 -202388 -276883 -397539 -445376 -388985 -335461 -353541 -346113 -228451 -139590 -270329 -518819
30922 -518819 -567335 -338677 -119695 -129324 -217008 -165297 -65788 -138765 -327440 -365605 -196138
30911 -196138 -45485 -71574 -186075 -277270 -379511 -520806 -593861 -519045 -404168 -399208 -479554
30900 -479554 -505796 -435258 -345229 -288198 -253001 -253108 -328104 -443621 -496161 -448866 -379139 -359956
30888 -359956 -370578 -362717 -343410 -342404 -354485 -364479 -381026 -399277 -380240 -315939 -262325 -254214
30876 -254214 -246070 -199694 -163436 -182169 -197931 -146337 -88451 -118312 -195820 -226139 -256311 -394468
30864 -394468 -548373 -484982 -207194 -32030 -170130 -433581 -524654 -438963 -379805 -400990
30854 -400990 -364718 -200463 -3675 113321 118079 21702 -124635 -216731 -190476 -96228 4325
30843 4325 132056 267629 250095 -23591 -384342 -581590 -627739 -729146 -913422 -982548
30833 -982548 -855026 -700082 -657610 -645771 -551861 -432160 -401822 -461843 -542849 -614979 -670521
30822 -670521 -690291 -686770 -690773 -667244 -558694 -429086 -416438 -511017 -548888 -477556 -444105
30811 -444105 -536828 -627063 -588713 -505722 -514749 -583186 -599460 -565441 -542362 -510540 -443502 -425661
30799 -425661 -522387 -611217 -531962 -358840 -328469 -501710 -677952 -675561 -540411 -417639 -345407
30788 -345407 -267547 -179029 -160117 -263878 -419809 -483592 -392257 -248684 -215164 -332411 -495192
30777 -495192 -599287 -635012 -624912 -564932 -472334 -410791 -413663 -448337 -496847 -588260 -697864
30766 -697864 -706711 -545272 -312704 -172173 -172120 -231278 -251374 -193427 -97192 -67792 -179019
30755 -179019 -356760 -442321 -402515 -363686 -391595 -382569 -262225 -144573 -160426 -251448 -288462
30744 -288462 -290327 -353628 -446069 -457587 -412060 -445203 -585855 -718436 -754923 -701614 -572216
30733 -572216 -383166 -223073 -176228 -184282 -134380 -70448 -139588 -320520 -402346 -288242 -140159
30722 -140159 -138266 -253591 -357888 -417329 -455796 -439030 -333199 -209962 -168532 -195682 -209159
30711 -209159 -204407 -250935 -355921 -431425 -415486 -358750 -363686 -470029 -614326 -689207 -646677
30700 -646677 -551972 -517380 -572424 -631620 -614207 -556960 -557481 -624814 -655228 -578450 -469330 -452193
30688 -452193 -518551 -529231 -426997 -353227 -457358 -647969 -677148 -478505 -269004 -251223
30678 -251223 -352669 -369671 -259590 -149455 -128357 -184500 -305019 -478037 -607926 -585848
30668 -585848 -458819 -385513 -404333 -395022 -306364 -256597 -325613 -398089 -339525 -220003 -216168
30657 -216168 -350178 -471277 -480005 -439108 -440592 -469617 -456116 -399145 -370286 -402624 -431078
30646 -431078 -375959 -264732 -215768 -284050 -383112 -411269 -396000 -422825 -464610 -412856 -278321
30635 -278321 -213664 -287396 -369854 -324923 -196918 -104237 -54398 4145 31822 -42209 -157828
30624 -157828 -186853 -142829 -161636 -261275 -295142 -198498 -115654 -183663 -327219 -397037 -404940
30613 -404940 -465689 -570679 -592043 -499846 -412672 -405538 -414275 -385869 -386638 -466319 -523856 -436425
30601 -436425 -260281 -170357 -225568 -323655 -387509 -457148 -554615 -588759 -488355 -343073 -298055
30590 -298055 -350756 -365644 -279902 -182303 -162865 -184524 -167200 -133161 -183892 -349054 -530648
30579 -530648 -613109 -582383 -509237 -444668 -373906 -276171 -191728 -191232 -279058 -364163 -354374 -262949
30567 -262949 -190038 -204819 -281517 -356401 -408242 -457741 -512321 -541866 -503783 -381371 -214554
30556 -214554 -100602 -126569 -267990 -386905 -378255 -294050 -264465 -318410 -365706 -354689 -340744
30545 -340744 -359454 -340150 -230905 -126333 -154894 -283418 -356161 -314637 -259594 -285215 -363140
30534 -363140 -418226 -422043 -380312 -317228 -298503 -373361 -466337 -438390 -294948 -206141 -258412
30523 -258412 -325161 -280938 -206253 -241297 -349368 -389657 -344223 -302830 -284180 -249720 -248328
30512 -248328 -355415 -489507 -486779 -361309 -295306 -352055 -403186 -383257 -400642 -511065 -587073
30501 -587073 -536817 -473493 -517181 -576804 -498218 -320280 -215684 -253499 -372459 -523025 -684122
30490 -684122 -789643 -787316 -739945 -737976 -745957 -667702 -532105 -470580 -518676 -575956 -568980 -529212
30478 -529212 -494133 -446832 -378905 -314785 -252973 -175007 -125273 -179239 -308256 -381250 -343454
30467 -343454 -296429 -340842 -422829 -416736 -310537 -224709 -254429 -353204 -393851 -326524 -252738
30456 -252738 -315882 -510891 -648609 -559561 -304588 -113239 -118686 -227942 -269295 -194240 -91196
30445 -91196 -52080 -83984 -137195 -173669 -196120 -225068 -259194 -267594 -227543 -161107 -121516 -145958
30433 -145958 -225990 -314293 -359276 -352753 -345775 -389364 -456967 -467300 -396061 -314851 -294888 -325291
30421 -325291 -362149 -402403 -456599 -495742 -487709 -454722 -438542 -437618 -428107 -409797 -379612 -310130
30409 -310130 -224325 -238710 -434150 -711754 -877687 -859618 -743989 -611462 -451217 -256683
30399 -256683 -94483 -27022 -43936 -116297 -249744 -429674 -566422 -558767 -401782 -205186
30389 -205186 -110325 -177646 -321221 -370080 -250829 -98677 -112700 -300128 -456360 -424503
30379 -424503 -276555 -179104 -169390 -162366 -130229 -157632 -301017 -470760 -503357 -338696 -104383
30368 -104383 -10901 -146945 -383621 -511795 -469878 -380983 -356472 -353898 -297169 -253636 -353974
30357 -353974 -548891 -601094 -390150 -109599 -43394 -211159 -373364 -367769 -282637 -255239 -255969
30346 -255969 -190265 -106589 -137938 -271619 -342841 -278643 -200845 -225729 -286523 -252280 -138134
30335 -138134 -82973 -154429 -276695 -345660 -336770 -289098 -238708 -186812 -111430 -10048 63146
30324 63146 33613 -96684 -224960 -256021 -203774 -147423 -122253 -104790 -80974 -70420 -86199
30313 -86199 -113234 -129210 -123379 -102823 -98444 -147741 -250909 -357416 -406643 -367208 -247962
30302 -247962 -111211 -59157 -136295 -248154 -264624 -206551 -212067 -296478 -305198 -186029 -138630
30291 -138630 -336349 -629089 -727658 -610325 -519674 -571795 -606199 -482317 -315833 -297906
30281 -297906 -420055 -515999 -497764 -427234 -390617 -401594 -423190 -423054 -402985 -395922 -418981 -427105
30269 -427105 -358153 -235893 -169878 -223553 -336044 -410283 -425911 -420267 -408110 -382275 -362496
30258 -362496 -375668 -396253 -368265 -295354 -254880 -294946 -357649 -351184 -283522 -267154 -370292
30247 -370292 -512464 -558916 -491067 -414851 -404693 -421059 -408763 -393220 -416165 -438691 -394434
30236 -394434 -308542 -274110 -312793 -342665 -307810 -269919 -321014 -441991 -508955 -447258 -334013
30225 -334013 -306971 -386172 -445583 -384934 -267138 -223839 -273676 -323981 -323429 -302797 -271193 -197934
30213 -197934 -117814 -121428 -194587 -203125 -109825 -68062 -189799 -344583 -337809 -203472 -153114
30202 -153114 -270706 -416185 -434934 -331978 -212795 -150807 -150678 -181766 -215674 -249481 -289279
30191 -289279 -309694 -273611 -200871 -147153 -97103 23049 187019 240166 102667 -108419 -242835
30180 -242835 -291007 -305089 -274624 -199542 -164203 -202891 -208223 -115395 -48917 -121269 -224775
30169 -224775 -228174 -243986 -442361 -699853 -732610 -539819 -411692 -484656 -581967 -552225 -490735
30158 -490735 -521663 -588638 -583760 -513928 -440710 -398335 -435469 -588764 -763953 -801518 -708417
30147 -708417 -662304 -743438 -835962 -838050 -781762 -691535 -525226 -331840 -271381 -385301 -526309
30136 -526309 -599660 -684998 -827310 -908224 -845647 -738660 -687897 -642094 -545087 -462286 -432098
30125 -432098 -363756 -219907 -131769 -190085 -290165 -332442 -398856 -559166 -677568 -613450 -466598
30114 -466598 -414761 -436090 -402526 -330661 -320024 -340335 -302061 -260206 -331747 -476415 -569135
30103 -569135 -626888 -747078 -872984 -847901 -677996 -524932 -448033 -362569 -252916 -216679
30093 -216679 -273384 -322480 -327882 -368649 -464924 -518721 -480827 -431771 -441297 -471904 -471149 -448333
30081 -448333 -417802 -368033 -318648 -309694 -313481 -262888 -187897 -208496 -354434 -497875 -512500
30070 -512500 -413218 -300086 -248044 -289370 -418712 -560879 -596908 -478891 -291344 -174115
30060 -174115 -204459 -345082 -468412 -451447 -300909 -163394 -153329 -208081 -196332 -128607 -136587
30049 -136587 -251691 -345616 -329406 -282567 -309063 -367634 -348669 -257735 -208447 -250084 -309101
30038 -309101 -321240 -325703 -369309 -392305 -311949 -189676 -186265 -324150 -427515 -378620 -308324
30027 -308324 -398229 -593942 -693274 -655151 -609634 -586319 -475900 -293719 -229416 -343598 -451051
30016 -451051 -432369 -431805 -573960 -699059 -605979 -390583 -290707 -316060 -293884 -200338 -175781
30005 -175781 -244263 -277584 -245005 -262586 -362314 -424107 -385628 -331382 -317686 -282649 -199071
29994 -199071 -163978 -252782 -397499 -477666 -443104 -309683 -134631 -32124 -106419 -317620
29984 -317620 -497883 -541537 -502509 -474548 -461314 -411957 -321166 -243019 -228548 -264747 -269694
29973 -269694 -183060 -82673 -135981 -374255 -601194 -624724 -501170 -427457 -463544 -509594 -502679
29962 -502679 -468365 -405576 -289802 -182630 -176469 -232777 -234890 -196142 -238110 -354278 -394332
29951 -394332 -328961 -329823 -493055 -654447 -606953 -383053 -191554 -145936 -169832 -143708 -65104
29940 -65104 -53352 -203240 -431171 -523638 -400145 -251745 -297263 -468231 -510523 -369562
29930 -369562 -264872 -351952 -515382 -575539 -522456 -440235 -346626 -225761 -112110 -37610 18022
29919 18022 46009 -25752 -207360 -383874 -457208 -459031 -451060 -420430 -361725 -351999 -428662 -481446
29907 -481446 -392913 -224911 -141542 -188169 -264870 -294683 -303072 -328521 -352145 -342630 -309214 -282775
29895 -282775 -277215 -286652 -304428 -332142 -364633 -367568 -299714 -185664 -130554 -202231 -319053 -329841
29883 -329841 -204070 -68948 -50442 -149479 -286795 -395014 -440794 -418774 -355351 -282237 -201160
29872 -201160 -113155 -64429 -100065 -184606 -239158 -250536 -273530 -333495 -401417 -460056 -518436
29861 -518436 -558422 -534010 -430896 -287369 -172322 -163444 -284515 -431626 -463453 -418848 -498191
29850 -498191 -729510 -840226 -642758 -364830 -334465 -481746 -476559 -268674 -122052 -140579
29840 -140579 -158181 -145734 -314490 -677599 -891317 -745208 -495216 -473553 -634626 -734501
29830 -734501 -731779 -761712 -909920 -1244471 -1863415 -2641667 -3113376 -2911148 -2220210 -1548516
29820 -1548516 -1159879 -971984 -869010 -810231 -709743 -507828 -331904 -335866 -423005 -376805
29810 -376805 -217159 -159209 -249670 -322514 -310367 -317243 -357717 -304784 -156915 -94230 -183455
29799 -183455 -264318 -223223 -153483 -139116 -106910 -28108 -47907 -234769 -385223 -294575 -90799
29788 -90799 -62822 -227752 -314512 -182268 -28231 -96508 -347924 -548809 -588970 -559146 -542656
29777 -542656 -494263 -384150 -329902 -450948 -645770 -666757 -433434 -142561 -20633 -78148
29767 -78148 -170878 -199341 -161521 -92022 -45862 -85233 -197648 -275800 -248400 -175507 -149694
29756 -149694 -168637 -174320 -150090 -112147 -78022 -98989 -223977 -369465 -356712 -170891 -39948
29745 -39948 -133671 -330887 -430875 -437002 -445382 -413958 -281848 -181085 -247926 -326018 -173309
29734 -173309 96247 122779 -153116 -408571 -448877 -436516 -501847 -488076 -281119 -84157
29724 -84157 -109183 -228576 -201477 -70265 -58882 -200489 -334847 -402131 -485910 -592646 -615324
29713 -615324 -527584 -435350 -416086 -443871 -476487 -492093 -446226 -314023 -167890 -99388 -82132
29702 -82132 -36131 -7483 -131151 -397476 -604117 -596278 -441419 -305408 -252830 -239361 -220080
29691 -220080 -179217 -100500 9564 89907 85945 35188 26552 64286 37981 -129434 -351797
29680 -351797 -469989 -455604 -430470 -458038 -425367 -224431 33207 124778 6886 -157175
29670 -157175 -260832 -366738 -504152 -542197 -392150 -190766 -120807 -154057 -150340 -131104 -241408
29659 -241408 -464930 -598872 -548362 -447133 -417348 -397825 -320783 -290831 -426786 -635646
29649 -635646 -716341 -627954 -496239 -398115 -309877 -255116 -320553 -484402 -587577 -544708 -451600
29638 -451600 -406260 -356028 -231800 -114496 -116914 -177446 -141325 -13773 41666 -37120 -124972
29627 -124972 -128324 -126121 -201945 -272646 -213651 -65663 24432 21168 18387 52083 34556 -91041
29615 -91041 -245771 -333909 -390582 -520219 -715303 -828333 -751083 -561068 -433794 -434926 -468725
29604 -468725 -437588 -369496 -336609 -323306 -271668 -215955 -250952 -366392 -431623 -374586 -270867
29593 -270867 -215837 -211133 -226497 -268186 -321153 -327002 -297563 -347536 -520049 -680017 -693675
29582 -693675 -620073 -592497 -597902 -536716 -438942 -433709 -521093 -555171 -469816 -358736 -301491 -264220
29570 -264220 -217510 -205161 -232823 -223931 -166561 -183010 -351862 -552598 -599712 -479431 -351606
29559 -351606 -337602 -388815 -372873 -243059 -99294 -75138 -167029 -222699 -143436 -41168 -98996
29548 -98996 -307821 -465063 -437422 -297731 -174432 -92658 -18661 47906 92034 109353 68428
29537 68428 -60598 -201294 -209979 -77222 29116 -5601 -93776 -115748 -104007 -132353 -147864
29526 -147864 -79277 -19169 -106470 -275862 -320766 -201307 -102868 -154050 -252414 -240198 -125523
29515 -125523 -40927 -59785 -130751 -156385 -93564 462 15508 -85508 -208956 -254231 -256892
29504 -256892 -314458 -400061 -383995 -251496 -157012 -208381 -319007 -347321 -279680 -192630 -125798
29493 -125798 -89341 -126110 -261051 -428379 -532971 -550043 -503527 -408870 -317193 -341943 -524188
29482 -524188 -720294 -753752 -653369 -606741 -685407 -759587 -707048 -567489 -440753 -355791 -308914
29471 -308914 -326919 -408971 -480467 -478122 -421806 -350911 -265179 -184210 -176760 -255918 -329874 -341330
29459 -341330 -368543 -485332 -605496 -593641 -465101 -339522 -251693 -161075 -107993 -182962 -339832
29448 -339832 -410320 -338116 -253286 -274134 -366115 -438654 -461125 -443563 -410881 -415114 -459429 -423654
29436 -423654 -226077 -41213 -126996 -405550 -490068 -231392 47631 37720 -117065 -120560 -21045
29425 -21045 -70439 -251584 -322493 -258224 -273244 -406540 -445882 -322728 -246935 -341958 -446277
29414 -446277 -415976 -355993 -386495 -417635 -343968 -261744 -294323 -367085 -353530 -303479 -328235
29403 -328235 -380678 -348433 -263719 -225508 -204480 -123715 -52394 -110379 -240356 -286266 -255395
29392 -255395 -286585 -381420 -389420 -268372 -148842 -113191 -107060 -101891 -146940 -215574 -202157 -134202
29380 -134202 -181481 -367999 -485644 -416542 -336198 -429016 -582353 -573828 -430322 -367186 -444470
29369 -444470 -510431 -457582 -330487 -188311 -52610 2958 -98435 -269468 -318912 -222465
29359 -222465 -161001 -231267 -295523 -211774 -53447 21410 -10773 -81221 -175780 -290572 -328538
29348 -328538 -208817 -39789 -26106 -206240 -409404 -479552 -432808 -379219 -382007 -416493 -405500
29337 -405500 -292526 -129191 -60865 -158128 -303912 -337065 -264836 -219694 -241233 -244736 -203286
29326 -203286 -206865 -299659 -388467 -372371 -265900 -144783 -56489 -21232 -31999 -22257 70904
29315 70904 184164 176607 33593 -97773 -120839 -107788 -144871 -194171 -197326 -194747 -237881 -284937
29303 -284937 -285331 -273750 -284753 -273962 -225134 -229667 -344551 -473286 -510558 -501835 -525590 -526870
29291 -526870 -429570 -316654 -314627 -372883 -349676 -258113 -223842 -241614 -194239 -101118 -120730
29280 -120730 -278243 -401722 -383203 -315387 -305165 -326438 -334940 -368845 -444055 -484094 -444879
29269 -444879 -395840 -396703 -399645 -351104 -293088 -286185 -311884 -313835 -267782 -176549 -74914 -50956
29257 -50956 -154145 -273910 -249313 -119925 -98940 -250091 -383556 -362966 -316069 -394433 -502219
29246 -502219 -460385 -313497 -256496 -327899 -384964 -351492 -295062 -260474 -207217 -140021 -146059
29235 -146059 -253952 -376604 -439941 -464436 -476447 -442900 -357419 -306286 -365653 -479146 -517793
29224 -517793 -449188 -379512 -410634 -504501 -535909 -464212 -385881 -385331 -402168 -333302 -226145 -236610
29212 -236610 -376806 -451836 -334191 -179610 -230021 -466841 -618846 -513252 -279866 -165551
29202 -165551 -251148 -415127 -507748 -487981 -416353 -373416 -389858 -429558 -434660 -389695 -330140
29191 -330140 -285785 -241313 -174768 -117268 -134059 -234621 -337199 -358830 -320991 -313954 -358114
29180 -358114 -369514 -294794 -214606 -247395 -387615 -509549 -515144 -419268 -306249 -259743 -312010
29169 -312010 -396220 -375854 -202812 -21119 -8960 -126193 -146307 29058 212775 164009
29159 164009 -112841 -391701 -493169 -438326 -355722 -319963 -307191 -270579 -220720 -214055 -267990
29148 -267990 -322206 -307528 -224312 -124462 -52553 -40871 -111737 -224894 -270275 -188576 -62559
29137 -62559 -15995 -65704 -149524 -237904 -316865 -330109 -270659 -268032 -423922 -607284 -597194
29126 -597194 -408068 -275363 -316293 -411182 -445999 -457102 -479317 -458023 -389301 -356367 -353311
29115 -353311 -273108 -149725 -185386 -419659 -600086 -539160 -387763 -370588 -449713 -465006 -430424
29104 -430424 -446261 -458527 -364405 -252378 -276531 -367291 -329205 -178579 -119003 -193934 -222574
29093 -222574 -107695 28130 65994 44298 22985 -26423 -119148 -194498 -226490 -268661 -327930
29082 -327930 -322385 -236689 -200245 -315185 -489142 -539698 -427951 -304632 -321051 -444988 -500472
29071 -500472 -391628 -236876 -213891 -303590 -317689 -201049 -139833 -272344 -449642 -444579 -284413
29060 -284413 -184527 -221096 -270665 -248457 -213379 -225523 -264263 -311469 -378429 -432561 -420633
29049 -420633 -369669 -342827 -305301 -177449 -19759 -747 -146477 -274666 -238126 -107700
29039 -107700 -46615 -109463 -238495 -373112 -477361 -501005 -390571 -158071 73628 128345
29029 128345 -56501 -315577 -404693 -301631 -237501 -359390 -514297 -499410 -374788 -331397
29019 -331397 -365482 -322374 -198850 -151243 -218923 -275421 -262859 -254062 -265025 -224468 -157836
29008 -157836 -184000 -288471 -313967 -226051 -176438 -247576 -349738 -430534 -553010 -684145 -653774
28997 -653774 -447224 -302410 -361094 -442271 -342167 -157190 -95700 -137400 -117861 -32825 -19327
28986 -19327 -106479 -203564 -287323 -397286 -477293 -421588 -274175 -199956 -243797 -286420 -269072
28975 -269072 -295598 -438621 -578432 -546276 -358548 -196800 -170965 -203798 -184651 -151613 -219626
28964 -219626 -357133 -378538 -213095 -44185 -63960 -201858 -256454 -206721 -189735 -225248 -200564
28953 -200564 -121673 -128521 -226108 -251952 -172249 -148260 -217103 -190054 -13719 57649 -134277
28942 -134277 -340465 -273343 -70134 -64360 -250638 -331493 -216059 -114739 -147802 -196884 -191258
28931 -191258 -233539 -348377 -376639 -249571 -145737 -223758 -372268 -387170 -275407 -223401
28921 -223401 -329145 -493781 -552015 -432474 -216242 -81061 -145103 -332679 -444798 -385255
28911 -385255 -252181 -183905 -198358 -231545 -256881 -296654 -361274 -438742 -517068 -571971 -557081
28900 -557081 -447781 -282804 -135994 -54280 -32882 -36786 -39348 -48580 -88946 -149317 -177110
28889 -177110 -149259 -113776 -120984 -153608 -181922 -242458 -370994 -481430 -426656 -201305 16199
28878 16199 67044 -23912 -133502 -202870 -237679 -217253 -120510 -27466 -77424 -285451 -484186
28867 -484186 -514453 -421029 -378527 -450035 -518770 -473269 -358014 -278621 -236109 -148919 -963
28856 -963 126343 158162 86666 -54624 -197197 -243098 -166362 -96496 -182803 -370608 -442974
28845 -442974 -312443 -134381 -79091 -131829 -200222 -282566 -406666 -505794 -498433 -430232 -402658
28834 -402658 -398506 -307940 -118973 30832 13355 -146273 -298232 -307758 -176562 -41126 -20922
28823 -20922 -77123 -96635 -100388 -220750 -433876 -498891 -283616 8658 102651 11722 -57407
28812 -57407 -52678 -95985 -210635 -279167 -277788 -319772 -421442 -438741 -313838 -198356 -230975
28801 -230975 -346117 -411426 -424004 -450397 -473090 -421905 -298415 -170977 -94160 -106678 -243448
28790 -243448 -458257 -587977 -502278 -276299 -126237 -166670 -298019 -349389 -279697 -202883
28780 -202883 -233190 -342683 -396056 -320559 -201056 -175243 -261993 -344244 -318423 -214168 -152629
28769 -152629 -212192 -345579 -423962 -373962 -270395 -255379 -357244 -451811 -432795 -342753 -276798
28758 -276798 -240309 -196688 -185603 -267996 -391335 -440992 -413687 -413945 -477211 -523251 -503736 -473206
28746 -473206 -475585 -469056 -414427 -350435 -330296 -350951 -381220 -395729 -356437 -233629 -75671
28735 -75671 9832 -24836 -122570 -207776 -252990 -253883 -217079 -187581 -210863 -253245 -236727 -161131
28723 -161131 -107198 -111775 -132532 -143045 -160900 -174958 -159769 -169835 -281747 -420230 -403650
28712 -403650 -222054 -105674 -216983 -416540 -458180 -304249 -118089 -32521 -52962 -121307
28702 -121307 -158182 -96333 29600 83858 407 -126250 -202453 -279159 -422826 -558029 -585929
28691 -585929 -558163 -565968 -551990 -429004 -300949 -324235 -395514 -258838 55275 192114 -23405
28680 -23405 -311365 -332995 -142187 -24527 -51663 -60342 5245 7422 -114011 -224835 -230737
28669 -230737 -239769 -368426 -521517 -519939 -377341 -285937 -330609 -368029 -251264 -65658 -34625
28658 -34625 -232049 -492710 -614320 -563531 -450671 -370426 -325422 -273592 -196636 -126758 -127509
28647 -127509 -227236 -356938 -398540 -326953 -251708 -264938 -303112 -242757 -95501 -637 -27407
28636 -27407 -94924 -116824 -125170 -194125 -314310 -407344 -416078 -327178 -154152 39291 136956
28625 136956 61639 -139927 -345718 -472912 -509453 -470684 -384532 -298030 -237518 -172183 -69567
$$ [...]
##END NTUPLES=NMR SPECTRUM
##END=
