##TITLE=31Pdec_LR-762-R2-EtOAc
 CDCl3, 24 sc
 26.12.2024
##JCAMPDX= 6.0         $$ Bruker NMR JCAMP-DX V2.0
##DATA TYPE= NMR SPECTRUM
##DATA CLASS= NTUPLES
##ORIGIN= UXNMR, Bruker Analytische Messtechnik GmbH
##OWNER= root
$$ XWIN-NMR		Version 3.5
$$ Thu Dec 26 16:33:01 2024 Russian Standard Time (UT+4h)  she@DPX200
##.OBSERVE FREQUENCY= 81.013821
##.OBSERVE NUCLEUS= ^31P
##.ACQUISITION MODE= SIMULTANEOUS
##.ACQUISITION SCHEME= undefined
##.AVERAGES= 24
##.DIGITISER RES= 17
##SPECTROMETER/DATA SYSTEM= spect
##.PULSE SEQUENCE= zgpg30
##.SOLVENT NAME= CDCl3
##.SHIFT REFERENCE= (INTERNAL, CDCl3, 0, 198.062)
##AUDIT TRAIL= $$ (NUMBER, WHEN, WHO, WHERE, WHAT)
$$ ##TITLE= Audit trail, XWIN-NMR		Version 3.5
$$ ##JCAMPDX= 5.01
$$ ##ORIGIN= Bruker BioSpin GmbH
$$ ##OWNER= she
$$ F:/spectra/data/she/nmr/P31/2/pdata/1/auditp.txt
$$ ##AUDIT TRAIL=  $$ (NUMBER, WHEN, WHO, WHERE, WHAT)
(   1,<2024-12-26 16:31:58.31 +0400>,<she>,<DPX200>,
      <created by zg, POWCHK disabled, PULCHK disabled
       configuration hash MD5:
       00 E9 B6 7A A2 85 ED C7 34 08 36 98 17 FE 4E 26
       data hash MD5: 32K
       AE 2D 83 7C DA 63 82 32 10 2C BB 5F F7 CA A4 69>)
(   2,<2024-12-26 16:32:01.12 +0400>,<she>,<DPX200>,
      <Start of raw data processing
       efp BC_mod = 2 LB = 1.5 FT_mod = 6 PKNL = 1 PHC0 = 2143.504 PHC1 = 27.88631 SI = 64K 
       data hash MD5: 64K
       F3 F7 E1 4A E7 79 6D 12 3F D2 EF B3 F8 C8 13 DB>)
(   3,<2024-12-26 16:32:19.89 +0400>,<she>,<DPX200>,
      <pk PHC0 = -28.20111 PHC1 = 82.60003 
       data hash MD5: 64K
       A0 0D 56 34 00 ED B0 F6 B7 ED C8 59 71 0C E5 0F>)
(   4,<2024-12-26 16:32:23.23 +0400>,<she>,<DPX200>,
      <abs ABSG = 5 
       data hash MD5: 64K
       A3 9E 88 72 00 F8 51 C4 D1 1F 5F 64 0D 66 31 20>)
$$ ##END=
$$ 
$$ hash MD5
$$ 9A 32 6C 9A CD 7C DD 71 56 67 67 9C 0F 2E 8C 9B
##$RELAX= 
##$RELAX= 
##$RELAX= 
##$RELAX= 
##$RELAX= 
##$RELAX= 
##$RELAX= 
##$RELAX= 
$$ Bruker specific parameters
$$ --------------------------
##$DU= <F:/spectra>
##$EXPNO= 2
##$NAME= <P31>
##$PROCNO= 1
##$TYPE= <nmr>
##$USER= <she>
##$AMP= (0..31)
100 100 100 100 100 100 100 100 100 100 100 100 100 100 100 100 100 100 
100 100 100 100 100 100 100 100 100 100 100 100 100 100 
##$AQSEQ= 0
##$AQ_mod= 1
##$AUNM= <au_zg>
##$AUTOPOS= <>
##$BF1= 81.014009
##$BF2= 200.13
##$BF3= 200.13
##$BF4= 200.13
##$BF5= 200.13
##$BF6= 200.13
##$BF7= 200.13
##$BF8= 200.13
##$BYTORDA= 1
##$CFDGTYP= 0
##$CFRGTYP= 5
##$CHEMSTR= <none>
##$CNST= (0..31)
1 1 145 1 1 1 1 1 1 1 1 1 1 1 1 1 1 1 1 1 1 1 1 1 1 1 1 1 1 1 1 1 
##$CPDPRG= <waltz16>
##$CPDPRG1= <>
##$CPDPRG2= <waltz16>
##$CPDPRG3= <>
##$CPDPRG4= <mlev>
##$CPDPRG5= <mlev>
##$CPDPRG6= <mlev>
##$CPDPRG7= <mlev>
##$CPDPRG8= <mlev>
##$CPDPRGB= <>
##$CPDPRGT= <>
##$D= (0..31)
0 1 0 0 0 0 0 0 0 0.06 0 0.03 2e-05 3e-06 0 0 0.0002 0 0 0 0 0 0 0 0 0 
0 0 0 0 0 0 
##$DATE= 1735216317
##$DBL= (0..7)
120 120 120 11 120 120 24 19 
##$DBP= (0..7)
150 150 150 150 150 150 150 150 
##$DBP07= 0
##$DBPNAM0= <>
$$ [...]
##$SUBNAM3= <"">
##$SUBNAM4= <"">
##$SUBNAM5= <"">
##$SUBNAM6= <"">
##$SUBNAM7= <"">
##$SUBNAM8= <"">
##$SUBNAM9= <"">
##$SW= 400.765351723535
##$SWIBOX= (0..15)
0 1 3 0 0 0 0 0 0 0 0 0 0 0 0 0 
##$SW_h= 32467.5324675325
##$TD= 32768
##$TD0= 1
##$TE= 0
##$TE2= 300
##$TE3= 300
##$TEG= 300
##$TL= (0..7)
0 120 53 12 22 120 120 120 
##$TP= (0..7)
150 150 150 150 150 150 150 150 
##$TP07= 0
##$TPNAME0= <>
##$TPNAME1= <>
##$TPNAME2= <>
##$TPNAME3= <>
##$TPNAME4= <>
##$TPNAME5= <>
##$TPNAME6= <>
##$TPNAME7= <>
##$TPOAL= (0..7)
0.5 0.5 0.5 0.5 0.5 0.5 0.5 0.5 
##$TPOFFS= (0..7)
0 0 0 0 0 0 0 0 
##$TUNHIN= 0
##$TUNHOUT= 0
##$TUNXOUT= 0
##$USERA1= <user>
##$USERA2= <user>
##$USERA3= <user>
##$USERA4= <user>
##$USERA5= <user>
##$V9= 5
##$VALIST= <valist>
##$VCLIST= <CCCCCCCCCCCCCCC>
##$VD= 0
##$VDLIST= <DDDDDDDDDDDDDDD>
##$VPLIST= <PPPPPPPPPPPPPPP>
##$VTLIST= <TTTTTTTTTTTTTTT>
##$WBST= 1024
##$WBSW= 4
##$XGAIN= (0..3)
0 0 0 0 
##$XL= 0
##$YL= 0
##$YMAX_a= 56029
##$YMIN_a= -62379
##$ZGOPTNS= <>
##$ZL1= 120
##$ZL2= 120
##$ZL3= 120
##$ZL4= 120
##$ABSF1= 198.0616
##$ABSF2= -202.7028
##$ABSG= 5
##$ABSL= 3
##$ALPHA= 0
##$AQORDER= 0
##$ASSFAC= 0
##$ASSFACI= 0
##$ASSFACX= 0
##$ASSWID= 0
##$AUNMP= <proc_1d>
##$AZFE= 0.1
##$AZFW= 0.5
##$BCFW= 0
##$BC_mod= 2
##$BYTORDP= 0
##$COROFFS= 0
##$CY= -3
##$DATMOD= 1
##$DC= 0
##$DFILT= <>
##$DTYPP= 0
##$F1P= 0
##$F2P= 0
##$FCOR= 1
##$FTSIZE= 65536
##$FT_mod= 6
##$GAMMA= 0
##$GB= 0
##$INTBC= 1
##$INTSCL= 9.790993e-09
##$ISEN= 30
##$LB= 1.5
##$LEV0= 0
##$LPBIN= 0
##$MAXI= 10000
##$MC2= 0
##$MEAN= 0
##$ME_mod= 0
##$MI= 50
##$NCOEF= 0
##$NC_proc= -4
##$NLEV= 6
##$NOISF1= 182.463
##$NOISF2= 159.3651
##$NSP= 0
##$NTH_PI= 0
##$NZP= 0
##$OFFSET= 198.0616
##$PC= 4
##$PHC0= 2115.303
##$PHC1= 110.4863
##$PH_mod= 1
##$PKNL= yes
##$PPARMOD= 0
##$PSCAL= 0
##$PSIGN= 0
##$REVERSE= no
##$SF= 81.0140089999434
##$SI= 65536
##$SIGF1= 159.3651
##$SIGF2= -187.1042
##$SINO= 113.3802
##$SIOLD= 16384
##$SREGLST= <1H.CDCl3>
##$SSB= 0
##$STSI= 65536
##$STSR= 0
##$SW_p= 32467.5324675325
##$SYMM= 0
##$S_DEV= 0
##$TDeff= 32768
##$TDoff= 0
##$TI= <>
##$TILT= no
##$TM1= 0
##$TM2= 0
##$TOPLEV= 0
##$USERP1= <user>
##$USERP2= <user>
##$USERP3= <user>
##$USERP4= <user>
##$USERP5= <user>
##$WDW= 1
##$XDIM= 65536
##$YMAX_p= 429171307
##$YMIN_p= -5593621
$$ End of Bruker specific parameters
$$ ---------------------------------
##NTUPLES= NMR SPECTRUM
##VAR_NAME=  FREQUENCY,     SPECTRUM/REAL,   SPECTRUM/IMAG
##SYMBOL=    X,             R,               I
##VAR_TYPE=  INDEPENDENT,   DEPENDENT,       DEPENDENT
##VAR_FORM=  AFFN,          ASDF,            ASDF
##VAR_DIM=   65536,         65536,           65536
##UNITS=     HZ,            ARBITRARY UNITS, ARBITRARY UNITS
##FACTOR=    0.49542278885378, 1,            1
##FIRST=     16045.7642231865, 0,            0
##LAST=      -16421.768244346, 0,            0
##MIN=       -16421.768244346, -5593621,     0
##MAX=       16045.7642231865, 429171307,    0
$$ Real data points
##PAGE= N=1
##DATA TABLE= (X++(R..R)), XYDATA
$$ [...]
38416a16364j979N027L0038k45o2581o0112K635K4882k717J5003P8193O1666n9089
$$ -116364 -118343 -113316 -83278 -83523 -146104 -206216 -203581 -178699 -181416 -166413 -88220 -26554 -85643
38403h5643j31395o3416K6417J0212m7350k1704O1740R9784R5552J12823J17892
$$ -85643 -217038 -280454 -254037 -243825 -291175 -312879 -251139 -151355 -55803 57020 174912
38392A74912L1265r9007j31000l2686P3845P8037r580j12298j59971j11968M154
$$ 174912 206177 107170 -23830 -56516 17329 95366 85786 -26512 -186483 -298451 -294297
38381b94297Q1566M4222m1876n0116L0942R7484R1689N2817N939p7129j72341
$$ -294297 -212731 -168509 -210385 -260501 -229559 -132075 -40386 12431 18370 -58759 -231100
38370b31100j75057m4769J04581J34531N1440j9849L973R0589J56377J50428P7553
$$ -231100 -406157 -450926 -346345 -211814 -160374 -180223 -176250 -85661 70716 221144 298697
38359B98697k2639j06315j45571j28559n8254L2145Q3332O6968K8826L2162O4609
$$ 298697 276058 169743 24172 -104387 -162641 -130496 -47164 19804 48630 80792 145401
38348A45401N5768p133m4757L609Q7253J06839L7478n5553j04248r8037o5206
$$ 145401 201169 194036 149279 152888 240141 346980 384458 328905 224657 126620 61414
38337F1414l3975j7211j0505P20J8962K4381M669j3455P573N5853P4830M5206
$$ 61414 27439 10228 -277 443 19405 43786 48455 35000 42573 98426 173256 218462
38325B18462K4860O9146J36518J28310K0593j00010j47677j30980j07242r5534
$$ 218462 243322 312468 448986 577296 597889 497879 350202 219222 111980 16446
38315A6446p9122n3504k2362K0816O0446M8563j8490o0845k3883K4437j708n2708
$$ 16446 -62676 -116180 -138542 -117726 -57280 -8717 -27207 -88052 -111935 -87498 -89206 -141914
38303a41914j8605P3021Q4713l043n3474m45M8073M720m9771j5006O0795P8242
$$ -141914 -160519 -87498 -2785 -5828 -59302 -59747 -11674 -6954 -56725 -71731 -10936 67306
38291F7306M9917M6079O1013M8964K1160K007l5306q8752p5022K7178Q2294j2500
$$ 67306 117223 163302 224315 273279 294439 296446 261140 172388 97366 124544 206838 194338
38279A94338j39173j26051j9144L521p3556j02743l6071K2405K0744R268j8293
$$ 194338 55165 -70886 -90030 -86509 -160065 -262808 -298879 -276474 -255730 -246462 -264755
38268b64755j19436k15341j34642R8212K38113J64990M1952K5815L7391l2831
$$ -264755 -384191 -599532 -734174 -635962 -397849 -232859 -190907 -165092 -127701 -160532
38258a60532r0821o683J32171J46384M5472j7723m114k670l0760j6701K7802M119
$$ -160532 -251353 -258036 -125865 20519 65991 48268 44154 41484 10724 -5977 21825 25944
38246B5944q2570r7976N182R1431L9777p6732j04022k4915M0224J9616k3857q148
$$ 25944 -56626 -154602 -149420 -57989 -18212 -94944 -198966 -223881 -183657 -164041 -187898 -196046
38234a96046M3962M8090j3815p4748q5187o5452m0459R56M1750J7383o5067p2840
$$ -196046 -152084 -103994 -117809 -192557 -277744 -343196 -383655 -382699 -340949 -323566 -388633 -461473
38222d61473P5496K46393K45120Q8155l7058n4410n3966o7319n667J25958J67966
$$ -461473 -385977 -139584 105536 193691 156633 102223 48257 -19062 -24729 101229 269195
38211B69195N8400m6132k2322K6258k9993j19305j11909m8728m0572n4011R067
$$ 269195 327595 281463 259141 285399 255406 136101 24192 -24536 -65108 -119119 -110052
38200a10052J07958J28798Q0810M6895J2753o8806j18343l9777P2698N6244m2555
$$ -110052 -2094 126704 207514 254409 267162 198356 80013 40236 112934 169178 126623
38189A26623m8982J5251l9999k08296k37316k7004J83035J57805j2789r2457l0342
$$ 126623 77641 92892 52893 -155403 -392719 -419723 -236688 -78883 -91672 -184129 -214471
38178b14471M9528O7828M0047j2230o5280o4480N409P4695R1393R9433J37290
$$ -214471 -164943 -97115 -57068 -69298 -134578 -199058 -193649 -118954 -27561 71872 209162
38167B09162J40514M1827r9346j69307j53598j23445j06505o3232K5064J18498
$$ 209162 349676 391503 292157 122850 -30748 -154193 -260698 -323930 -298866 -180368
38157a80368J64550J40490O9434K1844O2804J66132K24292J74943P0233q857m9269
$$ -180368 -15818 124672 194106 215950 278754 444886 669178 844121 914354 905497 856228
38146H56228p9443j04714j16974j23379j23520r6714m2621M198J7995k396n8876
$$ 856228 776785 672071 555097 431718 308198 211484 168863 173061 191056 188660 129784
38135A29784j29027j26134J4063J96186K32685Q3404q8694j43559j17447r2042
$$ 129784 757 -125377 -111314 84872 317557 400961 312267 168708 51261 -40781
38125d0781n4918J1018L0282m5359j20867r0485K01N0039O9673J11188J16216
$$ -40781 -95699 -84681 -54399 -99758 -220625 -311110 -310909 -260870 -191197 -80009 36207
38114C6207M900j37207j39754K427J21616J15528M4053j2187m0651l2005K9037
$$ 36207 41107 -96100 -235854 -233427 -111811 3717 47770 35583 -5068 -37073 -8036
38103h036Q3081L9158p4816j31333r4808n6626n1376M604J29813J88939Q9607
$$ -8036 75045 114203 39387 -91946 -186754 -243380 -294756 -290152 -160339 28600 118207
38092A18207n6894q8703j2810M7368M7403L7085K8493k2001j10479j68424j54700
$$ 118207 61313 -27390 -40200 7168 54571 91656 120149 98148 -12331 -180755 -335455
38081c35455r0377n578P8571J19600P8160j5660p5832n3217K2757R3070J18794
$$ -335455 -425832 -431410 -352839 -233239 -155079 -170739 -246571 -299788 -277031 -183961 -65167
38070f5167Q8470K3845k1649j4731O980k0229r2659j40026j20492n8768J6404
$$ -65167 23303 47148 25499 10768 17748 -2481 -95140 -235166 -355658 -414426 -398022
38059c98022J04734J80591J78669Q3275k4391o6451o6169p7568o9956J4821J16308
$$ -398022 -293288 -112697 65972 149247 124856 58405 -7764 -85332 -155288 -140467 -24159
38048b4159R4799n9995j79043j31059Q699Q1087M7949j7597p0079j04878q3354
$$ -24159 70640 10645 -168398 -299457 -290758 -209671 -161722 -179319 -249398 -354276 -437630
38037d37630K5178J45898J66959J00775N6906N7432J7555p2818j02003k5308M5381
$$ -437630 -412452 -266554 -99595 1180 58086 115518 133073 60255 -41748 -67056 -21675
38026b1675K3056j6930J4307N4398O055p6114o3913L8633J12599J10279Q6228
$$ -21675 1381 -15549 -1242 53156 59211 -16903 -80816 -42183 70416 180695 266923
38015B66923O5334J4498n8892j00536j01173q9186m5259N8263J46987J09742k0922
$$ 266923 332257 346755 287863 187327 86154 -3032 -48291 9972 156959 266701 245779
38004B45779r2193n1645o35j22J5776P2936O8319n0030j54944j19497j1098L2999
$$ 245779 153586 101941 101306 101184 116960 189896 258215 208185 53241 -66256 -77354 -44355
37992d4355K7364P4344J47946J25976J6006l6113J3394L0904o5416j54324r5826
$$ -44355 -16991 57353 205299 331275 347281 311168 324562 355466 290050 135726 39900
37981C9900M6148R7776K8089l0473L864N7755L5454m9913j22952j41184r0889
$$ 39900 86048 183824 211913 181440 185304 243059 278513 228600 105648 -35536 -126425
37970a26425L5330J81673K11870N1149j77498k60138j39526L1835R5146M8008
$$ -126425 -91095 90578 302448 353597 176099 -84039 -223565 -191730 -96584 -48576
37960d8576k0708n7449n1425k105N0301K9639p0335j45447j15486l3775J3926
$$ -48576 -69284 -126733 -178158 -180263 -129962 -100323 -170658 -316105 -431591 -465366 -451440
37949d51440M4999J12949J74094J50100P7710N6231P3198L2845m9489m5353O8388
$$ -451440 -406441 -293492 -119398 30702 108412 164643 237841 270686 221197 175844 244232
37938B44232J48183R6295o879n2104n1127n3208l4534K4869N5925P264m4126q203
$$ 244232 392415 488710 481831 429727 378600 325392 290858 315727 371652 378916 334790 326587
37926C26587N7090K7444q5309j40528p0379L5567N7933k4173j44523k21901k08461
$$ 326587 383677 411121 325812 185284 114905 150472 208405 184232 39709 -182192 -390653
37915c90653j17687j4496N2192R4104J31958J34888O4405m8168j27324j39913
$$ -390653 -508340 -522836 -470644 -376540 -244582 -109694 -45289 -93457 -220781 -360694
37905c60694j04696l9281M1344R1275O7650p66l4188M453P7074J25571J17963
$$ -360694 -465390 -504671 -463327 -372052 -304402 -305168 -339356 -334903 -257829 -132258 -14295
37894a4295N0133n0102j22320j17718m6714L9766R9448J05628M1935o3350j27546
$$ -14295 35838 -14264 -136584 -254302 -301016 -261250 -161802 -56174 -14239 -77589 -205135
37883b05135r4137o168M7424L5550j1791o7833j11268r6637n599Q7212Q6058R900
$$ -205135 -299272 -305440 -258016 -222466 -234257 -302090 -413358 -509995 -515594 -428382 -342324 -332424
37871c32424k9972N686L6902J0101l729P9137K08196K43517J29909l5507j17614
$$ -332424 -362396 -356710 -319808 -309707 -313436 -234299 -26103 217414 347323 311816 194202
37860A94202q7734l2518l1240n6419k4691O9262J28551Q4403j1154p0042q6774
$$ 194202 106468 73950 42710 -13709 -38400 30862 159413 243816 232662 162620 75846
37849G5846j00348q8345k400J08876J25770K5082p5286p5590j6452M592k9374
$$ 75846 -24502 -112847 -115247 -6371 119399 144481 69195 -6395 -22847 -18255 -47629
37838d7629n7588l8291J0277M3425L1227j7439n8476o1688n3435p2888r6209o4723
$$ -47629 -105217 -143508 -133231 -89806 -58579 -76018 -134494 -196182 -249617 -322505 -418714 -483437
37826d83437J2896O2453O1625P0655J14238J22159M4499n3103q3367o2471n7925
$$ -483437 -470541 -408088 -346463 -275808 -161570 -39411 5088 -48015 -131382 -193853 -251778
37815b51778o3693k4459M5932P2020L6966J116p411k7945o6693n2460M7812J36784
$$ -251778 -315471 -339930 -293998 -221978 -185012 -183896 -191307 -219252 -285945 -338405 -290593 -153809
37803a53809R3322n4735j46969q8896L4564P9497K6204j6957K8610J20005J70885
$$ -153809 -60487 -115222 -262191 -351087 -316523 -237026 -210822 -227779 -199169 -79164 91721
37792I1721J56460J03709L2472l4981m6321K1147R0058N6302o1827j30337p8090
$$ 91721 248181 351890 384362 349381 303060 324207 414265 470567 408740 278403 200313
37781B00313J1471K8173j8672m3435k0313l943l7243r7552j27814q9826m940M0708
$$ 200313 211784 239957 221285 177850 157537 153594 116351 18799 -109015 -198841 -203781 -163073
37769a63073k2984j34548j31419M3627K28295K21670L7678j24802j40943p1397
$$ -163073 -186057 -320605 -452024 -408397 -180102 41568 79246 -45556 -186499 -257896
37759b57896j3747K5595O3127N7704j5011q1830n8986K1823N9474K9706K118J9446
$$ -257896 -271643 -246048 -182921 -125217 -140228 -222058 -281044 -259221 -199747 -170041 -167923 -148477
37747a48477L9772J2905m8597r8273j11172q9330m6501n930J3504K0552L6564
$$ -148477 -108705 -95800 -144397 -242670 -353842 -443172 -489673 -495603 -482099 -461547 -424983
37736d24983N6012N7031N1813P6801J21093J24005P3051M1246P4458R9468K3403
$$ -424983 -368971 -311940 -260127 -183326 -62233 61772 134823 176069 250527 349995 373398
37725C73398j10242j58719o8864N9023J08878O8991q170q3323j26434j09283n5300
$$ 373398 263156 104437 35573 94596 203474 272465 264295 180972 54538 -54745 -110045
37714a10045l5114n8221l5528P8988J74300J11803o6123j68549r6882M5585J03355
$$ -110045 -145159 -203380 -238908 -159920 14380 126183 60060 -108489 -205371 -159786 -56431
37703e6431M3027n1428q6723k8684Q0964J43533Q6699m3840j20706q4567p176
$$ -56431 -13404 -64832 -151555 -180239 -99275 44258 130957 87117 -33589 -118156 -125332
37692a25332J8956m334j6338J626J3787p612m9135p0784l3431O1527J44791J32763
$$ -125332 -106376 -110710 -127048 -125422 -111635 -119247 -168382 -239166 -272597 -211070 -66279 66484
37680F6484L1829n6696o5287m2502o5808j25140j50012j09428k2199R2278J99146
$$ 66484 98313 41617 -23670 -66172 -131980 -257120 -407132 -516560 -538759 -446481 -247335
37669b47335K17591R9762o5730j24083m6469L3067M501p7722r7269m8305k0384
$$ -247335 -29744 70018 4288 -119795 -166264 -133197 -128696 -206418 -303687 -351992 -372376
37658c72376m6182n9014r237N7098P2172M4135L2356N7071Q5678R3999Q8100O6015
$$ -372376 -418558 -477572 -486809 -429711 -357539 -313404 -281048 -223977 -138299 -44300 43800 109815
37646A09815J2671n2296p4363m1111j1757k8276m1390J3446R6018R6369p849j03128
$$ 109815 122486 70190 -4173 -45284 -57041 -85317 -126707 -113261 -17243 79126 71277 -31851
37634c1851p9731K9702R0592K4241j04667j57902p4008N8591J00779L5212j2845
$$ -31851 -111582 -81880 8712 32953 -71714 -229616 -303624 -245033 -144254 -109042 -121887
37623a21887M5112J31425J23402L9316p337j56k7853j03224j24572n5700j061
$$ -121887 -76775 54650 178052 217368 210031 209875 182022 78798 -45774 -101474 -102535
37612a02535l2705o9074j4779Q8990J52600J76657J91274J48187O763j37505j51539
$$ -102535 -135240 -204314 -219093 -130103 22497 199154 390428 538615 545378 407873 256334
37601B56334n6176J0089p766m2820m9529n2330n0215k519O6568O2913m0235j47705
$$ 256334 200158 210247 202481 159661 110132 57802 7587 5068 71636 134549 94314 -53391
37589e3391j60102p8007K8979R0089O1575m1520j32692j38036q9037o2765n2729
$$ -53391 -213493 -291500 -262521 -172432 -110857 -152377 -285069 -423105 -512142 -574907 -627636
37578f27636K740Q0361Q5341J6109j2928N1464J21766J15334O5618K9318p007
$$ -627636 -624896 -544535 -459194 -443085 -456013 -404549 -282783 -167449 -101831 -72513 -79520
37567g9520n3236m8401M2868J41693J48692O8533k8176j02388j35893r5349N973
$$ -79520 -132756 -181157 -138289 3404 152096 220629 192453 90065 -45828 -141177 -135204
37556a35204O9208K4930n6320n5417K9519R2630O6303k0572j04335j32850p6133
$$ -135204 -65996 -41066 -97386 -152803 -123284 -30654 35649 15077 -89258 -222108 -298241
37545b98241L6406J10863Q7177J6874j9452l2291q0335j42943j35067m1463N4957
$$ -298241 -261835 -150972 -63795 -46921 -66373 -98664 -178999 -321942 -457009 -498472 -443515
37534d43515Q5308O1852K9396J5431K8395M5667J3666p6999j38220q5971K4805
$$ -443515 -358207 -296355 -266959 -251528 -223133 -177466 -163800 -240799 -379019 -464990 -440185
37523d40185O3168J0236k6446P061M1012K7369K9692R6869J53399J11585J7947
$$ -440185 -377017 -366781 -393227 -386166 -345154 -317785 -288093 -191224 -37825 73760 91707
37512I1707j5115K4920N2826K3641k6830o4683q9639q3594j3218R8095J69753
$$ 91707 76592 101512 154338 177979 151149 86466 -3173 -86767 -99985 -1890 167863
37501A67863J57141R0486J0189p0920j23651j00386k1117J2843m1047p5969K0516
$$ 167863 325004 415490 425679 354759 231108 130722 109605 122448 81401 5432 25948
37490B5948J71874J80226p369k15988k64190j64472m2753M0556R1318Q4432l52
$$ 25948 197822 378048 370679 154691 -109499 -273971 -316724 -276168 -184850 -100418 -100770
37479a00770q0107m5413O3896R4121J0354m7570M035N1124k5184j37314j21697
$$ -100770 -180877 -226290 -162394 -68273 -57919 -105489 -101454 -50330 -75514 -212828 -334525
37468c34525m495L4556n7338j31879p5191L3412O7004L5668L0303O3049P0192
$$ -334525 -339020 -304464 -361802 -493681 -568872 -535460 -468456 -432788 -402485 -339436 -269244
37457b69244L3473J598N465L2203P4677J27306J34378L4432j18197j69370o2968
$$ -269244 -235771 -234173 -228708 -196505 -121828 5478 139856 174288 56091 -113279 -176247
37446a76247N6044K7555r2385j11447P899R2060L3332l4796M5876J89399J82945
$$ -176247 -120203 -92648 -185033 -296480 -288581 -196521 -163189 -197985 -152109 37290 220235
37435B20235J1071j26690j16840n9227n0185k5018Q3977J86315J65453O4534K348
$$ 220235 231306 104616 -12224 -71451 -121636 -146654 -62677 123638 289091 353625 355973
37424C55973j3489m8441q3451m8661K3543K9507l7709q9609r8911j13248j17597
$$ 355973 342484 294043 210592 161931 185474 214981 177272 87663 -11248 -124496 -242093
37413b42093l8978R0231J29493L9892m3950j6347N3312N5245O321p502L5563J01072
$$ -242093 -281071 -190840 -61347 -21455 -65405 -81752 -28440 26805 33126 25624 61187 162259
37401A62259J56126J45414Q664j87213k40451o5571J36168J12125r3373j99743
$$ 162259 318385 463799 472463 285250 44799 -20772 115396 227521 134148 -65595
37391f5595q1713Q5186J08183L2988K0220R4278J46426J21558O8598K1306m8990
$$ -65595 -147308 -62122 46061 79049 99269 193547 339973 461531 530129 551435 502445
37380E02445j34960j47657l4651J14316J56588O8585m2996r2293r3460p5164j3171
$$ 502445 367485 219828 185177 299493 456081 524666 481670 389377 295917 220753 207582
37369B07582R3086J57899J13046K0696j4985n400l1934p6108m0864N5274O4329
$$ 207582 300668 458567 571613 592309 577324 571924 539990 463882 423018 478292 542621
37358E42621o3087j82964j67527p6793k4261N060P7645J52582J43226P2015K5634
$$ 542621 479534 296570 129043 52250 27989 33049 110694 263276 406502 478517 504151
37347E04151O479l3565n4470K4963J56168J83858N3541j22364k14606j86763o1167
$$ 504151 510630 477065 422595 447558 603726 787584 841125 718761 504155 317392 256225
37336B56225J03558J98184J50539M0678J3714P6048J05626O0549K0889J1412l6241
$$ 256225 359783 557967 708506 749184 762898 838946 944572 1005121 1026010 1037422 1001181
37325A001181j04269o8397O5449J04625l2567j55766r3825L3970L2475m4737k4675
$$ 1001181 896912 828515 893964 998589 966022 810256 716431 750401 782876 738139 713464
37314G13464N3359J1409j26877j59051n6824p781o8171o3275P3978J43415J0623
$$ 713464 766823 778232 651355 492304 435480 427699 359528 296253 370231 513646 524269
37303E24269j41931r8673M5129N5271o4014j14880m6722l75l7830o3115k8901
$$ 524269 382338 283665 328794 384065 320051 205171 158449 158074 120244 57129 28228
37292B8228j1587l7872k4753M8100P8320K6818J361O1761R4499J356j20343j29947
$$ 28228 16641 -21231 -45984 2116 80436 107254 108615 170376 264875 266231 145888 15941
37280A5941o9816p6358j39141j28346l0962K2835j6405l5411M5279J33686J10545
$$ 15941 -53875 -130233 -269374 -397720 -428682 -405847 -422252 -457663 -412384 -278698 -168153
37269a68153R539m3517q858M2930N2682L6436L1906M0263L2511j1876p4046r7350
$$ -168153 -158614 -202131 -210989 -168059 -115377 -78941 -47035 -6772 25739 13863 -60183 -157533
37257a57533m1098N7091J04070N5536l1723p1560m1586J4792M4570K0850m0037
$$ -157533 -198631 -141540 -37470 18066 -13657 -85217 -126803 -112011 -67441 -46591 -86628
37246h6628p3558k3462O9022Q8444k02q4124n6618K3899K5536n0574p8047q343
$$ -86628 -160186 -183648 -114626 -26182 -26384 -110508 -167126 -143227 -117691 -168265 -246312 -254655
37234b54655O7860Q6045R7152J28231Q7529p3851k03540j12360J34929K58538
$$ -254655 -186795 -100750 -3598 124633 212162 138311 -65229 -177589 -42660 215878
37224B15878J21811r3955j45397l9557K6380l2885r6274m7267N2115O2112l9859
$$ 215878 337689 243734 98337 58780 85160 52275 -43999 -91266 -39151 22961 -16898
37213a6898j45153j57298p6132M4464J48877J83223J15748j1512r3781o3750L9127
$$ -16898 -162051 -319349 -395481 -351017 -202140 -18917 96831 85319 -8462 -72212 -33085
37202c3085J19649J20980M9975n1834j25637j15909k4061P1881R4131M8998o701
$$ -33085 86564 207544 257519 205685 80048 -35861 -59922 11959 106090 155088 148387
37191A48387n7402j18889j49125o6507J06725K08078J20676n5203j10002R267
$$ 148387 90985 -27904 -177029 -243536 -136811 71267 191943 136740 26738 36005
37181C6005J33941R4452p4590j99115j77939o2901M4400R8846J06969Q2217M1993
$$ 36005 169946 264398 189808 -9307 -187246 -250147 -205747 -106901 68 82285 124278
37170A24278J3584O386j878k3046k5729J9406Q0202R3747M9408m094l2254m4966
$$ 124278 137862 144248 142370 119324 93595 113001 193203 286950 336358 332264 300010 255044
37158B55044m8220k4271J8512L4023J3536J9625R2929J66875J41070J9782q5906
$$ 255044 206824 182553 201065 235088 248624 268249 361178 528053 669123 688905 602999
37147F02999r0469j7716M6210L9794l1821j01830r2616K468R7349J07587M5729
$$ 602999 512530 494814 541024 580818 548997 447167 354551 357019 454368 561955 607684
37136F07684j9164o2811j00014j08076m8804L8313O2491J3402k9527l7014o7251
$$ 607684 588520 525709 425695 317619 268815 307128 369619 383021 353494 316480 249229
37125B49229j22991r6793N3637J79888J14529r3142k37041k16171j13893k8495
$$ 249229 126238 29445 83082 262970 377499 284357 47316 -168855 -282748 -311243
37115c11243M3637J23714J60234R6255k6159r6552o3454N872M057q4216j47799
$$ -311243 -267606 -143892 16342 112597 86438 -10114 -73568 -67696 -63639 -147855 -295654
37104b95654p6439Q6147J77543J23275L0346K2826O6428M7542l7826r1386p1495
$$ -295654 -372093 -285946 -108403 14872 45218 68044 134472 182014 144188 52802 -18693
37093a8693k1155M0562J20510J52395M8737j23579j75855o0182N1058K4726m7984
$$ -18693 -39848 714 121224 273619 322356 198777 22922 -37260 13798 38524 -9460
37082i460l7625J027m5433j14640o0190P8556J08410j5435j16108o8963K5848
$$ -9460 -47085 -46058 -91491 -206131 -266321 -187765 -79355 -94790 -210898 -279861 -254013
37071b54013K5776m2698o2464j0929N0110R8945J49090J60448P5703n7653j06969
$$ -254013 -228237 -270935 -333399 -344328 -294218 -195273 -46183 114265 189968 132315 25346
37060B5346k4494Q0104Q1641J683k9320M5129J23152P0405j01056k30916j97048
$$ 25346 852 80956 162597 164280 134960 180089 303241 373646 272590 41674 -155374
37049a55374n7610L0825M819n3973m8475J8488P6757Q3215N0945J6767P535J9505
$$ -155374 -212984 -182159 -177340 -231313 -279788 -261300 -184543 -101328 -50383 -33616 -26081 -6576
37037f576K0567l587j1181M1534J09877R3966j6235j03106p1929K6772P9674N4099
$$ -6576 13991 10404 -777 40757 150634 244600 228365 125259 53330 80102 159776 213875
37025B13875n198o4468j07327r8985k9968L8866N7000O9726J28725J63221O7014
$$ 213875 208677 144209 36882 -62103 -92071 -53205 3795 73521 202246 365467 432481
37014D32481j09411j98978j55695j01548j07930r2065L716Q7713P6106L6623N1828
$$ 432481 323070 124092 -31603 -133151 -241081 -333146 -329430 -241717 -165611 -128988 -77160
37003g7160O3034k853o1297k706Q5760L5903j07495j30609O774R8171J7094r3309
$$ -77160 -14126 -16979 -78276 -80982 4778 40681 -66814 -197423 -190649 -92478 -75384 -168693
36991a68693o0974O1142J13970O7417k713o0301q8542k3432J35062K25409J10474
$$ -168693 -229667 -168525 -54555 12862 10149 -50152 -138694 -162126 -27064 198345 308819
36980C08819r3234j53225n5513l310q0030j30151l9578O8270M0553n7746o2911
$$ 308819 215585 62360 6847 3537 -76493 -206644 -246222 -177952 -137399 -195145 -258056
36969b58056K3285N8544O15m0775P828Q1975R6989O0452K2056r145m4658o6678
$$ -258056 -234771 -176227 -175612 -216387 -208559 -126584 -29595 30857 52913 43768 -890 -67568
36957f7568m8650K271N7195R7041J07887P0811j2336r7180j29571r8969m3022
$$ -67568 -116218 -113947 -56752 40289 148176 218987 206651 109471 -20100 -119069 -162091
36946a62091r29K3803N0262Q0096Q6593N3503J2028J1846N3166Q1209O3134L2415
$$ -162091 -163020 -139217 -88955 -8859 77734 131237 143265 155111 208277 289486 352620 385035
36934C85035K6381J8672l3503j00507j07068m5418P647L251j5254O258M4142M1196
$$ 385035 411416 430088 396585 296078 189010 143592 151239 154490 139236 145494 189636 230832
36922B30832J752j7175J864N947n5585j55522k01391j25054L3914J43717J10450
$$ 230832 232584 215409 217273 223220 167635 12113 -189278 -314332 -280418 -136701 -26251
36911b6251o308n3742K3812J12442Q3875l6442j19831j05813m0564K5395P9342
$$ -26251 -32559 -86301 -62489 49953 133828 97386 -22445 -128258 -168822 -143427 -64085
36900f4085R1750K5247p7723j13202o3211l4048q9920j38623o9920O4693J22993
$$ -64085 27665 52912 -24811 -138013 -201224 -235272 -325192 -463815 -533735 -469042 -346049
36889c46049Q1806N1504Q6955J10124N5269j8566k6336J1038J4658k0463k7374
$$ -346049 -264243 -212739 -125784 -15660 39609 21043 -5293 5745 20403 -60 -27434
36878b7434J5679M9194K5563k0809k4685K1792O1999M5604j3249n1667k8339K6460
$$ -27434 -11755 37439 63002 42193 17508 39300 101299 146903 133654 81987 53648 80108
36866H0108M1537j0931p7769q7275l8580m317l9696j07358j10762o101J29733
$$ 80108 121645 110714 32945 -54330 -92910 -97227 -136923 -244281 -355043 -361144 -231411
36855b31411J63909N3243r2400j21920j2018J13070J33644N9093j7785l7963q070
$$ -231411 -67502 -14259 -106659 -228579 -240597 -127527 6117 65210 47425 9462 1392
36844A392L6968M6746k8913j64074k27268j20714O1934J24560K7682o1705k1688
$$ 1392 38360 85106 56193 -107881 -335149 -455863 -393929 -269369 -241687 -303392 -325080
36833c25080N6899M5914l092L4539J20165J08599P197k4923M5812O0569m9439
$$ -325080 -268181 -222267 -225359 -190820 -70655 37944 45141 20218 66030 126599 77160
36822G7160j19751k5136Q6665K4607j18502j02536P2600J71136R7160O685O323
$$ 77160 -42591 -67727 18938 43545 -74957 -177493 -104893 66243 163403 170088 176411
36811A76411R84n9801l5319J39695K55332J15148j32140j99726r4002o1901j58814
$$ 176411 177395 117594 82275 221970 477302 592450 460310 260584 166582 104681 -54133
36800e4133j72375j0883J22137N4902q8350j04979j1383N0959O3827R6983J23404
$$ -54133 -226508 -237391 -115254 -60352 -148702 -253681 -265064 -214105 -150278 -53295 70109
36789G0109O4042l7001o2498j8780j3454n2095l1436N3325P1229k5136j04888
$$ 70109 134151 97150 34652 15872 2418 -49677 -81113 -27788 43441 18305 -86583
36778h6583o5575M809j6189p7975m6704N9674Q1577l5653j41831q4832P6482J47848
$$ -86583 -152158 -147349 -163538 -241513 -288217 -228543 -146966 -182619 -324450 -409282 -332800 -184952
36766a84952N4644o7946o1607M8064J01043L3230l9204O86R5927J06128J8529
$$ -184952 -130308 -198254 -259861 -211797 -110754 -77524 -116728 -116042 -20115 86013 104542
36755A04542m6141k8649r532n6289j00522m3463Q3795J49865Q4363n2985j46986
$$ 104542 58401 29752 20220 -36069 -136591 -180054 -96259 53606 137969 84984 -62002
36744f2002j27499j8643P5125O1252k8928o0820L2005J50996J65092Q2481O570
$$ -62002 -189501 -208144 -133019 -71767 -100695 -161515 -129510 21486 186578 269059 275629
36733B75629l0344p6448j24288r6354Q650P2927J9512p4728r0662k0489N6326
$$ 275629 245285 168837 44549 -51805 -43155 29772 49284 -25444 -116106 -136595 -80269
36722h0269Q8751P2913O725r2277j55801j30193n4590o402Q082L6244P7183Q6115
$$ -80269 8482 81395 88120 -4157 -159958 -290151 -344741 -351143 -343061 -306817 -229634 -143519
36710a43519O9703P7759R2882L6244q3265j33468l8347R5692J19789M4259J850
$$ -143519 -73816 3943 96825 133069 49804 -83664 -122011 -26319 93470 137729 139579
36699A39579M9410J11693J14845P8942N8651O5304P6620P5313N6071K6906R729
$$ 139579 188989 300682 415527 494469 553120 618424 695044 770357 826428 853334 863063
36688H63063R843l165m3276o1362j5588L2965j3844j30037j75802r6300k706j826
$$ 863063 872906 869741 826465 765103 749515 782480 768636 638599 462797 366497 363791 361965
36676C61965m9795n6220l8426n8462p5132L037J41426J92278R8645k9304p3145
$$ 361965 312170 255950 217524 159062 83930 86967 228393 420671 519316 490012 416867
36665D16867m1589m103J8030K8421n432j04919k04670k03374q9013M3109J04461
$$ 416867 375278 371175 389205 417626 412194 307275 102605 -100769 -189782 -146673 -42212
36654d2212R9117P8811N4613r50p3378q4958P617J27402J53811Q4162M4881J12086
$$ -42212 56905 135716 190329 189379 116001 31043 38660 166062 319873 404035 448916 561002
36642E61002J96226J68670M4791m4975l4336J8956L8331L901p5132j72819k20428
$$ 561002 757228 925898 970689 925714 891378 910334 948665 952566 877434 704615 484187
36631D84187j57585l3025K8221j3920o7811n5528j4575m044K236N3290J17203
$$ 484187 326602 293577 321798 307878 240067 184539 169964 165920 168156 221446 338649
36620C38649J22195O1177j5001p4368j10909j09699o9524l0860k0860k077O0951
$$ 338649 460844 522021 507020 432652 321743 212044 142520 111660 90800 88723 149674
36609A49674J18312R3372K476o2012n7558k5880p339J806J001k9667p4653p7005
$$ 149674 267986 361358 363834 301822 244264 218384 211045 212851 213852 184185 109532 32527
36597C2527j7151N0787P0424N1719L9150M2039K9630j5306o0799n0353L2326J25070
$$ 32527 15376 66163 136587 188306 227456 269495 299125 283819 223020 172667 204993 330063
36585C30063J38272N9112k4864l3505P902K0491j0216k9794j3375L68k0375n6494
$$ 330063 468335 527447 502583 469078 476980 497471 487255 457461 444086 444454 424079 367585
36573C67585p9083q2059n7630O562P8851Q4527P58q3960o0706N8849J45089J08019
$$ 367585 288502 206443 148813 155375 234226 318753 319511 235551 174845 233694 378783 486802
36561D86802Q128k8625J9120M6916j4942r3121q4629k2912k8688j11217j40642
$$ 486802 494930 466305 485425 532341 517399 424278 339649 316737 288049 176832 36190
36550C6190m8085O5421Q5509M4506L2511L8116k706n9854m4795L3351P4112M3597
$$ 36190 -11895 53526 139035 183541 216052 254168 251462 191608 146813 180164 254276 297873
36538B97873J1464K4109M7625N1229M9141M1519N681l5449k4963L0915O7550P9867
$$ 297873 309337 333446 381071 432300 481441 522960 528641 493192 468229 499144 566694 646561
36526F46561J35023K37463K84666K10368Q8028L2645O1078R9005P8083p460r8082
$$ 646561 781584 1019047 1303713 1514081 1602109 1634754 1695832 1794837 1872920 1865460 1767378
36515A767378j10404l1303L8200L606p9317q1347k95M7711L2478M3400R4888P9245
$$ 1767378 1656974 1625671 1663871 1667477 1588160 1506813 1506518 1554229 1586707 1630107 1724995 1804240
36503A804240k3722p3359J19O8826L4142L331Q1354J53350P5790n1570l7721O9365
$$ 1804240 1780518 1707159 1707278 1776104 1810246 1813577 1894931 2048281 2124071 2072501 2034780 2104145
36491B104145N4954j04205k01956j24573J5195R1245J05156P6915p730q5670l7241
$$ 2104145 2159099 2054894 1852938 1728365 1743560 1834805 1939961 2016876 2009146 1923476 1886235
36480A886235J11073J73330O9288n8968q0105o0430j05008j57497j02484K9343
$$ 1886235 1997308 2170638 2239926 2180958 2100853 2040423 1935415 1777918 1675434 1704777
36470A704777R7394L8351q6067j79356j70723m8271R3182J06298l0730j61961
$$ 1704777 1802171 1840522 1754455 1575099 1404376 1356105 1449287 1555585 1524855 1362894
36460A362894j54486o8528l9862q2878j22444j39748j51580j07466L7283J76194
$$ 1362894 1208408 1139880 1100018 1017140 894696 754948 603368 495902 533185 709379
36450G09379J40838n3666j95761j46159R43P3367L2785l4672o0804n0956l6292
$$ 709379 850217 796551 600790 454631 455574 528941 561726 527054 466250 415294 379002
36439C79002l3286l9460l6064l390N2931J02391J15820P4458k9176j60438k28498
$$ 379002 345716 306256 270192 266802 319733 422124 537944 612402 583226 422788 194290
36428A94290j63547j5430Q0628N4699k8802o8909m1274J4471O6204J00203R7642
$$ 194290 30743 15313 95941 150640 121838 52929 11655 26126 92330 192533 290175
36417B90175N5387J2310N189J1047j3631m3745n815R1660J22188m57j75248k15774
$$ 290175 345562 357872 363061 374108 360477 316732 310917 402577 524765 524308 349060 133286
36405A33286r0343L8988M4896j58L9052J43714J79269J08807L2498J0952j4436
$$ 133286 42943 81931 126827 126669 165721 309435 488704 597511 630009 640961 626525
36394F26525q3966j31649j11515j00348j66185k19855j32621M3737J19334K6378
$$ 626525 542559 410910 299395 199047 32862 -186993 -319614 -275877 -156543 -130165
36384a30165r6824j09673l6859K1629M4002O7275Q4810O0261J4290Q316M2428
$$ -130165 -226989 -336662 -373521 -351892 -307890 -240615 -155805 -95544 -81254 -72938 -30510
36373c0510M4678j7301p2763l5376P8108J61047J40860N2450j7614k7568k972
$$ -30510 14168 -3133 -75896 -111272 -33164 127883 268743 321193 303579 276011 273039
36362B73039J1407o850n0645q6404p0533O328R4460J33519J18322Q2393L4268
$$ 273039 284446 277596 226951 140547 70014 76342 170802 304321 422643 505036 539304
36351E39304l1607p2479l2213M5454L6862q0262j64203j07554m660l506o5265
$$ 539304 507697 435218 403005 448459 485321 405059 240856 133302 128642 125136 59871
36340E9871l1687R6565J36470J6154q9036k1595R8966M4958j64441k64539j14427
$$ 59871 28184 124749 261219 277373 188337 166742 265708 310666 146225 -118314 -232741
36329b32741J00937J21691m5945j65174r9206L4486O6868Q044j9118L735j8481
$$ -232741 -131804 -10113 -56058 -221232 -320438 -285952 -219084 -211040 -230158 -226423 -244904
36318b44904r4577r0719N9840K11270J84057J8742p8255j1483J11091J62540J44530
$$ -244904 -339481 -430200 -370360 -159090 24967 43709 -34546 -46029 65062 227602 372132
36307C72132J16589R2687P0000P3518J01331Q8463o337j24289j77204j53574r9809
$$ 372132 488721 581408 651408 724926 826257 914720 908383 784094 606890 453316 353507
36296C53507m0263K0202M9879J8250m4831p7241o2123l0227q24L0527N8708P0918
$$ 353507 313244 333446 383325 401575 356744 279503 217380 187153 186329 216856 275564 346482
36284C46482P0606N9319J6246n6997r8796n8153J5724K6185l6936r2775r8471
$$ 346482 417088 476407 492653 435656 336860 278707 294431 320616 283680 190905 92434
36273I2434r5708j10996j01898m5274O876K2905O4073J72226K46838J54410n9348
$$ 92434 -3274 -114270 -216168 -261442 -254566 -231661 -167588 4638 251476 405886 346538
36262C46538j94357j53462n3864k9222m0026J6493J00927Q8514k057p407J19315
$$ 346538 152181 -1281 -55145 -84367 -124393 -107900 -6973 81541 79484 72077 191392
36251A91392K04917J05499o7064j01690J0960R1564N0286j7938l1428m8065j22995
$$ 191392 396309 501808 434744 333054 344014 435578 485864 467926 436498 388433 265438
36240B65438j76024j09395K9720J15735J16930R4880P2016J2895p3188j15893
$$ 265438 89414 -19981 9739 125474 242404 337284 409300 422195 349007 233114
36230B33114q5582l1097K876K7388N5193N5717j630r5431j68950j77824j15977
$$ 233114 147532 116435 119311 146699 201892 257609 255979 160548 -8402 -186226 -302203
36219c02203k1522M2929M6687K6971L9427Q1427J00387O7554J657o9232j20311
$$ -302203 -323725 -280796 -234109 -207138 -167711 -86284 14103 81657 83314 14082 -106229
36208a06229j15014l6448O5092J12187R1115M9530R054m9493j09410j08964l6804
$$ -106229 -221243 -257691 -192599 -80412 10703 60233 69287 19794 -89616 -198580 -235384
36197b35384L5203N0859L9608N1392Q0285R2542P9423M8633J4000J6286Q6892
$$ -235384 -200181 -149322 -109714 -58322 21963 114505 193928 242561 256561 272847 359739
36186C59739J65543J41531J9751n4437l663N4344j0635j29312j41112m5965J1030
$$ 359739 525282 666813 686564 632127 628464 682808 672173 542861 401749 355784 366814
36175C66814k4661o0238l8067j9890n7030j10753j41728j57209j33666k4840J05471
$$ 366814 342153 281915 243848 223958 166928 56175 -85553 -242762 -376428 -401268 -295797
36164b95797J04253l9596j29490l5060J06084J05531J9038K8362J07470M7974
$$ -295797 -191544 -231140 -360630 -395690 -289606 -184075 -165037 -136675 -29205 18769
36154A8769j74408k95825j22714J83621L18414K12410M8854k7644n1182q6095
$$ 18769 -155639 -451464 -574178 -390557 -72143 140267 189121 161477 110295 24200
36144B4200r3556j7251Q7452J02980N893r6371r4793n99Q3336Q4636K3744l5666
$$ 24200 -69356 -86607 845 103825 109718 13347 -81446 -82045 1291 85927 109671 74005
36132G4005o1935o6458o2866m3471J183N4845P8833M7979j4766m7683p237Q4928
$$ 74005 12070 -54388 -117254 -160725 -159542 -104697 -25864 22115 7349 -40334 -47571 37357
36120C7357J61627J71524J10878J2929o5723o7968L770N5849m899j35981j85193
$$ 37357 198984 370508 481386 494315 428592 360624 364394 420243 415344 279363 94170
36109I4170q1337P1699J37370J10836P3242M8338M14o3326r0363p1958m9076l7722
$$ 94170 12833 84532 221902 332738 405980 454318 454732 391406 301043 229085 180009 142287
36097A42287k4918j9831k3605K2818J49638K39661J43389p6854j76797n4182J12012
$$ 142287 117369 97538 73933 96751 246389 486050 629439 552585 375788 321606 433618
36086D33618J26812L2702j8845j1537k1223l0463K5995Q2246K723j78045k58011
$$ 433618 560430 593132 574287 562750 541527 511064 537059 619305 622028 443983 185972
36075A85972j47829Q055N1908J7070K4252Q2163J02833N5562j47j4945l003J000
$$ 185972 38143 46198 98106 115176 139428 221591 324424 379986 379839 364894 361891 362891
36063C62891j8407n9900j04669j14052o4054J4610O0583N3412L6533N2950P6157
$$ 362891 344484 284584 179915 65863 1809 16419 77002 130414 166947 219897 296054
36052B96054L9078o0102j20312n0443R8226J75410J12742r332r5779j49008j91234
$$ 296054 335132 275030 154718 104275 202501 377911 490653 481321 385542 236534 45300
36041D5300j68215l6192J13005J38323M1257m5085n1373l5449m0100j7466N6062
$$ 45300 -122915 -159107 -46102 92221 133478 88393 37020 1571 -38529 -55995 67
36030F7R8671L0897j02206j79035j31241O423J31681J47267N4888k1223K2416
$$ 67 98738 129635 27429 -151606 -282847 -276424 -144743 2524 57412 36189 58605
36019E8605J10950Q2742o2055j46199q2838l37k3219q2595o0101J3604M3424M0393
$$ 58605 169555 252297 190242 44043 -38795 -39132 -62351 -144946 -205047 -191443 -148019 -107626
36007a07626N7633N7183N861Q233J47017K65531J43762j34816k44135p5255J10253
$$ -107626 -49993 7190 13051 21284 168301 433832 577594 442778 198643 123388 233641
35996B33641P3434p9687j09638O59P8641L8965m6298r6225r4094m5252K1587M1062
$$ 233641 307075 227388 117750 118409 197050 236015 189717 93492 -602 -45854 -24267 16795
35984A6795k106j4746P3025J65258J17201l3054r5289J521J12559R8010J2106
$$ 16795 14689 -57 72968 238226 355427 322373 227084 228605 341164 439174 451280
35973D51280r201M9239R5426Q6107N7838K7196k8890q3368n4814N9441J29620
$$ 451280 442079 491318 586744 672851 730689 757885 728995 645627 590813 650254 779874
35962G79874N0596r8533j44844n0920M7941M5443o457j9751j6622n6864r4842
$$ 779874 830470 731937 587093 536173 584114 629557 623100 603349 586727 529863 435021
35951D35021m0012O9362R4055R112m4807K3921J15346R5513l477n5205m4150o4373
$$ 435021 395009 464371 558426 567538 522731 546652 661998 757511 754034 698829 654679 590306
35939E90306j32595j37963j1691J55065K20533J56484M8474k2202l8014j2491
$$ 590306 457711 319748 308057 463122 683655 840139 888613 866411 828397 815906
35929H15906L9698R5011J24366J19526R6671O7747K9008j2834k4420K2626J10232
$$ 815906 855604 950615 1074981 1194507 1291178 1358925 1387933 1375099 1350679 1373305 1483537
35918A483537J82403J96529J57209J06104R4205J55507K79310M05466M77369N11147
$$ 1483537 1665940 1862469 2019678 2125782 2219987 2375494 2654804 3060270 3537639 4048786
35908D048786N83698P38319R35747J123341J321482J603077J992548K388559K553873
$$ 4048786 4632484 5370803 6306550 7429891 8751373 10354450 12346998 14735557 17289430
35899A7289430K193277J155612l42362j744844k534766k615402k281956j863191
$$ 17289430 19482707 20638319 20295957 18551113 16016347 13400945 11118989 9255798
35891I255798j488919j170012r31098p84668o77785n58239m45283l74447l22477
$$ 9255798 7766879 6596867 5665769 4881101 4203316 3645077 3199794 2825347 2502870
35882B502870k47049j60939j12416j21417j71487k26659k27846j28544K5135J08623
$$ 2502870 2255821 2094882 1982466 1861049 1689562 1462903 1235057 1106513 1131648 1240271
35872A240271O3355k7933o1338m4432m3583o0984n0077j1990J1025J3140J8100
$$ 1240271 1303626 1275693 1214355 1169923 1126340 1065356 1015279 1003289 1014314 1027454 1045554
35861A045554J6960j4146n4756o6306n2484k9277K4541J06425J25942J1158j47147
$$ 1045554 1062514 1048368 993612 927306 874822 845545 870086 976511 1102453 1113611 966464
35850I66464j79246o1823O0614Q9181P7578R2224R5192L8426k7637l0766M257
$$ 966464 787218 725395 786009 875190 952768 1044992 1140184 1178610 1150973 1120207 1124464
35839A124464K925l2733k8949L9448R7148N0314j01329k40787k34470p9172P4029
$$ 1124464 1127389 1094656 1065707 1105155 1202303 1252617 1151288 910501 676031 596859 670888
35828F70888R0735K0286J0826P7801Q3516k5927j06481k9252J07577J12840j8501
$$ 670888 761623 781909 792735 870536 954052 928125 821644 792392 899969 1012809 994308
35817I94308j07342n4069L9795L9921m3588j01731p4572N534P5466R4989O0880
$$ 994308 886966 832897 872692 912613 869025 767294 692722 698256 773722 868711 929591
35806I29591N781k4671j3520J4890K8233J5776j6471n2661o0505j0239P6360J21108
$$ 929591 935372 910701 897181 912071 940304 956080 939609 886948 826443 816204 892564 1013672
35794A013672O7732m4314j17147j05147n5310k9467k4959k292L7848N3732L2057
$$ 1013672 1081404 1037090 919943 814796 759486 730019 705060 702768 740616 794348 826405
35783H26405P579K653n119l1869m8523k9114j972p491k9483j7760L3118P3122
$$ 826405 833984 836637 831518 799649 751126 722012 720040 712549 683066 665306 698424 771546
35771G71546O1967J1135l4529l2394K5178Q8873Q9073K3442k8361j4354J4037
$$ 771546 833513 844648 810119 777725 802903 891776 980849 1004291 975930 961576 975613
35760I75613r932o0226p5540p1081q9883q5958J3530J45831J56854K5566r2786
$$ 975613 965681 905455 829915 758834 668951 582993 596523 742354 899208 924774 831988
35749H31988q4064o292M3031N8942O3047L0823l2290n2336r523O828m6693p3260
$$ 831988 747924 741632 784663 843605 906652 937475 905185 852849 843326 850154 803461 730201
35737G30201l685N9126L415q2876l3765J26707K10777J36294J1416m6651l7178
$$ 730201 726516 785642 789057 706181 672416 799123 1009900 1146194 1157610 1110959 1073781
35726A073781j1856o666m7227j18497j33150l3417R0861J01051J1185l6636J1023
$$ 1073781 1061925 1055259 1008032 889535 756385 722968 813829 914880 926065 889429 900452
35715I00452O6305O8567N8350N9680L2756j8431k9103o221l7530j17356j13379
$$ 900452 966757 1035324 1093674 1153354 1186110 1167679 1138576 1132355 1094825 977469 864090
35704H64090J6130J17577O0466o2722p8534J9205R1213N9447k6872r2764j04503
$$ 864090 880220 997797 1058263 995541 917007 936212 1027425 1086872 1060000 967236 862733
35693H62733n9199J7940Q5524J34983J83903K01197J29413K0895L0224J89277
$$ 862733 803534 821474 906998 1041981 1225884 1427081 1556494 1577389 1607613 1796890
35683A796890L09482K22933J7021j03807r7226p0795o7509m0749j417r657l0260
$$ 1796890 2106372 2329305 2346326 2242519 2145293 2074498 2006989 1966240 1964823 1955166 1924906
35672A924906L2529J47230J64842M2026r3954j33651r6173k1855Q9839J82843
$$ 1924906 1957435 2104665 2269507 2311533 2217579 2083928 1987755 1965900 2055739 2238582
35662B238582J42289k6178j50215j18163l0866k4747o3441l5233L9692N2274j487
$$ 2238582 2380871 2354693 2204478 2086315 2055449 2030702 1967261 1932028 1971720 2023994 2022507
35651B022507k1058K4336N6957K9726r934j2365Q936K1692J2083k7870p9979p2636
$$ 2022507 2001449 2025785 2082742 2112468 2102534 2090169 2099105 2120797 2132880 2105010 2025031 1952395
35639A952395L9666J67398J58176O304j08036m2159J29538K27534J91073J06042
$$ 1952395 1992061 2159459 2317635 2323939 2215903 2173744 2303282 2530816 2721889 2827931
35629B827931N3725K7833m243l9514n7580m9738j7534J9189J4867n1372j18009
$$ 2827931 2881656 2909489 2905246 2865732 2808152 2758414 2740880 2760069 2774936 2723564 2605555
35618B605555r6579J420O2540K7856k3043k653L9424n488j23303j84249j27923
$$ 2605555 2508976 2510396 2572936 2600792 2577749 2575096 2614520 2609032 2485729 2301480 2173557
35607B173557l4246J0775J8526K5673J3304l6928p9184o7027k4815P395M0552
$$ 2173557 2139311 2150086 2168612 2194285 2207589 2170661 2091477 2024450 1999635 2007030 2047582
35596B047582Q1728Q1671K1948j5240K8574N9515l5827j75189j63839J4541J62065
$$ 2047582 2129310 2210981 2232929 2217689 2246263 2305778 2269951 2094762 1930923 1945464 2107529
35585B107529J47799N6340N980r604j6874K8674J07130O3754j61182l52614k65553
$$ 2107529 2255328 2311668 2317648 2308044 2291170 2319844 2426974 2490728 2329546 1976932 1711379
35574A711379K0918J93829J19781k9283o7985j7766J9126L4589O5720Q6540N1791
$$ 1711379 1732297 1926126 2045907 2016624 1948639 1930873 1949999 1984588 2050308 2136848 2188639
35563B188639j5007n4431n1455l5249l5265o1862r0279o3415K8851Q7374J7460
$$ 2188639 2173632 2119201 2067746 2032497 1997232 1935370 1845091 1781676 1810527 1897901 1915361
35552A915361r9843q1045Q6195J89367Q3477j02302j59364q0269m119K5259P4911
$$ 1915361 1815518 1734473 1820668 2010035 2093512 1991210 1831846 1751577 1747458 1772717 1847628
35541A847628J37571J06099m6691j96208k16482j14666J2864Q5904Q0689K8357
$$ 1847628 1985199 2091298 2044607 1848399 1631917 1517251 1530115 1616019 1696708 1725065
35531A725065o916Q062L4679K5886L067J0592K9840J9203O305M1435Q4442N3542
$$ 1725065 1718149 1726211 1760890 1786776 1789843 1800435 1830275 1849478 1855783 1897218 1981660 2035202
35519B035202k3562l4609L2194N9039j7525j20144j66796j67250j36778m7500
$$ 2035202 2011640 1977031 2009225 2068264 2050739 1930595 1763799 1596549 1459771 1412271
35509A412271O7215R3234Q666m7314K2187J22543J36937J17433J55969J78745
$$ 1412271 1479486 1572720 1581386 1534072 1556259 1678802 1815739 1933172 2089141 2267886
35499B267886O2364j14723j47883j5272Q9258M8578l8873n6244l1486l0305l2202
$$ 2267886 2330250 2215527 2067644 2052372 2141630 2190208 2151335 2095091 2063605 2033300 2001098
35488B001098n826M623l7254p7184n9900l1987o8866j50165j86866j40231n1598
$$ 2001098 1995272 1999895 1962641 1885457 1825557 1793570 1724704 1574539 1387673 1247442 1195844
35477A195844K2696O0322P4790R1492J01240M5709r6800k22516j88795m233J63134
$$ 1195844 1218540 1278862 1353652 1445144 1546384 1592093 1495293 1272777 1083982 1079749 1242883
35466A242883J95921J44771R7818N0767k0483o5888l9054J1354K4331K8338O3867
$$ 1242883 1438804 1583575 1681393 1732160 1711677 1645789 1606735 1618089 1642420 1670758 1734625
35455A734625P9344J8258n2138k6398O5767R8643L8233l1200n1812m1922r341
$$ 1734625 1813969 1832227 1780089 1753691 1819458 1918101 1956334 1925134 1873322 1831400 1822059
35444A822059O0010J18971Q6230j9234p9840m5820P46j6709o4416p6738n5551
$$ 1822059 1882069 2001040 2087270 2068036 1988196 1942376 1943122 1926413 1861997 1785259 1729708
35433A729708l8062l0370k1642j4663o437J7164M5291M8228L2177L2000L9997
$$ 1729708 1691646 1661276 1639634 1624971 1618534 1635698 1680989 1729217 1761394 1793394 1833391
35422A833391Q028o4537j13310r8249m5533J3231P2569J11852J02353P2777Q5653
$$ 1833391 1841419 1776882 1663572 1565323 1519790 1533021 1605590 1717442 1819795 1892572 1978225
35411A978225J32709J44484J17116J17298J36142P2979p8238j64305q3988N8459
$$ 1978225 2110934 2255418 2372534 2489832 2625974 2698953 2620715 2456410 2372422 2430881
35401B430881J14183Q7622N4517l1j06043j66002p3706P5681Q5351m8364j28016
$$ 2430881 2545064 2632686 2687203 2687172 2581129 2415127 2341421 2417102 2502453 2454089 2326073
35390B326073n7677K9273j068q8875j02817l4058K9512L8621M481n2234r7803
$$ 2326073 2268396 2297669 2296601 2207726 2104909 2070851 2100363 2138984 2143465 2091231 1993428
35379A993428q0078O734R0855J08462P8811M7881R749n4246j03627q4176k4882
$$ 1993428 1913350 1920084 2010939 2119401 2198212 2246093 2255842 2201596 2097969 2013793 1988911
35368A988911j1731n9819p9052L296J31577J80898J15541L7955N4896J33193J47881
$$ 1988911 1977180 1917361 1838309 1841605 1973182 2154080 2269621 2307576 2362472 2495665 2643546
35357B643546O3953j2754K263M6301K1365m0331l6768J8100Q091q1581j17108
$$ 2643546 2707499 2694745 2697008 2743309 2764674 2724343 2687575 2705675 2713766 2632185 2515077
35346B515077k0563J04244J28843Q0310O5120R0489P9546K4729N853N4956J03922
$$ 2515077 2494514 2598758 2727601 2807911 2873031 2963520 3043066 3067795 3073648 3128604 3232526
35335C232526R2607N3633M9541P4078O3792o777p8178o6395M0484J63271K15635
$$ 3232526 3325133 3378766 3428307 3502385 3566177 3559400 3481222 3414827 3455311 3618582 3834217
35324C834217J87389J25584O1428K323k2792J9370R6837J31293J09498J06068
$$ 3834217 4021606 4147190 4208618 4210941 4188149 4207519 4304356 4435649 4545147 4651215
35314D651215J61528K10510J84037J18973R8759J32578J60733J44242Q9335K0425
$$ 4651215 4812743 5023253 5207290 5326263 5425022 5557600 5718333 5862575 5951910 5972335
35304E972335j3567M7731J87321K80893K36796J25355P9294J06532J13278Q6216
$$ 5972335 5958768 6006499 6193820 6474713 6711509 6836864 6916158 7022690 7135968 7222184
35294G222184J16302K29693L26295L31345L00013L14579L67363M06177M18985
$$ 7222184 7338486 7568179 7894474 8225819 8525832 8840411 9207774 9613951 10032936
35285A0032936M11859L72341L18759L22766M14798N23441N78947O22372P29516
$$ 10032936 10444795 10817136 11135895 11458661 11873459 12396900 12975847 13598219 14327735
35276A4327735Q69718R34662Q90623Q18405Q09128Q94710J072553J313812J536470
$$ 14327735 15197453 16132115 17022738 17841143 18650271 19544981 20617534 21931346 23467816
35267B3467816J652689J677383J732994J914607K195432K490883K766711L048651
$$ 23467816 25120505 26797888 28530882 30445489 32640921 35131804 37898515 40947166
35259D0947166L368985L751718M226594M811308N486446O221146P022002P935634
$$ 40947166 44316151 48067869 52294463 57105771 62592217 68813363 75835365 83770999
35251H3770999R009991J0271382J1727487J3369716J5183470J7180841J9408020
$$ 83770999 92780990 103052372 114779859 128149575 143333045 160513886 179921906
35244A79921906K1878260K4490540K7038347K9275588L0887805L1352497K9912563
$$ 179921906 201800166 226290706 253329053 282604641 313492446 344844943 374757506
35237C74757506K5852131J8931153R630517r48550j1387576k0290263k6638445
$$ 374757506 400609637 419540790 429171307 428222757 416835181 396544918 369906473
35230C69906473l0102969l1081556l0348219k8587329k6214694k3519445k0796368
$$ 369906473 339803504 308721948 278373729 249786400 223571706 200052261 179255893
35223A79255893j8276332j6029479j4031729j2288679j0827325r606986q528833
$$ 179255893 160979561 144950082 130918353 118629674 107802349 98195363 89666530
35216H9666530p538033o656909n913918n293730m763941m300034l871400l450591
$$ 89666530 82128497 75471588 69557670 64263940 59499999 55199965 51328565 47877974
35208D7877974l055862k743581k534318k378080k212977k026761j839911j663060
$$ 47877974 44822112 42078531 39544213 37166133 34953156 32926395 31086484 29423424
35200B9423424j501073j368990j268246j170018j058303r67014r30823r17894
$$ 29423424 27922351 26553361 25285115 24115097 23056794 22089780 21158957 20241063
35192B0241063q66394p80816p27207p20420o85610n72214m48058m16061m71296
$$ 20241063 19374669 18593853 17866646 17146226 16460616 15888402 15440344 15024283 14552987
35183A4552987n13571m89200m43446m24096m11927l81468l62417l84779m11797
$$ 14552987 14039416 13550216 13106770 12682674 12270747 11889279 11526862 11142083 10730286
35174A0730286l92316l47142l33758l45031l18910k46154j90726j87235j90854
$$ 10730286 10337970 9990828 9657070 9312039 8993129 8746975 8556249 8369014 8178160
35165H178160j62046j38757j76559k57534l04272k61434j37242M063O7776o954
$$ 8178160 8016114 7877357 7700798 7443264 7138992 6877558 6740316 6744379 6812155 6805201
35155F805201j67850k71780k30372j04754k0349k7019q5708j46385j79282j67674
$$ 6805201 6637351 6365571 6135199 6030445 6010096 5983077 5897369 5750984 5571702 5404028
35145E404028j34868j42733j95948j93818o8670P0744N8442p9867j39730k6564
$$ 5404028 5269160 5126427 4930479 4736661 4667991 4738735 4797177 4717310 4577580 4551016
35135D551016J10008R7511k6711j03855q3896m8147n0498n5727l1984j1604l6806
$$ 4551016 4661024 4758535 4731824 4627969 4544073 4495926 4445428 4389701 4357717 4346113 4309307
35124D309307r5512j30630r6813j2619M0888L051q3746j25396j11192j16239j51853
$$ 4309307 4213795 4083165 3986352 3973733 4014621 4017672 3933926 3808530 3697338 3581099 3429246
35113C429246j27438k1016L4594n6220j78146j64410n0761m181m8704n1287K7364
$$ 3429246 3301808 3280792 3315386 3259166 3081020 2916610 2865849 2861668 2812964 2761677 2789041
35102B789041O3854p915q6651q1945m4833l3602P580J25572K28844K03263P7938
$$ 2789041 2852895 2844980 2758329 2676384 2631551 2597949 2605529 2731101 2959945 3163208 3241146
35091C241146l0894p2844o5335j6284N2942P2863J5806m1343m0603n0630j33314
$$ 3241146 3210252 3137408 3072073 3055789 3108731 3181594 3197400 3156057 3115454 3064824 2931510
35080B931510j88239r1455O6902P3801q5217j86544q8661Q1954J39445Q6427M9701
$$ 2931510 2743271 2651816 2718718 2792519 2707302 2520758 2432097 2514051 2653496 2739923 2789624
35069B789624P3431R1091M8972l4632j06393j16413n0431L5653N1785k0864j02750
$$ 2789624 2863055 2954146 3003118 2968486 2862093 2745680 2695249 2730902 2782687 2761823 2659073
35058B659073j21154q8679m8302p496K8513K5210j9849m1063L143M8143L005j19693
$$ 2659073 2537919 2449240 2400938 2393442 2421955 2447165 2427316 2386253 2389396 2437539 2440544 2320851
35046B320851k18708k24167j46925l6296N2239P1259K3963k1856j1339K7720L9873
$$ 2320851 2102143 1877976 1731051 1694755 1746994 1818253 1842216 1820360 1809021 1836741 1876614
35035A876614L2056M3302N4689J3159o3405r1761m8042r201l9180r7262j02250
$$ 1876614 1908670 1951972 2006661 2019820 1956415 1864654 1816612 1807411 1768231 1670969 1568719
35024A568719m2112K8704P4087J05624J27803J01110n189j35944j74774p9431
$$ 1568719 1526607 1555311 1629398 1735022 1862825 1963935 1958746 1822802 1648028 1568597
35014A568597L8083K7808j05152j96290j32128J2229R4336Q7843O6009N9495L3994
$$ 1568597 1606680 1634488 1529336 1333046 1200918 1213147 1307483 1395326 1461335 1520830 1554824
35003A554824j2822l3654j4537R070K6229O0671R6703P6945m380q1038j11777
$$ 1554824 1542002 1508348 1493811 1502881 1529110 1589781 1686484 1763429 1759049 1678011 1566234
34992A566234j23241j29395r1476m540N4695L2975o957K5644J10759J45660Q9614
$$ 1566234 1442993 1313598 1222122 1217582 1272277 1305252 1298295 1323939 1434698 1580358 1669972
34981A669972L950m9493p9938j19252j53229j35566n2784M9109J05839R7430O2028
$$ 1669972 1673922 1624429 1544491 1425239 1272010 1136444 1083660 1132769 1238608 1336038 1398066
34970A398066M1615K8610r491o3675q3375m8197L071L0073L5721L2957J1250l1080
$$ 1398066 1439681 1468291 1458800 1395125 1311750 1263553 1266624 1296697 1332418 1365375 1376625 1345545
34958A345545n9004m5070j4463q401k5519l4295k0946Q917N0294Q2516O2379j6698
$$ 1345545 1286541 1241471 1227008 1218607 1193088 1158793 1137847 1146764 1197058 1279574 1341953 1325255
34946A325255q2675o3813L01m201j05516j89396j39342J3052J29119J33091Q5072
$$ 1325255 1242580 1178767 1179068 1174867 1069351 879955 740613 753665 882784 1015875 1100947
34935A100947P6293J02260Q3940l908q6353r2830n6322n3322p6145m4596N2943
$$ 1100947 1177240 1279500 1363440 1359532 1273179 1180349 1124027 1070705 994560 949964 1002907
34924A002907J17642P8630j455k3801Q05j0940o2704o3459K5037J13247R8277
$$ 1002907 1120549 1199179 1197724 1173923 1174728 1163788 1101084 1037625 1062662 1175909 1274186
34913A274186l602q7876r1281m2294O19J3515P123k96M190J7336O044o7855j77614
$$ 1274186 1270584 1182708 1091427 1049133 1049752 1063267 1070390 1070094 1074284 1091620 1097664 1029809 852195
34900H52195k10671p9016J42310K57278J72706J8864k2157M4879O5105j7098p9951
$$ 852195 641524 562508 704818 962096 1134802 1153666 1131509 1176388 1241493 1224395 1144444
34889A144444k5078P0535Q0414J5675r209N2975J31395J32360K7071j28479k23130
$$ 1144444 1119366 1189901 1270315 1285990 1276781 1329756 1461151 1593511 1620582 1492103 1268973
34878A268973j86413q6918o2402j13957q1827R5430K32117J50654k7442m4672
$$ 1268973 1082560 995642 933240 819283 737456 832886 1065003 1215657 1188215 1143543
34868A143543J05589J85156Q7894l5977p2311j09233k06741k29464p2556J24551
$$ 1143543 1249132 1434288 1522182 1486205 1413894 1304661 1097920 868456 795900 920451
34858I20451J76320J22307J03410R1112k3327j47828o9468J81955L10591J66120
$$ 920451 1096771 1219078 1322488 1413600 1390273 1242445 1172977 1354932 1665523 1831643
34848A831643m3959o8751M5140Q3133k467p3429n6121k7892n2751p9808m6275
$$ 1831643 1787684 1718933 1764073 1847206 1844739 1771310 1715189 1687297 1634546 1554738 1508463
34837A508463K1874O3720O9182O2321M5461N783m8318r1616j07472r0821m7186
$$ 1508463 1530337 1594057 1663239 1725560 1771021 1776804 1728486 1636870 1529398 1438577 1391391
34826A391391m685L33k8310l9696n447L0619J1679m2468n4374N309P9474J01658
$$ 1391391 1386706 1387039 1358729 1319033 1313586 1344205 1355884 1313416 1259042 1264351 1343825 1445483
34814A445483O8731J9978j6786l2637k1820J0544M1098M9520L4529J070m3369
$$ 1445483 1514214 1534192 1517406 1484769 1462949 1473493 1514591 1564111 1598640 1599710 1556341
34803A556341p0903m7408J5493N4471K2429o2795j44862j65232p6293J08959K64453
$$ 1556341 1485438 1438030 1453523 1507994 1530423 1467628 1322766 1157534 1081241 1190200 1454653
34792A454653K42930O6367p5117q0838p8052j92688l04621k13018K5604J38733
$$ 1454653 1697583 1763950 1688833 1607995 1529943 1337255 1032634 819616 845220 983953
34782I83953J0436j89929k76664k47458j61525j8372J42513J92557Q9271l1800
$$ 983953 994389 804460 527796 280338 118813 100441 242954 435511 524782 492982
34772D92982n3173l4030n8467o6798J3566R3445N2279m7505n2778M0214J06473
$$ 492982 439809 405779 347312 280514 294080 387525 439804 392299 339521 379735 486208
34761D86208R4184L8290o7746k27220l12296j86131N9177J86526J39275Q3084
$$ 486208 580392 618682 550936 323716 11420 -174711 -115534 70992 210267 293351
34751B93351J09211J14848L0945m7881n2558o3256j29329j42147k5184J00916
$$ 293351 402562 517410 548355 500474 447916 384660 255331 113184 88000 188916
34741A88916R7800K9594L9282J03940R0246p805o2664k1548L5333M6581M5766
$$ 188916 286716 316310 355592 459532 549778 541973 479309 457761 493094 539675 585441
34730E85441O6529P8912M8571j4681q1448j18474q8850j575N5127O470r3245j18620
$$ 585441 651970 730882 779453 764772 683324 564850 476000 474425 529552 536022 442777 324157
34718C24157m2731L7629N2270L9549M8863N1429Q435l6484j2539N7158P0908l902
$$ 324157 281426 319055 371325 410874 459737 511166 519601 483117 470578 527736 598644 594742
34706E94742o8226k5341O5718N2724q9177j92678j14487N9080J26315M7077k7966
$$ 594742 526516 501175 566893 619617 530440 337762 223275 282355 408670 455747 427781
34695D27781l689L5519J631m0242M159Q4043Q4933K0460P413P6306J32712J07426
$$ 427781 424092 459611 461242 421000 425159 509202 594135 614595 622008 698314 831026 938452
34683I38452L7679j5512m1381n0025m1853k8295k8098l1907j9713j2152m6995
$$ 938452 976131 960619 919238 869213 827360 799065 770967 739060 719347 707195 660200
34672F60200j04809j20357p5192j8815J3478M3985R2716J25784R6765J3167o1767
$$ 660200 555391 435034 359842 341027 354505 398490 491206 616990 713755 726922 665155
34661F65155o6382j83O5965N6185k1784q3015p3980k7492J3086N3908Q6362M5903
$$ 665155 598773 598590 664555 720740 698956 615941 541961 514469 527555 581463 667825 713728
34649G13728p6838j54726p1316R5306J63200R4713J9214J9455M3830M6415N9826
$$ 713728 636890 482164 410848 506154 669354 764067 783281 802736 846566 892981 952807
34638I52807Q0534K7839j04078j77958r5884M6115Q9601K6705k3106L798O0083
$$ 952807 1033341 1061180 957102 779144 683260 729375 818976 845681 822575 826373 886456
34627H86456Q7975Q1098N1288N160m0428o3476n8587l2971K151K1689J92m8370
$$ 886456 974431 1055529 1106817 1111977 1071549 1008073 949486 916515 918666 940355 940547 892177
34615H92177q0757q5682q9017r2643p2563m7317o4745r7751n1816P8357J62155
$$ 892177 811420 725738 636721 544078 471515 424198 359453 261702 209886 288243 450398
34604D50398J09749j096n4579n6659o7257o5628o566O1755O9135N4891Q8844J12763
$$ 450398 560147 559051 504472 447813 380556 314928 308362 370117 439252 494143 582987 695750
34592F95750K1996j22434j40741l184J19394J10426M9704M1888O1552N8887P7497
$$ 695750 717746 595312 454571 451387 570781 681207 730911 772799 834351 893238 970735
34581I70735J46525J68750N8024q7494r9425J1452O8193j0665j01138o5055N9719
$$ 970735 1117260 1286010 1344034 1256540 1157115 1168567 1236760 1226095 1124957 1059902 1119621
34570A119621J29804Q8720J2516q331L3303Q1062Q5482L9957k4255n9166l4446
$$ 1119621 1249425 1338145 1350661 1342330 1375633 1456695 1542177 1582134 1557879 1498713 1464267
34559A464267K4076L9313l9973j60546k00270j07810K3546N9634j8984j11485
$$ 1464267 1488343 1527656 1487683 1327137 1126867 1019057 1042603 1102237 1083253 971768
34549I71768j30045p6725J1451J17294K09969K23984J34961K0153k3259m050j3385
$$ 971768 841723 764998 776449 893743 1103712 1327696 1462657 1482810 1459551 1455501 1442116
34538A442116p5704r9810j3708J15644J65524J28774J16447J81533K31234J73325
$$ 1442116 1366412 1266602 1252894 1368538 1534062 1662836 1779283 1960816 2192050 2365375
34528B365375Q1296J14432K94693M72383N34947N46189O21078P51035Q42034Q63716
$$ 2365375 2446671 2561103 2855796 3328179 3863126 4409315 5030393 5781428 6623462 7487178
34518G487178Q49634P73455N41617J33117l32101o90594q49359q06289o38008
$$ 7487178 8336812 9110267 9651884 9785001 9452900 8762306 7912947 7106658 6468650
34509F468650m83622m54070n14150n18666m02281k63417k14886k31996k24574
$$ 6468650 5985028 5530958 5016808 4498142 4095861 3832444 3617558 3385562 3160988
34500C160988j91378j97155k30348k00527q4492K9405P5729J00909J63474K20894
$$ 3160988 2969610 2772455 2542107 2341580 2257088 2286493 2362222 2463131 2626605 2847499
34490B847499J97453J20722R3727J35988J47303O2643l5246j9424J15901K65908
$$ 2847499 3044952 3165674 3259401 3395389 3542692 3605335 3570089 3550665 3666566 3932474
34480C932474L59949M12087M36712M10040L43267L10155L51153M13433M40098
$$ 3932474 4292423 4704510 5141222 5551262 5894529 6204684 6555837 6969270 7409368
34471G409368M60658N29334O25327O89055P17400P44526P61636P39869P04597
$$ 7409368 7870026 8399360 9024687 9713742 10431142 11175668 11937304 12677173 13381770
34462A3381770O93759O61830N27524L11758J23364J829j18665k74626m17852n24542
$$ 13381770 14075529 14737359 15264883 15576641 15700005 15701834 15583169 15308543 14890691 14366149
34452A4366149o40851p67253q11361p31357o30459o21943o75148o79620n97986
$$ 14366149 13725298 12958045 12146684 11415327 10784868 10162925 9487777 8808157 8210171
34443H210171m76280l65749l13841l66459m87854n36893m23022k42044j60848
$$ 8210171 7733891 7368142 7054301 6687842 6199988 5663095 5240073 4998029 4837181
34434D837181k07223k70703k72240k26714j65851j09694j00244j58390k15391
$$ 4837181 4629958 4359255 4087015 3860301 3694450 3584756 3484512 3326122 3110731
34425C110731j86181j02048o9658j06413j24959q2279l2263j7033j3866r908k5628
$$ 3110731 2924550 2822502 2752844 2646431 2521472 2439193 2406930 2389897 2376031 2366123 2340495
34414B340495m2101r857M5003L3322m6440q5362l8059l391o6936j69106k06351
$$ 2340495 2298394 2288537 2333540 2366862 2320422 2235060 2197001 2193610 2126674 1957568 1751217
34403A751217j70248j08216l5532L1262M1545P86M446Q0091R0568o9244k55367
$$ 1751217 1580969 1472753 1437221 1468483 1510028 1510814 1515260 1595351 1685919 1616675 1361308
34392A361308k25872J6483K06371J63648M354n5824J6811Q2786M7238l0389l3984
$$ 1361308 1135436 1151919 1358290 1521938 1526292 1470468 1487279 1570065 1617303 1586914 1552930
34381A552930O0515J50560J16517l5203j63938j56535o2492j4034m4782p1843
$$ 1552930 1613445 1764005 1880522 1845319 1681381 1524846 1462354 1448320 1403538 1331695
34371A331695m5914j5793k0445j7171K8153O0772K0930m8250n7821n168L1022
$$ 1331695 1285781 1269988 1249543 1232372 1260525 1321297 1342227 1293977 1236156 1230988 1262010
34360A262010J3995j1360q413m991k8805m2909K635P9543R7970K3569o3680o0761
$$ 1262010 1276005 1264645 1256232 1251241 1222436 1179527 1182162 1261705 1359675 1383244 1319564 1258803
34348A258803K4381P4013R282j01240j23177k9869O0733L5684p6044j52546j30820
$$ 1258803 1283184 1357197 1366479 1265239 1142062 1112193 1172926 1208610 1132566 980020 849200
34337H49200n7538K12L4550O6578Q4099N6424l269l5916p820M4264N6429J1692
$$ 849200 791662 791874 826424 893002 977101 1033525 1030256 994340 986520 1030784 1087213 1098905
34325A098905m2573m3661K4879J08902J21258K8714r1699j17737k5484O8762M8200
$$ 1098905 1056332 1012671 1037550 1146452 1267710 1296424 1204725 1086988 1061504 1130266 1178466
34314A178466n6651j15873p2102R713O0976R0404J15754R5425o044j29712j70528
$$ 1178466 1121815 1005942 933840 943553 1004529 1094933 1210687 1306112 1300068 1170356 999828
34303I99828j02206l536L7200R101k7314q270O8654J37571J33319O7652R331q666
$$ 999828 897622 894086 931286 940387 913073 904803 973457 1111028 1244347 1311999 1321330 1312664
34291A312664j3957k1751l936M2606O7752N1904M8067Q3886R2980J7610q6082
$$ 1312664 1298707 1276956 1273020 1315626 1383378 1435282 1483349 1567235 1660215 1677825 1591743
34280A591743j31142j25333j16321p8430J9530Q8326J7404j23541j53020n5431
$$ 1591743 1460601 1335268 1218947 1140517 1160047 1248373 1265777 1142236 989216 933785
34270I33785j0485j02353j82312j09936L2565R0739O9407O8962R1263O7562J5344
$$ 933785 923300 820947 638635 528699 561264 652003 721410 790372 881635 949197 964541
34259I64541Q974K7931j4691j03811j27345o0734j1207m3193q0744m2591K3998
$$ 964541 973515 1001446 986755 882944 755599 694865 683658 640465 559721 517130 541128
34248E41128K4673k8005k9957N9022J44775J08313m1760j61586j29764J2294J16421
$$ 541128 565801 537796 507839 566861 711636 819949 778189 616603 486839 499133 615554
34237F15554J10448O1033M7706O0456O3978P4376R9212Q3388J2762k200J25408
$$ 615554 726002 787035 834741 895197 959175 1033551 1132763 1216151 1228913 1226713 1352121
34226A352121K77442K48860L4563j53966j72960r7561n1987l9802j7987j1621
$$ 1352121 1629563 1878423 1912986 1759020 1586060 1488499 1436512 1396710 1378723 1367102
34216A367102n4386j04476j13528j09125j27355j33264r1513m8859n7626p8806
$$ 1367102 1312716 1208240 1094712 985587 858232 724968 633455 584596 526970 448164
34206D48164n3842j3432j2979j5679M0594J00725N2991p8855j41201o5756M6629
$$ 448164 394322 380890 367911 352232 392826 493551 546542 467687 326486 260730 307359
34195C07359R1722R0751R5826P7562j690p7458n0736O3588J44039J14302K3086
$$ 307359 399081 489832 585658 663220 661530 584072 533336 596924 740963 855265 878351
34184H78351l1078n904O0076R2325M4579n3363j11480o9738K9216Q6538O5029
$$ 878351 847273 841369 901445 993770 1038349 984986 873506 803768 832984 919522 984551
34173I84551K3662K4928M9809L8258j3326m5831k9831j4638n4721j16873j07902
$$ 984551 1008213 1033141 1082950 1121208 1107882 1062051 1032220 1017582 962861 845988 738086
34162G38086J757J19464J21316p317j43163j47029j1678J25553J31196K4817n3659
$$ 738086 739843 859307 980623 973306 830143 683114 671436 796989 928185 953002 899343
34151H99343k6102L0038M845q3274j23500p9103k3691p626J3053P6718J30801
$$ 899343 873241 903279 908124 824850 701350 622247 598556 590930 603983 680701 811502
34140H11502J08793L2326k9059n4639o4591n5338j4098K8319K9091J333j3134
$$ 811502 920295 952621 923562 868923 804332 748994 734896 763215 792306 793639 780505
34129G80505k1660o2019j14451j05539r238J13217J83162J68225Q1456k5875p2188
$$ 780505 758845 696826 582375 476836 467598 580815 763977 932202 1013658 987783 915595
34118I15595j1958R2886J24719M7871n7397j08033j04978q7656o3312j9876L0187
$$ 915595 903637 996523 1121242 1169113 1111716 1003683 898705 811049 747737 727861 758048
34107G58048N3893K7213m7306j26472j40017o6403J3172K070p0568p6989K3598
$$ 758048 811941 839154 791848 665376 525359 458956 472128 474198 403630 326641 350239
34096C50239J16996R4846l92n5210m1491j6204j1597n962J8043M8803O5090L9458
$$ 350239 467235 562081 561689 506479 464988 448784 437187 431225 449268 498071 563161 602619
34084F02619m4269j33917j20969K1930J59806J39270j0914j16005q2803Q026M8724
$$ 602619 558350 424433 303464 325394 485200 624470 613556 497551 414748 422774 471498
34073D71498M0163L4182K5801j9602p5376p0408O983Q1240Q1418K4077j8112j0205
$$ 471498 511661 545843 571644 552042 476666 406258 413241 494481 575899 599976 581864 571659
34061E71659J0353p678o0288r3881o9279j720O0064P8985N6775L0191L3275N0134
$$ 571659 582012 574334 514046 420165 350886 349166 409230 488215 544990 575181 608456 658590
34049F58590K5347n2944j09656p0876K8800R2442R5701R0222Q0883J3680r0678
$$ 658590 683937 630993 521337 450461 479261 571703 667404 757626 838509 852189 761511
34038G61511j18009l6786K9167n562m1231L1739J17133N0104j09779j29440M5139
$$ 761511 643502 606716 635883 630321 589090 620829 737962 788066 678287 548847 593986
34027E93986J84631R3109j29740k45379j82425o9101k5811m0116l3689K9686J18411
$$ 593986 778617 871726 741986 496607 314182 245081 219270 179154 145465 175151 293562
34016B93562J79040J92977J82738J56415Q1263m0357j06486j7919J59510K36507
$$ 293562 472602 665579 848317 1004732 1085995 1045638 939152 921233 1080743 1317250
34006A317250J29854l9374j10037n3498O0921J78207K65154K79350K13054J27944
$$ 1317250 1447104 1407730 1297693 1244195 1305116 1483323 1748477 2027827 2240881 2368825
33996B368825Q6330Q3403Q6487Q6485O7375q170j24672j89611j47850n9584k65
$$ 2368825 2455155 2538558 2625045 2711530 2778905 2770735 2646063 2456452 2308602 2249018 2248753
33985B248753M4654J04303J20162L2945q3449j02831l2554R579j0770j2455K7043
$$ 2248753 2293407 2397710 2517872 2550817 2467368 2364537 2331983 2341562 2330792 2318337 2345380
33974B345380J0477j08170k11547j70053l2373L1676n1103j78084k09073j22716
$$ 2345380 2355857 2247687 2036140 1866087 1833714 1865390 1814287 1636203 1427130 1304414
33964A304414j1445M7249P2278J17689J62318J20411k3787j57246j67939q9054
$$ 1304414 1292969 1340218 1412496 1530185 1692503 1812914 1789127 1631881 1463942 1374888
33954A374888m5070q1572j25957j06886l3954M6941J03852J08939M5665m9605
$$ 1374888 1329818 1248246 1122289 1015403 981449 1028390 1132242 1241181 1286846 1237241
33944A237241j07755j10313j03981j17578j22699r9861q2410r4555r5558l6580
$$ 1237241 1129486 1019173 915192 797614 674915 575054 492644 398089 302531 265951
33934B65951N6090J05067Q1334M1769N7611J20979J40936N0051r0892j38932m4053
$$ 265951 322041 427108 508442 550211 607822 728801 869737 919788 828896 689964 645911
33923F45911P3089P2264k5322q9413p9241p5837j14780j12913j2312J06481J32116
$$ 645911 719000 791264 765942 676529 597288 521451 406671 293758 281446 387927 520043
33912E20043P2007J4323p264k6838n5405o1254l6746j5913j4028o33M5744Q7374
$$ 520043 592050 606373 599109 572271 516866 455612 418866 402953 388925 388292 434036 521410
33900E21410O0654m1570j39424j40239m7467L6921M1858J6482L8224P4263K5325
$$ 521410 582064 540494 401070 260831 213364 250285 292143 308625 346849 421112 446437
33889D46437j05676j95295j69573r1070l9020k884M7731Q1701P2140O4795R5115
$$ 446437 340761 145466 -24107 -115177 -154197 -157081 -109350 -27649 44491 109286 204401
33878B04401J04806L5809m7837l6064O3616J37354J17260L3256o2811j31269j24025
$$ 204401 309207 345016 297179 261115 324731 462085 579345 612601 549790 418521 294496
33867B94496l2150N3782L3335n2567o4606L0787J12232Q8881K1509n43j420m7604
$$ 294496 262346 316128 349463 296896 232290 263077 375309 464190 485699 485156 483736 436132
33855D36132j04585p3847M7548J40643J14220J3718n2010n0922m8477r6313j46802
$$ 436132 331547 257700 305248 445891 560111 573829 521819 470897 422420 326107 179305
33844A79305j09300K8416J79095K58412K60566K15162J26735M533r2259j05375
$$ 179305 70005 98421 277516 535928 796494 1011656 1138391 1142924 1050665 945290
33834I45290n5855j4876r394r424N122K0498K1607k495o7548j52764j78351r8940
$$ 945290 889435 874559 865165 855741 860863 881361 902968 900473 832925 680161 501810 402870
33822D02870L679J2294n4245o7562Q737O5807L1861j4393J9058Q9652R9461M6207
$$ 402870 406549 418843 364598 297036 305773 371580 403441 389048 408106 497758 597219 643426
33810F43426j198k2886m4940n2652r086N1879M7734k5397o9199j8059O3102O1865
$$ 643426 642228 619342 574402 521750 512664 564543 612277 586880 517681 499622 562724 624589
33798F24589l1461j06036o7083M5600J07859O8358L648n297J0198k1123o8080
$$ 624589 593128 487092 420009 465609 573468 641826 645474 640177 650375 629252 561172
33787E61172l0061R6157J93832J91919J46434J19343Q7051K8572n596L719k4537
$$ 561172 531111 627268 821100 1013019 1159453 1278796 1365847 1394419 1388823 1392542 1368005
33776A368005j31666k02158j19154L0038N4844o5109j60687j25892m3066k6756
$$ 1368005 1236339 1034181 915027 945065 999909 934800 774113 648221 605155 578399
33766E78399o9881r5766o7672J609P5323R5017K9316n5785n4396K6447N8209k9216
$$ 578399 508518 412752 345080 346689 422012 517029 546345 490560 436164 462611 520820 491604
33754D91604j46477j73184j07634k9086J9652M3961M4840K3407N687R965J6040
$$ 491604 345127 171943 64309 35223 54875 98836 143676 167083 172770 182735 198775
33743A98775L504j3045j6307j1744N219N3384J06224R2348J6q2769q6489n6347
$$ 198775 202279 189234 172927 161183 166402 219786 326010 418358 418374 335605 249116 192769
33731A92769o7838j06604j08494p0909m2222l4131k1536k673J0769L5801Q3804
$$ 192769 124931 18327 -90167 -161076 -203298 -237429 -258965 -261638 -250869 -215068 -131264
33720a31264J16346J01433P2229N6333J738j26384k25707j65889K370Q8709K4790
$$ -131264 -14918 86515 158744 215077 216815 90431 -135276 -301165 -298795 -210086 -185296
33709a85296n1086n203J20436K00973J85356R9167j7929j14275j40438j14325
$$ -185296 -236382 -241585 -121149 79824 265180 364347 346418 232143 91705 -22620
33699b2620j01849r6975j6187J37684K18471J30426j6693n3287K1525P1128L0041
$$ -22620 -124469 -221444 -237631 -99947 118524 248950 232257 178970 200495 271623 301664
33688C01664l5458n0450j2923L7972N7409J5378n5231o5904Q724P3279M9600K685
$$ 301664 266206 215756 202833 240805 298214 313592 258361 192457 201181 274460 324060 326745
33676C26745K4633O5173J7522q0689r6773k6360Q937j5282Q049J01795J43323
$$ 326745 351378 416551 434073 353384 256611 230251 239188 223906 231955 333750 477073
33665D77073P4002j1436n4021j18429j97518j37291Q9835K30205Q0423j71592
$$ 477073 551075 539639 485618 367189 169671 32380 122215 352420 432843 261251
33655B61251j85873L8537J80191P6197q3486q4936K7437R3554P4041K5739k1450
$$ 261251 75378 113915 294106 370303 286817 201881 229318 322872 396913 422652 401202
33644D01202m9815k0853M3072L7128p0830j51875q6692M9969Q9141J672q0854
$$ 401202 351387 330534 373606 410734 339904 188029 101337 151306 240447 242119 161265
33633A61265n4311N0294J40374J57254R4844o417p3541o0647k950K4981L20l4884
$$ 161265 106954 157248 297622 454876 549720 543303 469762 409115 406165 431146 431466 396582
33621C96582m1442k1455P956L8533O0819N7622J9356l9947q0789o0029K0854R3046
$$ 396582 355140 333685 341641 380174 440993 498615 517971 478024 397235 337206 358060 451106
33609D51106Q6197K0838j7367p908k9710j26310k08021j59089J909J42638J72719
$$ 451106 537303 558141 540774 532866 503156 376846 168825 9736 11645 154283 327002
33598C27002J13632L4036k0041m0951n7626j04699j54572j20046J7044J29902
$$ 327002 440634 474670 454629 413678 356052 251353 96781 -23265 -6221 123681
33588A23681R0582m2502q9947M241J09704J06595K7467m0735q6804j35251j60006
$$ 123681 214263 171761 81814 86055 195759 302354 329821 289086 202282 67031 -92975
33577i2975j24866n9901k1451j0860L309J7383J0996J277J2684K1769K547j016
$$ -92975 -217841 -277742 -299193 -310053 -306744 -289361 -278365 -277088 -264404 -242635 -240088 -241104
33565b41104O5850J51377J42063M0622q445P4439J66186J04835o7711j47747m8116
$$ -241104 -175254 -23877 118186 158808 150363 224802 390988 495823 428112 280365 232249
33554B32249Q6126Q3425l2361j06735p5516j6635n330k6810m7413p2653r1401
$$ 232249 318375 401800 369439 262704 187188 170553 165223 138413 91000 18347 -73054
33543g3054m7561O6991J55357J27991K7684l5194l4210k4335j5746L8846J24517
$$ -73054 -120615 -53624 101733 229724 257408 222214 188004 163669 147923 186769 311286
33532C11286J44438O3079k3753k6524K560m5719j60516k11588j25024K0297J00348
$$ 311286 455724 518803 495050 468526 471086 425367 264851 53263 -71761 -51464 48884
33521D8884R7419R5818J44151J78267J12138k5508j06480o6628Q852J0652l7880
$$ 48884 146303 242121 386272 564539 676677 651169 544689 478061 486913 497565 459685
33510D59685l1301L6408M7550n7419j67433j33370L9346J94368J98135O4131q2681
$$ 459685 428384 464792 512342 454923 287490 154120 193466 387834 585969 650100 567419
33499E67419j31548q1794k7931m1582q1038n8331J6297L3447n0573j30808r2818
$$ 567419 435871 354077 326146 284564 203526 145195 161492 194939 144366 13558 -79260
33488g9260K8363J01567P0853k482m5465m4927j7908K1949N5408N9831L2677j1409
$$ -79260 -50897 50670 121523 119041 73576 28649 10741 32690 88098 147929 180606 169197
33476A69197o0839r9324r6063m0858K4455M8348L4137K7212M9246Q0522R5860
$$ 169197 108358 9034 -87029 -127887 -103432 -55084 -20947 6265 55511 136033 231893
33465B31893Q3060L9367j4854l6596j3920J823l4906q4095p1121n967K1201k6305
$$ 231893 314953 354320 339466 302870 288950 290773 255867 171772 100651 94684 115885 89580
33453H9580p2631l6306N6157J06129O2723l0496r1936p4051J0123R9784J22156
$$ 89580 16949 -19357 36800 142929 205652 175156 83220 9169 19292 119076 241232
33442B41232M6169p3334j18641j9954J41730J90147N6779j13375j30621l883Q7225
$$ 241232 287401 214067 95426 75472 217202 407349 464128 350753 220132 216249 303474
33431C03474N4709L263L2321P8952M6486l0642o8226q1287j18291j28082m4499
$$ 303474 358183 361446 393767 472719 519205 488563 420337 339050 220759 92677 48178
33420D8178N6876N1831k2872k7124L9639M4354k9264m2739M2578P7326k6133j39427
$$ 48178 105054 156885 134013 106889 146528 190882 161618 118879 161457 238783 212650 73223
33408G3223j22910k5555M0684Q0570J32521J36585M4086m2283m130R0737Q6076
$$ 73223 -49687 -75242 -34558 46012 178533 315118 359204 316921 312791 403528 489604
33397D89604j7479p9454m8938j4070k9509m5217k3456M3l820j7597l4402o7047
$$ 489604 472125 392671 343733 329663 300154 254937 231481 231524 227704 210107 175705 108658
33385A08658r2574o9436j0169L7600O5687Q2429N3648k8782o2568M1093J72737
$$ 108658 16084 -53352 -63521 -25921 39766 122195 175843 147061 84493 125586 298323
33374B98323J29612q1907k20810j38512L0855Q8221L3349K278N2428J29051J71489
$$ 298323 427935 346028 125218 -13294 17561 105782 139131 141409 193837 322888 494377
33363D94377J48194M5654q6221j36841p1896p265n1831j37922j21446l700P8661
$$ 494377 642571 688225 602004 465163 393267 386002 334171 196249 74803 71103 149764
33352A49764O8252N3691R9560J35605P7351l3296q8382o3890k9481l0068l6518
$$ 149764 218016 271707 371267 506872 584223 550927 462545 398655 369174 339106 302588
33341C02588k4198k8214p3264r6856j9246J20172J84676J25587N5920P5940J13619
$$ 302588 278390 250176 176912 80056 60810 180982 365658 491245 547165 623105 736724
33330G36724M9044o6995p1551M8653J20826M6336o2333p7865m4250n7525q4188
$$ 736724 785768 718773 647222 695875 816701 863037 800704 722839 678589 621064 536876
33319E36876l9350L8233M0142k8903o5106m1031l3722p8714j15122r0880k5720
$$ 536876 497526 535759 575901 546998 481892 440861 407139 328425 213303 122423 96703
33308I6703M2889R2237Q9751K1984m8713m2477K0252M6370J5972L937M7320R3636
$$ 96703 139592 231829 321580 343564 294851 252374 272626 318996 334968 338905 386225 479861
33296D79861J02285R6119Q1538J8871q2796j33933q2044J5022P8571R4833P0115
$$ 479861 582146 678265 759803 778674 695878 561945 479901 494923 573494 668327 738442
33285G38442r461j15227j60040j16610p4196j01232j27704n5489P8766J53631
$$ 738442 728981 613754 453714 337104 262908 161676 33972 -21517 57249 210880
33275B10880J30703P1861K3072j6709l3121p438J6106k6394j01894j03451j1688
$$ 210880 341583 413444 436516 419807 386686 379248 395354 368960 267066 163615 151927
33264A51927N6169K454j11403j35886j2565J59634K27874J34851l3084j42498
$$ 151927 208096 210550 99147 -36739 -49304 110330 338204 473055 439971 297473
33254B97473j48141j07369o7956q494P8099J20361O5431j6677k5099J2863j0667
$$ 297473 149332 41963 -25993 -34487 43612 163973 229404 212727 187628 200491 189824
33243A89824r4535j17583l4485M8323M2867P276K5461N8634K0945o0382p3160
$$ 189824 95289 -22294 -56779 -8456 34411 41687 67148 125782 146727 86345 13185
33232A3185J4190J09919J20868M4765o1949j45292j71473j34394o5089n992L2712
$$ 13185 27375 137294 258162 302927 240978 95686 -75787 -210181 -275270 -281262 -248550
33221b48550P1670J20909J62536J71173J33787N9124j5331m3475k1480N90j4786
$$ -248550 -176880 -55971 106565 277738 411525 470649 455318 411843 390363 390953 376167
33210C76167l9052l0590j8058o8652j69677k06701r8009Q6105J86441J30027K810
$$ 376167 337115 306525 288467 219815 50138 -156563 -254572 -168467 17974 148001 150811
33199A50811o0361k3518L9752N8426L5154K91m4652r4436r6525r845J09123J51490
$$ 150811 90450 66932 106684 165110 200264 200555 155903 61467 -35058 -44903 64220 215710
33187B15710Q9319l291o5197j04080j22674q5136k106M1870J2801k604O5719J39088
$$ 215710 305029 301738 236541 132461 9787 -75349 -77455 -35585 -22784 -25388 40331 179419
33175A79419J01467j2964o5936j9305L2331K6503O444J4419K6750K8315N1189
$$ 179419 280886 267922 201986 182681 215012 241515 247959 262378 289128 317443 368632
33164C68632R7144J07657N4944r610l3656k1267J3452P1502J21816J17009Q6095
$$ 368632 465776 573433 628377 618767 585111 563844 577296 648798 770614 887623 973718
33153I73718J12999J86778J89297Q7147N580K5488M2076m8941j50201j16626j5909
$$ 973718 1086717 1273495 1462792 1549939 1555519 1581007 1623083 1574142 1423941 1307315 1291406
33142A291406l2002j54518j83007n0836O7717L6020m6162k7802N2708M3638q6520
$$ 1291406 1259404 1104886 921879 871043 938760 974780 928618 900816 953524 997162 910642
33131I10642k12603k14267r1180N9729J30709R3035K7414K6531O4005L3154p7617
$$ 910642 698039 483772 392592 452321 583030 676065 703479 730010 794015 827169 749552
33120G49552j54136j32074q1577n8977p411R8762J41145L0115j08698q6628O9969
$$ 749552 595416 463342 381765 322788 315377 414139 555284 585399 476701 390073 460042
33109D60042J62903J09037J3715l0168m2478m0685N100O0458K7590q3709j31828
$$ 460042 622945 731982 745697 715529 673051 632366 637466 697924 725514 641805 509977
33098E09977n9013J2157j5647n5157J164Q1988N1040o6527j28854r6133n0660
$$ 509977 450964 463121 447474 392317 393481 475469 526509 459982 331128 234995 184335
33087A84335k6379K6546J02798J12128K5406o3303o7627j4738K2493K3924Q464
$$ 184335 157956 184502 287300 399428 424834 361531 293904 279166 301659 325583 334047
33076C34047j4746l5428k9486L396K5433J3127q621n992K2232N8211Q6421Q8982
$$ 334047 319301 283873 254387 257783 283216 296343 287722 281730 303962 362173 448594 537576
33064E37576N3985p19m4045p4674j10844j41104j32949q9624m5545o682M3200
$$ 537576 591561 590842 546797 472123 361279 220175 87226 -2398 -47943 -54625 -11425
33053a1425P7977M7391k7468n8147j4091L5447L4830J1715n902m6035j03858r1968
$$ -11425 66552 113943 86475 28328 14237 49684 84514 96229 90327 44292 -59566 -151534
33041a51534L0739J56523J57607O1252p013o724M004L627L1457Q3324R8693O4382
$$ -151534 -120795 35728 193335 254587 247574 240850 244854 248481 279938 363262 461955 526337
33029E26337L2722K2096q943p2352j23884j44289j61871j75124j40891o4284j2039
$$ 526337 559059 581155 572212 499860 375976 231687 69816 -105308 -246199 -310483 -322522
33018c22522n553J1115O1790Q9669O5337N0665R1917J31770J00046K0904m4626
$$ -322522 -328075 -316960 -255170 -165501 -100164 -49499 42418 174188 274234 295138 250512
33007B50512r5671j49913j66693j04000p666M5787N8191P4892Q1060L3861k8984
$$ 250512 154841 4928 -161765 -265765 -273431 -227644 -169453 -94561 -13501 20360 -8624
32996h624k4430L6090N0044j7804p8720n2130K9188Q3484P9688L2573m0758j11661
$$ -8624 -33054 3036 53080 35276 -43444 -95574 -66386 17098 96786 129359 88601 -23060
32984b3060j29004o3275N5215J60965J96908J37942J5396p9807p4633q788M587
$$ -23060 -152064 -215339 -160124 841 197749 335691 351087 271280 196647 187859 192446
32973A92446o8734j36125j14419m3401n263R345O8521J57117J62637K8526j41791
$$ 192446 123712 -12413 -126832 -170233 -175496 -166151 -97630 59487 222124 250650 108859
32962A08859j84351o0773R4614J23915J9203q2437p6490j8205l2123j25972j68991
$$ 108859 -75492 -136265 -41651 82264 101467 19030 -57460 -75665 -107788 -233760 -402751
32951d02751o8678R8728J77984J14229l920n7917j4132O5413R6481N9147J9360
$$ -402751 -471429 -372701 -194717 -80488 -84408 -142325 -156457 -91044 5437 64584 83944
32940H3944M5921J06810R7652n954q9045m6953N8287P6931j6320q7879l7165O7644
$$ 83944 129865 236675 334327 328373 239328 192375 250662 327593 311273 223394 186229 253873
32928B53873R3015J5495o8655p7431k8345L979k5053q8948j16943o6300K2850
$$ 253873 346888 362383 293728 216297 187952 191931 166878 77930 -39013 -105313 -82463
32917h2463O4715L4202L387L9078R7861Q2062j2805p9619m7608J7973R830p4282
$$ -82463 -17748 16454 19841 58919 156780 238842 226037 146418 98810 116783 126613 52331
32905E2331j37707j13570k6542O4109J20201J18246N2415k9934n1138j119L2984
$$ 52331 -85376 -198946 -225488 -161379 -41178 77068 129483 99549 48411 47292 80276
32894H0276j5335q2414n1256P5893J58110Q9915o3939j47592r2328K8656J06457
$$ 80276 64941 -17473 -68729 7164 165274 255189 191250 43658 -48670 -20014 86443
32883H6443J09317Q2119P2004Q4049R6811Q7915L7402o2586j75011k17586j41401
$$ 86443 195760 277879 349883 433932 530743 618658 656060 593474 418463 200877 59476
32872E9476j0536M5531j9448j07844r7763J0904J11109J23119O3624p244n2511
$$ 59476 48940 94471 75023 -32821 -130584 -119680 -8571 114548 178172 170928 118417
32861A18417o2526l6223J7061P2045R5909O2973k4120j16945j49954j10163n2733
$$ 118417 55891 19668 36729 108774 204683 267656 243536 126591 -23363 -133526 -186259
32850a86259j9234K3539J15103K04093J89891N5712j02187j81210j55485n7356
$$ -186259 -205493 -181954 -66851 137242 327133 382845 280658 99448 -56037 -113393
32840a13393N9264J29501J14890M9306O26k0078n8564j24705j64569j39437p4111
$$ -113393 -54129 75372 190262 239568 240194 220116 161552 36847 -127722 -267159 -341270
32829c41270j2930J8172L918m0545m4701M1222J44569J41933M1344k0563J5584
$$ -341270 -354200 -336028 -332110 -372655 -417356 -376134 -231565 -89632 -48288 -68851 -53267
32818e3267O1079N6640O9554J31886J34154O866j22753j11960l6132o2968j67442
$$ -53267 7812 64452 134006 265892 400046 406912 284159 172199 136067 73099 -94343
32807i4343j70115k9670R7755R9168K9948k4732m9995k7681P5477J89096J61868
$$ -94343 -264458 -294128 -196373 -97205 -67257 -91989 -141984 -169665 -94188 94908 256776
32796B56776j5805j46854q5684N2814O2067o2549j36252n6093P2051R7464K1542
$$ 256776 240971 94117 8433 61247 123314 60765 -75487 -131580 -59529 37935 59477
32785E9477k5858K8520J03221P6952l5204r6802n4273k5218j06846j90381j04867
$$ 59477 33619 62139 165360 242312 207108 110306 56033 30815 -76031 -266412 -371279
32774c71279J01936J93073O0970j37600k02550j09509M0174J56617J86230J19774
$$ -371279 -269343 -76270 -15300 -152900 -355450 -464959 -424785 -268168 -81938 37836
32764C7836M3490P0726J60540J29870p6651k64438k43260p9302L5169N2957O0772
$$ 37836 81326 152052 312592 442462 365811 101373 -141887 -221189 -186020 -133063 -72291
32753g2291Q1225N4742j9200p1100p5178n6026q999P2369J23023Q1071O931M649
$$ -72291 8934 63676 44476 -26624 -101802 -157828 -166827 -94458 28565 109636 116567 121216
32741A21216M9844K7361p3066j34181r0950j0006K7555J8098m144q702L0295R2013
$$ 121216 171060 198421 125355 -8826 -99776 -109782 -82227 -64129 -68273 -76975 -46680 45333
32729D5333Q9601j1514r5045l7059R0368J08924L07r0126j03242j17923j35232
$$ 45333 134934 123420 28375 -8684 81684 190608 190915 100789 -2453 -120376 -255608
32718b55608l7936J61329K52058J28352l2153l8961L3291J3183o8109n7581L3559
$$ -255608 -293544 -132215 119843 248195 216042 177081 210372 223555 155446 97865 131424
32707A31424M7385n1227j25050r4180m6666q1080j61616j75837o5277J18929K44298
$$ 131424 178809 127582 2532 -91648 -138314 -219394 -381010 -556847 -622124 -503195 -258897
32696b58897K03624M4235n9436k4267K9579k3863j07755p7109K3529L0620n3531
$$ -258897 -55273 -11038 -70474 -94741 -65162 -89025 -196780 -273889 -250360 -219740 -273271
32685b73271o3507L7387R0791K0699l5657L1394J22759J15675O5286O9676P0646
$$ -273271 -336778 -299391 -208600 -187901 -223558 -192164 -69405 46270 111556 181232 251878
32674B51878l1934j60575j46934L407J10533P9263J435j9740p592k7355p1801
$$ 251878 219944 59369 -87565 -84158 26375 105638 107073 87333 79741 52386 -19415
32663a9415r2917p9794n2434j9751J9822O1717R6476J08206P6593R028m3185l8715
$$ -19415 -112332 -192126 -244560 -264311 -244489 -182772 -86296 21910 98503 107531 64346 25631
32651B5631j236J9316J7770J7944J4437p321j9274P534L3555R146k0805J9420
$$ 25631 24395 43711 61481 79425 93862 86541 67267 74801 108356 117502 96697 116117
32639A16117P6272P948j82284k94724j90702J9004J43003J61463J79524K06732
$$ 116117 192389 200337 18053 -276671 -467373 -448369 -305366 -143903 35621 242353
32629B42353J47491k659j06229o8686L6883Q2207L9927k7022o9465q3583p4859
$$ 242353 389844 387185 280956 212270 249153 331360 371287 344265 274800 191217 116358
32618A16358m8754k6310k7548l9771l0745J936J6551k0549p6832p7457l415O6655
$$ 116358 67604 41294 13746 -26025 -56770 -54834 -38283 -58832 -135664 -213121 -216536 -149881
32606a49881N6295N389Q622M9948J1347j17408j68547l4426J35545J24930l5256
$$ -149881 -93586 -88197 -79575 -29627 -18280 -135688 -304235 -338661 -203116 -78186 -113442
32595a13442j21911o0438n349n0832p1448M4351J75727J42372j3823r1462k2567
$$ -113442 -235353 -295791 -301140 -351972 -423420 -379069 -203342 -60970 -74793 -166255 -188822
32584a88822N8864L4638n2714j03205r9543q9436r1498p5463j7269N9483J02488
$$ -188822 -129958 -95320 -148034 -251239 -350782 -440218 -531716 -607179 -624448 -564965 -462477
32573d62477Q7554M5898J9202N465j0896J750P6476J47758J04500k9193q4874
$$ -462477 -374923 -329025 -309823 -304358 -315254 -313504 -237028 -89270 15230 -13963 -98837
32562i8837J6210J35727J15035r454j00331j25143j27184q0515N2201J73422J48034
$$ -98837 -82627 53100 168135 158681 58350 -66793 -193977 -274492 -222291 -48869 99165
32551I9165K2235l7380r187k1574q4194l9299J52598K91882K20928N1735k1695
$$ 99165 121400 84020 74833 53259 -30935 -70234 82364 374246 595174 646909 625214
32540F25214P026K0973q443l5108p3136j53797k05868j34933J1411R6177Q4698
$$ 625214 632240 653213 644770 609662 536526 382729 176861 41928 53339 149516 234214
32529B34214N4796M1396Q096l5938l0462J0604k455q1237j21714o6714r84j9348
$$ 234214 289010 330406 338502 302564 272102 282706 280251 199014 77300 10586 9602 -9746
32517i746q0969p1745L5300J51941J85934J27431L2481l8718o0435m2927j5490
$$ -9746 -90715 -162460 -127160 24781 210715 338146 370627 331909 271474 228547 213057
32506B13057j1627n4354j27850j63933r6308N2833J75425J90137J18542K9358
$$ 213057 201430 147076 19226 -144707 -241015 -188182 -12757 177380 295922 325280
32496C25280m3333r0238q8662l1489L9324P7838Q1007N3964j5976r8328j02099
$$ 325280 281947 191709 103047 71558 110882 188720 269727 323691 307715 209387 107288
32485A07288j653Q2456L3020q2401j01919r922N2075J2223l9480j6612M0712O4720
$$ 107288 105635 188091 221111 138710 36791 26869 78944 91167 51687 35075 75787 140507
32473A40507O5724O6815L0122o5915j46393j24286k0384P3330J12509J15207R0150
$$ 140507 206231 273046 303168 237253 90860 -33426 -53810 19520 132029 247236 337386
32462C37386K5190n7247r2896m2825N3868J07134O1299m0183r1795m8604J5197
$$ 337386 362576 305329 212433 169608 223476 330610 391909 351726 259931 211327 226524
32451B26524R025m8204o9085l3514L047J7042K9466K0157m8436j13291n7274Q9880
$$ 226524 235549 187345 118260 84746 87793 104835 134301 154458 106022 -7269 -64543 25337
32439B5337J46253M0575p0944m9217J7499j1369p8259l8619O8840P5273l1981
$$ 25337 171590 212165 141221 92004 109503 98134 19875 -18744 50096 125369 93388
32428I3388q7394k0610M5230J3335m3877l2210K1462N4358O7840N9797j7893j35620
$$ 93388 5994 -14616 30614 43949 72 -32138 -10676 43682 111522 171319 153426 17806
32416A7806j40513L5119K14935J82469j4159j26689n4615M6597L3829j9677J5869
$$ 17806 -122707 -87588 127347 309816 295657 168968 114353 160950 194779 175102 190971
32405A90971R2660N6799r9308k04362j42542l547N4778J1846k3588J6642Q1703
$$ 190971 283631 340430 241122 36760 -105782 -109329 -54551 -42705 -66293 -49651 32052
32394C2052Q9886K8844m7499p6423k8576O4611J14768N5420o6800j31079r1874
$$ 32052 121938 150782 103283 26860 -1716 62895 177663 233083 166283 35204 -56670
32383e6670k5651K898L7274J20575J69704P6821r9752j78545r3864L2330Q4658
$$ -56670 -82321 -79423 -42149 78426 248130 324951 225199 46654 -47210 -14880 69778
32372F9778R5090J29888J51270R0287j9189q6111r6851j04442j13804p8264K23
$$ 69778 164868 294756 446026 536313 517124 431013 334162 229720 115916 37652 37875
32361C7875O0675P5455P1672N8537J7692k6754k0010J9768L361q4951j37307p7232
$$ 37875 98550 174005 245677 304214 321906 295152 275142 294910 298271 213320 76013 -1219
32349a219J9281L8540k833k154O1514J08854Q9321K8176m7193j25110j50793o4432
$$ -1219 18062 56602 53769 51615 113129 221983 311304 339480 292287 167177 16384 -48048
32337d8048P0082Q8478n5682j90655j35171N9551J80241J26472N665m2053r517
$$ -48048 22034 110512 54830 -135825 -270996 -211445 -31204 95268 100933 58880 49363
32326D9363J9589K810k4890j6244K7322N7950L6404j4110k6144K4401P8926P9435
$$ 49363 68952 71762 46872 30628 57950 115900 152304 138194 112050 136451 215377 294812
32314B94812N6965P5986J12720P3189n7185j65218j52067o2337j8947o7601j36859
$$ 294812 351777 427763 540483 613672 556487 391269 239202 176865 157918 90317 -46542
32303d6542j31124k1016J42518K64084K61402J26421n8244j79184j80879j01541
$$ -46542 -177666 -198682 -56164 207920 469322 595743 537499 358315 177436 75895
32293G5895k7157o015m358L9775J15069J29149L4596q2491j04934m4112r400l0858
$$ 75895 48738 42723 38365 78140 193209 322358 356954 274463 169529 125417 116017 85159
32281H5159k1854N8580J18756P1561l0634p7081m7850m83L6792O7022N8466k3360
$$ 85159 63305 121885 240641 312202 281568 204487 156637 156154 192946 259968 318434 295074
32269B95074j25805j39404l4356R0586J12411P529j26466j55981m4719Q1623N8015
$$ 295074 169269 29865 -4491 86095 198506 206035 79569 -76412 -121131 -39508 18507
32258A8507j00208j80203m5324J57264J81145J7189j05615m7788P0243P0443m3892
$$ 18507 -81701 -261904 -307228 -149964 31181 48370 -57245 -105033 -34790 35653 -8239
32247h239j33425j16964l0796N6327J08661J21043J02002N8833q839q1446j00291
$$ -8239 -141664 -258628 -289424 -233097 -124436 -3393 98609 157442 148603 67157 -33134
32236c3134k9691O8605R4967M8945K1144L5602R829q2343j26001l5521Q4046P0123
$$ -33134 -62825 5780 100747 149692 170836 206438 216267 133924 7923 -27598 56448 126571
32224A26571n7563j23623m5786P3939J20227J02028P1368J3235r7712j97170j88461
$$ 126571 69008 -54615 -100401 -26462 93765 195793 267161 280396 182684 -14486 -202947
32213b02947q0556J6515L7775K7885L8767M1336l085m2647K874R9054J17461K0347
$$ -202947 -283503 -266988 -229213 -201328 -162561 -121225 -124310 -166957 -164083 -65029 52432 72779
32201G2779p1662m9836L0310N1525K2945M9536J39569J69508O4873q5697j44602
$$ 72779 1117 -48719 -18409 33116 56061 105597 245166 414674 479547 393850 249248
32190B49248q5408M117K8908l5683j30182j54922p2276K8260K6408o3294j02986
$$ 249248 163840 167957 196865 161182 31000 -123922 -196198 -167938 -141530 -204824 -307810
32179c07810k6543P2688R2900O5672P4121J09383J01737M5624L070O902L2229
$$ -307810 -334353 -261665 -168765 -103093 -28972 80411 182148 227772 230842 237744 269973
32168B69973M5424K6208l3335j03219j23233q2604m8319o5099q3612m8917L583
$$ 269973 315397 341605 308270 205051 81818 -786 -49105 -114204 -197816 -246733 -243150
32157b43150J7815J6741L7081K8537o1965j54818j26528q774M9410J4915J0331
$$ -243150 -225335 -208594 -171513 -142976 -204941 -359759 -486287 -495061 -445651 -430736 -420405
32146d20405R6734J73501J51400Q3580M5210Q351o5419j13941p1191J434j115
$$ -420405 -323671 -150170 1230 84810 130020 138371 72952 -40989 -112180 -110746 -111861
32135a11861o1400o8410J5564J15409J53969J17306K5248q0815j30696q5661m650
$$ -111861 -173261 -241671 -226107 -110698 43271 160577 185825 105010 -25686 -111347 -115997
32124a15997J9071j6613k9881J6113O7275O9339L3172n757k8868k1919J3371K2864
$$ -115997 -96926 -113539 -143420 -127307 -60032 9307 42479 36722 7854 -14065 -694 22170
32112B2170m6944j35756j02186P4340K13075J46416m5561j30825l2149Q8764P4433
$$ 22170 -24774 -160530 -262716 -188376 24699 171115 125554 -5271 -37420 51344 125777
32101A25777k3350n2281J5687P2335M7690r824l3676l0359l5631m4550l4378j7887
$$ 125777 102427 50146 65833 138168 185858 176034 142358 111999 76368 31818 -2560 -20447
32089b0447k2672l7322k5012J5628M3297L1167J199o114K3042O4550P6687L5301
$$ -20447 -43119 -80441 -105453 -89825 -46528 -15361 -14162 -20276 2766 67316 144003 179304
32077A79304l6050p8521n9567j2733P086n348j4253j2728l3700q1009j01173n4828
$$ 179304 143254 64733 5166 -7567 -481 -5829 -20082 -32810 -66510 -147519 -248692 -303520
$$ [...]
##END NTUPLES=NMR SPECTRUM
##END=
