##TITLE=31Pdec_LR-762-4-B
 H2O, 24 sc
 10.4.2023
##JCAMPDX= 6.0         $$ Bruker NMR JCAMP-DX V2.0
##DATA TYPE= NMR SPECTRUM
##DATA CLASS= NTUPLES
##ORIGIN= UXNMR, Bruker Analytische Messtechnik GmbH
##OWNER= root
$$ XWIN-NMR		Version 3.5
$$ Mon Apr 10 14:41:31 2023 Russian Standard Time (UT+4h)  she@DPX200
##.OBSERVE FREQUENCY= 81.013821
##.OBSERVE NUCLEUS= ^31P
##.ACQUISITION MODE= SIMULTANEOUS
##.ACQUISITION SCHEME= undefined
##.AVERAGES= 24
##.DIGITISER RES= 16
##SPECTROMETER/DATA SYSTEM= spect
##.PULSE SEQUENCE= zgpg30
##.SOLVENT NAME= DMSO
##.SHIFT REFERENCE= (INTERNAL, DMSO, 0, 248.564)
##AUDIT TRAIL= $$ (NUMBER, WHEN, WHO, WHERE, WHAT)
$$ ##TITLE= Audit trail, XWIN-NMR		Version 3.5
$$ ##JCAMPDX= 5.01
$$ ##ORIGIN= Bruker BioSpin GmbH
$$ ##OWNER= she
$$ F:/spectra/data/she/nmr/P31/1/pdata/1/auditp.txt
$$ ##AUDIT TRAIL=  $$ (NUMBER, WHEN, WHO, WHERE, WHAT)
(   1,<2023-04-10 14:39:43.78 +0400>,<she>,<DPX200>,
      <created by zg, POWCHK disabled, PULCHK disabled
       configuration hash MD5:
       00 E9 B6 7A A2 85 ED C7 34 08 36 98 17 FE 4E 26
       data hash MD5: 32K
       10 60 AF C7 D5 35 12 45 19 B9 0E 8D F7 1E A9 CD>)
(   2,<2023-04-10 14:40:35.82 +0400>,<she>,<DPX200>,
      <Start of raw data processing
       efp BC_mod = 2 LB = 1 FT_mod = 6 PKNL = 1 PHC0 = -10806.17 PHC1 = 70.28476 SI = 64K 
       data hash MD5: 64K
       C6 D6 84 84 B6 07 29 15 8E 28 80 B1 F9 45 7E 53>)
(   3,<2023-04-10 14:40:51.40 +0400>,<she>,<DPX200>,
      <pk PHC0 = 72.60712 PHC1 = 0 
       data hash MD5: 64K
       95 BE 2A EA 9A B0 85 9E 0F 2E 97 FD A7 F3 F9 B6>)
$$ ##END=
$$ 
$$ hash MD5
$$ B2 EF CE 0C 62 BE 2F 97 CD 66 A0 95 A1 7F C6 BF
##$RELAX= 
##$RELAX= 
##$RELAX= 
##$RELAX= 
##$RELAX= 
##$RELAX= 
##$RELAX= 
##$RELAX= 
##$RELAX= 
$$ Bruker specific parameters
$$ --------------------------
##$DU= <F:/spectra>
##$EXPNO= 1
##$NAME= <P31>
##$PROCNO= 1
##$TYPE= <nmr>
##$USER= <she>
##$AMP= (0..31)
100 100 100 100 100 100 100 100 100 100 100 100 100 100 100 100 100 100 
100 100 100 100 100 100 100 100 100 100 100 100 100 100 
##$AQSEQ= 0
##$AQ_mod= 1
##$AUNM= <au_zg>
##$AUTOPOS= <>
##$BF1= 81.014009
##$BF2= 200.13
##$BF3= 200.13
##$BF4= 200.13
##$BF5= 200.13
##$BF6= 200.13
##$BF7= 200.13
##$BF8= 200.13
##$BYTORDA= 1
##$CFDGTYP= 0
##$CFRGTYP= 5
##$CHEMSTR= <none>
##$CNST= (0..31)
1 1 145 1 1 1 1 1 1 1 1 1 1 1 1 1 1 1 1 1 1 1 1 1 1 1 1 1 1 1 1 1 
##$CPDPRG= <waltz16>
##$CPDPRG1= <>
##$CPDPRG2= <waltz16>
##$CPDPRG3= <>
##$CPDPRG4= <mlev>
##$CPDPRG5= <mlev>
##$CPDPRG6= <mlev>
##$CPDPRG7= <mlev>
##$CPDPRG8= <mlev>
##$CPDPRGB= <>
##$CPDPRGT= <>
##$D= (0..31)
0 1 0 0 0 0 0 0 0 0 0 0.03 2e-05 3e-06 0 0 0 0 0 0 0 0 0 0 0 0 0 0 0 0 
0 0 
##$DATE= 1681123183
##$DBL= (0..7)
120 120 120 11 120 120 24 19 
##$DBP= (0..7)
150 150 150 150 150 150 150 150 
##$DBP07= 0
##$DBPNAM0= <>
##$DBPNAM1= <>
##$DBPNAM2= <>
##$DBPNAM3= <>
##$DBPNAM4= <>
##$DBPNAM5= <>
##$DBPNAM6= <>
##$DBPNAM7= <>
##$DBPOAL= (0..7)
0.5 0.5 0.5 0.5 0.5 0.5 0.5 0.5 
##$DBPOFFS= (0..7)
$$ [...]
##$SUBNAM2= <"">
##$SUBNAM3= <"">
##$SUBNAM4= <"">
##$SUBNAM5= <"">
##$SUBNAM6= <"">
##$SUBNAM7= <"">
##$SUBNAM8= <"">
##$SUBNAM9= <"">
##$SW= 501.771253377433
##$SWIBOX= (0..15)
0 1 3 0 0 0 0 0 0 0 0 0 0 0 0 0 
##$SW_h= 40650.406504065
##$TD= 32768
##$TD0= 1
##$TE= 0
##$TE2= 300
##$TE3= 300
##$TEG= 300
##$TL= (0..7)
0 120 53 12 22 120 120 120 
##$TP= (0..7)
150 150 150 150 150 150 150 150 
##$TP07= 0
##$TPNAME0= <>
##$TPNAME1= <>
##$TPNAME2= <>
##$TPNAME3= <>
##$TPNAME4= <>
##$TPNAME5= <>
##$TPNAME6= <>
##$TPNAME7= <>
##$TPOAL= (0..7)
0.5 0.5 0.5 0.5 0.5 0.5 0.5 0.5 
##$TPOFFS= (0..7)
0 0 0 0 0 0 0 0 
##$TUNHIN= 0
##$TUNHOUT= 0
##$TUNXOUT= 0
##$USERA1= <user>
##$USERA2= <user>
##$USERA3= <user>
##$USERA4= <user>
##$USERA5= <user>
##$V9= 5
##$VALIST= <valist>
##$VCLIST= <CCCCCCCCCCCCCCC>
##$VD= 0
##$VDLIST= <DDDDDDDDDDDDDDD>
##$VPLIST= <PPPPPPPPPPPPPPP>
##$VTLIST= <TTTTTTTTTTTTTTT>
##$WBST= 1024
##$WBSW= 4
##$XGAIN= (0..3)
0 0 0 0 
##$XL= 0
##$YL= 0
##$YMAX_a= 594
##$YMIN_a= -452
##$ZGOPTNS= <>
##$ZL1= 120
##$ZL2= 120
##$ZL3= 120
##$ZL4= 120
##$ABSF1= 0
##$ABSF2= 0
##$ABSG= 0
##$ABSL= 0
##$ALPHA= 0
##$AQORDER= 0
##$ASSFAC= 0
##$ASSFACI= 0
##$ASSFACX= 0
##$ASSWID= 0
##$AUNMP= <proc_1d>
##$AZFE= 0.1
##$AZFW= 0.5
##$BCFW= 0
##$BC_mod= 2
##$BYTORDP= 0
##$COROFFS= 0
##$CY= -3
##$DATMOD= 1
##$DC= 0
##$DFILT= <>
##$DTYPP= 0
##$F1P= 0
##$F2P= 0
##$FCOR= 1
##$FTSIZE= 65536
##$FT_mod= 6
##$GAMMA= 0
##$GB= 0
##$INTBC= 1
##$INTSCL= 6.047779e-11
##$ISEN= 30
##$LB= 1
##$LEV0= 0
##$LPBIN= 0
##$MAXI= 10000
##$MC2= 0
##$MEAN= 0
##$ME_mod= 0
##$MI= 50
##$NCOEF= 0
##$NC_proc= -10
##$NLEV= 6
##$NOISF1= 182.463
##$NOISF2= 159.3651
##$NSP= 0
##$NTH_PI= 0
##$NZP= 0
##$OFFSET= 248.5645
##$PC= 4
##$PHC0= -10733.56
##$PHC1= 70.28476
##$PH_mod= 1
##$PKNL= yes
##$PPARMOD= 0
##$PSCAL= 0
##$PSIGN= 0
##$REVERSE= no
##$SF= 81.0140089999694
##$SI= 65536
##$SIGF1= 159.3651
##$SIGF2= -187.1042
##$SINO= 113.3802
##$SIOLD= 16384
##$SREGLST= <1H.CDCl3>
##$SSB= 0
##$STSI= 65536
##$STSR= 0
##$SW_p= 40650.406504065
##$SYMM= 0
##$S_DEV= 0
##$TDeff= 32768
##$TDoff= 0
##$TI= <>
##$TILT= no
##$TM1= 0
##$TM2= 0
##$TOPLEV= 0
##$USERP1= <user>
##$USERP2= <user>
##$USERP3= <user>
##$USERP4= <user>
##$USERP5= <user>
##$WDW= 1
##$XDIM= 65536
##$YMAX_p= 292088600
##$YMIN_p= -25174267
$$ End of Bruker specific parameters
$$ ---------------------------------
##NTUPLES= NMR SPECTRUM
##VAR_NAME=  FREQUENCY,     SPECTRUM/REAL,   SPECTRUM/IMAG
##SYMBOL=    X,             R,               I
##VAR_TYPE=  INDEPENDENT,   DEPENDENT,       DEPENDENT
##VAR_FORM=  AFFN,          ASDF,            ASDF
##VAR_DIM=   65536,         65536,           65536
##UNITS=     HZ,            ARBITRARY UNITS, ARBITRARY UNITS
##FACTOR=    0.620285442955139, 1,           1
##FIRST=     20137.2065510682, 0,            0
##LAST=      -20513.1999529968, 0,           0
##MIN=       -20513.1999529968, -25174267,   0
##MAX=       20137.2065510682, 292088600,    0
$$ Real data points
##PAGE= N=1
##DATA TABLE= (X++(R..R)), XYDATA
$$ [...]
37308D22813L15589J20918j12846M5133K39854o2711n74168n45491N6329M68916
37298C74336K37162k44241m15203k41507j3405J27607J98624J86020R0690J7417
37288C17500N9655J72564K13281M5782l22264n84094k97891N06122J057964O44898
37278A813517l73642q81899m25513K48259K95110j43676l69553j74999P6891J32942
37268A97437N3759j08114l14089l11721R2172N59263N24900J8093l10199q6993
37258C14508L17105L95807J51172j13275k70588l39709k65892n7730N7990p0919
37248A18469k18619o7019K98236M61073K19319j76579l47737j88003Q7215K00213
37238C86568J03618K7092J73871L89891L03750j49659n40794m21209J36936O05134
$$ y = [422813, 738402, 859320, 746474, 791607, 1031461, 968750, 394582, -150909, -94580, 374336, 611498, 367257, -47946, -289453, -302858, -175251, 23373, 209393, 300083, 317500, 377155, 549719, 763000, 808782, 486518, -97576, -395467, 110655, 1168619, 1813517, 1439875, 557976, 132463, 380722, 675832, 532156, 162603, -12396, 64495, 197437, 251196, 143082, -171007, -482728, -390556, 168707, 693607, 711700, 401501, 314508, 631613, 1027420, 1178592, 1065317, 794729, 455020, 189128, 131398, 189388, 118469, -100150, -167169, 131067, 592140, 811459, 634880, 287143, 99140, 186355, 386568, 490186, 517278, 691149, 1081040, 1384790, 1235131, 694337, 273128, 410064, 1015198]
37228A015198N22179j04256p97209r72617m70130K27336M84353K41161M003R4806
37218B44824K71041K01111p6995l60348n45260m61062J01208Q60437J027357K93262
37208A555575n82798p31023l20464q9852j00813J73658O92813P54502J63162l88829
37198A125931l68930p5329N4145R7030K15936K10042l6369j89818k5241J29972
37188A137369j5446j59868J7905J78330j30635n88339n06130O2771L79690J71332
37178E46979k4012J70211L32499l5496o37841p47023k22139L27609L94838J65965
37168B71590P8656J10528j02678n33540o36341j53786L62608K49186l12952n51608
37158a218337k00324K19943K40970Q982j39623j56669j21009l1510K9641p6761
$$ y = [1015198, 1537377, 1433121, 635912, -336705, -806835, -579499, -95146, 146015, 150018, 244824, 515865, 716976, 639981, 279633, -265627, -726689, -625481, 234956, 1262313, 1555575, 972777, 241754, -78710, -168562, -269375, -95717, 597096, 1351598, 1514760, 1125931, 757001, 681672, 735817, 832847, 1048783, 1258825, 1222456, 1032638, 1007397, 1137369, 1121923, 962055, 979960, 1158290, 1027655, 439316, -66814, -4043, 375647, 546979, 522967, 693178, 1025677, 990181, 352340, -394683, -616822, -289213, 105625, 271590, 350246, 460774, 358096, -175444, -811785, -965571, -602963, -353777, -666729, -1218337, -1418661, -1198718, -957748, -948766, -1088389, -1245058, -1366067, -1397577, -1367936, -1444697]
37148a444697k04483n7694K00333N0299m62744n90200k7639M94663K97693k19497
37138a963966l00466p758R1987m1625m5777K6441j45745m25373m54234l88034
37128c654550n63351o69704j97856M58779M17113k06158l54160K61019O63059
37119c845809J99824m60430m84086o9421J93419L39417O25689P71721M36640k3438
37109b316474p5237R2036l0641k78577n4146N89262R18871O09043J54533N3800
37099c37530J53887M2819l06176n33652l35210K27364P35166P28544J57402n13370
37089A9244p65719n08574j735M92479P82453O95021K60643j69074k74085j53350
37079C77303j27135k74930m19979m38715l09784Q793M41899O59704M26416J0831
$$ y = [-1444697, -1649180, -1706874, -1506541, -1456242, -1918986, -2509186, -2536825, -2042162, -1744469, -1963966, -2264432, -2272190, -2180203, -2221828, -2267605, -2241164, -2386909, -2812282, -3266516, -3654550, -4217901, -4887605, -5085461, -4626682, -4209569, -4415727, -4769887, -4508868, -3845809, -3645985, -4106415, -4590501, -4659922, -4466503, -4127086, -3501397, -2729676, -2293036, -2316474, -2391711, -2299675, -2330316, -2608893, -2663039, -2073777, -1154906, -545863, -391330, -337530, -183643, -140824, -447000, -980652, -1315862, -1088498, -353332, 375212, 532614, 19244, -746475, -1255049, -1256784, -764305, 18148, 713169, 973812, 804738, 530653, 377303, 250168, -24762, -444741, -883456, -1193240, -1184447, -742548, -82844, 343572, 354403]
37069C54403j03142J32473L25919K60349J16086N3331n492o0088Q8088M15990
37059A577917M94135N2015n08614n55336q8814K32678o712m20199l87997O5193
37049D54266L32183J06337k08052j21267K52540M33751K68601L360j92947l53733
37039I75039m14991k46146r492k3367j87153m8073M09973O05017K54570j32287
37029A183090m9951K64626L82694M29539O35545O44384J01484m38063j76268N36351
37019C513431N66220k12706o55569j75549L30552m267o40789o67974l41913m45063
37009A266373p12779k53617O88865Q32718q9807p41103k19162N07022J48535q18442
36999F08603q73150J80487R22623M60783l75646m54809M2339J96715j23631k46817
$$ y = [354403, 251261, 383734, 709653, 970002, 1086088, 1139419, 1133927, 1073839, 1161927, 1577917, 2072052, 2124067, 1615453, 1060117, 971303, 1203981, 1197269, 777070, 389073, 454266, 786449, 892786, 684734, 563467, 816007, 1249758, 1518359, 1521719, 1328772, 975039, 560048, 313902, 304410, 281043, 93890, 45817, 455790, 1060807, 1315377, 1183090, 1133139, 1397765, 1780459, 2209998, 2845543, 3489927, 3591411, 3153348, 2977080, 3513431, 4079651, 3866945, 3211376, 3035827, 3366379, 3362112, 2721323, 2053349, 1711436, 1266373, 553594, 299977, 988842, 1821560, 1731753, 990650, 771488, 1278510, 1427045, 608603, -264547, -84060, 838563, 1299346, 923700, 468891, 511230, 707945, 584314, 337497]
36989C37497P3657L22451J42204j84821l67424n40695p39067n38305K50832R55199
36979b88472P57607j36061o92018m06275J53283L06298J44974R8780J30008o0091
36969H033l07614j37891L91454O44510L65151Q5749K44944M36120R2085m51718
36959A370823l24006N18163J053229N62448l77730o92088j82848L86664L67195
36950B681850j06896m83563m35793p3270K41526K26843m1309k10317r6256Q9120
36940A791935R6112J4118M3469R4062l0410j78850j7847L55458M05892j00377
36930B473562p05072q23093m62436j38676j82358l62366k46585J89423M93980
36921B36379L54857P1071R9176K72975K9266n39308n99779Q5964N29462n0561
$$ y = [337497, 411154, 733605, 875809, 690988, 323564, -217131, -956198, -1494503, -1243671, -288472, 469135, 333074, -358944, -765219, -611936, -305638, -160664, -61884, 68124, 8033, -299581, -437472, -46018, 598492, 963643, 1049392, 1294336, 1730456, 1822541, 1370823, 1046817, 1564980, 2618209, 3180657, 2802927, 2110839, 1927991, 2314655, 2681850, 2574954, 2091391, 1655598, 1582328, 1823854, 2050697, 2009388, 1799071, 1702815, 1791935, 1888047, 1902165, 1945634, 2039696, 2009286, 1830436, 1812589, 2168047, 2573939, 2473562, 1768490, 945397, 482961, 344285, 161927, -200439, -447024, -257601, 236379, 591236, 662307, 761483, 1034458, 1063724, 524416, -75363, 10601, 540063, 489502]
36911D89502q28927m66500P79683J290401M22663o34000o60069N0248M96107L97419
36901A336527J30838p2241j76664q6904R4820L445l38810l42043J98789N71837
36891A319594J67380n37447o94370k84589J15640L06312M19246L11705j40102
36882I83369m46655q8177N11582M78051j67879n42421k55687J31261R7546j77205
36872E23785l08546k01022R0912M09854L58037k61386q62636o62215J06348L78640
36862d28229j78814o64530l38932L14408M59035J45895K0461K57410M60123L78001
36852D24828J61259J0615k3584K5476L9768j25387l84879m19193j19813J91160
36842b19750K03010M0612k655O2669J3508j58306k08729j7311K03569J37728k41473
$$ y = [489502, -339425, -805925, -26242, 1264159, 1686822, 1052822, 392753, 443001, 939108, 1336527, 1467365, 1395124, 1218460, 1131556, 1226376, 1229821, 891011, 548968, 747757, 1319594, 1486974, 949527, 255157, -29432, 86208, 392520, 811766, 1123471, 983369, 536714, 448537, 960119, 1438170, 1270291, 727870, 472183, 603444, 700990, 523785, 215239, 14217, 105129, 514983, 873020, 611634, -251002, -913217, -806869, -428229, -607043, -1271573, -1610505, -1296097, -837062, -691167, -670706, -413296, 46827, 424828, 586087, 596702, 573118, 598594, 638362, 512975, 128096, -291097, -410910, -219750, -16740, 23872, 21217, 83886, 97394, -60912, -269641, -286952, -83383, 54345, -187128]
36831a87128n47777l53185K52521O46917M08950j11542k51920Q1705L66077K24740
36821E29358j53109l67530k51154N3506K10612k4640l98974k85303M31921R50176
36811F94863N75893k09720m59224k08121k45614o23217n64472O1033M12876J56737
36801d08966M5051M81027O86733P6158o12465n15808o0892q7260l17628M6005
36791f68045P21394O77375j36682o42424k60219L74814M91154J06817l19192m59605
36781a14613j88671L38521O16864L31235j06579j42721j3181l16288q07947o16142
36771a019522K61168P20461J66102n82364n37634P9073L77979J40682j16282q8780
36761e99117l781q6430k30685k29392l0857K35184L36822J47836j15030n5154
$$ y = [-187128, -734905, -1088090, -835569, -188652, 220298, 108756, -143164, -61459, 304618, 529358, 376249, 8719, -242435, -188929, 21683, -2957, -401931, -687234, -255313, 694863, 1270756, 1061036, 601812, 393691, 148077, -475140, -1039612, -978579, -565703, -408966, -363915, 117112, 803845, 880003, 267538, -248270, -309162, -396422, -714050, -668045, 53349, 730724, 594042, -48382, -308601, 66213, 557367, 664184, 344992, -114613, -303284, 35237, 652101, 983336, 876757, 734036, 720855, 404567, -403380, -1019522, -758354, -37893, 128209, -454155, -991789, -912716, -534737, -394055, -510337, -599117, -602898, -689328, -920013, -1149405, -1180262, -945078, -608256, -460420, -575450, -630604]
36751f30604L60547O38806L35750l69317q55419p00333l6605N89100O48256J11437
36741I1618m37375l77337K07033O15866M25793l3644k32028j17818P357J1900
36731A61365r33K435n9542j63996j69634m1993O9783R507k22881m81561n75135
36720a472585l68156J25267O80719R21580N81580j49932o43306m54662P8072K20668
36710d80755j20026k49693J81181N15728J22790m56091k63051M79899N99466j79229
36700A50219p31241k62701M71047L75118l22187n09613J26734P67432O97327J26263
36690H88398l01799k61907J21076M95342N09864J00600l62734m17342k7292L99374
36680A143580M91424K46084q1778k43808j47181J42304N13747Q91121J107647
$$ y = [-630604, -270057, 368749, 704499, 335182, -520237, -1220570, -1257175, -668075, -19819, 91618, -345757, -723094, -516061, 99805, 525598, 491954, 259926, 142108, 149465, 161365, 160432, 162867, 103325, -60671, -230305, -272298, -202515, -193008, -415889, -897450, -1472585, -1840741, -1715474, -1034755, -113175, 468405, 318473, -324833, -779495, -701423, -480755, -600781, -850474, -669293, -153565, -30775, -486866, -749917, -270018, 329448, 150219, -581022, -843723, -372676, 2442, -319745, -829358, -702624, 64808, 762135, 888398, 586599, 324692, 445768, 941110, 1450974, 1551574, 1188840, 771498, 744206, 1143580, 1635004, 1881088, 1799310, 1555502, 1408321, 1550625, 2064372, 2955493, 4063140]
36671D063140Q29320n5962r76403j079202l00658M10289K60072m00565o68444
36662B081587l08365J46055K73780J73030O9718L1267P2451J43473L8621l22643
36652B398974o06268m48285l7686J09292j23640l87741m33816k69554J18004O27419
36642I46699P51444J31225o24921n05616L92797Q23122J77371o14727n42997J0394
36632I44791Q9098k53359k41683J60739K14776k60360n73949l26209L3083P1689
36622a41384p197L7996N576j88383j25493L71783O55137J01319q02592r77217
36612a070455k32790M82752L96440j51937l41569J8423L87913K89431j48745m27608
36602g98145k46632K11425M84775K97007j58028m02416j61609L45821O22969M01876
$$ y = [4063140, 4892460, 4836498, 3860095, 2780893, 2480235, 2890524, 3150596, 2750031, 2081587, 1773222, 1919277, 2193057, 2366087, 2435805, 2467072, 2539523, 2682996, 2721617, 2398974, 1792706, 1344421, 1306735, 1416027, 1292387, 904646, 470830, 201276, 319280, 946699, 1698143, 1829368, 1204447, 698831, 1091628, 1914750, 2092121, 1477394, 934397, 944791, 1033889, 780530, 538847, 699586, 914362, 654002, 80053, -246156, -213073, -141384, -148581, -110585, -105009, -293392, -418885, -47102, 608035, 709354, -93238, -1070455, -1303245, -820493, -424053, -575990, -917559, -899136, -511223, -221792, -370537, -798145, -1044777, -833352, -348577, -51570, -209598, -612014, -773623, -427802, 195167, 597043]
36592E97043q1492l57198k56851o4809o3522j06724R8972L90575K46793l95789
36582F998q48570n14512K77731P03176N12764J84383P1702k8630l13046m96937
36572d44941k58325J78216L11610N1791k39535l08341k35313j14114J09042L62196
36562e87714L66028N6788j78620q801K78553J25326m27587o91210l00663K19411
36552a148489K17884j09361m4309N16286Q74050N52845p3962m14059l99766k58702
36542b87583q114L37450M07492p5729o56757n64408K22223Q54382O72271l7364
36532H63863m89424k85204K90894O31649L84792j69478l67062L0592M59023K97600
36522A647245k47982n01375l42076k07505j67148J82876P79033Q95857K37917
$$ y = [597043, 515551, 158353, -98498, -163307, -226829, -333553, -234581, 155994, 402787, 6998, -841572, -1356084, -1078353, -375177, 137587, 321970, 393672, 365042, 51996, -444941, -703266, -525050, -213440, -161649, -401184, -709525, -944838, -1058952, -949910, -587714, -221686, -164898, -343518, -352319, -73766, 51560, -376027, -1067237, -1367900, -1148489, -930605, -1039966, -1084275, -567989, 306061, 858906, 784944, 370885, -28881, -287583, -295697, 41753, 449245, 373516, -283241, -847649, -625426, 228956, 901227, 863863, 374439, 89235, 380129, 1011778, 1396570, 1227092, 860030, 890622, 1349645, 1647245, 1399263, 897888, 555812, 348307, 181159, 364035, 1143068, 2038925, 2276842]
36513B276842n16408o94692m76344k85075l5355L92669N64044J41681l59326k70051
36503G37985J69564K61022R765n6786L9455j62872n02476l02330L79983O42743
36493A216053J40906l58717k16399J54809J16032k01352l36385l15499l66974
36484a67526l08303Q5903M52133K65573l03537n78651k92690K25062O40707Q37896
36474H56567O58571M7592n24954m12440K73221O35278J68979n31903o27887j82221
36464C60803O7712j51900l64607k03873M5430J5463j21372k2187J54399k0075
36454b40207m66287o11267k32907K21359L20803J90519J27874J11689Q675r8036
36444f67785j24685j96525l10061j62005K95474N47628K68440l9908J97827O01299
$$ y = [2276842, 1760434, 1065742, 589398, 304323, 268968, 661637, 1225681, 1367362, 1008036, 737985, 907549, 1168571, 1178336, 1121550, 1161005, 998133, 495657, 193327, 573310, 1216053, 1356959, 998242, 781843, 936652, 1052684, 851332, 514947, 199448, -167526, -475829, -389926, 62207, 327780, 24243, -554408, -847098, -622036, 18671, 856567, 1515138, 1562730, 1037776, 625336, 898557, 1533835, 1702814, 1170911, 543024, 360803, 428515, 276615, -87992, -291865, -246435, -230972, -352344, -374531, -220132, -240207, -706494, -1317761, -1550668, -1329309, -1008506, -817987, -690113, -578424, -569749, -667785, -792470, -988995, -1299056, -1461061, -1165587, -617959, -349519, -389427, -191600, 409699]
36434D09699L55745m59400r30609o44027j12465J71529K76526L06209J51087l4047
36424e09753J27597M96272M66956l8325m20836m45803n26198o97587l63516M61595
36414a449598P58796O9663n87223k71867L65824K30687l92250m47756O4455K68822
36404a390447M6221O7666L53784K09355l51292m61709Q1398M05083K7101l96612
36394a409452k50602J37025K90628L47644M38638J71477n77508j071965o46900
36385b571015K94502Q58224P73610L60205j35687n48851n54145o9031L92644L42485
36375h57059L3340K8728L22630M32560J68861j95817l71319k44454J72802N93854
36365H4126N13976j45072p17865o05893j27917m266k46531k32299K36821O59987
$$ y = [409699, 765444, 306044, -624565, -1268592, -1381057, -1209528, -933002, -626793, -475706, -509753, -382156, 114116, 581072, 542747, 121911, -323892, -850090, -1547677, -1911193, -1449598, -690802, -621139, -1208362, -1480229, -1114405, -883718, -1275968, -1723724, -1659269, -1390447, -1344226, -1276560, -922776, -713421, -1064713, -1526422, -1445024, -1039941, -1012840, -1409452, -1660054, -1523029, -1232401, -884757, -446119, -274642, -852150, -1924115, -2571015, -2276513, -1418289, -644679, -284474, -420161, -969012, -1523157, -1592188, -1199544, -857059, -823719, -794991, -472361, -39801, 129060, -66757, -438076, -682530, -509728, 84126, 598102, 453030, -264835, -870728, -998645, -1002911, -1249442, -1481741, -1244920, -584933]
36355e84933O59585M37969K63129M3213l55517p62236q94787o50251j14560M64018
36345a494370P03047M15547n0632j35147K17783M87572K81543k14323n67470n70931
36335i27381k91811O4169K40490J33645k6247O2544L20431L80629J35824j44638
36325e2345k64441k98300k94608j77674k4383k0008m2117K38661O94444P18954
36315D78183J44440l66649k51031J44000K06733O0901K23844N70823M69265j04931
36305A575578m18119j37935J07901k55786p69135n68520L11485R10428N85563
36296A341460k57755q16398q26454n62611k28398J87053N14889L77595k27650
36287d98269o80909m38514K23185N66981L81418J36802J64331K24870O6439j17038
$$ y = [-584933, 74652, 512621, 775750, 818963, 463446, -298790, -1193577, -1843828, -1958388, -1494370, -791323, -375776, -426408, -561555, -343772, 143800, 425343, 211020, -356450, -927381, -1219192, -1155023, -914533, -780888, -807135, -744591, -424160, -43531, 92293, -52345, -316786, -615086, -909694, -1087368, -1111751, -1131759, -1173876, -935215, -240771, 478183, 622623, 255974, 4943, 148943, 355676, 416577, 640421, 1211244, 1680509, 1575578, 1157459, 1019524, 1127425, 871639, 102504, -466016, -154531, 755897, 1341460, 1083705, 267307, -559147, -1121758, -1350156, -1163103, -648214, -270619, -498269, -1179178, -1617692, -1394507, -827526, -446108, -309306, -144975, 79895, 146334, 29296]
36277B9296j11784j14431l00459l38920J18440P13225P47096J71460l70443m80882
36267F2598m12434m45938m25292j52731J83559K77150J31510j5877j2632J17349
36257f92738K46544K37297J10123P5103J85446J16016l33920o85950l10327N38338
36247e14068R04403M49779j45948l10689k88563l43315j27091N02518Q10074J98123
36237A135223o82874p98391k71348k8086k13650j22356L66076M95489m171l71693
36227d95781o4404L84015L06217p0762j61425K4157J14778J20222K96134N42319
36217I95470M93174O8073m56502p88414p77885m40972l4467J34812J16502K13952
36207d76257M03661L47019R6684J33571M42274L22546m10418q48145l27485L92510
$$ y = [29296, -82488, -196919, -497378, -836298, -717858, -4633, 742463, 913923, 543480, 62598, -349836, -795774, -1221066, -1373797, -1190238, -913088, -781578, -797455, -810087, -692738, -446194, -208897, -98774, -23671, 161775, 277791, -56129, -742079, -1052406, -514068, 390335, 840114, 694166, 383477, 94914, -248401, -375492, 127026, 937100, 1135223, 452349, -346042, -617390, -645476, -859126, -981482, -615406, -119917, -124088, -495781, -560185, -176170, 130047, 59285, -102140, -77983, 36795, 157017, 453151, 995470, 1488644, 1556717, 1100215, 311801, -466084, -907056, -941523, -806711, -690209, -476257, -72596, 274423, 371107, 504678, 946952, 1269498, 859080, 10935, -316550, 75960]
36197G5960K41688m56292n36832R0356L58111j37179m96389k6681O88608P72974
36187E74324K88571j27168k49645k72979k51603j20360j6050r6289k05006j01638
36177e77843J13128J33622p2928j98609M663M07274N97995L04119k32482m29944
36167D8995r2389K46596N3150l51560k25682L98167O73475K31577k34497n1683
36157F96149M23473M44638N4626n8364L21802O14745K90813m03760p47316l93213
36147A243593K10318K99153k72568p57690m49246K98701N10334k955l82472n5486
36137F41682M38510M00784O4624Q1311M25989N61995L78753K34181K42662J88922
36127C659413M5053j3970m928j3241J48865N76847P79878K67256n12162o31195
$$ y = [75960, 317648, -138644, -675476, -585120, -227009, -364188, -860577, -887258, -198650, 574324, 862895, 735727, 486082, 213103, -38500, -158860, -174910, -271199, -476205, -577843, -464715, -331093, -404021, -602630, -597967, -190693, 407302, 711421, 478939, 48995, -43394, 203202, 256352, -95208, -320890, 77277, 750752, 982329, 747832, 696149, 1119622, 1564260, 1618886, 1560522, 1882324, 2497069, 2787882, 2384122, 1636806, 1243593, 1453911, 1753064, 1480496, 722806, 273560, 572261, 1082595, 1079640, 697168, 641682, 1080192, 1480976, 1545600, 1626911, 2052900, 2614895, 2993648, 3227829, 3470491, 3659413, 3704466, 3690496, 3685568, 3672327, 3821192, 4398039, 5177917, 5445173, 4933011, 4301816]
36117D301816p2493K16055j93128n53124j58388N44182O27534l1519p13704q33522
36107C133709m91019j62151j30861k11220j2658M15287M35557k78208r74252o90861
36097A033323K20686M10029m76237j189008p44442J55970L58633m282n6713K19675
36087g2366J44538k69552l27674M2718J65821j25105k02291J62831L54716K8442
36077i7922k73219j03073J28174m5350l08174j93658N5834k0019k31633j21348
36067a210388J50940R1334j94622j49079K57235M63975K61343N9628R7679P6246
36057i5709j86818l73072k74489k26610m85960o34676j66588O16753R00465M64516
36047d62188n3413o8051K49293L50615K8423m85338q67694q84031m28994K82761
$$ y = [4301816, 4229323, 4445378, 4252250, 3699126, 3540738, 4084920, 4712454, 4680935, 3967231, 3133709, 2642690, 2480539, 2349678, 2138458, 2125800, 2541087, 2976644, 2698436, 1724184, 1033323, 1254009, 1664038, 1187801, -1207, -745649, -589679, -231046, -235328, -292041, -72366, 72172, -197380, -525054, -482336, -316515, -441620, -643911, -481080, -126364, -97922, -371141, -474214, -346040, -391390, -699564, -893222, -837388, -857407, -1089040, -1210388, -1059448, -968114, -1162736, -1311815, -1054580, -590605, -329262, -269634, -171955, -95709, -282527, -655599, -930088, -1156698, -1642658, -2277334, -2443922, -1827169, -926704, -462188, -515601, -583652, -334359, 16256, 44679, -440659, -1308353, -2192384, -2621378, -2338617]
36037b338617O82375L80322k54719m24598P9672N72985M33373j8156m2655L72515
36027e57503N17549Q2692l96224m27305k66913l20021l79132o7312L37639K53080
36017a223450k08992l58251l8703J53250p3184k05382J47442N35423M21268Q4275
36007g66304R7046L11711J41159l69549n64093k45449N4251J7805K5197L76584
35997i21642O63587L93721j94857m71565l10682j43315k28540l39880k06655Q5753
35987a674075K47846J49073m8271m9086K50653N64758M91840P0399j88701j9608
35977b05172J43327j98313p41280o96997M4998O56642M88408n0859j26609L32538
35967c53317N81917J28177o01099q03418k64158M27443N61342P1730m29714l66133
$$ y = [-2338617, -1656242, -1275920, -1530639, -1955237, -1875565, -1302580, -869207, -887363, -930018, -557503, -39954, 42738, -353486, -780791, -1047704, -1367725, -1746857, -1814169, -1476530, -1223450, -1432442, -1790693, -1829396, -1676146, -1749330, -1954712, -1807270, -1271847, -850579, -766304, -669258, -357547, -216388, -585937, -1150030, -1395479, -1341228, -1323423, -1298226, -921642, -258055, 135666, -59191, -530756, -841438, -984753, -1213293, -1553173, -1759828, -1674075, -1426229, -1277156, -1325427, -1374513, -1123860, -559102, -67262, 3137, -185564, -205172, -61845, -260158, -1001438, -1698435, -1653437, -996795, -508387, -559246, -685855, -353317, 228600, 356777, -244322, -1047740, -1311898, -884455, -323113, -251383, -681097, -1047230]
35957a047230J46333M72737K66415j20823j65278R9035J69463j62720m88214l65219
35947a195501L7716J80383o7690k42918J2615L88212L36371j18528m20202l11200
35937a400742j33520j22195O2667O34265R60377L15146q12384j079982j50731
35928a727099P19980M59026k95012k78808L95062M84398l18739q27574j82226
35919a570992Q33113R54662J78721m61932m20453j07255k082n2332l4403M9770
35909f33183J05552J11236L9442j14969k02067q4750Q4916O4119o6482p1560p5418
35898h43164l77592p22167m23139N05628J026433M34158n10250n76409J36135
35889a350367L53314m08362j040992m46267Q65249J493970R81631J11409l85101
$$ y = [-1047230, -900897, -428160, -161745, -282568, -447846, -348811, -179348, -342068, -830282, -1195501, -1157785, -977402, -1045092, -1288010, -1275395, -887183, -550812, -669340, -1089542, -1400742, -1534262, -1656457, -1593790, -959525, 852, 315998, -496386, -1576368, -1727099, -1007119, -548093, -843105, -1121913, -726851, -242453, -561192, -1388766, -1570992, -737879, 216783, 395504, -66428, -486881, -594136, -596218, -648550, -682953, -633183, -527631, -416395, -376953, -491922, -693989, -778739, -693823, -629704, -696186, -767746, -843164, -1220756, -1942923, -2366062, -1860434, -834001, -399843, -910093, -1486502, -1350367, -997053, -1405415, -2446407, -2892674, -2027425, -533455, 448176, 559585, 174484]
35880A74484n50292n88418l82604L5832K10492n2378k24629J48603O02905L94016
35870b31989k75237m72384N3229N10630L20269o5916k9113K03931M7652l94183
35860c33111m92049j00208K72711K60004K0101j96612l23988k54967J23590N17409
35850e07120L62367l57307q68801n47102K35255O01760L08974m7015Q3247N05563
35840b30179O03838J40041m51281n54123p4287M31200L84927j26674m68583k56266
35830f01387J84768K80028n3114l38187j60343L41676O59752M88072J6512l39602
35820D78175m06140l41046k92900j70105J30597M31471M30864R7610k89334m75283
35810d06091m32765k53954j8152K23216M47971O24525O12457K65758k28976l71440
$$ y = [174484, -375808, -964226, -1346830, -1310998, -1100506, -1152884, -1377513, -1228910, -626005, -231989, -507226, -979610, -926381, -415751, -95482, -161398, -190511, 13420, 61072, -333111, -825160, -925368, -652657, -392653, -372552, -569164, -893152, -1148119, -1024529, -507120, -144753, -502060, -1370861, -1917963, -1682708, -1080948, -771974, -818989, -735742, -230179, 373659, 513700, 62419, -491704, -565991, -134791, 250136, 123462, -345121, -601387, -416619, -136591, -189705, -527892, -688235, -346559, 313193, 801265, 817777, 478175, 72035, -269011, -561911, -732016, -601419, -169948, 260916, 358526, 69192, -406091, -838856, -1092810, -1110962, -887746, -439775, 184750, 797207, 1062965, 833989, 462549]
35800D62549J6628M26700L30944k0597o812L29917L52422o4788k78455M5747L55725
35789A949980J52822j35375J75861R39358J403878J251235P94642L32669p9433
35780F785637k91329r4743L24032M59188J65260j13585J9174L26016K29231m16879
35770G392002j060276j033117l37435L05132K80395k18980n52129n00149l65437
35761C910006l19712k33702j92427n04561r87538r49897k60787K66112Q2593j97355
35751F12732J66795P34576N63102k13430n50786j09302L35315J77486k58649m69859
35741I87980m67567m03914j88678J58544L19500J74623L1293Q1811Q8031j17836
35731F63787k69852j36290L3668j04625m32934n37045k70678R8771K18183j922
$$ y = [462549, 479177, 905877, 1236821, 1216224, 1209412, 1539329, 1891751, 1826963, 1548508, 1594255, 1949980, 2102802, 1967427, 2143288, 3082646, 4486524, 5737759, 6532401, 6865070, 6785637, 6494308, 6399565, 6723597, 7182785, 7348045, 7234460, 7253634, 7579650, 7808881, 7392002, 6331726, 5298609, 4961174, 5266306, 5546701, 5327721, 4775592, 4275443, 3910006, 3590294, 3356592, 3164165, 2659604, 1672066, 722169, 461382, 727494, 810087, 612732, 779527, 1514103, 2077205, 1863775, 1312989, 1203687, 1539002, 1716488, 1457839, 987980, 520413, 116499, -72179, 86365, 405865, 580488, 611781, 693592, 781623, 663787, 393935, 257645, 291313, 186688, -246246, -783291, -1053969, -955198, -737015, -738937]
35721g38937k84796k43082J28376L41322N5016l47455k42997K96157N87702L43715
35711a04979l21o8679o1656k29945l39881m9510M74177O70614K40509m75584p78834
35700g24089l52581K49012J76356m80224n97304L47446J216129P11450n80725
35691c4530r27120k2249O48014J92477m63630l12739J90518K05721n1706m420
35681e79664J03060j44975k74574K76802Q93730N85659l34138o44487r8648L26115
35671A08880O0316l37468k85960j0043N1456j11758l34016n40790n33786r0363
35661b023532N18873O67966K47895j08766Q9915N34698N89123Q1669n89539q95106
35651h86804n95597O1774N28192N21412L27352L12388L52737J36438j87457k07801
$$ y = [-738937, -1023733, -1266815, -1138439, -797117, -742101, -1089556, -1332553, -1036396, -448694, -104979, -105300, -173979, -235635, -465580, -805461, -854971, -380794, 289820, 530329, 54745, -724089, -1076670, -827658, -651302, -1131526, -1728830, -1381384, -165255, 546195, -34530, -961650, -983899, -335885, -143408, -607038, -919777, -729259, -523538, -575244, -579664, -476604, -621579, -896153, -619351, 274379, 860038, 525900, -118587, -217235, 108880, 169196, -168272, -454232, -464275, -412819, -524577, -858593, -1399383, -1933169, -2023532, -1504659, -836693, -588798, -697564, -607649, -72951, 516172, 597841, 8302, -886804, -1482401, -1420627, -892435, -371023, -43671, 268717, 621454, 757892, 570435, 362634]
35641C62634J0125j2273l61428n90381m69510k82774k01183M7267N64821Q42331
35631i0371L88582m73038q79923m36949L52677O85334L16242k44001l52058L0937
35621g02568L52063K24251o8036n630M11903O42375K92406l96352p93906n34695
35611e78189O8717L06142j02772n78937m06664K19159M17773o2422m50269j44977
35601a312439M05794M87118J39419j74258l50690m52151k62595K44971M81367
35592g93464M8440m80298l93966J3132M5581j27154R3201M17910P4852o48738
35582a750504o41428J83689O35701J30687m54416k85076K35945L89582K53237
35573a302583J96936R5537k31909m37374j68879K98733M76708K80683j04169m62713
$$ y = [362634, 372759, 360486, -942, -591323, -1060833, -1343607, -1544790, -1497523, -932702, -90371, 298211, -174827, -1054750, -1491699, -1139022, -453688, -137446, -381447, -733505, -702568, -350505, -126254, -194290, -199920, 211983, 854358, 1146764, 750412, -43494, -578189, -509472, -203330, -306102, -885039, -1291703, -1072544, -654771, -717193, -1167462, -1312439, -906645, -419527, -280108, -454366, -805056, -1257207, -1519802, -1274831, -793464, -745024, -1225322, -1619288, -1606156, -1560575, -1687729, -1594528, -1176618, -1101766, -1750504, -2391932, -2208243, -1572542, -1441855, -1896271, -2181347, -1945402, -1555820, -1302583, -1105647, -1010110, -1242019, -1679393, -1848272, -1549539, -1072831, -792148, -896317, -1359030]
35563a359030m05941L38007J188707J054046j57447j144556q69454J29261O66493
35554e59914M36829n4795m26918n49627k89756J57553J81957l32421n60770Q0598
35544a917264Q88842Q62509K13413q5098J34362J90402j29039l07943j77323k12061
35534e39200n44855n97664o2879M90468M54989P3564k7150J79911J73673k03522
35524f02665m34544j01642M13069M11919o3983k24366K51205O06370J53754n15381
35514a06264l40605N06859Q36904L23965n1677K69708N13726n85o49961n75365
35504G26705l4975K45835K83577M07869L35325k53921q06462o72664k82974l99933
35494d51618o72798k30499O15179O79130j48757o56993j91736M74745M81542j1718
$$ y = [-1359030, -1764971, -1426964, -238257, 815789, 658342, -486214, -1355668, -1226407, -559914, -123085, -177880, -604798, -1154425, -1444181, -1286628, -1104671, -1437092, -1997862, -1917264, -1028422, -165913, 47500, -37598, 96764, 287166, 158127, -149816, -327139, -539200, -1084055, -1681719, -1744598, -1254130, -799141, -725577, -752727, -572816, -399143, -602665, -1037209, -1138851, -725782, -313863, -377846, -602212, -351007, 255363, 409117, -106264, -446869, 59990, 896894, 1220859, 1169182, 1438890, 1952616, 1952031, 1302070, 726705, 691730, 937565, 1221142, 1629011, 1964336, 1710415, 903953, 231289, -51685, -451618, -1124416, -1354915, -739736, -60606, -209363, -866356, -1058092, -583347, -101805, -113523]
35484a13523m52435o83866o80597l05862K51938M72315K52417M8172O8463J2058
35474a130920k08165k24173O6932K70659K23705K19167K73299k4944o20601p80772
35464a935813k03327M30525M87680K40780J76388J55833j00403k80419O4323P06409
35454b58024R84372O27516l7964m40364j30047P61611J306922O96855m39563n31337
35444B539977P14941J642814R44236l94408n71493M00034R60634M99432M5841
35435F782008L84865Q69193N92410k71834r09733r71014o84548l30803n4559R7866
35425E503851K51537N39068P07468K86165o31696j205637q12684R1264M71751
35416E201087m8452p88203q39742q0562P23238P67488R4171m80024l50515J73138
$$ y = [-113523, -565958, -1249824, -1930421, -2236283, -1984345, -1512030, -1259613, -1211441, -1142978, -1130920, -1339085, -1563258, -1496326, -1225667, -1001962, -782795, -509496, -534440, -1155041, -1935813, -2139140, -1708615, -1220935, -980155, -803767, -647934, -748337, -1028756, -964433, -258024, 726348, 1353864, 1315900, 875536, 745489, 1507100, 2814022, 3510877, 3071314, 2539977, 3254918, 4897732, 5841968, 5447560, 4876067, 5276101, 6236735, 6736167, 6782008, 7166873, 8036066, 8628476, 8356642, 7446909, 6475895, 5791347, 5460544, 5405985, 5503851, 5755388, 6294456, 7001924, 7288089, 6656393, 5450756, 4638072, 4729336, 5201087, 5152635, 4364432, 3524690, 3444128, 4167366, 4934854, 5029025, 4549001, 4198486, 4371624]
35406D371624L55619J4919l63637m02233k62507k31419k96176l08382k36359o4568
35396B576881K52554N36064L99813k07388p54584p43288l40229m7284M2817K09207
35386A924563M48201M07546M8452j50723R6588L85905J91185l49868o43194m88874
35376A869781k78936l35545m63027l15888Q3221M12255M64009K90794M1730j60320
35366A608074k30493j63959n9806j6967l5371p8220j53408k34201j77623J23888
35356E81914N17331O59036L74500j13952l79888k12055J77620L75827J94181j53867
35346B020647l10084j50964J22284K04940m0716m34425n50579j25658M92215N69332
35336A796992p5351o48865l55658M32714O25913k0253n70578l44208J30206Q7775
$$ y = [4371624, 4727243, 4742162, 4378525, 3976292, 3713785, 3482366, 3186190, 2877808, 2641449, 2576881, 2829435, 3365499, 3765312, 3557924, 2803340, 2060052, 1719823, 1672539, 1715356, 1924563, 2372764, 2780310, 2828762, 2678039, 2774627, 3160532, 3351717, 3001849, 2358655, 1869781, 1590845, 1255300, 792273, 476385, 559606, 971861, 1435870, 1726664, 1768394, 1608074, 1377581, 1213622, 1153816, 1136849, 1101478, 1023258, 869850, 635649, 458026, 581914, 1099245, 1758281, 2132781, 2018829, 1638941, 1426886, 1604506, 1980333, 2174514, 2020647, 1710563, 1559599, 1681883, 1886823, 1846107, 1411682, 861103, 735445, 1227660, 1796992, 1721641, 1072776, 717118, 1149832, 1775745, 1755492, 1184914, 840706, 970912, 1058687]
35326A058687k41228j22669L91858N18875l0839o31411o30066q9711M86897P39592
35316A449985O14714K65765p5486k90198m30969m90130l12751N2716K06210o4221
35306I25635l80002l19946o8013o218K5673L95227Q21550O44510q9731n94061
35296A354624m74767j66741r4090j20496o1489o1613j68188j32303Q3548J75845
35286C34330J18370K63204N46252L38594m69299r81729n20786K99858M62546k9
35276C91311k59951m3474J66096J23529J43407L54247L78102j2145m52956m71303
35266C16863o6245L69248M63718J24388l91498o34955m14691o3673k5663k59265
35256e81773l58241j82856J8929J06693K21528L64085K38702k36780o09687m17907
$$ y = [1058687, 817459, 694790, 1086648, 1605523, 1574684, 943273, 313207, 223496, 710393, 1449985, 2064699, 2330464, 2254978, 1964780, 1533811, 1043681, 730930, 783646, 989856, 925635, 545633, 225687, 157674, 151456, 177129, 572356, 1393906, 2038416, 1948685, 1354624, 879857, 713116, 619026, 498530, 437041, 375428, 207240, 74937, 158485, 334330, 452700, 715904, 1262156, 1600750, 1131451, 149722, -371064, -71206, 391340, 391311, 131360, 87886, 253982, 377511, 520918, 875165, 1253267, 1241122, 788166, 316863, 250618, 619866, 1083584, 1207972, 816474, 181519, -233172, -296845, -322508, -581773, -940014, -1122870, -1103941, -997248, -775720, -411635, -172933, -409713, -1019400, -1437307]
35246a437307J60469N24618M30331K15040K22320L28205K20532p0167k09627p9931
35236C04483M0431p9304k47096j42373J60579K55507j8218l30822k91814O3568
35226b85059L49621K83593n6915l69615m09701j48988K43376N13134M62034J09898
35216F91378k38539k48806n820K079l92727n88271M713Q95465R75592J21137n43311
35205F72890l21930N2831k39196o69903k97828N28071O68846N6000k89281k8566
35195A31934N7365l94539o54060k20736L00280K50927p9236j41876k2039q21O5001
35184g07800K81899K76516j40125m42844j70730K90699L44634J15027R8991L13815
35174B60082M18387L22197J15962k34204o14237o07102j28049K42032R6142j29600
$$ y = [-1437307, -1276838, -752220, -321889, -106849, 115471, 443676, 664208, 594041, 384414, 304483, 344914, 265610, 18514, -123859, 36720, 292227, 274009, -56813, -348627, -285059, 64562, 348155, 291240, -78375, -488076, -637064, -393688, 119446, 581480, 691378, 452839, 204033, 198213, 200292, -192435, -780706, -775993, 119472, 1095064, 1216201, 672890, 350960, 403791, 164595, -505308, -803136, -275065, 393781, 449781, 160500, 131934, 189299, -205240, -859300, -1080036, -779756, -528829, -608065, -749941, -771980, -772801, -707800, -425901, -149385, -289510, -732354, -903084, -612385, -267751, -152724, -53733, 260082, 678469, 1000666, 1116628, 882424, 268187, -338915, -466964, -224932, -128790, -258390]
35164b58390O9938L57761J52325l14604l53557P1458L68596K55544j6541k04036
35154A28494k43067q5065J27128K3013l61621l64832K91499Q11726M19115l77350
35144C69040n31740m3348K45623J08698N8493J77867%m24172m61678n5550R6294
35133d60473k36853l99137J833M09450K33967k51310l95764m7164M20774N80597
35123a44080K62076k56313l58562J68251O30148K82980m51858m63579L63359R04330
35113I36752M53673l19231n04793k22402j67590m88918p38122n99696j87114J92116
35103a645325K87517J10519q19K21625N18716M13516o1878m13064m13101k50735
35093a233029n811L82041O31715L37453k46449l81400M6945L47323J43883j03658
$$ y = [-258390, -188452, 169309, 321634, 7030, -346527, -275069, 93527, 349071, 332530, 128494, -114573, -199638, -72510, -49497, -411118, -775950, -484451, 327275, 746390, 369040, -162700, -206048, 39575, 148273, 206766, 384633, 384633, -39539, -501217, -556767, -460473, -697326, -1096463, -1094630, -685180, -451213, -702523, -1098287, -1145451, -724677, -144080, 117996, -138317, -496879, -328628, 301520, 584500, 132642, -330937, 32422, 936752, 1390425, 1071194, 566401, 343999, 176409, -312509, -1050631, -1650327, -1837441, -1645325, -1357808, -1247289, -1248108, -1026483, -507767, -94251, -156129, -569193, -982294, -1233029, -1238840, -856799, -225084, 112369, -134080, -515480, -468535, -121212, 22671, -80987]
35083h0987J3502K08176J13254j29597k70996l27959k42826J67758O01760L52603
35073D04688n65811j107628n56187M46550Q22187M40601l4312j89788j03904R3670
35063c49934K89028K58359l8840k59293j30535J57766K97944K55872O8525l13109
35053B35783o95694o45447j48333K26998J65080O4969K92192N55402M87104K64101
35043H02155J26782j36526o13997p44013j11179O64497O40791j11586o58400n31170
35033f72646j68903n7785j00720J3637K80174M16488K27951j55252l67820k15997
35023h00873L5775K1903j36964r577L87682N39583K35116j44205k86819l12164
35013d70543l05823j34242Q5906J8079j99070m5016L98021M43814L9872l7617
$$ y = [-80987, -67485, 140691, 253945, 124348, -146648, -474607, -717433, -549675, 52085, 404688, -161123, -1268751, -1824938, -1378388, -556201, -115600, -149912, -339700, -443604, -349934, -60906, 197453, 158613, -100680, -231215, -73449, 224495, 480367, 548892, 235783, -459911, -1105358, -1253691, -1026693, -861613, -796644, -504452, 50950, 538054, 802155, 928937, 792411, 178414, -565599, -676778, -12281, 628510, 516924, -141476, -672646, -841549, -899334, -1000054, -986417, -706243, -289755, -61804, -217056, -584876, -800873, -765098, -743195, -880159, -889736, -502054, 37529, 272645, 128440, -158379, -470543, -776366, -910608, -824702, -806623, -1005693, -1050709, -652688, -208874, -169002, -206619]
35003b06619L80050L95110l67893r23137n08105J59110K06224M7354L07869M15478
34993i4559k81166r23164l40273Q23885R39975m8473o47793k30879K84688K36865
34983b80894Q3378J99041K23588k3834j54662l8606L927j0838K23254M28331L5113
34972F87798o32520o76900j54953L3133j65048J23819Q73543Q98726q0367p37052
34962A70179k60371L40783K6714n53547l13371M14764N52751N59n10243o62562
34952g94344n76480j51967N68966Q82461L03037m36664k83020N39071Q20225J06829
34942I78114p75118r41317m40780P5067J51435j03906j98278J46883N20575L10896
34932b76429k71389l24199L33669P08067J20634o60605n52770K59924P69104O32753
$$ y = [-206619, 173431, 568541, 200648, -722489, -1230594, -1071484, -865260, -817906, -510037, -94559, -375725, -1298889, -1639162, -815277, 124698, 76225, -571568, -802447, -517759, -280894, -197516, 1525, 225113, 201279, 46617, 8011, 11938, 1100, 224354, 652685, 687798, 55278, -621622, -776575, -743442, -908490, -784671, 88872, 987598, 907231, 170179, -90192, 250591, 277305, -276242, -589613, -174849, 377902, 378461, -131782, -794344, -1370824, -1522791, -953825, -71364, 231673, -204991, -488011, 51060, 871285, 978114, 202996, -738321, -1179101, -1104034, -952599, -1056505, -1254783, -1107900, -587325, -276429, -547818, -872017, -538348, 169719, 290353, -370252, -923022, -663098, 106006, 738759]
34922G38759K85157j9908l10490l58681j946K45286j43185o53853l77003M46413
34912a49451O60896J9942m09191L9869O23212M44452j87549l90451p7704Q5397
34902F59422k18208n89853n78356k18324J42756K66641K00338J40907J61907J22300
34892H9530o9912k23980j25145O3612j3142l25101m27476r1808L74505N73171
34882a75746M69688K36895n4533l46479m29616j72802J91775K82838L7243k55585
34872b16322l74357l93360m31738m00104j77462R0655J25883n3985j08720J03636
34862a835874K33791p4951n69865o06043J2191P18835Q34696L23988k32920l05493
34852a501645O5044L79397K66444r5035k43526q1318K1353j53404l22936k10391
$$ y = [738759, 1023916, 1004008, 693518, 334837, 332891, 578177, 434992, -218861, -595864, -149451, 511445, 531387, 122196, 162065, 785277, 1229729, 1042180, 651729, 574025, 659422, 441214, -148639, -726995, -945319, -802563, -535922, -335584, -194677, -32770, 89530, 19618, -204362, -329507, -265895, -279037, -604138, -1031614, -1123422, -748917, -175746, 293942, 530837, 476304, 129825, -299791, -472593, -280818, 2020, 39263, -216322, -590679, -984039, -1415777, -1815881, -1993343, -1902688, -1776805, -1830790, -1939510, -1835874, -1602083, -1677034, -2246899, -2852942, -2840751, -2121916, -1287220, -963232, -1196152, -1501645, -1436601, -1057204, -790760, -885795, -1129321, -1210639, -1189286, -1342690, -1665626, -1876017]
34842a876017J206P6343J57885L06600R7874o11970r82076k38235Q69958Q67826
34832a330606k38453q94720l67187K50463j8279m81210j47434N30183N40413Q3605
34822b073225P3022M16863K25446n04965p91950l01160J30746j42013o80070p70956
34812d418262l72031R9555L51048L24405J46335R4251K61186L15968R268k81729
34802c470006q5151L08641K48054j72209k40745J69683M23123K33285N0269J19168
34792b415888M5195l43772n22039j32707L50418L37059n4537l53789m19061l22346
34782c831467l5462L12626L01488j96556o64282n78995o2706M28673O49011M88524
34772c189146j03689p09267n44003M60875J237924R32000J51003L3611N20325
$$ y = [-1876017, -1874811, -1798468, -1640583, -1333983, -1236109, -1848079, -2830155, -3068390, -2198432, -1330606, -1569059, -2463779, -2830966, -2580503, -2598782, -3079992, -3227426, -2697243, -2156830, -2073225, -2000203, -1583340, -1357894, -1862859, -2654809, -2955969, -2825223, -2967236, -3647306, -4418262, -4790293, -4690738, -4339690, -4015285, -3868950, -3774699, -3513513, -3197545, -3188277, -3470006, -3555157, -3246516, -2998462, -3170671, -3411416, -3241733, -2818610, -2585325, -2535056, -2415888, -2370693, -2714465, -3236504, -3369211, -3018793, -2681734, -2736271, -3090060, -3509121, -3831467, -3866929, -3554303, -3252815, -3449371, -4113653, -4692648, -4755354, -4326681, -3677670, -3189146, -3292835, -4002102, -4546105, -4085230, -2847306, -1915306, -1764303, -1730692, -1210367]
34763a210367O12222J20245p1613L83474O44790J45418l45431P4236R32052J058838
34753B343864L48572j94307n9591J31439j92613o19216m95725J8937K71970J14914
34743A668244n4672n8644j05713k15507p9619L66950P35634P39261N28487K79429
34733C803850q9882n04338n21832p519L71815n3221q71033j001645k04451N23859
34723A445603L19741l69393m80550J35294N33994N7401p10641p57032n6151M38903
34713E57169K07174j33035J11868N65749M25011j40371j98010L82971O32599L1121
34703B442246o41713n54983l6019J93893K04873L78579M03530j72136q31972o93842
34693F92456K0369K82799p5327k03572K00117M12921P9250j26343K29316M70630
$$ y = [-1210367, -598145, -477900, -549513, -166039, 478751, 624169, 278738, 352974, 1285026, 2343864, 2692436, 2498129, 2438538, 2569977, 2377364, 1758148, 1262423, 1281360, 1553330, 1668244, 1613572, 1554928, 1449215, 1233708, 1154089, 1521039, 2256673, 2995934, 3524421, 3803850, 3713968, 3209630, 2687798, 2680279, 3052094, 2998873, 2127840, 1126195, 921744, 1445603, 1765344, 1395951, 915401, 1050695, 1584689, 1642090, 931449, 174417, 118266, 557169, 764343, 631308, 743176, 1308925, 1733936, 1593565, 1395555, 1778526, 2411125, 2442246, 1800533, 1245550, 1209531, 1403424, 1608297, 1986876, 2390406, 2218270, 1386298, 692456, 712825, 995624, 920297, 716725, 916842, 1329763, 1409013, 1282670, 1511986, 1982616]
34683A982616m1848p47791p20031p0780L21838J28950j55462p8391K51087M43307
34673A313495K33142l01067o88532m64038J86236N19757K07912k12647j57141
34664F37117K11221M05426L74324L30149K06953j29041m07643k84699K5519n297
34654A364029m36979p95713p21327k76093K97816P37347P70683L59634j24317
34645A175080k75003r9274J67181M50025O78917N32482j21647p25385o00350L6879
34635A218905K88371j27972m78034j51597M43817N75754K63793N4411K8231k35688
34625A879991p28633p96643j55898M89835L86053j41843k07321K11479K53229
34616A190249l47961p42619l44594K03644J68680j0333L78400Q32968L87566n27669
$$ y = [1982616, 1940768, 1192977, 472946, 402166, 724004, 852954, 697492, 619101, 870188, 1313495, 1546637, 1245570, 557038, 93000, 279236, 798993, 1006905, 794258, 637117, 848338, 1253764, 1628088, 1958237, 2165190, 2036149, 1628506, 1343807, 1369326, 1364029, 927050, 131337, -589990, -866083, -568267, 169080, 939763, 1299397, 1175080, 900077, 800803, 967984, 1418009, 2096926, 2629408, 2507761, 1782376, 1182026, 1218905, 1507276, 1379304, 901270, 749673, 1193490, 1769244, 2033037, 2087448, 2115679, 1879991, 1151358, 354715, 198817, 688652, 1074705, 932862, 725541, 937020, 1190249, 842288, 99669, -244925, -41281, 127399, 117066, 495466, 1328434, 1716000, 1188331]
34606A188331n26448M30543Q08880k2885p09301j17831Q20813O64370k86736o77276
34596A572460k53368J20150J18849K00113L91534J84064l41735m58407K465L85492
34586A921617K88602Q17k39655n24960o93932l74470K16784L94823J08713K0727
34576A119066K79803K22224l46119o14329q9752N06592M15700N8519J65366M02304
34566B119374j1795p50742o91518K62983Q60214L23337m87733l59847N19854R20742
34556B704869L79693k40329j45350K21158l0558p47457q80117j01245O08266M03949
34546B172879j46099P078O89550P64448k3364n85538j83509M21963J80346o22947
34536B674807q29870j16775O71862Q19829N34292K92170J23702q5061j34302J24987
$$ y = [1188331, 661883, 1092426, 1901306, 1878421, 1169120, 1051289, 1872102, 2536472, 2249736, 1572460, 1319092, 1439242, 1558091, 1758204, 2149738, 2333802, 1992067, 1533660, 1536125, 1921617, 2210219, 2211036, 1971381, 1446421, 752489, 378019, 594803, 989626, 1098339, 1119066, 1398869, 1621093, 1274974, 660645, 570893, 1077485, 1493185, 1551704, 1717070, 2119374, 2107579, 1356837, 665319, 928302, 1788516, 2111853, 1624120, 1264273, 1784127, 2704869, 3084562, 2844233, 2698883, 2920041, 2889483, 2142026, 1261909, 1160664, 1768930, 2172879, 2026780, 2033858, 2723408, 3487856, 3464492, 2878954, 2695445, 3117408, 3297754, 2674807, 1844937, 1728162, 2400024, 3219853, 3754145, 4046315, 4170017, 4084956, 3950654, 4075641]
34526D075641L10611j9347n55541n20727J65998O31313K64543l47067k37018N49728
34516D318134J070202Q35684K96612o9265l54224o24938m91414K01263Q29198
34507F011252P62057K70516M7138J71229K15806J14703J93127M55820N40452L65554
34497I147654K19883K11249J86496J74960L43393N34523M38569K09211K94108
34488A1760046O52429P93444O15205M95237M88472K46035q6348K17227J229689
34479A6411436J868954J270955P7712l56397L07390J126806J184337N96670K00424
34470B2688287N71649J436360J985935J810103J382207J358279J620394J589987
34462C4443201J372679J747766K833241L653935L524059L090933L335161M140723
$$ y = [4075641, 4386252, 4366905, 3811364, 3290637, 3456635, 4087948, 4352491, 4005424, 3768406, 4318134, 5388336, 6224020, 6520632, 6451367, 6097143, 5472205, 4980791, 5182054, 6011252, 6773309, 7043825, 7090963, 7262192, 7477998, 7592701, 7785828, 8241648, 8782100, 9147654, 9367537, 9578786, 9765282, 9940242, 10283635, 10818158, 11256727, 11465938, 11760046, 12412475, 13205919, 13821124, 14316361, 14804833, 15050868, 14964520, 15181747, 16411436, 18280390, 19551345, 19629057, 19272660, 19580050, 20706856, 21891193, 22487863, 22688287, 23259936, 24696296, 26682231, 28492334, 29874541, 31232820, 32853214, 34443201, 35815880, 37563646, 40396887, 44050822, 47574881, 50665814, 54000975, 58141698]
34454E8141698M648563M630610M687549N250098O112378O943897P698260Q471875
34446A06584928R351444J0396666J1505761J2424877J3126634J3918780J4878679
34439A92187769J5522461J5443183J4913420J4319573J3324659J1270629Q238118
34432B85219812M989978J878810j495000n386214r234546j2146528j3708440j4179390
34424B35938482j4171039j4217084j4379490j4222172j3399164j2208563j1257565
34417A42083405j0670413j0046088r173799q304414p619049o909432o011761n172660
34409G8175789m691332m466183m194148l837681l590651l466691l219917k725410
34401D7983776k229164k077357k271451k442238k286938j890365j521305j265982
$$ y = [58141698, 62790261, 67420871, 72108420, 77358518, 83470896, 90414793, 98113053, 106584928, 115936372, 126333038, 137838799, 150263676, 163390310, 177309090, 192187769, 207710230, 223153413, 238066833, 252386406, 265711065, 276981694, 285219812, 290209790, 292088600, 290593600, 285207386, 275972840, 263826312, 250117872, 235938482, 221767443, 207550359, 193170869, 178948697, 165549533, 153340970, 142083405, 131412992, 121366904, 112193105, 103888691, 96269642, 89360210, 83348449, 78175789, 73484457, 69018274, 64824126, 60986445, 57395794, 53929103, 50709186, 47983776, 45754612, 43677255, 41405804, 38963566, 36676628, 34786263, 33264958, 31998976]
34393C1998976j066294j000250j203984j524004j598471j365866j148753j108331
34385B1983023r91512o25884k88315k80368m62396n54653o07398p77137r00083
34376A6495277p58119n80809p54855j107718j028223l72232K44823K48411j93707
34367A2192848n24494n49468n00898n16074m48333k44083j50998l07426l71702
34358H579372L1130N82546N33015j84647p17596n19538j61013k94850m66114O1016
34348G443321P63995M59388o86102j199465n85769o6570m64710q48782k54500
34339D560806N78752M91667j30817j73224K03085p943o75799o65734J57985O50333
34329D989111K62777k21342j43114J07793N2908q8443m9494k3820q9428K5462
$$ y = [31998976, 30932682, 29932432, 28728448, 27204444, 25605973, 24240107, 23091354, 21983023, 20991511, 20365627, 20077312, 19796944, 19334548, 18779895, 18172497, 17395360, 16495277, 15737158, 15156349, 14401494, 13293776, 12265553, 11893321, 12138144, 12386555, 12192848, 11668354, 11118886, 10617988, 10101914, 9653581, 9409498, 9258500, 8951074, 8579372, 8610502, 9193048, 9726063, 9541416, 8823820, 8304282, 8143269, 7848419, 7382305, 7443321, 8207316, 8666704, 7980602, 6781137, 6195368, 6128798, 5664088, 4815306, 4560806, 5139558, 5631225, 5500408, 5327184, 5530269, 5522326, 4846527, 4180793, 4338778, 4989111, 5251888, 5030546, 4887432, 4995225, 5048133, 4959690, 4910196, 4886376, 4796948, 4822410]
34319D822410K27899j4660o36931p74287j12613M37839P8075o21943n79076K21743
34309C048456P92629N08264k48936o95507m56800J59802M67215R4961n50124p58422
34299B361538m08911K0879K61537M68019O14685L98110q5073k80110m4345J20013
34289C426342k9049q2431J58625K09893k29585o60728n80518k38583m2926J24497
34279B055537L79903L04597l05771p56646l75206L59862N10809J20262k2637J86599
34269B457309M8212n92516r03184l17005N44498O96272P0984n09213m18383J33581
34259A210555N30680N08767K99242J32554q0274m13529n82373l16947J13141K35903
34249A637719J09996J42274K68697M7264m15659m77799o6207J30385j30018k03148
$$ y = [4822410, 5050309, 5035649, 4398718, 3624431, 3511818, 3949657, 4027732, 3405789, 2826713, 3048456, 3841085, 4349349, 4100413, 3404906, 2948106, 3107908, 3575123, 3670084, 3119960, 2361538, 1952627, 1973506, 2235043, 2703062, 3317747, 3715857, 3630784, 3350674, 3306329, 3426342, 3397293, 3314862, 3473487, 3683380, 3453795, 2793067, 2212549, 1973966, 1931040, 2055537, 2435440, 2740037, 2434266, 1677620, 1302414, 1662276, 2173085, 2293347, 2270710, 2457309, 2505521, 1913005, 1009821, 692816, 1237314, 1933586, 2004570, 1495357, 1076974, 1210555, 1741235, 2250002, 2549244, 2681798, 2601524, 2187995, 1605622, 1288675, 1401816, 1637719, 1747715, 1889989, 2158686, 2205950, 1790291, 1312492, 1246285, 1376670, 1246652, 1043504]
34239A043504K17748M41630Q251l82554k4061N67286N52839J52118M7284P7274
34229B701319k70518o11162k36702M15399K66411n66329q25976q4126O63520O12052
34219B063888J54258r1651j83583l25825l47748j84195j25794k03646k9532M27033
34209A153205O20784L05663q5042k28677l33625m57990k22164L75203O44922K33307
34199B005586k46470j66364J79313J79384j30827l31342l57780l80034l44853
34190D06613j72997l8719o972J73562M96580M57331j14963n66305l65913L4114
34180C02331K718j66224J76284Q07258R54311N63692K41536R4955l07534q27827
34170A841500p20433O2766N55364J87375l76101l47887J3518L9450j65891j2151
$$ y = [1043504, 1261252, 1702882, 1711133, 1328579, 1304518, 1871804, 2424643, 2576761, 2624045, 2701319, 2430801, 1819639, 1582937, 1998336, 2264747, 1698418, 872442, 788316, 1451836, 2063888, 2218146, 2126495, 1942912, 1617087, 1269339, 1085144, 959350, 755704, 726172, 1153205, 1773989, 2079652, 1994610, 1765933, 1432308, 974318, 752154, 1127357, 1772279, 2005586, 1759116, 1592752, 1772065, 1951449, 1820622, 1489280, 1131500, 751466, 406613, 233616, 194897, 187925, 361487, 858067, 1315398, 1200435, 634130, 268217, 302331, 305049, 138825, 315109, 1122367, 2076678, 2640370, 2881906, 2976861, 2669327, 1841500, 1121067, 1183833, 1739197, 1926572, 1550471, 1202584, 1216102, 1255552, 1089661, 1077510]
34160A077510M56101N79255J55217k52809k04229K7249N178j82677j53615J18441
34150A625621K85791J95944J02151J95831K34007q4788n29907n24274K3920M88086
34140B012382L73486L0980P9004L86345K83827k57430m37909J10797O22012L17496
34130C520990l49157l63700K88814O61192L40558p7527j57119k50817n34517l91898
34120B686819M81398J146078N93727o41931j133242n55406R2629J91137K10108
34111C071317M96819N42724N473n17240m37932j40222k54953o07698o54062m47848
34101A056378l97946m77521m28716l82145n34800n89901k82992n4585l34586n86238
34091c013052j14247N27974K10273q29540j123760k26110N98609M00326r5098
$$ y = [1077510, 1533611, 2112866, 2268083, 2015274, 1811045, 1838294, 1843472, 1660795, 1507180, 1625621, 1911412, 2107356, 2209507, 2405338, 2639345, 2554557, 2024650, 1500376, 1524296, 2012382, 2385868, 2416848, 2495852, 2882197, 3166024, 2908594, 2470685, 2581482, 3203494, 3520990, 3171833, 2808133, 3096947, 3758139, 4098697, 4021170, 3864051, 3613234, 3078717, 2686819, 3168217, 4314295, 4908022, 4266091, 3132849, 2577443, 2670072, 2861209, 3071317, 3568136, 4110860, 4116333, 3599093, 3161161, 3020939, 2765986, 2158288, 1504226, 1056378, 658432, 180911, -247805, -629950, -1164750, -1754651, -2037643, -2092228, -2426814, -3013052, -3127299, -2599325, -2389052, -3218592, -4342352, -4568462, -3969853, -3569527, -3664625]
34082c664625R6450O21877O04706J48344n6436J7878o0712k03489n6220J19401
34072b432826j60521n73379l76527L09713O24769L55907J78614L90075M32226
34063a251949m411l54955j56378J55447L1507k70486k37734l7765j22854k75909
34053b525487P4747P29043P95609K8195p04223o20015p1587Q9085k52521m48411
34043b905565r0436N17022Q61454P47478K75283l07858o37691m69381k5528J92777
34033a842445O8452O561K43335M17392J56367k52286k36006K18768N85959N69940
34023f3963L58408J10622k76649p39424q59871m14581K03124M38008K59624Q0875
34013i03827J06840J10167j05572l13575j42986L58646O86618M72244o8191m36535
$$ y = [-3664625, -3568175, -2946298, -2341592, -2193248, -2249684, -2231806, -2292518, -2496007, -2552227, -2432826, -2593347, -3166726, -3543253, -3233540, -2608771, -2252864, -2074250, -1684175, -1251949, -1256360, -1611315, -1767693, -1612246, -1580739, -1851225, -2088959, -2126724, -2249578, -2525487, -2450740, -1721697, -926088, -897893, -1602116, -2222131, -2293718, -2204633, -2457154, -2905565, -2996001, -2478979, -1617525, -870047, -594764, -902622, -1540313, -2009694, -2035222, -1842445, -1773993, -1767432, -1524097, -1106705, -950338, -1202624, -1438630, -1219862, -633903, -63963, 294445, 405067, 128418, -611006, -1470877, -1885458, -1682334, -1244326, -984702, -903827, -796987, -686820, -792392, -1105967, -1248953, -890307, -203689, 268555, 200364, -236171]
34003b36171m55138l11832j18762J78281M33652L13609j43417m17696k33655K5373
33993i65756k8965j51852N9341M33893N18517K92508K6904k67829o22021o40884
33983a346144k2956O74512O40311O1773j36646K26534L74358m0015l76588j65075
33973a09936J68458J94156J90541M05185M38499J9207l39503j62208J56116O3853
33963A024368j90233p5839K65200L69042K89174K92214J67064k98301n60097j7724
33953A264868P99814P78348j39520q46318o44077n630L62904L49871J10521k90766
33943A740015o03208m24328J64907N46858L97090L6493k28457m88916o99779m54202
33933a3527K62755O94111K66291m97609o29541j4640N52392M75247k1296l63060
$$ y = [-236171, -691309, -1003141, -1121903, -943622, -509970, -196361, -339778, -757474, -991129, -965756, -994721, -1146573, -1087232, -653339, -134822, 157686, 184590, -83239, -705260, -1346144, -1369100, -694588, -54277, 7496, -129150, 97384, 471742, 431727, 55139, -109936, 58522, 252678, 443219, 848404, 1286903, 1306110, 966607, 804399, 960515, 1024368, 834135, 758296, 1023496, 1392538, 1681712, 1973926, 2140990, 1842689, 1282592, 1264868, 2064682, 2843030, 2703510, 1857192, 1213115, 1207485, 1570389, 1920260, 2030781, 1740015, 1136807, 712479, 877386, 1424244, 1821334, 1857827, 1629370, 1140454, 440675, -13527, 249228, 943339, 1209630, 712021, 82480, 67840, 620232, 1095479, 1074183, 711123]
33923G11123k73054J10364M25899L43690j09349m62048k96762J71272L24683j4928
33913I30890l56504k94452q1458j23413k59143o0224L42406L69087n0460l00002
33903A16727p2900J25845j17028l61047p6572L75179L32767p046K2598K78877
33893F17400K9717o05612o69180k4921K70031k54411n88143O5445Q32385N11986
33883A84697m79348p83318j74306L50353K81972J21104K01346J62734j95616m88817
33873h19199m43126k65289j04275J63409M26066L03820j40550k96675R5712M93844
33863e86263L22638k31624n19241k36159L00788N29291K21697k00233p7936N67233
33853I0191Q69896K74280n48999n82590O7895M13980J19640j56432J612J52993
$$ y = [711123, 438069, 548433, 974332, 1318022, 1208673, 746625, 449863, 621135, 945818, 930890, 574386, 279934, 198476, 75063, -184080, -244304, 98102, 467189, 416729, 116727, 43827, 169672, 52644, -308403, -384975, -9796, 322971, 315925, 338523, 617400, 647117, 41505, -627675, -652596, -382565, -636976, -1225119, -1159674, -327289, 184697, -294651, -1077969, -1252275, -901922, -619950, -498846, -297500, -134766, -330382, -819199, -1262325, -1527614, -1631889, -1468480, -1042414, -738594, -879144, -1175819, -1080107, -586263, -263625, -495249, -1014490, -1250649, -949861, -420570, -198873, -399106, -477042, 90191, 960087, 1234367, 685368, 102778, 170673, 584653, 704293, 547861, 549473, 702466]
33843G02466r5678m04015l28972j2760J58084J00148o0466k08208j81164O9377
33833b61188J93569j36684n03548j65407O91295R88147L36556l17480j34462L77107
33823A067905K72880l52468o57583l90037o0324K0312P8341K60152L42016K00007
33813G81201Q7925K29302M21248K82343j96560n51788l98125K5795J31663j65108
33803F47896k83821Q3882L80394N0024m62332l52396K26100M23663J18003K1290
33793H52703L32617L98354l7891l34555j09818J16588n0577j71245J21517L95244
33783A512937K49138L6879R0931N3010l09254m62628q4608J65280k36950o11107
33773D03628j74596N31033N04900l5966j36074J97923J41921l53499m81426m6884
$$ y = [702466, 606788, 202773, -126199, -138959, 19125, 119273, 58807, -149401, -330565, -261188, -67619, -204303, -707851, -873258, -181963, 806184, 1142740, 825260, 690798, 1067905, 1340785, 988317, 330734, -59303, -119627, -99315, -20974, 239178, 581194, 781201, 869126, 1098428, 1519676, 1802019, 1605459, 1053671, 655546, 681341, 813004, 647896, 364075, 447957, 828351, 878375, 416043, 63647, 289747, 713410, 831413, 852703, 1185320, 1583674, 1545783, 1211228, 1101410, 1217998, 1167421, 996176, 1117693, 1512937, 1762075, 1798954, 1889885, 1942895, 1633641, 1171013, 1086405, 1251685, 1014735, 403628, 229032, 760065, 1264965, 1228999, 1092925, 1290848, 1432769, 1079270, 597844, 550960]
33763E50960K43441M0548k22940k66467k70029j77768K49512O16151K45988n18881
33753D90515n68842J85667N47327k1970m94847k2557O29231L82045l84862n43927
33743A97780n2877J59724j78003l67319m5204K48411O0639k29533n4336M88385
33733B27667Q28364O56044J34977m08065p16059o54659l08372M497L2952p7588
33723b80242L6177L97621N62844K28985k67182l85919j70123j44646m36787n19730
33713i79002l0601O15514P59395L27743j88457l43946p6214L21775L81155p7925
33703G09437n31841k78067M52855N81337k54417r89160o33593K51188M84663P0309
33693a37289n3576K92924L27850k40867p21727n89690j57844J49964L55771N02785
$$ y = [550960, 794401, 834949, 612009, 345542, 75513, -102255, 147257, 763408, 1009396, 490515, -78327, 107340, 654667, 632697, 137850, 115293, 744524, 1126569, 741707, 197780, 144903, 304627, 126624, -240695, -285899, -37488, 23151, -206382, -260718, 227667, 1056031, 1712075, 1847052, 1438987, 722928, 68269, -240103, -235606, -202654, -280242, -244065, 153556, 716400, 945385, 678203, 292284, 122161, -22485, -459272, -979002, -1009603, -394089, 365306, 693049, 504592, 160646, 84432, 406207, 787362, 709437, 177596, -100471, 352384, 933721, 679304, -309856, -943449, -692261, -207598, -137289, -190865, 102059, 429909, 189042, -532685, -1122375, -1280219, -1130255, -774484, -271699]
33683b71699M29556K09993J46741J70208o7709m15120l28093J26712K51511j02900
33673A49200k52949J28116M64793L20627P6901Q0466j2585m49681p29756l96778
33663f21646J80812M40245M01228K42797j86209p62691p09926L32403J402969
33654G19982J275093Q1822q94312q08363K1576P33330P04380l9993p67693p05518
33644C20304n6096J95784k20147m05482J51362N95472J50842m55685j98907M63972
33634E41419M22371j37968j90574J78282K51n78313l66471O51201R86779L8692
33624A545669q63779n55108L03456N68851L31587K31047J39792l01404o48537
33615G51574l14049L11687M32244O7804k17516l36320n03660m95227m6589L78976
$$ y = [-271699, 157857, 367850, 514591, 684799, 617090, 201970, -126123, 589, 252100, 149200, -103749, 24367, 489160, 809787, 886688, 967154, 954569, 504888, -224868, -621646, -440834, -589, 400639, 643436, 457227, -305464, -1015390, -682987, 719982, 1995075, 2076897, 1182585, 374222, 395798, 1129128, 1833508, 1793515, 1025822, 320304, 264208, 459992, 239845, -165637, -14275, 581197, 732039, 276354, 77447, 541419, 963790, 825822, 635248, 813530, 813781, 235468, -131003, 520198, 1506977, 1545669, 681890, 126782, 430238, 999089, 1330676, 1561723, 1701515, 1400111, 751574, 437525, 749212, 1181456, 1249260, 1031744, 695424, 191764, -303463, -350052, 28924]
33605B8924J96688k34111j35546L57437M27563k8176l07043j66419j04352k87414
33595b52449k53449J01807K43345Q207n4846K58704L43860j22768n02046k27777
33585d57412K47475K46829n8502j31218l8895j21454j81354J10913L98224J62925
33575A77531k31280m0447M97220M14737l45327o98655r6070O53976P11764L70765
33565A414214K55738K26496r9881m14285k34200J08497l7906m46864k98471M22766
33555H96104P95791L80115j09422R0942O74019P32352j5747q90543j025350k84459
33545A243802N53505N88201j18720n31737k1886O63632M61554l39421m85413K65623
33535B279140P34225J88104n45259m69874R5725K92558J36142J29754J24933k68918
$$ y = [28924, 225612, -8499, -144045, 213392, 640955, 612779, 305736, 139317, 34965, -252449, -505898, -404091, -160746, -152539, -207385, 51319, 395179, 272411, -229635, -457412, -209937, 36892, -21610, -152828, -191723, -313177, -494531, -383618, 14606, 177531, -53749, -94196, 403024, 817761, 472434, -226221, -322291, 331685, 1043449, 1414214, 1669952, 1896448, 1796567, 1382282, 1148082, 1256579, 1218673, 771809, 473338, 896104, 1691895, 2072010, 1962588, 2053530, 2727549, 3459901, 3444154, 2553611, 1528261, 1243802, 1797307, 2385508, 2266788, 1735051, 1713165, 2376797, 2838351, 2498930, 2013517, 2279140, 3013365, 3201469, 2656210, 2186336, 2282061, 2574619, 2710761, 2840515, 2965448, 2696530]
33525B696530n95300j39243O20084M73663n63001j081898l74310N57980O43184
33516B237689K72597L72409Q09565P32002J7380n75443n19889l4573M34773O50589
33506D397099N55842K92909J94085L89495N74861N05010M38421O53403Q56861
33497H857986O75524M53896Q13862J564792J884323J596015J391055J599365J649040
33488B0485858J160374P24510R25548J247299P90509l11575j068715j086707j019997
33479B1847104j477281k151967k301548j663847o74671n2208k62499j107634j769703
33470A0385746j548216o21923J64421K49024k13806p87836j165936j132190o35596
33461D693688n2136R7561j32795j50685K42626N17071K99849j3097J3556R1252
$$ y = [2696530, 2101230, 1961987, 2582071, 3055734, 2492733, 1410835, 1036525, 1594505, 2237689, 2510286, 2882695, 3692260, 4424262, 4441642, 3866199, 3346310, 3311737, 3746510, 4397099, 4952941, 5245850, 5439935, 5829430, 6404291, 6909301, 7347722, 8001125, 8857986, 9533510, 9987406, 10801268, 12366060, 14250383, 15846398, 17237453, 18836818, 20485858, 21646232, 22370742, 23296290, 24543589, 25334098, 25022523, 23953808, 22867101, 21847104, 20369823, 18217856, 15916308, 14252461, 13577790, 13525582, 13263083, 12155449, 10385746, 8837530, 8215607, 8380028, 8629052, 8415246, 7627410, 6461474, 5329284, 4693688, 4641552, 4739113, 4606318, 4455633, 4698259, 5215330, 5515179, 5502082, 5515638, 5606890]
33451E606890k06344n67492m01331J34659L52489J20078l6322J42321L55707L88268
33441E888923L43352J95099j85343m85040j79776N38705Q22210L80680j15796
33432G203014j36099l081j07360j88081N1346K94580J89395l8137j61568m99307
33422F604702j149602j330961m40556P06048P66415k51681j073121j003096n96211
33413B231937m14449k33401J62421L46292l2645n52840n92726j82528J43525M8091
33403I23677l45241o33559m35015J98720O37303L39302l43801n60093j67058J17487
33393b68278j03290l33961j09193K39948K06845j09567l43735m48612m40118r0364
33383a800325N50028Q15551K71064m93335n89573m9334L61958L00909J14110R6996
$$ y = [5606890, 5400546, 4833054, 4431723, 4566382, 4918871, 5038949, 5002627, 5144948, 5500655, 5888923, 6232275, 6427374, 6242031, 5756991, 5577215, 6115920, 6938130, 7318810, 7203014, 7066915, 7063834, 6956474, 6768393, 6819739, 7114319, 7303714, 7265577, 7104009, 6604702, 5455100, 4124139, 3683583, 4389631, 5156046, 4904365, 3831244, 2828148, 2231937, 1817488, 1584087, 1746508, 2092800, 2060155, 1507315, 914589, 732061, 875586, 923677, 578436, -55123, -490138, -291418, 345885, 685187, 341386, -218707, -385765, -268278, -371568, -705529, -814722, -574774, -367929, -477496, -821231, -1269843, -1709961, -1800325, -1250297, -434746, -163682, -657017, -1246590, -1295924, -933966, -633057, -518947, -421951]
33373d21951J58941J78340J22483j21664n19219o22459j01232N93725P14331K55799
33363B37094j41379k31047l39334n01206k75629L60626P29518M34435l8267j35575
33353I9236p9771l70541q69498r53435l94229L50345O63048L56580j69789k81156
33343a649210K01321O81506M97521j06347k61467K22798N41530J38944m62566
33334a95970n45497k32862p323K11946O97493J032265N41037n22212j093855o87045
33324h02023O0260L64894J94122l4305j22212j64330k61376l75025l30826J8835
33314a451986M72176N25691N3244l55174j98944J35631N3796j26603K93082R24974
33304C25887O10354o23736j265235n29256M23119L67174r3805J90480P20999J52214
$$ y = [-421951, -263010, -84670, 37813, -83851, -603070, -1225529, -1326761, -733036, -18705, 237094, 95715, -135332, -474666, -975872, -1251501, -890875, -161357, 273078, 234811, 99236, 19465, -351076, -1220574, -2174009, -2568238, -2217893, -1554845, -1198265, -1368054, -1649210, -1447889, -766383, -268862, -375209, -636676, -413878, 127652, 266596, -195970, -741467, -974329, -981652, -769706, -72213, 960052, 1501089, 978877, -114978, -802023, -741763, -376869, -182747, -217052, -339264, -503594, -764970, -1139995, -1470821, -1451986, -979810, -454119, -400875, -756049, -954993, -819362, -765566, -892169, -599087, 325887, 936241, 312505, -952730, -1481986, -1058867, -691693, -785498, -595018, 125981, 278195]
33294B78195j159422j309023K58769J727871J452199J17955n73360k86834M3985
33285E50335k3035o2900Q4660k2418n15125q43390n88569m0029K97646L25861
33275h36964K55392K36562K85432L31863K23691r8423l97301l76773j32120l6580
33265e45221j51231j41351J18906K85956R9347j97265k71348j94622j82764j39125
33255a318718J38809N06490O38249M98793K56507j09316o41652r67485o13044
33246a611367K00538O59516M23109L9105M4645K09983Q4209k02942k47392j22965
33236e23561j80837l10195j07333K73047J89871m11395p23363k35498M45652M69184
33226a114428j2158j29747L72210P88346M93066k39890o88859n73460k19309n4431
$$ y = [278195, -881227, -2190250, -1931481, -203610, 1248589, 1366544, 793184, 506350, 550335, 527300, 464400, 549060, 526642, 11517, -831873, -1420442, -1460471, -1162825, -836964, -581572, -345010, -59578, 272285, 495976, 397553, 252, -376521, -508641, -545221, -696452, -837803, -718897, -432941, -333594, -530859, -802207, -996829, -1179593, -1318718, -1179909, -673419, -35170, 463623, 720130, 610814, -30838, -998323, -1611367, -1410829, -751313, -328204, -289099, -244454, -34471, 49738, -153204, -400596, -523561, -704398, -1014593, -1121926, -848879, -659008, -1070403, -1793766, -2029264, -1583612, -1114428, -1126586, -1256333, -884123, -95777, 397289, 157399, -531460, -1104920, -1324229, -1378660]
33216a378660j79536l35294j63889L91399Q87333P76099J03778m36056l51399
33207f86225M615j3415l46705l23821K26458N66973J06145o16840n90938K35114
33197a438639Q53204N83339q0786k95439K704K52943J88706L3882n4238j78902
33187a33226l37240l30017j17214J01620K08196K23063N9971l44432o52350m09662
33177a731291K00473M80323K61090J36906L56626K97872l63136p77382j72850
33168a311369O52677L53966p38029q76891M50806J604580J147503j50979o62756
33159D69508k63158o8228m04862m79452K6611L79392J09745j97979L9461M24420
33149C5458L19020o2919o1208L03284L71841r5250n78126n89568k81669p9473
$$ y = [-1378660, -1558196, -1893490, -2057379, -1665980, -778647, -2548, 101230, -334826, -686225, -681610, -695025, -1041730, -1365551, -1139093, -572120, -465975, -1082815, -1673753, -1438639, -585435, -2096, -82882, -378321, -375617, -122674, 66032, 99914, 45676, -133226, -470466, -800483, -917697, -816077, -607881, -384818, -324847, -669279, -1321629, -1731291, -1530818, -1050495, -789405, -652499, -295873, 1999, -361137, -1138519, -1311369, -658692, -304726, -1042755, -1919646, -1468840, 135740, 1283243, 1132264, 469508, 206350, 138122, -266740, -746192, -719581, -340189, -230444, -428423, -388962, 35458, 354478, 291559, 230351, 533635, 905476, 810226, 232100, -357468, -639137, -718610]
33139g18610q9943j17403m1409O1722R2511N6839K6008M4817Q8214R5460N0051
33128d51743O990K5712J08608K16622K88392K36651K6822k01485k11599N0982
33118I5952L55761M41389K72619j4971k76042l71051k05178J02041K62644J99550
33108H62714J76156L44983M23995J44118k14183j67564K31919M95998M74241M94473
33098C266850O97253P88900O14884M62614N45163O16295L76967p6440m33092m84186
33088F375208j39783M56979P39527K13947o64972p96919L7981O88093J96301q55629
33078F250733j282052r43831n97360n83177o21870n92510n60798k67296M62091
33069A263930R90753N52964m59525r08536n39467j48862j48641j07157J68890
$$ y = [-718610, -808553, -925956, -967365, -905643, -813132, -756293, -730285, -685468, -597254, -501794, -451743, -444753, -419041, -310433, -93811, 194581, 431232, 458054, 256569, 44970, 95952, 451713, 893102, 1165721, 1150750, 874708, 503657, 298479, 400520, 663164, 862714, 1038870, 1383853, 1807848, 1951966, 1737783, 1570219, 1802138, 2298136, 2772377, 3266850, 3964103, 4753003, 5367887, 5830501, 6375664, 6991959, 7368926, 7292486, 6859394, 6375208, 6235425, 6692404, 7431931, 7645878, 6980906, 6183987, 6221968, 6910061, 7106362, 6250733, 4968681, 4024850, 3427490, 2844313, 2222443, 1629933, 1069135, 801839, 1263930, 2254683, 2807647, 2348122, 1439586, 900119, 751257, 602616, 495459, 664349]
33060F64349K59418P3818N5576J80322j18253p29226p86665j96285N0226l99022
33050i45742n81332K7632M88744P6709l61246Q7054P29158M79054k54715l63295
33040f17979O3032J20504k26807l01454o5613M8009J87046O19657P45353l590
33030E68158p93099m90095L22690J61199q47568j128741k39035O12419P23570
33021a110502O89783P63347L13755n82415q01095n1087N54567M26891L13849N02205
33011A019298M4268j225808j717749m95215R03171O59364n60582p93785J72794
33002a994244P87574L19090k85396j41435L61597L97839j35917o29259n16552
32993a836703R3813M69828J45139l26666q7571O35136P74500J27534l37292j41300
$$ y = [664349, 923767, 997585, 1053161, 1233483, 1115230, 386004, -400661, -596946, -546720, -945742, -1527074, -1499442, -1010698, -933989, -1295235, -1208181, -479023, 31, -254684, -617979, -554947, -434443, -661250, -962704, -1028317, -980308, -793262, -173605, 571748, 568158, -224941, -715036, -392346, -231147, -1078715, -2207456, -2446491, -1834072, -1110502, -420719, 342628, 656383, 73968, -727127, -778214, -223647, 203244, 517093, 1019298, 1063566, -162242, -1879991, -2375206, -1472035, -812671, -1373253, -2167038, -1994244, -1206670, -887580, -1172976, -1314411, -952814, -554975, -690892, -1320151, -1836703, -1742890, -1273062, -1127923, -1454589, -1542160, -907024, -132524, -4990, -342282, -483582]
32983d83582K7376k35645l03870J01250J96525l36413n36219Q6891M30112l06322
32973a359897j017224n08138L86678K71416l25510P6335J218031J450162L96928
32964E88781o42550q17820n55654l10067l356K61564K16467J08647K79794L32685
32954e41509k01226p99412p03816j99796N9569L14497R28465J154723K74844p66601
32944d80262o14442K70995M51089r7957l43797k49978m04275l22219O09882J230324
32934D9360J76783j305335r54800O48099R41385k48515o31148K94529N87499k01545
32924f43688k50017P01622O11421p96354j169549P2752N61330m40384o74728K99634
32914a727961q6581j732620q56109K138925N58281p333992j1575279l312285J0287024
$$ y = [-483582, -456206, -691851, -995721, -894471, -697946, -1034359, -1570578, -1483687, -1053575, -1359897, -2377121, -2885259, -2498581, -2227165, -2552675, -2476340, -1258309, 191853, 588781, -53769, -871589, -1427243, -1737310, -1740666, -1479102, -1262635, -1153988, -874194, -541509, -742735, -1542147, -2245963, -2445759, -2386190, -2071693, -1143228, 11495, 286339, -480262, -1094704, -823709, -372620, -470577, -814374, -1064352, -1468627, -1790846, -1180964, 49360, 226143, -1079192, -2033992, -1385893, -444508, -693023, -1324171, -1029642, -442143, -643688, -893705, -192083, 419338, -377016, -1546565, -1473813, -912483, -1352867, -2027595, -1727961, -1814542, -3547162, -4403271, -2264346, -1706065, -9040057, -20615336, -23927621, -13640597]
32905a3640597J3952309N162770l429314k856244J529051J554672j337982j316492
32897c81827J241350J757804n8614p14975K73909K37981j036777r36163R19809
32888A302497J846162P16667m28679j01912N29861J77441n69105p89820p12464
32879A970648o94751l89366K49200M84921K2712m26873l50886j72733l12387m50224
32869f9739k14144J65659L14680K30915N5489j59611k89226k20842j67062m06788
32859g60669p12703n53594J16607P50722Q95237N76098O5289l32408l62759q6555
32849d04735O8028j36950l66653k57435j7308m566m6169K21166N84703M91422
32839A31503p3183n50096n96331l76007j02003K11953N14397O21296M10616p7554
$$ y = [-13640597, 311712, 5474482, 2045168, -811076, 717975, 2272647, 934665, -381827, 859523, 2617327, 2558713, 1843738, 2117647, 2355628, 1318851, 382688, 1302497, 3148659, 3865326, 3436647, 3334735, 3864596, 4042037, 3472932, 2683112, 1970648, 1275897, 886531, 1135731, 1620652, 1643364, 1216491, 865605, 692872, 380485, -69739, -283883, -118224, 196456, 427371, 482860, 323249, 34023, -186819, -353881, -760669, -1473372, -2026966, -1910359, -1159637, -264400, 311698, 376987, 44579, -318180, -404735, -336707, -473657, -840310, -1097745, -1115053, -1119619, -1165788, -944622, -359919, 131503, 58320, -491776, -1088107, -1464114, -1566117, -1354164, -839767, -218471, 192145, 114591]
32829A14591o27434q23936l74515L37918M69082j83621p70568n28462J55387L92031
32819a839527Q5559j00101J89230O08958O73773K20943n33846j043148q02059
32810b540218j4641M84134K93960p5017j37976j27983k31875P837P28387J034918
32800e78474L05660n49072l85364K71944J01964p14705p80071Q5091M88763k08372
32790a962636r16621o87301k7978L37548O10818R68971P77603j77020p72083j27124
32780a975823P26427J71160j436630j994931n28861J368574J461591m55562k364021
32771e028076k243581q4323K307795L208166K435986J056187J23581k2307L27114
32762B080542N32592J09719n59307m17117P51045J561872Q03837n30521m13134
$$ y = [114591, -512843, -1336779, -1711294, -1373376, -904294, -1087915, -1858483, -2386945, -2231558, -1839527, -1753968, -1854069, -1664839, -1055881, -382108, -161165, -695011, -1738159, -2540218, -2554859, -2070725, -1776765, -1851782, -1989758, -2117741, -2349616, -2341779, -1613392, -578474, -272814, -821886, -1207250, -935306, -833342, -1548047, -2328118, -2243027, -1754264, -1962636, -2879257, -3566558, -3594536, -3256988, -2646170, -1677199, -899596, -1076616, -1848699, -1975823, -1249396, -1078236, -2514866, -4509797, -5038658, -3670084, -2208493, -2664055, -5028076, -7271657, -7355980, -5048185, -1840019, 595967, 1652154, 1775735, 1753428, 2080542, 2613134, 2722853, 2163546, 1746429, 2497474, 4059346, 4863183, 4332662, 3919528]
32753C919528J159621J953923P08759j081014j401227l53198N16315M54439q7266
32744E789880n33326o02753j84266L48477K55956m14445n50875L22145R56774
32735E387567J23962j326454j518235k01724J035270J019173J68146n66569p81842
32726C339294n21178m9530J05461l69219r75245r02022q8934P51395J005722N64589
32716B860333k92774q83368n21396M24826N80136n14774j402315p62294M75348
32707c6278O18006k9073J19937R64415Q10303n27752j131946j01271R49974N33670
32697B169985m83002n68788J21205M97251M10021L48630J88217m02597r58911
32688A322011q11217j91103J99656K24630J20672j50008n85488p62117m70998
$$ y = [3919528, 5079149, 7033072, 7741831, 6660817, 5259590, 4906392, 5422707, 5877146, 5789880, 5256554, 4653801, 4469535, 4818012, 5073968, 4659523, 4108648, 4430793, 5387567, 5511529, 4185075, 2666840, 2465116, 3500386, 4519559, 4687705, 4121136, 3339294, 2818116, 2768586, 2874047, 2504828, 1529583, 627561, 538627, 1290022, 2295744, 2860333, 2567559, 1684191, 1162795, 1587621, 2167757, 1652983, 250668, -511626, -36278, 581728, 552655, 672592, 1637007, 2447310, 1919558, 787612, 686341, 1636315, 2169985, 1686983, 1118195, 1239400, 1736651, 2146672, 2495302, 2683519, 2280922, 1322011, 510794, 319691, 519347, 743977, 864649, 714641, 129153, -632964, -1103962]
32679a103962j36038p107K99110Q34724Q23574p6312r24679q10677j54606K01628
32669a054345K87113L97493J77588n17170p65322Q6464J045824Q52563R262j04945
32659D14525M55823M74560k07403m96091l8729K40726j43476m12188J04067Q16684
32649A208498O85140l77098j298656r68675L88898J164105L39129p90638k82791
32640F7912J215402J185302l85152m60393J734563K542572j8523j696558J612299
32631E797424N757216L165225n111207r448518n074538J505007K604888l30838
32623a135341j246085O22235J353830m4682p74389J02984N34708j19535j54322
32614h60597O96194O11342n80667p38815O43704J258741n8814j299568p12992
$$ y = [-1103962, -1240000, -1247107, -947997, -113273, 710301, 633989, -290690, -1101367, -1255973, -1054345, -767232, -369739, -192151, -709321, -1474643, -1388179, -342355, 510208, 519470, 414525, 870348, 1344908, 1137505, 641414, 602685, 843411, 699935, 287747, 391814, 1208498, 1893638, 1516540, 217884, -750791, -361893, 802212, 1141341, 350703, 67912, 1283314, 2468616, 2083464, 1623071, 3357634, 5900206, 5881683, 4185125, 5797424, 11554640, 14719865, 9608658, 160140, -4914398, -3409391, -804503, -1135341, -2381426, -1759191, -405361, -450043, -1224432, -1121448, -586740, -706275, -860597, -164403, 446939, -133728, -872543, -228839, 1029902, 971088, -328480, -1041472]
32605a041472M35021L03965n49563n62227J52076L98024K4826j99994n2855J40618
32595i51581L39399N85309N50066J09749k28457j38928m0550k54130l60684k7965
32585d17772K87483J27476j83767j83495l3511l2879j4917J81203K55636J7951
32575C408j88856j30047j10961k98434l05361M3824K57570L9300j24605J60892
32565f53270M63700L17341L8510M2559L4341l31801o23950l19290K29284L77154
32555d25422K39028K73938L07217n3189m25669j58343M18776L60315l36669o44652
32545d44670j12380M64585L07344k72142n08581k44689J11612K26888M0075l14164
32535g46122m66787p0093N97266O79766j83296j167614j173258k34972N71310
$$ y = [-1041472, -606451, -302486, -852049, -1414276, -1262200, -864176, -839350, -1039344, -1092199, -951581, -612182, -26873, 523193, 632942, 404485, 265557, 225007, -29123, -389807, -417772, -130289, -2813, -186580, -370075, -403586, -436465, -451382, -270179, -14543, 3408, -185448, -315495, -426456, -724890, -1030251, -986427, -728857, -689557, -814162, -653270, -189570, 127771, 166281, 208840, 243181, -88620, -712570, -1031860, -802576, -425422, -186394, 87544, 394761, 341572, -84097, -242440, 176336, 536651, 199982, -444670, -557050, -92465, 214879, -57263, -565844, -810533, -698921, -472033, -431958, -746122, -1212909, -1283002, -685736, -5970, -189266, -1356880, -2530138, -2765110, -2193800]
32526b193800O06809L85867N68824Q84365O53073o362k95870l527J82535j54848
32516F27066m75563k37550J63019R0650k31673j46420K76726L86553N6609k40249
32506B69168l55839n56327p17355l91325K28238L83736l146j36921L07453O31506
32496c40812L29748r4760p6291J31824J31797J12220K45429J50807l16428n07237
32486b33703p020N05431K98556j99997j92293J22697M2860l01627k61157P0935
32476a55318Q9190j06031P3776M40689K31121m45735n98726O0720O77039O22843
32466H89568K34554q5578m30468p12372m81016J48024L78628J5686j44842K58939
32456G1123M19906k03753p72156l87482L47956K99722l20956l93447J54446K52192
$$ y = [-2193800, -1586991, -1201124, -632300, 252065, 905138, 898776, 602906, 599379, 781914, 627066, 151503, -86047, 76972, 167622, -64051, -210471, 66255, 452808, 509417, 269168, -86671, -642998, -1360353, -1751678, -1523440, -1139704, -1142850, -1279771, -972318, -340812, -11064, -105824, -182115, -50291, 81506, 193726, 439155, 589962, 273534, -233703, -240723, 264708, 563264, 363267, 170974, 293671, 336531, 34904, -226253, -155318, -66128, -172159, -98383, 342306, 573427, 127692, -471034, -410314, 266725, 889568, 1124122, 1038544, 608076, -104296, -585312, -437288, -58660, -42974, -187816, 71123, 491029, 287276, -484880, -872362, -524406, -224684, -545640, -939087, -784641, -532449]
32446e32449m31385q64728k95815N84635P24891J63088k68476j55040K33576N58812
32436b82891P01418N87691K14840j93066l97936m63185n71602o20423l41313J87585
32426a178882M98658L08909j24285l60776k83659q0479J05515K67840L61010K88575
32416a97574Q6907r4525k41512m67190o58750m32318K89492R01359P53534P8972
32406A8395k32925J33103M79565J72077m03321m90951j42495l928j48865q405
32396f27750M81403N90842O902n15855l01148J75728J33262j88764k1684M85699
32386B18635M37710k62480o71905l14347J18727l0955m17991m54604k38764j17028
32376a733002j5782J62599J21760j95311k02373L69888P67074L34697k74334o5250
$$ y = [-532449, -963834, -1828562, -2124377, -1539742, -814851, -651763, -920239, -1075279, -841703, -282891, 418527, 1006218, 1221058, 1027992, 630056, 166871, -404731, -1025154, -1366467, -1178882, -680224, -371315, -495600, -856376, -1140035, -1220514, -1114999, -847159, -486149, -197574, -110667, -205192, -446704, -913894, -1572644, -2004962, -1715470, -814111, -60577, 18395, -214530, -81427, 398138, 570215, 166894, -324057, -466552, -470480, -619345, -627750, -146347, 444495, 451397, -64458, -365606, -189878, -56616, -245380, -267064, 218635, 656345, 393865, -278040, -592387, -473660, -504615, -922606, -1377210, -1615974, -1733002, -1748784, -1586185, -1464425, -1659736, -1862109, -1492221, -725147, -390450, -664784, -730034]
32366g30034O30910O67710m4421m75207k02676R8593J6594p504K61556L63888
32356E79409J06470m9926J8397k18675p88475q29601M017P78003O53475P0004
32346C23098k42152m52302q61581q82695o559R31878Q00856k123j64658L98804
32336a57434M99084k49259p85565l68468L31511M76400K98025L45239L61396j75626
32326E75303r09586r28014q1448P63618Q58022M07312Q0501O9832n68l36782n59809
32315f1619k65143K59587L32055j37247m86500k90524N8954R3219O479J26140
32305c64599J76626j97498n76111l06009L32712M52697k1693k70984q998Q3345
32295g00512l09601m45204J96903Q52818N66550l05738o51571k49412J38853J12376
$$ y = [-730034, -99124, 568586, 524165, 48958, -153718, -55125, -38531, -46035, 215521, 579409, 685879, 635953, 654350, 435675, -352800, -1182401, -1178384, -400381, 253094, 323098, 80946, -371356, -1232937, -2115632, -2122191, -1190313, -389457, -391580, -556238, -157434, 341650, 92391, -693174, -1061642, -730131, -253731, 44294, 389533, 750929, 575303, -334283, -1262297, -1343745, -580127, 277895, 685207, 765708, 835540, 834972, 498190, -61619, -326762, -67175, 264880, 127633, -358867, -649391, -590437, -497218, -490739, -364599, -187973, -385471, -961582, -1267591, -934879, -482182, -503875, -774859, -783857, -700512, -1010113, -1455317, -1258414, -405596, 160954, -144784, -796355, -1045767, -906914, -794538]
32285g94538M5054J38281N6291k45584k31635K42899M63595l9810n84776k99656
32275a249879M85094P12779K07917j80296k6368J06526j89748m41572k37214m6876
32265h59637l65972p15850l83028L22452N13277J39876m1560K04015L10686J1405
32255h64336k59641k49800k55825l50900j49367L03574L10888l14542p11563k19952
32245b761464N60619O67257J35230k64860j71639J95926O08597Q73485O48856
32236D92007j09790p75752p26278j58798K75594L42724K16459k2293k89588k66676
32226a022391J10916K93741q9474m63369j06659O03630O50751o6645n58442j87786
32216h35728N06072O45723J06308m63895m03679K54935P09387K36107p41333r59171
$$ y = [-794538, -749484, -611203, -554912, -800496, -1032131, -789232, -325637, -365447, -950223, -1249879, -764785, -52006, 155911, -24385, -50753, 55773, -133975, -575547, -812761, -859637, -1225609, -1941459, -2324487, -2002035, -1488758, -1348882, -1390442, -1186427, -875741, -864336, -1123977, -1373777, -1629602, -1980502, -2129869, -1826295, -1515407, -1829949, -2541512, -2761464, -2200845, -1533588, -1398358, -1663218, -1834857, -1638931, -1030334, -156849, 492007, 382217, -393535, -1119813, -1278611, -1003017, -660293, -443834, -466127, -755715, -1022391, -911475, -617734, -707208, -1170577, -1277236, -673606, -22855, -89500, -647942, -835728, -329656, 316067, 422375, -41520, -445199, -190264, 519123, 755230, 13897, -945274]
32206i45274l7021Q12275M55743m88846o18273J82678Q05188P18308M35309K63186
32196A583273j42013p90709j045176o11487K9750M32108O34927O55810L50648
32187A097131p3049k09106k09265n29565q89412n17053M27015Q16331K66753k72371
32177i2591j02330K03778K5465j55840K66270P77102N14388k86604o28490k07833
32167C13315L29174M03698O3044l70130o32120n57146j96283J58097K99675K97502
32157A08826K32681O7031r4632m0641Q7263j10358n19551m56514K63356Q30636
32147C68097N26581k35498n49119k72381q908j13760l43300l73893j63902J52661
32137a013422L73934L05341J710j78174J0356L58941M74511K33686j75504m78148
$$ y = [-945274, -982295, -170020, 285723, -203123, -821396, -638718, 166470, 884778, 1320087, 1583273, 1441260, 650551, -394625, -1006112, -976362, -544254, 90673, 746483, 1097131, 1024082, 814976, 605711, 76146, -813266, -1330319, -903304, -86973, 179780, -92591, -194921, 8857, 34322, -121518, 144752, 921854, 1436242, 1149638, 521148, 313315, 642489, 1046187, 1109231, 739101, 106981, -450165, -646448, -488351, -188676, 108826, 341507, 408538, 313906, 273265, 360528, 250170, -269381, -725895, -462539, 368097, 894678, 659180, 110061, -162320, -171228, -284988, -628288, -1002181, -1166083, -1013422, -639488, -334147, -332437, -510611, -500255, -141314, 333197, 566883, 391379, -86769]
32127h6769m59968j13800K42405K20154j61226m64757l73108k4877K17149J40140
32117h64657j50735k89097k8934K98515R1443n21347o11973J13980O01554L7707
32107a323544o42667j43803R27108Q65740l39136r21928j76945N73643L54824
32098h26708k5458K30714M44404p1007n87401k93568K30456J79752O300L71684
32088c40832O84608J54883n95259m96911J25418K04291j88449j50752L12986L88016
32078I7999P39j47780P1982J27452n8853p3546O3369J7048n0620J70268L13101
32067E31159n1528l91950n516N99123M37609k28977l60452n35r0634o04049n38235
32056g03985K10125O13037L19102J04192K75704K00786k45349l21362P8709J16508
$$ y = [-86769, -546737, -660537, -418132, -197978, -359204, -823961, -1197069, -1221946, -1004797, -864657, -1015392, -1304489, -1333423, -1034908, -943465, -1464812, -2076785, -1962805, -1361251, -1323544, -1966211, -2110014, -1182906, -317166, -656302, -1578230, -1755175, -1181532, -826708, -852166, -621452, -177048, -248055, -835456, -1129024, -898568, -718816, -712516, -340832, 343776, 498659, -96600, -593511, -468093, -263802, -452251, -603003, -290017, 97999, 98738, -49042, 22940, 150392, 91539, 17993, 81362, 98410, 47790, 218058, 531159, 479631, 87681, 82165, 681288, 1118897, 889920, 529468, 528933, 438299, -165750, -703985, -493860, 119177, 438279, 542471, 818175, 1018961, 773612, 452250, 530959, 647467]
32046F47467l12409j86968P01862J017790k0385j243017j283226m94380j4928
32037a188194J4535J50950M22792N02943M44697L40087q4246p34853p96974L8107
32027h90156P87671N25268k64961o09841m98997l79991n1443O97522J080389L59459
32017G54920o46528n96799K09404L03417m93888q11027j02976M42421k1210n59388
32007a521654o3075Q94117R88770J65834m85422m44637j90143o8751J62981N28115
31997c3865N12669o1262n69689m77273j35608j28455k66335M4879O63691P66234
31987C14986J07551n34962m67395J3284K30376J03744n962j0910o8363j09128
31977d26779N1854L09706M28897L98063K34741k08164p68457p92317r8774L89192
$$ y = [647467, 335058, 148090, 849952, 1867742, 1847357, 604340, -678886, -1173266, -1188194, -1173659, -1022709, -599917, -96974, 347723, 687810, 603564, -131289, -928263, -890156, -102485, 422783, 157822, -452019, -951016, -1331007, -1382450, -684928, 395461, 754920, 108392, -488407, -279003, 24414, -469474, -1280501, -1383477, -941056, -962266, -1521654, -1584729, -690612, 298158, 463992, -21430, -466067, -656210, -724961, -561980, -33865, 478804, 417542, -152147, -629420, -765028, -893483, -1159818, -1114939, -451248, 314986, 422537, -112425, -579820, -566536, -336160, -232416, -238378, -249288, -317651, -426779, -374925, -65219, 363678, 761741, 996482, 788318, 19861, -772456, -871230, -482038]
31967d82038j10595q25034m36978P67006J173767L08058m91895k61036K10097
31958a48648o3759o20590n15853N9018K75610R4799O4094J72650m605l21020k19649
31947a227953K71175N59056M04484R8420j39541k80739j89722J39838K72233p2782
31937a65531l73566j9566N87408N39028j23130m41453m9171L57644K44515k7948
31927E28230n0516p1187l50047n33176k63379J33472J65473m9546r7143L836k4040
31916f08023q6263J12989M09011K98532k67044p29321o47969j61712L48163O43935
31906f87702N78742J02017m54340m84778J53743P80839O43949j30379p09661n89864
31896g97434q0725K26717J17495j79139k91671l0486L58789L32444k49553p17904
$$ y = [-482038, -592633, -1417667, -1854645, -1087639, 86128, 394186, -97709, -358745, -148648, -212407, -832997, -1348850, -1289832, -1014222, -919423, -855329, -682679, -687284, -1008304, -1227953, -956778, -397722, 6762, 105182, -34359, -315098, -504820, -364982, -92749, -165531, -539097, -558663, 28745, 567773, 444643, 3190, -45981, 311663, 556178, 528230, 477714, 406527, 56480, -476696, -740075, -606603, -441130, -490676, -587819, -583983, -608023, -694286, -581297, -172286, 126246, -140798, -870119, -1518088, -1679800, -1331637, -687702, -108960, -6943, -461283, -946061, -792318, -11479, 632470, 502091, -207570, -797434, -878159, -651442, -533947, -713086, -1004757, -1035243, -676454, -344010, -593563, -1311467]
31886a311467m15413J98674N4973q22862j103693r3174J094126J120411L32098
31877i46327k2150J75696N1941m11513k48812O29023R75383J57668p50300o20574
31867a009965P7199K49505o3175l9723L66188M20113m3698l50611j30419J52857
31857c71729L8448k44420k37535N7508K66143J61749j35039l53454l30036j14577
31847a262942J29323L11649M45623N14751M53696K70444L7281k12435l98947l19217
31837c0774M4444K75747K9467l21321j37041M10199M48976k45484q15019n85233
31827i26039j2664J46961n2247r5645P7058J77396J76009J79317O3487j91475
31817d57842j89900K70662O87098N61813J87411N3114l3770m12603o43403j45604
$$ y = [-1311467, -1726880, -1528206, -1473233, -2296095, -3399788, -3492962, -2398836, -1278425, -946327, -968477, -792781, -740840, -1152353, -1401165, -772142, 203241, 360909, -389391, -1009965, -932766, -683261, -746436, -786159, -419971, 142, -43556, -394167, -524586, -371729, -333281, -577701, -815236, -757728, -491585, -329836, -464875, -818329, -1148365, -1262942, -1133619, -821970, -376347, 138404, 592100, 862544, 899825, 687390, 288443, -30774, 13670, 289417, 318884, -2437, -139478, 270721, 719697, 474213, -340806, -926039, -938703, -791742, -843989, -939634, -862576, -685180, -509171, -329854, -266367, -457842, -647742, -377080, 310018, 871831, 1059242, 1112356, 1078586, 665983, 22580, -123024]
31807a23024N69875M71548l09591n83588J4255M68939O9895m96045l53665J90641
31797h0760K76617j54617m52169l31907j19899q0774j02682k2380J61350L92003
31787e15218N65833M67750k2865o35482q36564l68662M02885P88854M77987j36697
31777A87821m70692m70226m85258m99203j15339N03699M89510l67748q96488j33081
31767b257005R91305Q30526m50286j058393l42032K84598k63957j018405o75075
31758c958724K48173L76484k62482m90292n4079J04041l77548o71121k46345K16505
31748e115388o1540p95322j161301q84849l02050K04253M06099K46529O886J29941
31738g326742O13640R35350P89423M62071K40174j2878l32529k83165L32282Q69639
$$ y = [-123024, 446851, 918399, 608808, 25220, 39475, 508414, 578309, 82264, -271401, -80760, 195857, 41240, -410929, -742836, -862735, -943509, -1046191, -1068571, -907221, -515218, 50615, 518365, 495500, -139982, -976546, -1345208, -942323, -153469, 324518, 187821, -282871, -753097, -1238355, -1737558, -1852897, -1349198, -859688, -1227436, -2123924, -2257005, -1265700, -435174, -885460, -1943853, -2285885, -2001287, -2265244, -3283649, -3958724, -3710551, -3334067, -3596549, -4086841, -4140920, -4036879, -4414427, -5085548, -5331893, -5115388, -5176928, -5972250, -7133551, -8018400, -8320450, -8116197, -7710098, -7463569, -7456683, -7326742, -6713102, -5777752, -4988329, -4526258, -4286084, -4298962, -4631491, -4914656, -4582374, -3712735]
31728c712735O35451l8005k33120K34928O82803O45966L31261l1598m85161q18544
31718b788754n43301K47123O89434L00984k63140j61244M13391O24382K79680
31709a201445K256K08613N63903N44531Q7662m40938o41852l98910N387J50775
31699a120018N990j7633K49793L56875n5973n23759l51824K82766N44567J87957
31689d41259j59522m5343K18767K45745J65461J69919N4377l27832n94861l18580
31679a033128K98979O69956N62250K32746m2304k34745m16019n92263o98088o43838
31669a896454l87618J3053M58769Q46275R76170O30883l9045m55336k84919O9132
31659f9090P4873j15947l5996J99669J17838j84580k18752j06659l90522q25861
$$ y = [-3712735, -3077284, -3115289, -3348409, -3113481, -2430678, -1784712, -1453451, -1485049, -1970210, -2788754, -3332055, -3084932, -2395498, -2094514, -2357654, -2518898, -2105507, -1481125, -1201445, -1199189, -990576, -426673, 117858, 205520, -235418, -877270, -1276180, -1270793, -1120018, -1114028, -1131661, -881868, -524993, -580966, -1104725, -1456549, -1173783, -629216, -441259, -600781, -646124, -427357, -181612, -16151, 153768, 208145, -119687, -714548, -1033128, -734149, -64193, 498057, 730803, 688499, 453754, 37735, -554528, -1252616, -1896454, -2284072, -2271019, -1812250, -965975, 10195, 641078, 602033, 146697, -138222, -69090, 5783, -110164, -146160, 53509, 171347, -13233, -231985, -338644, -729166, -1555027]
31649a555027n31715M28467Q57364K70313l13227q3602L00923P6569j99723K17026
31639e32632P14225L39174l84086k25293O09657P31422j58512q16843m65987J52990
31629c5885J49480k58661l95280j49851J72093L69682L16865n2389m60650m85257
31619h29853j87331k1692o6737L5516L13428L39243M792k55847j83975P395J81496
31608f63565M32898N60714J48697o02861q85464m24767J04969J37733l6830J6564
31598a211912J24910k3720k31560j49404J34706K99531K30541k7654l44884l51638
31588a551084K24148Q84471P53235p5387m40369J66697P18295K21179p03502q10162
$$ y = [-1555027, -2086742, -1658275, -800911, -530598, -843825, -927427, -626504, -549935, -749658, -532632, 181593, 520767, 136681, -88612, 521045, 1252467, 1093955, 277112, -188875, -35885, 113595, -145066, -540346, -690197, -518104, -148422, 168443, 116054, -344596, -829853, -1017184, -1038876, -1105613, -1070097, -756669, -417426, -412634, -668481, -852456, -845061, -663565, -230667, 330047, 478744, -124117, -1009581, -1434348, -1329379, -1191646, -1228476, -1211912, -1087002, -1110722, -1342282, -1491686, -1356980, -1057449, -826908, -854562, -1199446, -1551084, -1326936, -442465, 310770, 235383, -204986, -38289, 680006, 901185, 197683, -612479]
$$ [...]
##END NTUPLES=NMR SPECTRUM
##END=
