##TITLE=31Pdec_LR-762-4-B-C1
 H2O, 24 sc
 13.4.2023
##JCAMPDX= 6.0         $$ Bruker NMR JCAMP-DX V2.0
##DATA TYPE= NMR SPECTRUM
##DATA CLASS= NTUPLES
##ORIGIN= UXNMR, Bruker Analytische Messtechnik GmbH
##OWNER= root
$$ XWIN-NMR		Version 3.5
$$ Thu Apr 13 13:54:11 2023 Russian Standard Time (UT+4h)  she@DPX200
##.OBSERVE FREQUENCY= 81.013821
##.OBSERVE NUCLEUS= ^31P
##.ACQUISITION MODE= SIMULTANEOUS
##.ACQUISITION SCHEME= undefined
##.AVERAGES= 24
##.DIGITISER RES= 16
##SPECTROMETER/DATA SYSTEM= spect
##.PULSE SEQUENCE= zgpg30
##.SOLVENT NAME= DMSO
##.SHIFT REFERENCE= (INTERNAL, DMSO, 0, 248.564)
##AUDIT TRAIL= $$ (NUMBER, WHEN, WHO, WHERE, WHAT)
$$ ##TITLE= Audit trail, XWIN-NMR		Version 3.5
$$ ##JCAMPDX= 5.01
$$ ##ORIGIN= Bruker BioSpin GmbH
$$ ##OWNER= she
$$ F:/spectra/data/she/nmr/P31/1/pdata/1/auditp.txt
$$ ##AUDIT TRAIL=  $$ (NUMBER, WHEN, WHO, WHERE, WHAT)
(   1,<2023-04-13 13:52:53.84 +0400>,<she>,<DPX200>,
      <created by zg, POWCHK disabled, PULCHK disabled
       configuration hash MD5:
       00 E9 B6 7A A2 85 ED C7 34 08 36 98 17 FE 4E 26
       data hash MD5: 32K
       7B F3 66 55 9A 81 45 6A 38 2D 57 3D E9 4B 2C 02>)
(   2,<2023-04-13 13:53:07.32 +0400>,<she>,<DPX200>,
      <Start of raw data processing
       efp BC_mod = 2 LB = 1 FT_mod = 6 PKNL = 1 PHC0 = -11351.03 PHC1 = 814.2854 SI = 64K 
       data hash MD5: 64K
       D4 C1 C5 E3 BF 6C C4 56 3C 73 56 AB C5 2D CA 3A>)
(   3,<2023-04-13 13:53:29.56 +0400>,<she>,<DPX200>,
      <pk PHC0 = 341.8694 PHC1 = -715.2 
       data hash MD5: 64K
       22 9F 6D A8 5E 2F 86 43 59 08 DF 4D 00 30 60 C9>)
$$ ##END=
$$ 
$$ hash MD5
$$ 74 FC 4A 02 7A 6A E3 42 D2 A2 6E CC 54 63 69 41
##$RELAX= 
##$RELAX= 
##$RELAX= 
##$RELAX= 
##$RELAX= 
##$RELAX= 
##$RELAX= 
##$RELAX= 
##$RELAX= 
$$ Bruker specific parameters
$$ --------------------------
##$DU= <F:/spectra>
##$EXPNO= 1
##$NAME= <P31>
##$PROCNO= 1
##$TYPE= <nmr>
##$USER= <she>
##$AMP= (0..31)
100 100 100 100 100 100 100 100 100 100 100 100 100 100 100 100 100 100 
100 100 100 100 100 100 100 100 100 100 100 100 100 100 
##$AQSEQ= 0
##$AQ_mod= 1
##$AUNM= <au_zg>
##$AUTOPOS= <>
##$BF1= 81.014009
##$BF2= 200.13
##$BF3= 200.13
##$BF4= 200.13
##$BF5= 200.13
##$BF6= 200.13
##$BF7= 200.13
##$BF8= 200.13
##$BYTORDA= 1
##$CFDGTYP= 0
##$CFRGTYP= 5
##$CHEMSTR= <none>
##$CNST= (0..31)
1 1 145 1 1 1 1 1 1 1 1 1 1 1 1 1 1 1 1 1 1 1 1 1 1 1 1 1 1 1 1 1 
##$CPDPRG= <waltz16>
##$CPDPRG1= <>
##$CPDPRG2= <waltz16>
##$CPDPRG3= <>
##$CPDPRG4= <mlev>
##$CPDPRG5= <mlev>
##$CPDPRG6= <mlev>
##$CPDPRG7= <mlev>
##$CPDPRG8= <mlev>
##$CPDPRGB= <>
##$CPDPRGT= <>
##$D= (0..31)
0 1 0 0 0 0 0 0 0 0 0 0.03 2e-05 3e-06 0 0 0 0 0 0 0 0 0 0 0 0 0 0 0 0 
0 0 
##$DATE= 1681379573
##$DBL= (0..7)
120 120 120 11 120 120 24 19 
##$DBP= (0..7)
150 150 150 150 150 150 150 150 
##$DBP07= 0
##$DBPNAM0= <>
##$DBPNAM1= <>
##$DBPNAM2= <>
##$DBPNAM3= <>
##$DBPNAM4= <>
##$DBPNAM5= <>
##$DBPNAM6= <>
##$DBPNAM7= <>
##$DBPOAL= (0..7)
0.5 0.5 0.5 0.5 0.5 0.5 0.5 0.5 
##$DBPOFFS= (0..7)
$$ [...]
##$SUBNAM2= <"">
##$SUBNAM3= <"">
##$SUBNAM4= <"">
##$SUBNAM5= <"">
##$SUBNAM6= <"">
##$SUBNAM7= <"">
##$SUBNAM8= <"">
##$SUBNAM9= <"">
##$SW= 501.771253377433
##$SWIBOX= (0..15)
0 1 3 0 0 0 0 0 0 0 0 0 0 0 0 0 
##$SW_h= 40650.406504065
##$TD= 32768
##$TD0= 1
##$TE= 0
##$TE2= 300
##$TE3= 300
##$TEG= 300
##$TL= (0..7)
0 120 53 12 22 120 120 120 
##$TP= (0..7)
150 150 150 150 150 150 150 150 
##$TP07= 0
##$TPNAME0= <>
##$TPNAME1= <>
##$TPNAME2= <>
##$TPNAME3= <>
##$TPNAME4= <>
##$TPNAME5= <>
##$TPNAME6= <>
##$TPNAME7= <>
##$TPOAL= (0..7)
0.5 0.5 0.5 0.5 0.5 0.5 0.5 0.5 
##$TPOFFS= (0..7)
0 0 0 0 0 0 0 0 
##$TUNHIN= 0
##$TUNHOUT= 0
##$TUNXOUT= 0
##$USERA1= <user>
##$USERA2= <user>
##$USERA3= <user>
##$USERA4= <user>
##$USERA5= <user>
##$V9= 5
##$VALIST= <valist>
##$VCLIST= <CCCCCCCCCCCCCCC>
##$VD= 0
##$VDLIST= <DDDDDDDDDDDDDDD>
##$VPLIST= <PPPPPPPPPPPPPPP>
##$VTLIST= <TTTTTTTTTTTTTTT>
##$WBST= 1024
##$WBSW= 4
##$XGAIN= (0..3)
0 0 0 0 
##$XL= 0
##$YL= 0
##$YMAX_a= 48742
##$YMIN_a= -44550
##$ZGOPTNS= <>
##$ZL1= 120
##$ZL2= 120
##$ZL3= 120
##$ZL4= 120
##$ABSF1= 0
##$ABSF2= 0
##$ABSG= 0
##$ABSL= 0
##$ALPHA= 0
##$AQORDER= 0
##$ASSFAC= 0
##$ASSFACI= 0
##$ASSFACX= 0
##$ASSWID= 0
##$AUNMP= <proc_1d>
##$AZFE= 0.1
##$AZFW= 0.5
##$BCFW= 0
##$BC_mod= 2
##$BYTORDP= 0
##$COROFFS= 0
##$CY= -3
##$DATMOD= 1
##$DC= 0
##$DFILT= <>
##$DTYPP= 0
##$F1P= 0
##$F2P= 0
##$FCOR= 1
##$FTSIZE= 65536
##$FT_mod= 6
##$GAMMA= 0
##$GB= 0
##$INTBC= 1
##$INTSCL= 6.047779e-11
##$ISEN= 30
##$LB= 1
##$LEV0= 0
##$LPBIN= 0
##$MAXI= 10000
##$MC2= 0
##$MEAN= 0
##$ME_mod= 0
##$MI= 50
##$NCOEF= 0
##$NC_proc= -3
##$NLEV= 6
##$NOISF1= 182.463
##$NOISF2= 159.3651
##$NSP= 0
##$NTH_PI= 0
##$NZP= 0
##$OFFSET= 248.5645
##$PC= 4
##$PHC0= -11009.16
##$PHC1= 99.08539
##$PH_mod= 1
##$PKNL= yes
##$PPARMOD= 0
##$PSCAL= 0
##$PSIGN= 0
##$REVERSE= no
##$SF= 81.0140089999694
##$SI= 65536
##$SIGF1= 159.3651
##$SIGF2= -187.1042
##$SINO= 113.3802
##$SIOLD= 16384
##$SREGLST= <1H.CDCl3>
##$SSB= 0
##$STSI= 65536
##$STSR= 0
##$SW_p= 40650.406504065
##$SYMM= 0
##$S_DEV= 0
##$TDeff= 32768
##$TDoff= 0
##$TI= <>
##$TILT= no
##$TM1= 0
##$TM2= 0
##$TOPLEV= 0
##$USERP1= <user>
##$USERP2= <user>
##$USERP3= <user>
##$USERP4= <user>
##$USERP5= <user>
##$WDW= 1
##$XDIM= 65536
##$YMAX_p= 418907316
##$YMIN_p= -7763940
$$ End of Bruker specific parameters
$$ ---------------------------------
##NTUPLES= NMR SPECTRUM
##VAR_NAME=  FREQUENCY,     SPECTRUM/REAL,   SPECTRUM/IMAG
##SYMBOL=    X,             R,               I
##VAR_TYPE=  INDEPENDENT,   DEPENDENT,       DEPENDENT
##VAR_FORM=  AFFN,          ASDF,            ASDF
##VAR_DIM=   65536,         65536,           65536
##UNITS=     HZ,            ARBITRARY UNITS, ARBITRARY UNITS
##FACTOR=    0.620285442955139, 1,           1
##FIRST=     20137.2065510682, 0,            0
##LAST=      -20513.1999529968, 0,           0
##MIN=       -20513.1999529968, -7763940,    0
##MAX=       20137.2065510682, 418907316,    0
$$ Real data points
##PAGE= N=1
##DATA TABLE= (X++(R..R)), XYDATA
$$ [...]
37537A8310213p01329k78059L9305O90175J299153J092545J2213j269772k195745
$$ 18310213 17608884 17330825 17370130 18060305 19359458 20452003 20464216 19194444 16998699
37528A6998699k610564k482985j933508j380057j157222j100379q80243n61157
$$ 16998699 14388135 11905150 9971642 8591585 7434363 6333984 5453741 4892584
37520D892584m30867m63094l86179j76572p5631j63797k67185k67157k14772j56821
$$ 4892584 4461717 3998623 3612444 3435872 3360241 3196444 2929259 2662102 2447330 2290509
37510B290509q9375n6833r6512j32518r3568n0872p5811q4413q094K6659q8490
$$ 2290509 2201134 2144301 2047789 1915271 1821703 1770831 1695020 1610607 1602513 1629172 1540682
37499A540682j93660q4753J26364J58516p311j29017r3100k0165P242M4941R2904
$$ 1540682 1347022 1262269 1388633 1547149 1539838 1410821 1317721 1297556 1304798 1349739 1442643
37488A442643O0480k3697k122J42315K19919J23118m299J2276J39709K21468J83254
$$ 1442643 1503123 1479426 1477304 1619619 1839538 1962656 1958357 1970633 2110342 2331810 2515064
37477B515064O3217p0275j53167j48537r0905n3941n5033n6909n7027q0815r4122
$$ 2515064 2578281 2508006 2354839 2206302 2115397 2061456 2006423 1949514 1892487 1811672 1717550
37466A717550m1416K4439j4782j46743k16605j54815p6096q5926j23731q9654
$$ 1717550 1676134 1700573 1685791 1539048 1322443 1167628 1091532 1005606 881875 792221
37456G92221j2615J4827j4629m0706l9455k3678M252K7417K325o2603q6326l9923
$$ 792221 779606 794433 779804 739098 699643 675965 680217 707634 709959 647356 561030 521107
37444E21107q588m8108p3137J128R1683O1802n7653j15185p4182l9047n1190l0027
$$ 521107 512519 464411 391274 392402 484085 545887 488234 373049 298867 259820 208630 178603
37432A78603M6317O4956l5537j32891q5890N3133J08901K5821p1375o0595K4033
$$ 178603 224920 289876 254339 121448 35558 88691 197592 223413 152038 91443 115476
37421A15476N9758Q394l5087K4273J40326J70479O1828p3949j09647o2123l5063
$$ 115476 175234 183628 148541 172814 313140 483619 545447 471498 361851 299728 264665
37410B64665n7233p1873n2907k6630L980M8691O1154L585l4402O6768K36279K68570
$$ 264665 207432 135559 82652 56022 60002 108693 169847 173432 139030 205798 442077 710647
37398G10647J33686L0183N5046M8935r0837j77976m3490J22977L9374j89263k10800
$$ 710647 844333 874516 929562 978497 887660 709684 666194 789171 828545 639282 428482
37387D28482l813P0522j36817k94162j05384K15110K60081J6407j73693j30414
$$ 428482 424669 495191 358374 64212 -41172 173938 434019 450426 276733 146319
37377A46319p327L4717L8058P0662O9271k3961j23499j21076m3969J1711K5036
$$ 146319 138992 173709 211767 282429 351700 327739 204240 83164 39195 50906 75942
37366G5942K5575m937q6650j39095n8086J04060J64530N6575o6195m7821M7148
$$ 75942 101517 96580 9930 -129165 -187251 -83191 81339 137914 71719 23898 71046
37355G1046M6950n3867q7295K3231J45283J38767M3339k3195m5157p2764q6994
$$ 71046 117996 64129 -23166 65 145348 284115 327454 304259 259102 186338 99344
37344I9344l5765L9900M9441l82k7767k3760m0417m4704N1767J95947J99819R072
$$ 99344 63579 103479 152920 152538 124771 101011 60594 15890 67657 263604 463423 472495
37332D72495j89215k14564j09050p778O1824J18011R5226m4782j59882q1480J18124
$$ 472495 283280 68716 -40334 -48112 13712 131723 226949 182167 22285 -59195 58929
37321E8929K02643J06443K252J2065M2827j5871r7772q2616J476K9940k4921o9479
$$ 58929 261572 368015 370267 382332 425159 409288 311516 228900 230376 260316 235395 165916
37309A65916l2818N4751J19223J16765N8605M175J0942N9461O3374j1009q4527
$$ 165916 133098 187849 307072 423837 482442 486617 497559 557020 620394 609385 524858
37298E24858p4549j0339K9343M0933O5586P3431l585j28442j71202r2942p589
$$ 524858 450309 439970 469313 510246 575832 649263 645678 517236 346034 253092 245503
37287B45503j1830n3160l5446K9374O0677L9228R610n944j3592o00L8944O0048
$$ 245503 233673 180513 145067 174441 235118 274346 283956 278012 264420 263820 302764 362812
37275C62812K7004j0415J4875O7475N1308m0608j12212r9353l1290M0950Q8977
$$ 362812 389816 379401 394276 461751 513059 472451 360239 260886 229596 270546 359523
37264C59523Q1872J0997n7667n0233j589k658m0414j7846O4500R4987M2880Q562
$$ 359523 441395 452392 394725 344492 342903 340245 299831 281985 346485 441472 484352 492914
37252D92914L9466N5242J4023j0370J3471J0854k6389M781R2854O2481j06782
$$ 492914 532380 587622 601645 591275 604746 615600 589211 593992 686846 749327 642545
37241F42545j53254O5637K75990J70430j04094j75338k3158M7962n7292j17911
$$ 642545 489291 554928 830918 1001348 897254 721916 698758 746720 689428 571517
37231E71517l3693J8301n4512r3400r040M2869m0600j12769m9517K4588l5094
$$ 571517 537824 556125 501613 408213 399173 442042 401442 288673 239156 263744 228650
37220B28650j46518j63942j08209o5807k3794L9308O0356K9786M6428J01731K4994
$$ 228650 82132 -81810 -190019 -255826 -279620 -240312 -179956 -150170 -103742 -2011 22983
37209B2983j91661k59518j5654K53376K03260m5970j19183K4942R5222q298o8268
$$ 22983 -168678 -428196 -443850 -190474 12786 -33184 -152367 -127425 -32203 -40501 -108769
37198a08769K8155J09343N5519j387N0416R6138K0428p5251n3920K6564L8310
$$ -108769 -80614 28729 84248 82861 133277 229415 249843 174592 120672 147236 185546
37187A85546R785N4352J59130K05141J48312M8280m5186j14547j11061Q219J73119
$$ 185546 195331 249683 408813 613954 762266 810546 765360 650813 539752 547971 721090
37176G21090K32077J26215l2587r4478m0471K0298l272q9165j56473j68247j46751
$$ 721090 953167 1079382 1046795 952317 911846 932144 928872 839707 683234 514987 368236
37165C68236j13873o5237O39O8246J16703J10140K686j81794l01604k32045n1738
$$ 368236 254363 189126 189765 258011 374714 484854 487540 305746 4142 -227903 -279641
37154b79641K0879r4421k44357k72850k20750k15035k73131l24012l41783l55853
$$ -279641 -258762 -353183 -597540 -870390 -1091140 -1306175 -1579306 -1903318 -2245101 -2600954
37144b600954l89809m66755n96347o78990n22207o1783N05411R02679J015620
$$ -2600954 -2990763 -3457518 -4053865 -4732855 -5255062 -5316845 -4811434 -3908755 -2893135
37135b893135Q88657O07843K99216J17622R1061P1632l2694r9767j0419J22972
$$ -2893135 -2004478 -1396635 -1097419 -979797 -888736 -817104 -849798 -949565 -959984 -837012
37125h37012J37481R2910J35365K07066J55889M2531M6180J20581N8110j17455
$$ -837012 -699531 -606621 -471256 -264190 -108301 -65770 -19590 100991 159101 41646
37115D1646j47663L4920J90342J52128L1249m7690j21283j84019j02868J07757
$$ 41646 -106017 -71097 119245 271373 302622 254932 133649 -50370 -153238 -45481
37105d5481J95913M6450r5930Q970K21537K50309Q6880l7526j4062O5138J22447
$$ -45481 150432 196882 100952 109922 331459 581768 668648 631122 617060 682198 804645
37094H04645J82949K82110M28470O00741O74970M70466Q634l97279m73156k87613
$$ 804645 987594 1269704 1698174 2298915 2973885 3444351 3452985 3055706 2582550 2294937
37084B294937o7347J29346L27599L77787J02458l44253n74427m51418k17806j06225
$$ 2294937 2227590 2356936 2684535 3062322 3164780 2820527 2246100 1794682 1576876 1470651
37074A470651q6143o6983q7070j61795j58245K272J62224J23322o8087j87756
$$ 1470651 1384508 1317525 1230455 1068660 910415 912687 1074911 1198233 1130146 942390
37064I42390j30921r298K2583o5074j71891j66328j7544J30864Q3042j53338l15385
$$ 942390 811469 802171 824754 759680 587789 421461 403917 534781 617823 464485 149100
37053A49100j89451R8089K26398Q7131j01807j07201L8806J38210R5377j7500
$$ 149100 -40351 57738 284136 371267 269460 162259 201065 339275 434652 417152
37043D17152r9378j16959q5061m0929l3191o5622o3846K7696J34424J34462M5671
$$ 417152 317774 200815 115754 74825 41634 -23988 -87834 -60138 74286 208748 254419
37032B54419Q601O2877Q0483j6891j15662r0932m603J6716k92M9491J26372R1956
$$ 254419 263020 325897 406380 389489 273827 182895 178292 195008 194716 244207 370579 462535
37020D62535m4406j17805o0058J7390K4061N692J3635K0413K1899O7094J23307
$$ 462535 418129 300324 240266 257656 281717 287409 301044 321457 343356 410450 533757
37009E33757P5710n8620q8780O4797K08797J50147j0374l6498R4112J93149J61063
$$ 533757 609467 550847 462067 526864 735661 885808 875434 838936 933048 1126197 1287260
36998A287260R9413J34902K78571M57316N61201M67072J39521k77473n62714o19229
$$ 1287260 1386673 1521575 1800146 2257462 2818663 3285735 3425256 3147783 2585069 1965840
36988A965840n10911l34673j51710j7983K8893J6949n559m6247j18625j53045
$$ 1965840 1454929 1120256 968546 950563 979456 996405 990846 944599 825974 672929
36978F72929p0895O7960J13543K9161o7661q6055o9212q0904r0211l9143M3709
$$ 672929 602034 669994 783537 812698 745037 658982 589770 508866 418655 379512 423221
36967D23221P3084K3272m0134l9887K8955R5912Q9550J3639o1067q0054n2400
$$ 423221 496305 519577 479443 439556 468511 564423 653973 667612 606545 526491 474091
36956D74091j0806L0372N6879M3693m992m7521o3146o9504o3147j4910M7834M8708
$$ 474091 463285 493657 550536 594229 589237 541716 478570 409066 345919 331009 378843 427551
36944D27551P25K8016J70382K76721K03900K5181q8034j06322j18932j46023j41416
$$ 427551 428276 456292 626674 903395 1107295 1132476 1044442 938120 819188 673165 531749
36933E31749j31281j72657k02369j09811M7361Q7039j9099r1434q657J36397K01302
$$ 531749 400468 227811 25442 -84369 -37008 50031 30932 -60502 -69159 67238 268540
36922B68540J64470P3856l0329p8528kJ35968J41338m0035k22620k13706n3185
$$ 268540 433010 506866 476537 398009 398007 533975 675313 635278 412658 198952 145767
36911A45767P2895O3163m3304j51115j60991k6562J54292J94275N1456q6100m9403
$$ 145767 218662 281825 238521 87406 -73585 -100147 54145 248420 299876 213776 164373
36900A64373Q0791J18275N0859J3576M0973K7371o6956j32959p8285M3432J18982
$$ 164373 245164 363439 414298 427874 468847 496218 429262 296303 218018 261450 380432
36889C80432J04751K6563p3672j40526j12389J1905J35206J39872J1504j32764
$$ 380432 485183 511746 438074 297548 185159 197064 332270 472142 483646 350882
36879C50882j51316j7317J52312K12507J24815l1611j52090j72873q2163O1734
$$ 350882 199566 182249 334561 547068 671883 640272 488182 315309 233146 294880
36869B94880J36865O8600o0363r7697k5514K6848j1121o1694n8155m8190n8591
$$ 294880 431745 500345 439982 342285 316771 343619 332498 270804 212649 164459 105868
36858A05868o523J30579J95476O9565r7704p9863P3431J01189o2660j80829o7872
$$ 105868 99345 229924 425400 494965 397261 317398 390829 492018 429358 248529 180657
36847A80657J45150K06854O7388j08758j62793p6860N5293J20311Q1339J6315
$$ 180657 325807 532661 600049 491291 328498 251638 306931 427242 508581 524896
36837E24896K2644Q4773J05219N7142N013k4254o2288p6681J7795J75877K14500
$$ 524896 547540 632313 737532 794674 799687 775433 713145 636464 654259 830136 1044636
36826A044636P7310n3525l1353K5105n6808j94954j72745M495J09223M2671l5057
$$ 1044636 1121946 1068421 1037068 1062173 1005365 810411 637666 642161 751384 794055 758998
36815G58998K3243J36700J45471M2978m5784m3580O344J2189o7629j76478k07682
$$ 758998 782241 918941 1064412 1107390 1061606 1018026 1024370 1036559 968930 792452 584770
36804E84770j35664p0487j15437k10793k22865j54935j29373j65890j42387j4726
$$ 584770 449106 378619 263182 52389 -170476 -325411 -454784 -620674 -763061 -777787
36794g77787Q7472O2718l887J6653J05773J51522J10877K8145l8194l9983K8730
$$ -777787 -690315 -627597 -631484 -614831 -509058 -357536 -246659 -218514 -256708 -296691 -267961
36783b67961P2926k1014j86733k03165p567J72785J30864l1248q8999k8613R220
$$ -267961 -195035 -216049 -402782 -605947 -613514 -440729 -309865 -341113 -430112 -458725 -449505
36772d49505K305L0511O4240J2129o4610k6138Q4178R4651P571q523O8985Q6353
$$ -449505 -447200 -416689 -352449 -340320 -404930 -431068 -346890 -252239 -244668 -253191 -184206 -97853
36760i7853K4195M5018J60216J54350l5320j60962n7618Q3179M8112m4255J3817
$$ -97853 -73658 -28640 131576 285926 250606 89644 32026 115205 163317 119062 132879
36749A32879J38292J17198k675j3107P3054O1023n2148o1709P9947J78101J26757
$$ 132879 271171 388369 385694 372587 445641 506664 454516 392807 472754 650855 777612
36738G77612O4350J18660K18271K53656K43953K54324L05592M36774O86002R19855
$$ 777612 841962 960622 1178893 1432549 1676502 1930826 2236418 2673192 3359194 4279049
36728D279049Q57004M01550j66785m74895m53926l41651l54230m75955n51043
$$ 4279049 5136053 5537603 5370818 4895923 4441997 4100346 3746116 3270161 2719118
36719B719118m84836l33536k26799k13144k06987j23797j9180n62l6135P800J35706
$$ 2719118 2234282 1900746 1673947 1460803 1253816 1130019 1110839 1110277 1074142 1081942 1217648
36708A217648J93745J23210P4812J64834K63508J78301n1132k12865k26243k08726
$$ 1217648 1411393 1534603 1609415 1774249 2037757 2216058 2164926 1952061 1725818 1517092
36698A517092k43173k53794j72236q4762j04048j75299j39774K4020J45376R0864
$$ 1517092 1273919 1020125 847889 763127 659079 483780 344006 368026 513402 604266
36688F04266m5814p1971L8742J25723Q2070j2363m5753m0944p1314j03384n3556
$$ 604266 558452 486481 525223 650946 733016 720653 674900 633956 562642 459258 405702
36677D05702M7107P8979J0015p2770j01854q6018l3887N6382J21429P2798n8597
$$ 405702 452809 531788 541803 469033 367179 281161 247274 303656 425085 497883 439286
36666D39286j33013q8988q998L0472M8824N6841j623j25638j93968j22899M944
$$ 439286 306273 217285 208287 238759 287583 344424 342801 217163 23195 -99704 -94760
36655i4760O2730M6436K5345P016l7652p4831m8764R854J6608m2597r9278r7050
$$ -94760 -32030 14406 39751 46767 9115 -65716 -114480 -104626 -88018 -130615 -229893 -326943
36643c26943l5803N2953J18083J09775M2538m344K95j2231q2785j20596l0428
$$ -326943 -362746 -309793 -191710 -81935 -39397 -43741 -43446 -55677 -138462 -259058 -289486
36632b89486J13647J48177N0318l9299k6988K2380J5441l1937m2908K538N4851
$$ -289486 -175839 -27662 22656 -16643 -43631 -21251 -5810 -37747 -80655 -78117 -23266
36621b3266O4681K7540j9426k7396J5096N7023L6714l8052r2906p3913k115O0959
$$ -23266 41415 68955 49529 22133 37229 94252 130966 92914 8 -73905 -76020 -15061
36609a5061P1556K5725m3159q0899n5442O781M9662N6684O3345R0821J00740M7079
$$ -15061 56495 82220 39061 -41838 -97280 -90499 -40837 15847 79192 170013 270753 317832
36597C17832m4039r0927o3121k7085m4998o4875Q679J38256J58068Q230j42090
$$ 317832 273793 182866 119745 92660 47662 -17213 -8534 129722 287790 296020 153930
36586A53930j12350L0966Q0199j36n0279m124R572p5850j12432J4890J53394R4066
$$ 153930 41580 72546 152745 152609 102330 98206 107778 31928 -80504 -65614 87780 181846
36574A81846q3181j04783Q1237K16320J13304p1450p6363Q5654J58946K1219j41091
$$ 181846 98665 -6118 75119 291439 404743 333293 256930 342584 501530 522749 381658
36563C81658r2300J29982K66124J74013n508n4233N7545J87889K28492J85819
$$ 381658 289358 419340 685464 859477 853969 799736 857281 1045170 1273662 1459481
36553A459481J01272J0753k8934J0543N1930l678j15572j49611q8997n2522q2314
$$ 1459481 1560753 1571506 1542572 1553115 1605045 1601367 1485795 1336184 1247187 1194665 1112351
36542A112351q3264k7186l4644j55545k40273j63422k8937o69n5461o9800m3785
$$ 1112351 1029087 1001901 967257 811712 571439 408017 379080 378411 322950 253150 209365
36531B09365o1057j07645j05680o4649l9742p639N9298P8720n912o6625K4746
$$ 209365 148308 40663 -65017 -129666 -169408 -177047 -117749 -39029 -44941 -111566 -86820
36520h6820J40373P2794r4885q4583J22124K34508J07770n7635p6525m8303j04586
$$ -86820 53553 126347 31462 -53121 69003 303511 411281 353646 277121 228818 124232
36509A24232j45563m3698Q5657N6291p5652j02809O113Q3991L5127n7022q6884
$$ 124232 -21331 -65029 20628 76919 1267 -101542 -95429 -11438 23689 -33333 -120217
36498a20217m5701K1378O7614N5959M06k4730J3245M0318q404o8996m6626K3326
$$ -120217 -165918 -144540 -76926 -20967 -20561 -45291 -32046 8272 -132 -69128 -115754 -92428
36486i2428L3644j3091j2609O2514J17992Q3990L99o4406r1283q5459n1155j4329
$$ -92428 -58784 -71875 -84484 -21970 96022 180012 180411 116005 24722 -60737 -111892 -126221
36474a26221r263k7181k9900j4363o171K300L5886O3507K5334n6103p9680j0198
$$ -126221 -135484 -162665 -192565 -206928 -213099 -210799 -174913 -111406 -86072 -142175 -221855 -232053
36462b32053O1112M4063l1310p4902n7848j5518K2764M2214J7753m7984q5386
$$ -232053 -170941 -126878 -158188 -233090 -290938 -306456 -283692 -241478 -223725 -271709 -357095
36451c57095l2963N8033P5978J2197j7614N2356J32818J13807K8131j4434n363
$$ -357095 -390058 -332025 -256047 -243850 -261464 -209108 -76290 37517 65648 51214 45851
36440D5851l3103j15080j54851q8717K7197J07967J26133P9188k5475j14223q9587
$$ 45851 12748 -102332 -257183 -345900 -318703 -210736 -84603 -5415 -30890 -145113 -234700
36429b34700J5334M4806m8443j16197n3643K7975P548k2450O6314J72166J22553
$$ -234700 -219366 -174560 -223003 -339200 -392843 -364868 -357320 -379770 -313456 -141290 -18737
36418a8737K227L2583J68049J36365r3475k17347p1510J11045Q4550m5523n7175
$$ -18737 -16510 16073 184122 320487 227012 9665 -61845 49200 133750 88227 31052
36407C1052J7952J1636n9293n1494K8766N4535J9745K8903Q4065Q3492J2744l8100
$$ 31052 49004 60640 1347 -50147 -21381 33154 52899 81802 165867 249359 262103 224003
36395B24003l3036j6239o180o54m1829j34075j58683l4206J01870O1580r4122
$$ 224003 190967 174728 168548 167894 126065 -8010 -166693 -200899 -99029 -37449 -131571
36384a31571j36984k5852N0355o282p1012l7493K2584K3468Q558L4392N7255K7015
$$ -131571 -268555 -294407 -244052 -250334 -321346 -358839 -336255 -312787 -304229 -269837 -212582 -185567
36372a85567k0909l6292j5612M2816J29188J52347K8444j39810j49087K51Q4165
$$ -185567 -206476 -242768 -258380 -215564 -86376 65971 94415 -45395 -194482 -194231 -110066
36361a10066L991o5778R046Q7058M565j27890j02892M5071J10749M3991k0976
$$ -110066 -106075 -171853 -162807 -75749 -71184 -199074 -301966 -256895 -146146 -102155 -123131
36350a23131j6120n668j4787J1756O4904N5700k4261o9546k4609L8977M4160L934
$$ -123131 -139251 -144919 -159706 -147950 -83046 -27346 -51607 -121153 -145762 -106785 -62625 -58691
36338e8691l7274o5884o9987k6170N1199J04979J00917N6794O898k1717j4970
$$ -58691 -95965 -161849 -231836 -258006 -206807 -101828 -911 55883 62781 41064 26094
36327B6094K350k1230p7900p9736J0151R1509O3634j8417l8927q213j1887k7280
$$ 26094 28444 7214 -70686 -150422 -140271 -48762 14872 -3545 -42472 -50685 -62572 -89852
36315h9852L4809J28798J09572j4900o2935L6182J24908O8804m7454q4993n8242
$$ -89852 -55043 73755 183327 168427 105492 141674 266582 335386 287932 202939 144697
36304A44697m5955k4716N7380J34240J01011j9093j15774j44179j20546l4865
$$ 144697 98742 74026 131406 265646 366657 347564 231790 87611 -32935 -67800
36294f7800R7668J61269P0719o2962o0088N7710R7969j416q6440m4294L2216K2958
$$ -67800 29868 191137 261856 198894 138806 196516 294485 293069 206629 162335 194551 217509
36282B17509k7709j3662M9102O9106L9237K7671M9684N8041M0844L3052L6755
$$ 217509 189800 176138 225240 294346 333583 361254 410938 468979 509823 542875 579630
36271E79630J2085m6454q6981o1552K9874J47830K26813K01149O6740r6352k01222
$$ 579630 591715 545261 458280 396728 426602 574432 801245 1002394 1069134 972782 771560
36260G71560k27511j84705o7019P9291J14474l5219k08297j63010P7340K06491
$$ 771560 544049 359344 292325 371616 486090 450871 242574 79564 156904 363395
36250C63395L9332k26012k81500j19034R890k3456q4080k4897R9394J42501P1907
$$ 363395 402727 176715 -104785 -223819 -213929 -237385 -321465 -346362 -246968 -104467 -32560
36239c2560k2578n9503l4254Q534K6676K4349N0779J18958J44489M3624j13456
$$ -32560 -55138 -114641 -148895 -140361 -113685 -89336 -38557 80401 224890 268514 155058
36228A55058j54323l4526R6107J06993N1094L7713N3580K7863p149M0613J58099
$$ 155058 735 -33791 62316 169309 220403 258116 311696 339559 332410 373023 531122
36217E31122K33754K16177J62364J40711J75829K61908L33977K66304K1287k33885
$$ 531122 764876 981053 1143417 1284128 1459957 1721865 2055842 2322146 2343433 2109548
36207B109548l01888k23624k05483k84069k68420o8705J26680J18590l0495j35059
$$ 2109548 1807660 1584036 1378553 1094484 826064 757359 884039 1002629 972134 837075
36197H37075j52861j45470r2353N3335J88975J51859k4190j26444n9819L6961
$$ 837075 684214 538744 446391 499726 688701 840560 816370 689926 630107 667068
36187F67068J6359p9964j19030o5310R462M1278L3301L3139Q0856J50545J49151
$$ 667068 683427 603463 484433 419123 428585 469863 503164 536303 617159 767704 916855
36176I16855L0239j04223j03729K3063J02028K7488r6116j03820J8191J38796
$$ 916855 947094 842871 739142 762205 864233 891721 795605 691785 709976 848772
36166H48772J44288L3762j02977j51292n7953J02664J89867J58475J02858J03736
$$ 848772 993060 1026822 923845 772553 714600 817264 1007131 1165606 1268464 1372200
36156A372200J13854O6667J6867O1212J66716K03531J39994Q6355J27087K16137
$$ 1372200 1486054 1552721 1569588 1630800 1797516 2001047 2141041 2227396 2354483 2570620
36146B570620K74772K98203L10293K92091K28264J70795J78315K20938K18090
$$ 2570620 2845392 3143595 3453888 3745979 3974243 4145038 4323353 4544291 4762381
36137D762381J56575J00388Q3221O0550j3606j23456k35328l48990m58472n08714
$$ 4762381 4918956 5019344 5102565 5163115 5149509 5026053 4790725 4441735 3983263 3474549
36127C474549m60629l77701l68532m36354m63335l75996k53440k11455k35667
$$ 3474549 3013920 2636219 2267687 1831333 1367998 992002 738562 527107 291440
36118B91440k15679j20544m3001n4796j06571j17135r3262r1227j00593n2602
$$ 291440 75761 -44783 -87784 -142580 -249151 -366286 -459548 -550775 -651368 -703970
36108g03970N5534J24322P7631k7332p1143k9704K379m8008j29809j42288o9766
$$ -703970 -648436 -524114 -446483 -473815 -544958 -574662 -572283 -620291 -750100 -892388 -962154
36097i62154J3561N4605P4087J00917J11471O6825j9258p9186n1565O0176J75385
$$ -962154 -948593 -893988 -819901 -718984 -607513 -540688 -559946 -639132 -690697 -630521 -455136
36086d55136J96435J11491J6922n758j101n4045j29686j19263l8720k7314j09134
$$ -455136 -258701 -147210 -130288 -136046 -137147 -191192 -320878 -440141 -478861 -506175 -615309
36075f15309j22621K1364J68289J40507j797p6631m7173p93M0707R5573Q8374
$$ -615309 -737930 -716566 -548277 -407770 -409567 -486198 -533371 -534164 -493457 -397884 -309510
36064c09510m0354j49617o1595J23320J33513n3629j75646j07804l1567q7608
$$ -309510 -349864 -499481 -561076 -437756 -304243 -357872 -533518 -641322 -672889 -760497
36054g60497j44406o3154N5994P6493O4223J25258J81187J11733k0570q2257p9086
$$ -760497 -904903 -968057 -912063 -835570 -771347 -646089 -464902 -353169 -373739 -455996 -535082
36043e35082p6017m0081N3498R4566J2939n4197K4034J28788Q8977j5336n221
$$ -535082 -611099 -651180 -597682 -503116 -490177 -544374 -520340 -391552 -302575 -317911 -323132
36032c23132O6161K6062p4201m8122N7622K4852j26832j43959K0427J17823K7150
$$ -323132 -256971 -230909 -305110 -353232 -295610 -270758 -397590 -541549 -521122 -403299 -376149
36021c76149o7157k9249J1790n3926j03429k6685O1723M1173j24M7535J07000
$$ -376149 -443306 -472555 -460765 -514691 -618120 -644805 -583082 -541909 -542033 -494498 -387498
36010c87498P7123K9041N6999R0042L0950n7615p1973l8972j9417J6810P5499
$$ -387498 -310375 -281334 -224335 -134293 -103343 -160958 -232931 -271903 -291320 -274510 -199011
35999a99011N7831n3365j00596p647O3401m266n8520K8778P3814j04846k82485
$$ -199011 -141180 -194545 -295141 -302788 -239387 -243653 -302173 -273395 -199581 -304427 -586912
35988e86912j22103K50646L82202J58803p7535j02864q0206j51025j59108J8151
$$ -586912 -709015 -458369 -76167 82636 5101 -97763 -177969 -328994 -488102 -469951
35978d69951J85073J20647p3357j54883r8192m3675k7848J6014P7311Q4124M3370
$$ -469951 -284878 -164231 -237588 -392471 -490663 -534338 -562186 -546172 -468861 -384737 -341367
35967c41367J0502j9826n5650j8511J31832K50983J64285o4393j89980j08136
$$ -341367 -330865 -350691 -406341 -424852 -293020 -42037 122248 57855 -132125 -240261
35957b40261M0932J03823Q6616M8178k3617j28661j60048k9166J58466J85392
$$ -240261 -199329 -95506 -8890 39288 15671 -112990 -273038 -302204 -143738 41654
35947D1654l070k06896k04392j0950J60632J57650K5147j00401j42159j01871
$$ 41654 38584 -168312 -372704 -383654 -223022 -65372 -40225 -140626 -282785 -384656
35937c84656j3441O1950N2357m3080j23239r7676R06P5281R5406R7863Q8671L9060
$$ -384656 -398097 -336147 -283790 -326870 -450109 -547785 -546879 -471598 -376192 -278329 -189658 -150598
35925a50598l2847o5464m4912j9172j6850j8353p264J3909M9139Q1666M6420p7975
$$ -150598 -183445 -248909 -293821 -312993 -329843 -348196 -355460 -341551 -292412 -210746 -164326 -242301
35913b42301j73087j00493P9032J45674J9440j19265q4985N8217J10426K0694
$$ -242301 -415388 -515881 -436849 -291175 -271735 -391000 -475985 -417768 -307342 -286648
35903b86648p5073o9896j2414K141k6834k8525J8520N2218K1695l0202k4075L4662
$$ -286648 -361721 -431617 -444031 -441890 -468724 -497249 -478729 -426511 -404816 -435018 -459093 -424431
35891d24431N9163J7700j3723K0920O2311M4117J6666N6447J18398J08369N5697
$$ -424431 -365268 -347568 -361291 -340371 -278060 -233943 -217277 -160830 -42432 65937 121634
35880A21634O7311J37449J60379J22681J14379J37829Q4435n6881j41520q5652
$$ 121634 188945 326394 486773 609454 723833 861662 946097 889216 747696 662044
35870F62044J3561M4228J9323j8429p7061j22154o3403P1135J08073j5405j31473
$$ 662044 675605 719833 739156 720727 643666 521512 458109 529244 637317 621912 490439
35859D90439j01798k8401n1164j01288m8787M4780L8208l0452k0948M9596M8489
$$ 490439 388641 360240 309076 207788 159001 203781 241989 211537 190589 240185 288674
35848B88674k2111l6115K3432M8446N965l7226o9051j20597j28236j3635J20819
$$ 288674 266563 230448 253880 302326 308291 271065 202014 81417 -46819 -60454 60365
35837F0365J00845k3494l3079R2927J26722l1736j86248j55545k0728O4368J00711
$$ 60365 161210 137716 104637 197564 324286 292550 106302 -49243 -69971 -5603 95108
35826I5108J38682J30873M6831j8489K484L0754Q691K9600J45048K03708P5589
$$ 95108 233790 364663 411494 393005 395489 426243 434934 464534 609582 813290 888879
35815H88879r5791p9559J01786K36927K60680K95651L89912M40897M02897L78928
$$ 888879 793088 713529 815315 1052242 1312922 1608573 1998485 2439382 2842279 3221207
35805C221207M56232N93416P14973Q02227Q54159Q48423P60441N54687J85586
$$ 3221207 3677439 4270855 4985828 5788055 6642214 7490637 8251078 8805765 8991351
35796H991351k99602p03196q51329q00542p40890p28655o75144n73071n28432
$$ 8991351 8691749 7988553 7137224 6336682 5595792 4867137 4191993 3618922 3090490
35787C090490n42179m72642k90674j73463k28074l00108k14928o5130o2487j92561
$$ 3090490 2548311 2075669 1784995 1611532 1383458 1083350 868422 803292 740805 548244
35777E48244k32459r6151L9591L843j30803j72082p2253M0799N9869K2417J7738
$$ 548244 315785 219634 259225 263068 132265 -39817 -112070 -71271 -11402 11015 28753
35766B8753M4478K6481n0914r9211n1534L4312N8652K1481P75J5813R435l6534
$$ 28753 73231 99712 48798 -50413 -101947 -67635 -8983 12498 13273 29086 38521 1987
35754A987p2537q4581j16485j51964r2034P9367K14243J83613N6769j3536j1638
$$ 1987 -70550 -155131 -271616 -423580 -515614 -436247 -222004 -38391 18378 4842 -6796
35743f796k9851o9713l6374O5853R3993k0698j47873j31208K591J02214R9252
$$ -6796 -36647 -106360 -142734 -76881 17112 -3586 -151459 -282667 -280076 -177862 -78610
35732g8610N4291K3038j4675p2589r4710l3419N7572Q0726L3772J6485P5073J12978
$$ -78610 -24319 -1281 -15956 -88545 -183255 -216674 -159102 -78376 -44604 -28119 46954 159932
35720A59932K5707j21474j54821l4557P4657K8955r2697j05890J7122J18942Q1833
$$ 159932 185639 64165 -90656 -125213 -50556 -21601 -114298 -220188 -203066 -84124 -2291
35709b291k9434q1675m6275j189o030l4073k1367N0863J30494J45635Q1952J686
$$ -2291 -31725 -113400 -159675 -160864 -166894 -200967 -222334 -171471 -40977 104658 186610 188296
35697A88296k4433N939L1963L29q1698j48744j27504j6986P4784L2507j02233
$$ 188296 163863 169802 201765 202094 120396 -28348 -155852 -172838 -98054 -65547 -167780
35686a67780j47708k2307J20473J01531j9093m1364N4783Q4104l0522j25016o2922
$$ -167780 -315488 -337795 -217322 -115791 -134884 -176248 -121465 -37361 -67883 -192899 -255821
35675b55821M3471K2345q3696j05150k1366L3098J142l0701o18M5006O0244O3451
$$ -255821 -212350 -190005 -273701 -378851 -400217 -367119 -365977 -396678 -397296 -352290 -292046 -228595
35663b28595O1289K3331l2988m0284k050n460o4783o8417M1698J46216J10739
$$ -228595 -167306 -143975 -176963 -217247 -219297 -224757 -289540 -357957 -316259 -170043 -59304
35652e9304j1174o4415k7692j7743p2314q4684Q77O5797j0570j43278j37953L0147
$$ -59304 -70478 -134893 -162585 -180328 -252642 -337326 -336449 -270652 -281222 -424500 -562453 -532306
35640e32306J66927J23569n488l4637M3876P3984m990o7138j6003N1557J1335
$$ -532306 -365379 -241810 -247298 -281935 -238059 -164075 -169065 -236203 -252206 -200649 -189314
35629a89314o4790j8002J12026J09107p9461k15809r3780J56001K40090R7532
$$ -189314 -254104 -272106 -160080 -50973 -130434 -346243 -440023 -284022 -43932 53600
35619E3600n5290n2289K8298M1680j133R853Q9516J36077Q3232j6600p3905o5681
$$ 53600 -1690 -53979 -25681 15999 14866 24719 114235 250312 333544 316944 243039 177358
35607A77358l0550O39K9905N8622O9103N8585O6134J28028K12810K50380K42811
$$ 177358 146808 147447 177352 235974 305077 363662 429796 557824 770634 1021014 1263825
35596A263825K90310M53870O25746O08872L29990p5717l95258n09140m42270l13638
$$ 1263825 1554135 2008005 2633751 3242623 3572613 3496896 3101638 2592498 2150228 1836590
35586A836590k50877k89810l31064k52976q8990j4541j12037k37548k08548n3287
$$ 1836590 1585713 1295903 964839 711863 622873 608332 496295 258747 50199 -3088
35576c088M6443J9357l3652m1861o7728j46031j65015k9244J49904J69570P350
$$ -3088 43355 62712 29060 -12801 -80529 -226560 -391575 -420819 -270915 -101345 -93995
35565i3995j52181j59187n0289N3552Q6745M2366n7423j37193j04779K0206R3699
$$ -93995 -246176 -405363 -455652 -402100 -315355 -272989 -330412 -467605 -572384 -552178 -458479
35554d58479L6830m3825k0902N1633L7600l7729j9946J01117J41152O181j44788
$$ -458479 -421649 -465474 -486376 -434743 -397143 -434872 -454818 -353701 -212549 -206368 -351156
35543c51156j32573j2832M4764K3626L2964P8720N5024m4310q9873k6624M1329
$$ -351156 -483729 -496561 -451797 -428171 -395207 -316487 -261463 -305773 -395646 -422270 -380941
35532c80941L2611R792M2080P7762N0017j366k0097m3836j02993j02499M1674
$$ -380941 -348330 -338538 -296458 -218696 -168679 -170045 -190142 -233978 -336971 -439470 -397796
35521c97796K07807J84613k6181j86220j29295M4095J31175P1012m2202j03618
$$ -397796 -189989 -5376 -31557 -217777 -347072 -302977 -171802 -100790 -142992 -246610
35511b46610q2355j2757L9951K9879k5738p2811q4338o0235P443R6833J14793
$$ -246610 -328965 -341722 -301771 -271892 -297630 -370441 -454779 -515014 -507571 -410738 -295945
35500b95945K774j26241r0330J02997K46494K28832J83599K49543L28960K31500
$$ -295945 -293171 -419412 -509742 -406745 -160251 68581 252180 501723 830683 1062183
35490A062183l4370k67999l29171k53898j48200q2845p8331j00204q1854j4083
$$ 1062183 1027813 759814 430643 176745 28545 -54300 -132631 -232835 -314689 -328772
35480c28772L2788L5202P9857K09013L03590K57367J76626K32060L80402M39677
$$ -328772 -295984 -260782 -180925 28088 331678 589045 765671 997731 1378133 1817810
35470A817810M07704M73065O85463Q42287P81759O01644M88296M78817M89774
$$ 1817810 2225514 2698579 3384042 4226329 5008088 5609732 6098028 6576845 7066619
35461G066619M55356L49820J84311M6637K4212L9876q1238l23069m48782l59422
$$ 7066619 7521975 7871795 8056106 8102743 8126955 8166831 8085593 7762524 7313742 6954320
35451F954320k70857l71067n04074m24927k09654j29988k13495k36752j39080
$$ 6954320 6683463 6312396 5808322 5383395 5173741 5043753 4830258 4593506 4454426
35442D454426j29018l05767m51065l48143j09955j0925j13509k38010k43111j75091
$$ 4454426 4325408 4019641 3568576 3220433 3110478 3099553 2986044 2748034 2504923 2329832
35432B329832j42019j65181j91621j80054j29291n4756K2370O7237M6261k9765
$$ 2329832 2187813 2022632 1831011 1650957 1521666 1466910 1489280 1556517 1602778 1573013
35422A573013r5867r7267n3127j8403R75L0805L8370l8438j49505j42368J7233
$$ 1573013 1477146 1379879 1326752 1308349 1309324 1340129 1378499 1340061 1190556 1048188 1065421
35411A065421J51529J04044l5477p7785k2983k7026j18398j45191l0963R2925
$$ 1065421 1216950 1320994 1285517 1207732 1184749 1157723 1039325 894134 863171 956096
35401I56096Q4169j4326o6288l7573m786k1736o2002p6955n4140j7773K457j52
$$ 956096 1040265 1025939 959651 922078 917292 895556 833554 756599 702459 684686 687143 686991
35389F86991j0203j8709l0540l7712k4526j3302m5074q7618m5881Q2102J56264
$$ 686991 676788 658079 627539 589827 565301 551999 506925 419307 373426 455528 611792
35378F11792Q7898j4537q108O8522Q4687L8592J4821j0073j13777k19057j65931
$$ 611792 699690 685153 677045 745567 830254 868846 883667 873594 759817 540760 374829
35367C74829Q498R5560M6088L2907J26070J63689N5760l4585K3639Q5455k1859
$$ 374829 383327 478887 524975 557882 683952 847641 903401 868816 892455 977910 956051
35356I56051j85838j80026k3086P5005M7745J6380L8048L8245n18J2064R6539
$$ 956051 770213 590187 567101 642106 689851 706231 744279 782524 782006 794070 890609
35345H90609J42665Q0621j7620o2029o3223p3675r2408p9812j8220O8053J18756
$$ 890609 1033274 1113895 1096275 1034246 971023 897348 804940 725128 706908 774961 893717
35334H93717P3923m6102j23188p5138K0825K9485l9469m9094L5331O9134n3934
$$ 893717 967640 921538 798350 723212 744037 773522 734053 684959 720290 789424 735490
35323G35490k14354k07854k7340J13674N6607r5988j19374L0000J50061O2273
$$ 735490 521136 313282 285942 399616 456223 360235 240861 270861 420922 483195
35313D83195j42069k17010q5101P2676O7225o8845j60743j19213r273O3214N7721
$$ 483195 341126 124116 39015 111691 178916 110071 -50672 -169885 -179158 -115944 -58223
35302e8223N924l5216l5486j1958J1027M4342R1194Q8331j9971j52664j52181
$$ -58223 -52299 -87515 -123001 -134959 -123932 -79590 11604 99935 79964 -72700 -224881
35291b24881n310J12748P2365m1700p0230J0163J03450J36565R5814n841j11135
$$ -224881 -230191 -117443 -45078 -86778 -157008 -146845 -43395 93170 188984 183143 72008
35280G2008j33831o7751j0181j1147N345Q9002J44282P6813m2014q5936o0670
$$ 72008 -61823 -129574 -139755 -150902 -145557 -56555 87727 164540 122526 36590 -24080
35269b4080m3491k1461N6337J34498J20589M6903P769j1702q0643j48445j09343
$$ -24080 -67571 -89032 -32695 101803 222392 269295 277064 265362 184719 36274 -73069
35258g3069o578K1656j6346J7898J29205J55166M1008n5384j3240P1640N6134
$$ -73069 -79647 -57991 -74337 -56439 72766 227932 268940 213556 200316 271956 328090
35247C28090m5110j27492j52345j33059o1617M9392J21003R4345J6970k2033p90
$$ 328090 282980 155488 3143 -129916 -191533 -142141 -21138 73207 90177 68144 67354
35236F7354M0184O7417P3107N6320J9894k8574p7254r8014o2253K101K0174j6396
$$ 67354 107538 174955 248062 304382 324276 295702 218448 120434 58181 60282 80456 64060
35224F4060j6960N7064R9530K3494p9730q7924n7598j03978j59943q4983M4496
$$ 64060 47100 104164 203694 227188 147458 59534 1936 -102042 -261985 -346968 -302472
35213c02472K6065j01313q2206J18311K17384O7855r4069l6323R9811N7766j09650
$$ -302472 -276407 -377720 -459926 -341615 -124231 -56376 -150445 -186768 -86957 -29191 -138841
35202a38841j44326J1974J73127K01998J26526P800j07575j32836k4219R4007
$$ -138841 -283167 -271193 -98066 103932 230458 238258 130683 -2153 -26372 67635
35192F7635N4650j06164j82088q0323P3635J33592R9089M4580l322n6065j01630
$$ 67635 122285 16121 -165967 -246290 -172655 -39063 60026 104606 101284 45219 -56411
35181e6411j10523p3338m993O6946J05865P9045j2590j10732j18950Q314J73268
$$ -56411 -166934 -240272 -245265 -178319 -72454 6591 -5999 -116731 -235681 -227367 -54099
35170e4099J96775L7487j21579j07654k332M423o4126k1078J28829J56085o893
$$ -54099 142676 180163 58584 -49070 -51402 -46979 -111105 -132183 -3354 152731 145838
35159A45838j21773k2921J13324O9152o4475p3660J5263K2585n1914n4913K2526
$$ 145838 24065 1144 114468 183620 119145 45485 60748 83333 31419 -23494 -968
35148i68L0190p0969j44116r4674J9942J04425J10277K7926p6375o6326Q1653
$$ -968 29222 -41747 -185863 -280537 -260595 -156170 -45893 -17967 -94342 -160668 -79015
35137g9015J74122M6510j64662j95852l8908P7253M9829L934L1379O6826N9056
$$ -79015 95107 141617 -23045 -218897 -257805 -180552 -130723 -126789 -95410 -28584 30472
35126C0472N1552M6766j7797j15742j33143n5648J8301O0447J16879J33619J2698
$$ 30472 82024 128790 110993 -4749 -137892 -193540 -175239 -114792 2087 135706 148404
35115A48404j41571r9724J15007K07122N9644q5936l7897N1379l095q4921j0764
$$ 148404 6833 -92891 22116 229238 288882 202946 165049 216428 213333 128412 117648
35104A17648J20857J04688r282k7358L0384j0654j31403j36119k788P1632O998
$$ 117648 238505 343193 333911 306553 336937 326283 194880 58761 55973 127605 134603
35093A34603l9186M5987J51005J35626L1204m9011o4887l8525l128j5550j03494
$$ 134603 95417 141404 292409 428035 459239 410228 345341 306816 303688 288138 184644
35082A84644j64395n7881J53560K19761M4175j51777j33206K2086P2049j8608
$$ 184644 20249 -37632 115928 335689 379864 228087 94881 116967 189016 170408
35072A70408o4418J7739Q6845K5913o5162l0679R9220J54987O8928m8272p5673
$$ 170408 105990 123729 210574 236487 171325 140646 239866 394853 463781 415509 339836
35061C39836l0794q331l3158m5006j5177j603m8571q6402j5014J19974J40924
$$ 339836 309042 300711 267553 222547 207370 205767 157196 70794 55780 175754 316678
35050C16678j6816j70402j16661O5157J04734o0084j71115l0417J88236J88072
$$ 316678 299862 129460 12799 77956 182690 122606 -48509 -78926 109310 297382
35040B97382j3678j31820m8059N8806M6457J2398N4945O4190o7565k01731j40678
$$ 297382 283704 151884 103825 162631 209088 221486 276431 340621 273056 71325 -69353
35029f9353M8273J23487K9596n4341j5497N6068O1695L5541K7789J877o8216j12792
$$ -69353 -21080 102407 132003 77662 62165 118233 179928 215469 243258 245135 176919 64127
35017F4127o2855M1738J01861O7749k7980r8102o7667K7003M3411p2837j60762
$$ 64127 1272 43010 144871 212620 184640 86538 18871 45874 89285 16448 -144314
35006a44314n6888J21948J18741n5106j09941O5118K09113R6522j09034j21398
$$ -144314 -201202 -79254 39487 -15619 -125560 -60442 148671 245193 136159 14761
34996A4761L8018J28583P9671K2724N732n0232j21459p2283P9939J25512k1978
$$ 14761 52779 181362 261033 283757 289489 239257 117798 45515 125454 250966 228988
34985B28988j66018j06465O9044J17965k1496j70085j52743P714J49216J53159
$$ 228988 62970 -43495 25549 143514 122018 -48067 -200810 -193096 -43880 109279
34975A09279M7315m6607n2415j5606k5004q1241r6932k8898N5817P8755O1470
$$ 109279 156594 109987 57572 41966 16962 -64279 -161211 -190109 -134292 -55537 5933
34964E933Q1510J41249J48480M7316q1770j05914q790R0493J01766O6429M3165
$$ 5933 87443 228692 377172 424488 342718 236804 228014 318507 420273 486702 529867
34953E29867j3029j36659j91769k0402K53839L00566M2340j85370r2101J49034
$$ 529867 516838 380179 188410 168008 421847 722413 764753 579383 487282 636316
34943F36316J72451l5555j55207l7631J18957J29866P3606P7328R3965M4291k360
$$ 636316 808767 773212 618005 580374 699331 829197 902803 980131 1074096 1118387 1116027
34932A116027M1583J01485N5910n9014j13800q8708p2463j03963j40796j54018
$$ 1116027 1157610 1259095 1315005 1255991 1142191 1053483 981020 877057 736261 582243
34922E82243j47225j09007l7650J8225K1989O907k319n6850j76060k46829j56615
$$ 582243 435018 326011 288361 306586 328575 335482 333163 276313 100253 -146576 -303191
34911c03191K6233J36260J31091R3162N6400j1833q0334p1340n599K7689M0505
$$ -303191 -276958 -140698 -9607 83555 139955 128122 47788 -23552 -29151 -1462 39043
34900C9043J12633J89364J17584q1035j88737j15589l1840p7420j54549j43933
$$ 39043 151676 341040 458624 377589 188852 73263 41423 -35997 -190546 -334479
34890c34479j14648j44620j33365o976P3958l4721j60718o3999J34422J14087
$$ -334479 -449127 -593747 -727112 -734088 -660130 -694851 -855569 -919568 -785146 -671059
34880f71059j13946k08913n1843P7752k3872j79307j68394q0149j12390k43421
$$ -671059 -785005 -993918 -1045761 -968009 -991881 -1171188 -1339582 -1419731 -1532121 -1775542
34870a775542l22794l16772k59716j14327J17862K81579K62241J75768J76869
$$ -1775542 -2098336 -2415108 -2674824 -2789151 -2671289 -2389710 -2127469 -1951701 -1774832
34861a774832K07429J40098M2046N7384J31183J06446J7847J9954P7733J9318
$$ -1774832 -1567403 -1427305 -1385259 -1327875 -1196692 -1090246 -1072399 -1052445 -974712 -955394
34851i55394j18517j04283Q7551J87914M4739j41028j33345L089N3689k3466j02101
$$ -955394 -1073911 -1178194 -1090643 -902729 -857990 -999018 -1132363 -1129274 -1075585 -1099051 -1201152
34840a201152j06904o7901j8163L4117O3470M4030j2325p4784j13470r0780N36
$$ -1201152 -1308056 -1375957 -1394120 -1360003 -1296533 -1252503 -1264828 -1339612 -1453082 -1543862 -1543326
34829a543326Q6052Q0350J1833j7139J0738K0621j1171l8569o3120j17820j38945
$$ -1543326 -1457274 -1376924 -1365091 -1382230 -1371492 -1350871 -1362042 -1400611 -1463731 -1581551 -1720496
34818a720496l5252J04974Q5016q4980j71030q1110m371p6883j59143j06718k7175
$$ -1720496 -1755748 -1650774 -1565758 -1650738 -1821768 -1902878 -1907249 -1984132 -2143275 -2249993 -2277168
34807b277168o4152j33438j08207q6430k08542l52047k98334j11510n5160j75060
$$ -2277168 -2341320 -2474758 -2582965 -2669395 -2877937 -3229984 -3528318 -3639828 -3694988 -3870048
34797c870048k51030j60704j9012P7177J89669L54269M72996M83877M66647M88833
$$ -3870048 -4121078 -4281782 -4300794 -4223617 -4033948 -3679679 -3206683 -2722806 -2256159 -1767326
34787a767326M90405M10238L09284K83316L39870M21445M72559M43815L13964
$$ -1767326 -1276921 -866683 -557399 -274083 65787 487232 959791 1403606 1717570
34778A717570J47974N7154O9972J11770J25241J24902J14905N2426o3170j45629
$$ 1717570 1865544 1922698 1992670 2104440 2229681 2354583 2469488 2521914 2458744 2313115
34768B313115j22480l1359K9073J5436k4344k0914K4784L4276l9316j19159r7212
$$ 2313115 2190635 2159276 2188349 2203785 2179441 2158527 2183311 2217587 2178271 2059112 1961900
34757A961900j1402j0925j17535j72154r2947k0349p8020j51408q2311N4742Q5407
$$ 1961900 1950498 1939573 1822038 1649884 1556937 1536588 1458568 1307160 1224849 1279591 1364998
34746A364998L4968N1545J05552L2545j50719k37410j49905k5153M0338R0238
$$ 1364998 1399966 1451511 1557063 1589608 1438889 1201479 1051574 1026421 1066759 1156997
34736A156997J21743M9919q1150r6084K0921O8949l8088j19477l5013Q1814O0815
$$ 1156997 1278740 1328659 1247509 1151425 1172346 1241295 1203207 1083730 1048717 1130531 1191346
34725A191346k9891l2106L1834K8029n5161j13168r2074j6927P5640J28428P1664
$$ 1191346 1161455 1129349 1161183 1189212 1134051 1020883 928809 911882 987522 1115950 1187614
34714A187614o4425j36203p2881K2985L7744q577n6342j04845j25814l3553J44161
$$ 1187614 1123189 986986 914105 937090 974834 966257 909915 805070 679256 645703 789864
34703G89864K20711J06278m4510p6579n6541q7659q4492N0619J80083J14027o6183
$$ 789864 1010575 1116853 1072343 995764 939223 851564 767072 817691 997774 1111801 1045618
34692A045618j26014m3437M990k7369j5801N7482N2138o4158j33967o0007N7672
$$ 1045618 919604 876167 881157 853788 837987 895469 947607 883449 749482 689475 747147
34681G47147J00159P8328M4474N635k2679j0814J746m9138j06556m3532J17880
$$ 747147 847306 925634 970108 975743 953064 942250 943996 894858 788302 744770 862650
34670H62650K04021J41380M0140j7656q5831j77517j73474k3039J27068J37471
$$ 862650 1066671 1208051 1248191 1230535 1144704 967187 793713 770674 897742 1035213
34660A035213P0016M1241K0064o3189j23626l9132J06345J08232m3686j38452
$$ 1035213 1105229 1146470 1166534 1103345 979719 940587 1046932 1155164 1111478 973026
34650I73026o3733L7193J0147p1173m7273N3412N5511p7904j72562r8317M4725
$$ 973026 909293 946486 956633 885460 838187 891599 947110 869206 696644 598327 643052
34639F43052Q8950M2359L4353P8562N6918n4507j12036k2247J06814J29457O3124
$$ 643052 732002 774361 808714 887276 944194 889687 777651 755404 862218 991675 1054799
34628A054799R921k2485p9390j14259n2681L5662M931j23265j55008m788J70622
$$ 1054799 1064720 1042235 962845 848586 795905 831567 836498 713233 558225 553437 724059
34617G24059J90043P6326j9431k5786J4716N5257Q8004R9360O0494k8409j19125
$$ 724059 914102 990428 970997 945211 959927 1015184 1103188 1202548 1263042 1234633 1115508
34606A115508j46987q1784L2964R8340N6557l1569n0946K3732R9586Q9827J2888
$$ 1115508 968521 886737 919701 1018041 1074598 1043029 992083 1015815 1115401 1205228 1218116
34595A218116n1153n6481j9738J5260K3074K5365O9942J56423K03607J35477j6847
$$ 1218116 1166963 1110482 1090744 1106004 1129078 1154443 1224385 1380808 1584415 1719892 1703045
34584A703045j48543j97921j74590r8125J1284R1632P9834Q793j4712M8416J19814
$$ 1703045 1554502 1356581 1181991 1083866 1095150 1186782 1266616 1275409 1260697 1309113 1428927
34573A428927J20893P5224N8976R6544J39098J22025L1839o5076p3873J9502J19336
$$ 1428927 1549820 1625044 1684020 1780564 1919662 2041687 2073526 2008450 1934577 1954079 2073415
34562B073415J40039J08193Q5026N1635k6657p7248m467J21785J18933m5089j89080
$$ 2073415 2213454 2321647 2406673 2458308 2431651 2354403 2349936 2471721 2590654 2545565 2356485
34551B356485j63691k3930R9245J64936J81838J27941J7455m5869O168R3401R9311
$$ 2356485 2192794 2168864 2268109 2433045 2614883 2742824 2760279 2714410 2720578 2813979 2913290
34540B913290L7678O989K7712L4829R110J0183P3164J53196J89111J65536J00583
$$ 2913290 2950968 2957957 2985669 3020498 3029608 3039791 3112955 3266151 3455262 3620798 3721381
34529C721381K2280k5675J777R6058J70692J32597l755j00123l6424J37495K51155
$$ 3721381 3743661 3717986 3719763 3815821 3986513 4119110 4115355 4015232 3978808 4116303 4367458
34518D367458K23508J42979J04482P4070K618k9473P6198K43325L03402K44111
$$ 4367458 4590966 4733945 4838427 4912497 4915115 4885642 4961840 5205165 5508567 5752678
34508E752678K07197K41712K38911J47359P9214J29119K28377K63966K34140K10598
$$ 5752678 5959875 6201587 6440498 6587857 6667071 6796190 7024567 7288533 7522673 7733271
34498G733271K35572L13753M23572N00345M96819M74912N26700O03623N74650
$$ 7733271 7968843 8282596 8706168 9206513 9703332 10178244 10704944 11308567 11883217
34489A1883217M69433M80854O74542Q83687R69880J001478J076322J158051J214364
$$ 11883217 12352650 12833504 13508046 14391733 15361613 16363091 17439413 18597464 19811828
34480A9811828J339293J591573J868061K081977K313596K640973K988964L310947
$$ 19811828 21151121 22742694 24610755 26692732 29006328 31647301 34636265 37947212
34472C7947212L748511M416420N191073N934344O786296P994541R569137J1361963
$$ 37947212 41695723 46112143 51303216 57237560 64023856 72018397 81587534 92949497
34464I2949497J3406609J5927352J9058369K2772946K7030654L1743970L6529113
$$ 92949497 106356106 122283458 141341827 164114773 191145427 222889397 259418510
34457B59418510M0468402M1892025L8408948K7946827J0772604r383503k6952034
$$ 259418510 299886912 341778937 380187885 408134712 418907316 409523813 382571779
34450C82571779l7898190m1701058m0421961l6527455l1709462k6933392k2690131
$$ 382571779 344673589 302972531 262550570 226023115 194313653 167380261 144690130
34443A44690130j9082558j6025781j3480745j1426252r735616q266732p005814
$$ 144690130 125607572 109581791 96101046 84674794 74939178 66672446 59666632
34436E9666632n990747n180724m515150l991200l569284l127724k637743k254325
$$ 59666632 53675885 48495161 43980011 39988811 36419527 33291803 30654060 28399735
34428B8399735k091198k022484j853450j581423j342186j196735j115283j080456
$$ 28399735 26308537 24286053 22432603 20851180 19508994 18312259 17196976 16116520
34420A6116520j063787r82343q11407o59962o16083o11031n52579m80715m60356
$$ 16116520 15052733 14070390 13258983 12599021 11982938 11371907 10819328 10338613 9878257
34411I878257m40367l68945l29509l95773m66380m22369l36303l30088l38528
$$ 9878257 9437890 9068945 8739436 8343663 7877283 7454914 7118611 6788523 6449995
34402F449995k39186j17439j44783k61835k60683j50390j45385k75044l05922
$$ 6449995 6210809 6093370 5948587 5686752 5426069 5275679 5130294 4855250 4549328
34393D549328j30187M2342M475j61404k56430k38306j76258r1540M210L3184m1383
$$ 4549328 4419141 4461483 4465958 4304554 4048124 3809818 3633560 3542020 3546230 3579414 3538031
34382C538031j24599j26819j00521j27669j65214j28318m7275j0895j7105j0101
$$ 3538031 3413432 3286613 3186092 3058423 2893209 2764891 2717616 2706721 2689616 2679515
34372B679515j3345q5108j68262j28193M3890J80590J31951n9839k12295j91529
$$ 2679515 2666170 2581062 2412800 2284607 2328497 2509087 2641038 2581199 2368904 2177375
34362B177375l8410P1653R786j47800j92819n6079P4365J333j85228k14785k5135
$$ 2177375 2138965 2210618 2220404 2072604 1879785 1823706 1898071 1899404 1714176 1499391 1474256
34351A474256J36679O4332j23218j77014p7234j6884p7040j18962l3782P6539
$$ 1474256 1610935 1675267 1552049 1375035 1297801 1280917 1203877 1084915 1051133 1127672
34341A127672O6158k8614n5641K6573J09208R0833k5013j69041k51077j87550
$$ 1127672 1193830 1165216 1109575 1136148 1245356 1336189 1311176 1142135 891058 703508
34331G03508J3708K02995K23559R9078q175j8937k27m442J0541N7152N4430l4048
$$ 703508 717216 920211 1143770 1242848 1234673 1215736 1215509 1211067 1221608 1278760 1333190 1299142
34319A299142j15373j07771o3331n8599o1165j2332M1607J8591n9934j08574j05542
$$ 1299142 1183769 1075998 1012667 954068 892903 880571 922178 940769 880835 772261 666719
34308F66719q2053l9839K2353N8229M9663O6806J44257J73520N3445j18548j60546
$$ 666719 584666 544827 567180 625409 675072 741878 886135 1059655 1113100 994552 834006
34297H34006o6033J0855r43k7467j7272k54K5452R6926J57486R0828p8828j78235
$$ 834006 767973 778828 777885 750418 733146 732892 758344 855270 1012756 1103584 1024756 846521
34285H46521j25455k9626N464K7301J02146J66626J17853k5456j35693j09586
$$ 846521 721066 691440 696904 724205 826351 992977 1110830 1085374 949681 840095
34275H40095M0378J76585J31243j00605k89790k22531M534J06320J3350o0733
$$ 840095 880473 1057058 1188301 1087696 797906 575375 579909 686229 699579 638846
34265F38846J5301J03848P2798J5503M4088P5182J2006m0511L8842J33773O3588
$$ 638846 654147 757995 830793 846296 890384 965566 977572 937061 975903 1109676 1173264
34254A173264r6181j21216l480N1735k2095n9690L8479J43241J14193K077o5752
$$ 1173264 1077083 955867 952387 1004122 982027 922337 960816 1104057 1218250 1220327 1154575
34243A154575p0644p2364q2323n8805J5156J03226J40125P6841n5707j40853r9068
$$ 1154575 1083931 1011567 929244 870439 885595 988821 1128946 1205787 1150080 1009227 910159
34232I10159k528J2882o1453r9750l0617O7633Q9362L5491j4837q033M0208O7190
$$ 910159 907631 920513 859060 759310 728693 796326 885688 921179 906342 898309 938517 1005707
34220A005707K1047o9533j02047k6669O6605N9094l3526j01927j12991j18491
$$ 1005707 1026754 957221 855174 828505 895110 954204 920678 818751 705760 587269
34210E87269j11714k3367J17509J69491Q5292m039N468K9772l9929j20617m9052
$$ 587269 475555 452188 569697 739188 824480 820441 825909 855681 815752 695135 646083
34199F46083J36869K08981O8941j00058r0447L6135N3975p6484j40428N51J73069
$$ 646083 782952 991933 1060874 960816 870369 906504 960479 883995 743567 744118 917187
34188I17187J32081o4727j30304J8868J37463L9935j07946o0704J09907J29389
$$ 917187 1049268 984541 854237 873105 1010568 1050503 942557 881853 991760 1121149
34178A121149m6684j68399o5212J38558K33773J70875K8768j04295j44515m2206
$$ 1121149 1074465 906066 840854 979412 1213185 1384060 1412828 1308533 1164018 1121812
34168A121812J24383J95752J29737L9129r126p8782j79899j75929k279J72635
$$ 1121812 1246195 1441947 1571684 1610813 1601687 1522905 1343006 1167077 1164798 1337433
34158A337433J64758L8326j6606K4609M0480Q073K2335Q9238R9327L0097m461
$$ 1337433 1502191 1540517 1523911 1548520 1589000 1597073 1619408 1708646 1807973 1838070 1833609
34147A833609M5636P6289J0290o7773m5131N7703J48473J95884K06308J47020
$$ 1833609 1879245 1955534 1965824 1898051 1852920 1910623 2059096 2254980 2461288 2608308
34137B608308P347j09792p9338O4727J40174L3366j65596k77536k36812j45239
$$ 2608308 2615655 2505863 2426525 2491252 2631426 2664792 2499196 2221660 1984848 1839609
34127A839609j49370k90746m69731n49810n03695m42521m75414n62058n63283
$$ 1839609 1690239 1399493 929762 379952 -123743 -566264 -1041678 -1603736 -2167019
34118b167019m38593l13021l04256l56690l28495j94961n8941K3014R9879J88777
$$ -2167019 -2605612 -2918633 -3222889 -3579579 -3908074 -4103035 -4161976 -4138962 -4039083 -3850306
34108c850306K08011J20500L8613P9961J88722K17141J41774P5294P9745R3640
$$ -3850306 -3642295 -3521795 -3483182 -3403221 -3214499 -2997358 -2855584 -2780290 -2700545 -2606905
34098b606905O1174K4268M6304J22254J98883K24389J62578K7259q0614m7084
$$ -2606905 -2545731 -2521463 -2475159 -2352905 -2154022 -1929633 -1767055 -1739796 -1820410 -1867494
34088a867494J09852K30039J79775q713j76905j81037r582J84940K03606K6274
$$ -1867494 -1757642 -1527603 -1347828 -1356541 -1533446 -1714483 -1724065 -1539125 -1335519 -1309245
34078a309245j29687q2845M8983L1757r3697o0189J64343K65730O6966j60810
$$ -1309245 -1438932 -1521777 -1472794 -1441037 -1534734 -1594923 -1430580 -1164850 -1097884 -1258694
34068a258694r9259J30475J75974J732j00963K484J23272R7622J6480J6421O4276
$$ -1258694 -1357953 -1227478 -1051504 -1049772 -1150735 -1148251 -1024979 -927357 -910877 -894456 -830180
34057h30180O3135J1430m3053q3563q8085k8948M2095L1663l5058l3086M5609
$$ -830180 -767045 -755615 -798668 -882231 -970316 -999264 -957169 -925506 -960564 -993650 -948041
34046i48041O1731k3384n4765N6088J55455Q0327p6497j06683Q818J07878R5997
$$ -948041 -886310 -909694 -964459 -908371 -752916 -672589 -749086 -855769 -846951 -739073 -643076
34035f43076K9392j0625N922P1134J21899O4441q0546j40780k7972Q8534J4750
$$ -643076 -613684 -624309 -618387 -547253 -425354 -360913 -441459 -582239 -610211 -521677 -506927
34024e06927j51416j55946J0943J03601J5485p7679l5754L4105N362m4364l28
$$ -506927 -658343 -814289 -803346 -699745 -684260 -761939 -797693 -763588 -758226 -802590 -802918
34013h02918P0068M9028p576L0866J32610J52356O6451j0836j5453J4033M5868
$$ -802918 -732850 -683822 -691398 -660532 -527922 -375566 -309115 -319951 -335404 -321371 -275503
34002b75503P3777N4646k7016o4532L8347J66922J19122o7606j24512O3103K83059
$$ -275503 -201726 -147080 -174096 -238628 -200281 -33359 85763 18157 -106355 -43252 239807
33991B39807K97613J33336l9087j38520j49985l3499J67592K58065J27356m0302
$$ 239807 537420 670756 631669 493149 343164 309665 477257 735322 862678 822376
33981H22376L782K01804K67620J02435r3645j37291p4453k6227j1844o037k3027
$$ 822376 826158 1027962 1295582 1398017 1304372 1167081 1092628 1066401 1054557 1048520 1025493
33970A025493n8535o3272l8876n1913j02986j00196j4957N8042N2621J9587P781
$$ 1025493 966958 903686 864810 812897 709911 609715 594758 652800 705421 725008 732789
33959G32789j1734m2753k8904R911l4536j49403j58834r691R1729o509j36950
$$ 732789 721055 678302 649398 659309 624773 475370 316536 306845 398574 392065 255115
33948B55115p8241P2164N4635j27884k24376j25557L3469J39299J98785J71690
$$ 255115 176874 249038 303673 175789 -48587 -174144 -140675 -1376 197409 369099
33938C69099j2043k26832k23873j0294J09470j9828j76056j25525K9587O7007
$$ 369099 357056 130224 -93649 -103943 5527 -14301 -190357 -315882 -286295 -219288
33928b19288L31j4814K1914P54n1982j7514P2733O5669m9044j05609j8007J00809
$$ -219288 -218957 -233771 -211857 -211103 -263085 -280599 -207866 -142197 -191241 -296850 -314857 -214048
33916b14048J19361N0893j5895m3211m4300k8625K331L8325O2191N4326Q737l8706
$$ -214048 -94687 -43794 -59689 -102900 -147200 -175825 -173494 -135169 -72978 -18652 -9915 -48621
33904d8621l7015o20m077n8026o9493J0377Q5422N4055k8209l9556J8804N1561
$$ -48621 -85636 -86256 -90333 -148359 -217852 -207475 -122053 -67998 -96207 -135763 -116959 -65398
33892f5398L7854L2226K9851k1820q7863p1161J6781N4006O641p877Q9739K04007
$$ -65398 -27544 4682 34533 12713 -75150 -146311 -129530 -75524 -68883 -76760 12979 216986
33880B16986J91578M9684q6835r5811J7505J25660J00991l2136j04869k4201Q2611
$$ 216986 408564 458248 371413 275602 293107 418767 519758 487622 382753 358552 441163
33869D41163N5993l4779O476J71158K31245Q8499p6641q8906j4595N026j7694
$$ 441163 497156 462377 468853 640011 871256 959755 883114 794208 779613 784639 766945
33858G66945l892J8560q520l7643j7222k3411j17971j74998n2086J40696J70635
$$ 766945 763053 781613 773093 735450 718228 694817 576846 401848 349762 490458 661093
33847F61093M2656j6303O1132P9421o7764j91799j02794Q5639J31876J4435r1363
$$ 661093 703749 687446 748578 827999 760235 568436 465642 551281 683157 697592 606229
33836F06229j00770q1991o7648m754Q8552R3449k2658j28362j11667k7692J9492
$$ 606229 505459 423468 355820 351066 439618 533067 510409 382047 270380 242688 262180
33825B62180L9114Q9373J29671P2114n0699j02722l8238L5802K0997m8497q8098
$$ 262180 301294 390667 520338 592452 541753 439031 400793 436595 457592 409095 320997
33814C20997q1025n3668o437N4984P2084J668r4954j10032l0265M6831M3289n357
$$ 320997 239972 186304 179867 234851 306935 308603 213649 103617 73352 120183 163472 158115
33802A58115m785P5324J49570R8019q3033k34172j98426k4011R4322Q6370Q1949
$$ 158115 153330 228654 378224 476243 393210 159038 -39388 -63399 30923 117293 199242
33791A99242J59748J87150M3985j40815j67424p2137l1803m0379M9949J91673
$$ 199242 358990 546140 590125 449310 281886 209749 177946 137567 187516 379189
33781C79189J50996r3374k57266j71801k3348j4460m5033N0487J69582J16655
$$ 379189 530185 436811 179545 7744 -15604 -30064 -75097 -24610 144972 261627
33771B61627m1378q0655Q657L5973m8692r5228l5870J7365n861k4581K6261Q8999
$$ 261627 220249 139594 148251 184224 135532 40304 4434 21799 15938 -8643 17618 106617
33759A06617R7837O2885M257p2468j17646q0656j8386l1407r5793r7790k4335
$$ 106617 204454 267339 271596 199128 81482 826 -17560 -48967 -144760 -242550 -266885
33748b66885L6510O9862J29219J65895P1487r0130j15482K3272J17046M6418n3873
$$ -266885 -230375 -160513 -31294 134601 206088 115958 476 23748 140794 187212 133339
33737A33339n5892m0022r9585j46752p6194M4351J05693J28281J52743J16939
$$ 133339 77447 37425 -62160 -208912 -285106 -240755 -135062 -6781 145962 262901
33727B62901J948n7038J9332Q6783O409j11431r8273j2022O95j7650M2493Q9411
$$ 262901 264849 207811 227143 313926 320335 208904 110631 98609 99304 81654 124147 213558
33715B13558j4787j33788l2526J84359J82147n1423j54560K6274J90734Q9596
$$ 213558 198771 64983 32457 216816 398963 347540 192980 219254 409988 499584
33705D99584p7738k4528J42131J14566j09380k31416j02944R8554J50847M5286
$$ 499584 421846 397318 539449 654015 544635 313219 210275 308829 459676 504962
33695E04962p3111r2921k4912L2491J0545k9165L0411J65348K02506O9804p7729
$$ 504962 431851 338930 314018 346509 357054 327889 358300 523648 726154 795958 718229
33684G18229q7519l3407o2699j34114r8943K5553P1694o251p1320l6097K0786
$$ 718229 630710 597303 534604 400490 301547 327100 398794 392543 321223 285126 305912
33673C05912J7616m250J5417M8669M8424K7210M671l3836o9511l6212N7870R0926
$$ 305912 323528 319278 334695 383364 431788 458998 463669 429833 360322 324110 381980 472906
33661D72906r32r9589o5896M2861N7065l5680o8222L3450J17033L6065j10122
$$ 472906 471974 372385 306489 349350 406415 370735 302513 335963 452996 489061 378939
33650C78939j13560K9748J14024L5151n8824r01J45006J88263Q3947l7125p4672
$$ 378939 265379 295127 409151 444302 385478 384577 529583 717846 801793 764668 689996
33639F89996n5315k1931L5476R6308P4581n6497j81840j66583k0196J22830J56954
$$ 689996 634681 612750 648226 744534 819115 762618 580778 414195 393999 516829 673783
33628F73783R0937L412m3009n1289p1283j20605j38649o5859M5996Q1659K7320
$$ 673783 764720 768132 725123 673834 602551 481946 343297 277438 323434 405093 432413
33617D32413m774N2726J21260R9797O982o3321o0442N364R3591J30294N6730o2623
$$ 432413 427639 480365 601625 701422 708404 645083 584641 590005 683596 813890 870620 807997
33605H07997p8055L2386J05812M2108l0437K3172R9191L4446p9846k1869J74672
$$ 807997 729942 762328 868140 910248 879811 902983 1002174 1036620 956774 934905 1109577
33594A109577K44672J15239J0186N5337P7109n3039j48573j3111K00666K18757
$$ 1109577 1354249 1469488 1479674 1535011 1612120 1559081 1410508 1397397 1598063 1816820
33584A816820Q5009O3649J85365K21729J06185M5985J40707K04457J12322M0323
$$ 1816820 1901829 1965478 2150843 2372572 2478757 2524742 2665449 2869906 2982228 3022551
33574C022551J53124K97286K73863K22000L97783O87590P27520N02936M35197
$$ 3022551 3175675 3472961 3746824 3968824 4366607 5054197 5781717 6284653 6719850
33565F719850P60795J183707J351894J379371J613662K103942K616651L021077
$$ 6719850 7480645 8664352 10016246 11395617 13009279 15113221 17729872 20750949
33557B0750949L296009L221369K456686J008212o59253k051910k957706l316421
$$ 20750949 24046958 27268327 29725013 30733225 30073972 28022062 25064356 21747935
33549B1747935l122171k597363k156765j970933j780275j350322q84239p13076
$$ 21747935 18625764 16028401 13871636 11900703 10120428 8770106 7885867 7172791
33541G172791p67997p02560m47054k88104l90441n55939n38228l48922j47739
$$ 7172791 6404794 5702234 5255180 4967076 4576635 4020696 3482468 3133546 2985807
33532B985807k3542M948p4158k11115k79572k11737q3978j7813n9389j73133k71671
$$ 2985807 2962265 2967213 2893055 2681940 2402368 2190631 2106653 2088840 2029451 1856318 1584647
33521A584647k49233q9647N6951K5934j29042j93754r4702K1536M4354M7432J00438
$$ 1584647 1335414 1245767 1302718 1328652 1199610 1005856 911154 932690 977044 1024476 1124914
33510A124914J16916K1414q2578o9630k373j4750p2082l6183P3361Q1366o2094
$$ 1124914 1241830 1263244 1180666 1111036 1108663 1093913 1021831 985648 1059009 1140375 1078281
33499A078281j80311j20346K8149P1835m865k5315J13765K75360K51799M5276
$$ 1078281 897970 777624 805773 877608 872743 847428 961193 1236553 1488352 1533628
33489A533628j25935j08162R692N7661K1901P197L3764K5776j6948k8Q6348J23395
$$ 1533628 1407693 1299531 1309223 1366884 1388785 1395982 1429746 1455522 1438574 1438546 1524894 1648289
33477A648289N6816m438L7880J20466J36764J00398Q2433P4601L6152J0986P0329
$$ 1648289 1705105 1700667 1738547 1859013 1995777 2096175 2178608 2253209 2289361 2300347 2370676
33466B370676J77125K28505K13115K12477K54220K81022K82231L40016M84142
$$ 2370676 2547801 2776306 2989421 3201898 3456118 3737140 4019371 4359387 4843529
33457D843529N87769N08941L11718K36746M01668O09161N60671K37618p1953j64585
$$ 4843529 5431298 5940239 6251957 6488703 6890371 7499532 8060203 8297821 8225868 8061283
33447H061283j72772l02443m78572m80129l45622l57604o00350q14738p96097
$$ 8061283 7888511 7586068 7107496 6627367 6281745 5924141 5323791 4509053 3712956
33438C712956o79930o65846o79712n40694l10399k12918k76758l03858j86778
$$ 3712956 3033026 2367180 1687468 1146774 836375 623457 346699 42841 -143937
33429a43937m4140j2096p3571j38971j60612j23526l4328M2490L2344l6017n3904
$$ -143937 -188077 -200173 -273744 -412715 -573327 -696853 -731181 -688691 -656347 -692364 -746268
33418g46268O879M9669J657q2736j14215q6851m3884J3338J03756J80768J53566
$$ -746268 -739389 -689720 -688063 -770799 -885014 -971865 -1015749 -1002411 -898655 -717887 -564321
33407e64321J7727r7494p3509L0294L7854r5631j95211j01845Q9858J59313P6029
$$ -564321 -546594 -644088 -717597 -687303 -649449 -745080 -940291 -1042136 -952278 -792965 -716936
33396g16936K3428J04636J97093J55274J0353j10587j45019r9811n928O0176J7714
$$ -716936 -693508 -588872 -391779 -236505 -226152 -336739 -481758 -581569 -587497 -527321 -509607
33385e09607q8725j11325j0958P9637O6594K0667J4752J484m4848l8872L5949
$$ -509607 -598332 -709657 -720615 -640978 -574384 -553717 -538965 -537481 -582329 -621201 -585252
33374e85252L8016q5993j47614j969J84030J75585L4313j5055L7620K2564p2980
$$ -585252 -547236 -633229 -780843 -782812 -598782 -423197 -388884 -403939 -366319 -343755 -416735
33363d16735q7844J6455R8659P8252J4808m4201r2533o8774O1712J63148Q5222
$$ -416735 -504579 -488124 -389465 -311213 -296405 -340606 -433139 -501913 -440201 -277053 -191831
33352a91831p5634j02227l935J8043p2198j00421k181Q7236R4093R6503J15617
$$ -191831 -267465 -369692 -373627 -355584 -427782 -528203 -530384 -443148 -349055 -252552 -136935
33341a36935O9337k6011n3611k2824m3785o8047M8824K07885J36990j33932k39441
$$ -136935 -67598 -93609 -147220 -170044 -213829 -281876 -233052 -25167 111823 -22109 -261550
33330b61550m3983J35370N4585p7562N5J48115R2609j01948j59262l0306R6576
$$ -261550 -305533 -170163 -115578 -193140 -193085 -44970 47639 -54309 -213571 -243877 -147301
33319a47301J12891N7876l7054j43386j58947l7253Q7076P3747j5445m0312l914
$$ -147301 -34410 23466 -13588 -156974 -315921 -353174 -266098 -192351 -207796 -248108 -252022
33308b52022O181j3839k5396m5998p5006m7129K8179M0970j703N5442K03773J92073
$$ -252022 -245841 -259680 -285076 -331074 -406080 -453209 -425030 -384060 -385763 -330321 -126548 65525
33296F5525n5119k27271r0870J15617O7285j19463j21031L5812O9469m1161o7155
$$ 65525 10406 -216865 -307735 -192118 -124833 -244296 -365327 -329515 -260046 -301207 -368362
33285c68362K0601L0615n0810l7653Q1799J24271P2630Q8624J48318M5877j90243
$$ -368362 -347761 -317146 -367956 -405609 -323810 -199539 -126909 -38285 110033 155910 -34333
33274c4333k66473r8207M5815j1370j03253n0801O4460J09252J04511P9386k0520
$$ -34333 -300806 -399013 -353198 -364568 -467821 -518622 -454162 -344910 -240399 -161013 -181533
33263a81533j44100j12979P2653J61919L1342j17643r2249J1322K9946m107m316
$$ -181533 -325633 -438612 -365959 -204040 -172698 -290341 -382590 -371268 -341322 -345429 -349745
33252c49745r440l8979J3648J57459J92561K2819j36595q4288M5162L1126n6360
$$ -349745 -359185 -398164 -384516 -227057 -34496 -11677 -148272 -232560 -187398 -156272 -212632
33241b12632j2553J22872J43013L0415n0573n2765o6735q5107r181J18944J32381
$$ -212632 -225185 -102313 40700 71115 20542 -32223 -98958 -184065 -193246 -74302 58079
33230E8079N091j03501r1669k6023P686J989l7235j00217j07507J3789J70146
$$ 58079 63170 -40331 -132000 -158023 -150337 -148348 -185583 -285800 -393307 -379518 -209372
33219b09372J66261l2019k23578k09498j5722J59623J59480P802j25963j08085
$$ -209372 -43111 -75130 -298708 -508206 -523928 -364305 -204825 -197023 -322986 -431071
33209d31071L02K3829o9142j09319L795J23960Q6700k1733j5315P6279P3989k6350
$$ -431071 -430769 -406940 -476082 -585401 -581606 -457646 -370946 -392679 -407994 -331715 -257726 -284076
33197b84076m7903N1453J07393M0451j3627M6004J08609M6639p5851j23040r0604
$$ -284076 -331979 -280526 -173133 -132682 -146309 -100305 8304 54943 -20908 -143948 -234552
33186b34552n8064l6970N009M3012L7292J8732K5457R516q2303j79436j58562
$$ -234552 -292616 -329586 -324577 -281565 -244273 -225541 -200084 -190568 -272871 -452307 -610869
33175f10869k4966Q7691R7813N6450L5929L1529Q334k4675l2691q970K0274K1983
$$ -610869 -635835 -548144 -450331 -393881 -357952 -326423 -318089 -342764 -375455 -384425 -364151 -342168
33163c42168k0932q2232q9710K418J32673J79899J09084J1771k3459j5190k4030
$$ -342168 -363100 -445332 -535042 -532624 -399951 -220052 -110968 -99197 -122656 -137846 -161876
33152a61876n2049o7055o5157l9661M5323J60809J67291n467j90000j61366L7308
$$ -161876 -213925 -280980 -346137 -385798 -340475 -179666 -12375 -17842 -207842 -369208 -331900
33141c31900J42336N4533m0442J683O9066L4144o452P7402J88482J55780K9355
$$ -331900 -189564 -135031 -175473 -173790 -104724 -70580 -77032 370 188852 344632 373987
33130C73987r836M8583O7004K9687N4929J58918K29130K32628K49697K99492L24256
$$ 373987 364151 412734 479738 509425 564354 723272 952402 1185030 1434727 1734219 2058475
33119B058475L43520M33557N62754O40264P04392Q48335R85132R26579O77613
$$ 2058475 2401995 2835552 3398306 4038570 4742962 5591297 6576429 7503008 8180621
33110H180621L96597R3314l25073p20093q07002o29601n61302p20763p87503n69797
$$ 8180621 8577218 8670532 8345459 7625366 6818364 6188763 5627461 4906698 4119195 3549398
33100C549398l43384l70103m63218l57296j79763j81776k69978k04301n3168m8955
$$ 3549398 3206014 2835911 2372693 2015397 1835634 1653858 1383880 1179579 1126411 1077456
33090A077456j48334j33204k8955l3204j19066r4131Q070k3582j69768j90430
$$ 1077456 929122 795918 766963 733759 614693 520562 528632 505050 335282 144852
33080A44852m0911O8400M2374L534M039m7201j38316j37209n3467l1265o3305
$$ 144852 103941 172341 214715 218249 222288 175087 36771 -100438 -153905 -185170 -248475
33069b48475q279R5152N5696r8209j13195N8740J63091O6151n3712m7172n756
$$ -248475 -256754 -161602 -105906 -204115 -317310 -258570 -95479 -29328 -83040 -130212 -135968
33058a35968q559K6528R6914L4003j66806k37313m6928J60860J45394J5231j7966
$$ -135968 -144527 -117999 -21085 12918 -153888 -391201 -438129 -277269 -131875 -116644 -134610
33047a34610K1468J3155j0175O644k8807j55081j86137N441K18109J96664J5982
$$ -134610 -113142 -99987 -110162 -103518 -132325 -287406 -473543 -468102 -249993 -53329 -37347
33036c7347p4345m0211k3904m2901j1818K9504j3578o3954J6343J45381J17835
$$ -37347 -111692 -151903 -175807 -218708 -230526 -201022 -214600 -278554 -262211 -116830 1005
33025A005m9355j27308l0644P5814N2589l6746o7405j6996M9782N3830l7970j43282
$$ 1005 -48350 -175658 -206302 -130488 -77899 -114645 -182050 -199046 -149264 -95434 -133404 -276686
33013b76686j12734N9145J72747R8536j6955N760O9996k3349k00242k01365m198
$$ -276686 -389420 -330275 -157528 -58992 -75947 -70187 -191 -23540 -223782 -425147 -429345
33002d29345J37495R1047M108J1750L9732p528p6681q8495n9392j0641Q3352J73967
$$ -429345 -291850 -200803 -196695 -184945 -145213 -152741 -229422 -317917 -377309 -387950 -304598 -130631
32990a30631J31121m2561j44648m1190J26733J38782k227j08570q6735k8337k8254
$$ -130631 490 -42071 -186719 -227909 -101176 37606 35379 -73191 -159926 -188263 -216517
32979b16517m2225K0977J37474J80334R3636j6061j5256P6865J36387J39549J87998
$$ -216517 -258742 -237765 -100291 80043 173679 157618 142362 219227 355614 495163 683161
32968F83161L10155L93685L85609L99565N08500N80155M67533K28542r835k62684
$$ 683161 993316 1387001 1772610 2172175 2680675 3260830 3728363 3956905 3947070 3684386
32958C684386n52260p01486n42895k54970j79890l22198l47626j22046P4342o882
$$ 3684386 3132126 2430640 1887745 1632775 1452885 1130687 783061 661015 735357 728475
32948G28475k10996k46157j06603q500l4537o3155p513N3466R814j06212j32945
$$ 728475 517479 271322 164719 156219 121682 58527 51014 104480 114294 8082 -124863
32937a24863K4303K24577K07283n9993k70721j67767P1960P9510j47967k41624
$$ -124863 -100560 124017 331300 271307 586 -167181 -95221 -15711 -163678 -405302
32927d05302l4423J93588J63249j3926q3912l7604j8759l3144N138O3158N1038
$$ -405302 -439725 -246137 -82888 -96814 -180726 -218330 -237089 -270233 -265095 -201937 -150899
32916a50899M323Q126K2181l4280j03274p6436Q340L5497J0842K0257N7675O7291
$$ -150899 -146576 -138450 -116269 -150549 -253823 -330259 -321919 -286422 -275580 -255323 -197648 -130357
32904a30357Q3268J41014J27637o1432k75830k64041n0830Q9565M4140j6065L0113
$$ -130357 -47089 93925 221562 160130 -115700 -379741 -430571 -341006 -296866 -312931 -282818
32893b82818O5448j3008r3435n6717R126k0281p2332q794J16568J32489K3883
$$ -282818 -217370 -230378 -323813 -380530 -371404 -391685 -464017 -472811 -356243 -223754 -199871
32882a99871n8291l9666l147k0148n3534n7116m2431j1821N5476J11189N7747
$$ -199871 -258162 -297828 -300975 -321123 -374657 -431773 -474204 -486025 -430549 -319360 -261613
32871b61613p7916j18530J6043J51438R1209p9686j09199L6647J17415q988j65704
$$ -261613 -339529 -458059 -442016 -290578 -199369 -279055 -388254 -351607 -234192 -243180 -408884
32860d08884j30132L7036J08069K9064m6926k0759M5262P6505P3150K8289q4111
$$ -408884 -539016 -501980 -393911 -364847 -411773 -432532 -387270 -310765 -237615 -209326 -293437
32849b93437j99660j86394l5161R5654Q4788j2967q3780r4642o0754N291M7822
$$ -293437 -493097 -679491 -714652 -618998 -534210 -547177 -630957 -725599 -786353 -781062 -733240
32838g33240k470q4360l5128J44089K13221K5183k16018k18750j4160J16722O0493
$$ -733240 -735710 -820070 -855198 -711109 -497888 -472705 -688723 -907473 -921633 -804911 -744418
32827g44418k4059j1474K0221j4713m6635R566R5404J06989N7068K8512K6678
$$ -744418 -768477 -779951 -759730 -774443 -821078 -811512 -716108 -609119 -552051 -523539 -496861
32816d96861j7724j18897j89177j35505K7541J71603J69519L0629r9282j04465
$$ -496861 -514585 -633482 -822659 -958164 -930623 -759020 -589501 -558872 -658154 -762619
32806g62619l4160j5584o4900p5847M045Q6566P1242j5780o6511k6981O3554J38689
$$ -762619 -796779 -812363 -877263 -953110 -949065 -862499 -791257 -807037 -873548 -900529 -836975 -698286
32794f98286J61715J30376O7338J2839M015M6000J06230J52591K04213L17011
$$ -698286 -536571 -406195 -338857 -326018 -322003 -276003 -169773 -17182 187031 504042
32784E04042M85118N88992N19977L54675L01555M31671N64804N02561K87888J28104
$$ 504042 989160 1578152 2098129 2452804 2754359 3186030 3750834 4253395 4541283 4669387
32774D669387J24894K00338K47474K22756J04682j06420l28098m39996m13767
$$ 4669387 4794281 4994619 5242093 5464849 5569531 5463111 5135013 4695017 4281250
32765D281250l24355k35891j66286j54203k42358l73925m15844l21472j80319
$$ 4281250 3956895 3721004 3554718 3400515 3158157 2784232 2368388 2046916 1866597
32756A866597q2703l2811k0346o4853j39729j56165q4905q365K365k4769m7585
$$ 1866597 1783894 1751083 1730737 1665884 1526155 1369990 1285085 1276720 1279085 1254316 1206731
32745A206731p9178j07008n5285P4790J30825M647j73352j84311k8306P3180j1507
$$ 1206731 1127553 1020545 965260 1040050 1170875 1175522 1002170 817859 789553 862733 851226
32734H51226j53695j55354n557J26892J03541m2272j56771j28428n268N4775k7228
$$ 851226 697531 542177 536620 663512 767053 724781 568010 439582 434314 489089 461861
32723D61861j36547r8601Q0635J95320R8067j01783j77273p3724M8495O1151L3944
$$ 461861 325314 226713 307348 502668 600735 498952 321679 247955 296450 357601 391545
32712C91545Q1002J41415N7207j51887k57809j31327O0349Q4616l0257o8003K6904
$$ 391545 472547 613962 671169 519282 261473 130146 190495 275111 244854 176851 203755
32701B03755P8166j6836j13144n6364O6061O9447l6049q1216k2134O09r1685j75891
$$ 203755 281921 265085 151941 95577 161638 231085 195036 113820 91686 92295 610 -175281
32689a75281j07247P3685J99847J74740M0790r3331j29221l2344J22365J92117
$$ -175281 -282528 -208843 -8996 165744 206534 113203 -16018 -48362 74003 266120
32679B66120J12020l0991j14407j17460q3827k0822O1914P6935l2470j39087o1464
$$ 266120 378140 347149 232742 115282 31455 10633 72547 149482 117012 -22075 -83539
32668h3539J42992K10056N3744q9707k6211R4783M4008r4471o8273J03780J51032
$$ -83539 59453 269509 323253 233546 207335 302118 346126 251655 183382 287162 438194
32657D38194l573j33446j00280n0017r7385j01812N5945K14837J79432L8231m497
$$ 438194 434621 301175 200895 150878 53493 -48319 7626 222463 401895 440126 435629
32646D35629L7536K2678j9138M0750J33727O5551j33738k10788o7561J07007J31222
$$ 435629 473165 495843 476705 517455 651182 716733 582995 372207 304646 411653 542875
32635E42875L9442n2938r2633n0332O5552J19020k2026k26075k06253M7366K04203
$$ 542875 582317 529379 436746 386414 451966 570986 548960 322885 116632 163998 368201
32624C68201P4151j14798r1976N1577O9479k6042l6127N7831Q2055j8849j06866
$$ 368201 442352 327554 235578 287155 356634 330592 294465 352296 434351 415502 308636
32613C08636q7109j7846K9522N2321M3382j7599q2744p1579Q92M1112J9612j0800
$$ 308636 221527 203681 233203 285524 328906 311307 228563 156984 157876 198988 218600 207800
32601B07800k8464n9012q3751m8813K7940O3427K9068k5172n7574n7417q254O8977
$$ 207800 179336 120324 36573 -12240 15700 79127 108195 83023 25449 -31968 -40222 28755
32589B8755P4696l9300j36831n5952J18508J35712m3840j63555m7989J33911J28375
$$ 28755 103451 64151 -72680 -128632 -10124 125588 81748 -81807 -129796 4115 132490
32578A32490l3755j13474k2698Q7525P8417p146n6883m3077j0874M024p222l8926
$$ 132490 98735 -14739 -37437 50088 128505 121359 64476 21399 10525 14549 7327 -31599
32566c1599n7942j6055Q6865J77107J77118Q8089j8143p4061o2627o920N2873
$$ -31599 -89541 -105596 -18731 158376 335494 423583 405440 331379 268752 261832 314705
32555C14705P4901M1900j5017m0347j6139J6230Q085m0982r2588j12211q6083
$$ 314705 389606 431506 416489 376142 360003 376233 384318 343336 250748 138537 52454
32544E2454k4704K5146O298p1793j16155o2118L0234N6560J4658j2961r47j491
$$ 52454 27750 52896 59194 -12599 -128754 -190872 -160638 -104078 -89420 -102381 -103328 -104819
32532a04819k4408j2913L7231N1297J0593m611L1053J5187j03624j84592p0561
$$ -104819 -129227 -142140 -104909 -53612 -43019 -47630 -16577 -1390 -105014 -289606 -360167
32521c60167J58028K52092J06523j16397j93434q3918O2514R3009J6688k1253
$$ -360167 -202139 49953 156476 40079 -153355 -237273 -174759 -81750 -65062 -86315
32511h6315N9009J35476L8176j73701k38396n0874J64658J60213N52p1491L429
$$ -86315 -27306 108170 146346 -27355 -265751 -316625 -151967 8246 8798 -62693 -59264
32500e9264P6298O3930L1652J5065l2592r1208o3245M0092P5247j0074r1137p7008
$$ -59264 17034 80964 112616 127681 95089 3881 -59364 -19272 55975 45901 -45236 -122244
32488a22244m9135r2100j30970o4489N0814Q8630M8817K9115N0477M2883j5816
$$ -122244 -171379 -263479 -394449 -458938 -408124 -319494 -270677 -241562 -191085 -148202 -164018
32477a64018o5638o7595m1585O20O3219R5739J9196j32707j91032n0008J69337
$$ -164018 -229656 -297251 -338836 -338216 -274997 -179258 -160062 -292769 -483801 -533809 -364472
32466c64472K48517J39641K226l0199j725m042j6672J3541K5971o3603j70584
$$ -364472 -115955 23686 25912 -4287 -6012 -10054 -26726 -13185 12786 -50817 -221401
32455b21401j21598O3870J58245M7974j05547j17139k4788L4631M5627O1721N9715
$$ -221401 -342999 -279129 -120884 -72910 -178457 -295596 -320384 -285753 -240126 -178405 -118690
32444a18690R058j8609K7818N1098k6783q3511R958J24757N7838r9664p5735J26408
$$ -118690 -109632 -128241 -100423 -49325 -76108 -159619 -149661 -24904 32934 -66730 -142465 -16057
32432a6057K05661L7315j43644j31419l1429j2361l8194k4045l1335j05423j13104
$$ -16057 189604 226919 83275 -48144 -79573 -91934 -130128 -154173 -185508 -290931 -404035
32421d04035L5301J61519N8658j60133k00757r346J82432K02058J03412p275r7754
$$ -404035 -368734 -207215 -148557 -308690 -509447 -518793 -336361 -134303 -30891 -38166 -135920
32410a35920j27680l5329J19993J56586M554j69621j67024n083J31483J33578
$$ -135920 -263600 -298929 -178936 -22350 -17796 -187417 -354441 -359524 -228041 -94463
32400i4463N9404M8m2612j03100j45643r0764N6205J75407J67861P4485R991P985
$$ -94463 -35059 -35011 -77623 -180723 -326366 -417130 -360925 -185518 -17657 56828 66819 74804
32388G4804n207q4017j64842j22265P6471K78157K50095m9492l39867k95722K5805
$$ 74804 69597 -14420 -179262 -301527 -225056 53101 303196 253704 -86163 -381885 -356080
32377c56080K19878P6413j31774p7952J21646J29310n2208j13445J7797P1644
$$ -356080 -136202 -59789 -191563 -269515 -147869 -18559 -70767 -184212 -166415 -94771
32367i4771o7869j54077j4419J50014J14767n880L074Q7760O5160l8012n8851
$$ -94771 -162640 -316717 -331136 -181122 -66355 -72235 -69161 18599 83759 45747 -13104
32356a3104L111J2987m7712p6848m5723j0447J9400O2529P7824L8914J7589N3208
$$ -13104 -9993 2994 -44718 -121566 -167289 -177736 -158336 -95807 -17983 20931 38520 91728
32344I1728M4879o6884j32855q767J69063J51511m6640j71713j02297K5900O2612
$$ 91728 136607 69723 -63132 -71899 97164 248675 202035 30322 -71975 -46075 16537
32333A6537J0840o2003j11883j01140l0487J5590k4964p3876k6405P2271J07685
$$ 16537 27377 -34626 -146509 -247649 -278136 -262546 -287510 -361386 -387791 -315520 -207835
32322b07835Q6945Q3846O2385m9361j60038j06288P3056J65160R1784q003k0357
$$ -207835 -120890 -37044 25341 -24020 -184058 -290346 -217290 -52130 39654 31651 11294
32311A1294R699K0785L4762O1460M5767l8481j40962k00113j80344p4162N0639
$$ 11294 20993 41778 76540 138000 183767 145286 4324 -195789 -376133 -450295 -399656
32300c99656P5759J943j5115P8661J01995n3641j68701k3418J87397J24717j26499
$$ -399656 -323897 -321954 -337069 -258408 -156413 -210054 -378755 -402173 -214776 -90059 -216558
32289b16558j78570J6953J10559k3984q9860P5431K03784Q1142q1280m2789N3240
$$ -216558 -395128 -378175 -267616 -291600 -381460 -306029 -102245 -21103 -102383 -145172 -91932
32278i1932j5430j28083n9477R1334P8391n2642o6385L7127N3375l7170n0808
$$ -91932 -107362 -235445 -294922 -203588 -125197 -177839 -244224 -207097 -153722 -190892 -241700
32267b41700M5067P2652l5716j30805j09361m8557j8322L1487J20862J54512P6449
$$ -241700 -196633 -123981 -159697 -290502 -399863 -448420 -466742 -435255 -314393 -159881 -83432
32256h3432k4873m7717r857J6782J6285J0869J817j3773j3824J4596M0542K2456
$$ -83432 -108305 -156022 -165879 -149097 -132812 -121943 -120126 -133899 -147723 -133127 -92585 -70129
32244g0129l6648q6248q0054k5503K8425N6667Q0590J01729O9294k0432n4786
$$ -70129 -106777 -193025 -273079 -298582 -270157 -213490 -132900 -31171 38123 17691 -37095
32233c7095M9817J77578J42893k3740j01887j6758N3784j8502j05425m7831Q2069
$$ -37095 12722 190300 333193 309453 207566 190808 244592 226090 120665 72834 154903
32222A54903J09164K5453l7403k5690J409L986j481k537P359M4355Q0861M3918
$$ 154903 264067 289520 252117 226427 227836 231822 230341 227804 235163 279518 360379 404297
32210D04297o4649j30578q2353Q648N3874O3327N8551J081r3103j06879j1794
$$ 404297 339648 209070 126717 135365 189239 252566 311117 312198 219095 112216 100422
32199A00422L5388o9294j79597j13065N6421J14525K5505o4298p9534p5384p8628
$$ 100422 135810 66516 -113081 -226146 -169725 -55200 -29695 -93993 -173527 -248911 -327539
32188c27539n0376K891K5016R09n7829j62968k71099k40710j4332K36077L03230
$$ -327539 -377915 -375024 -350008 -349099 -406928 -569896 -840995 -1081705 -1096037 -859960 -556730
32177e56730K07584J08264M6979k6737o4019J8677J31768J01519n0632j32894
$$ -556730 -349146 -240882 -193903 -220640 -284659 -265982 -134214 -32695 -83327 -216221
32167b16221p6299N171L6353M8851L1860o3189j59399j19090Q867L4639n1011
$$ -216221 -292520 -287349 -250996 -202145 -170285 -233474 -392873 -511963 -503096 -468457 -519468
32156e19468m6514J09715K11098J11264n1090r5625o7396r3497j35027p2265O2534
$$ -519468 -565982 -456267 -245169 -133905 -184995 -280620 -348016 -441513 -576540 -648805 -586271
32145e86271J18709N3175j7886J1375J05851J39814M4205r9035j30010j2095R2461
$$ -586271 -467562 -414387 -432273 -420898 -315047 -175233 -131028 -230063 -360073 -372168 -279707
32134b79707L1932j08358j22204J3170J15895P8579r143m5483n1048o5505o4954
$$ -279707 -247775 -356133 -478337 -465167 -349272 -270693 -279836 -325319 -376367 -441872 -506826
32123e06826m4260m6052n7452j3092O1482O1680l046k652P4780P4890m7820j14164
$$ -506826 -551086 -597138 -654590 -667682 -606200 -544520 -547566 -550218 -475438 -400548 -448368 -562532
32111e62532p838J18706R6033K2386Q6301K32907K45464R8358l192O4548J89765
$$ -562532 -570370 -451664 -355631 -333245 -246944 -14037 231427 329785 326593 391141 580906
32100E80906K20865J57817Q5182L0778k8077p9880p6804r146N9176M8564m3332
$$ 580906 801771 959588 1044770 1075548 1047471 967591 890787 881641 940817 989381 946049
32089I46049j26570j20816n5480k5947o1009r1743n6678J9876O9984N8655Q214
$$ 946049 819479 698663 643183 617236 556227 464484 407806 427682 497666 556321 564535
32078E64535k2202R803O7867O1882k7384j07456j13144j00678j15592p5720P1067
$$ 564535 542333 552136 620003 681885 654501 547045 433901 333223 217631 141911 212978
32067B12978J77473Q3915r8676j26669l146M3432m4526p2181L9044J01597j165
$$ 212978 390451 474366 375690 249021 245875 289307 244781 172600 211644 313241 312076
32056C12076j05911o1276J7285k0714q9436m8318K4076j9787j05399m5421J38588
$$ 312076 206165 144889 162174 141460 52024 3706 27782 7995 -97404 -142825 -4237
32045d237K34574J45828j0794r2804o8617Q870M5056l8290j87249k27373r0046
$$ -4237 230337 376165 365371 272567 203950 212820 257876 219586 32337 -195036 -285082
32034b85082P0106R7282N2637O4146Q8086J6357p8773l5894J08299J49408K8848
$$ -285082 -214976 -117694 -65057 -911 87175 103532 24759 -11135 97164 246572 275420
32023B75420q6661o5213K2217L7888m6666j48657j60136l0540J62408K51316J65547
$$ 275420 188759 123546 145763 183651 136985 -11672 -171808 -202348 -39940 211376 376923
32012C76923K4865l8113n8160j15512j41400l3106J10377R1893o5051j27347o176
$$ 376923 401788 363675 305515 190003 48603 15497 125874 217767 152716 25369 19193
32001A9193J14816O9265o2136j07098m1820K8701K9821l2002j04088j09211j481
$$ 19193 134009 203274 141138 34040 -7780 20921 50742 18740 -85348 -194559 -196040
31990a96040J47193J86103O4763q7952j18196l2621K7223k9578j34986j47522
$$ -196040 -48847 137256 202019 114067 -4129 -36750 -9527 -39105 -174091 -321613
31980c21613k4278J21257J53780P9490J3638K096j9832p0281n3463P3776J83116
$$ -321613 -345891 -224634 -70854 8636 22274 24370 4538 -65743 -119206 -45430 137686
31969A37686J34959k2687j27161j08739k1198P0097J21627R0862j1295r6129j10941
$$ 137686 272645 249958 122797 14058 -7140 62957 184584 275446 264151 168022 57081
31958E7081j07568j17606o8240O3358J33782K9803j21587j20213R794P7985K0402
$$ 57081 -50487 -168093 -236333 -172975 -39193 -9390 -130977 -251190 -241396 -163411 -143009
31947a43009n7516q1742o2620R808J30567J80896O6448q1052n4196J02706J44523
$$ -143009 -200525 -282267 -344887 -335079 -204512 -23616 42832 -38220 -92416 10290 154813
31936A54813P11j33634j07239Q232Q9976J10926P0479k9730j00118l8365P8636
$$ 154813 155524 21890 -85349 -77117 12859 123785 194264 164534 64416 26051 104687
31925A04687O8255o9270j42569p6385j006Q167L9196J21099J33557L5433m1943
$$ 104687 172942 103672 -38897 -115282 -116288 -108121 -68925 52174 185731 221164 179221
31914A79221l2212m1628j12399j13227L120O9821p022o2313L7036J34488M7189
$$ 179221 147009 105381 -7018 -120245 -117125 -47304 -54326 -116639 -79603 54885 102074
31903A02074j01355p8011O5250P6870q0417j72668n4875J33386J78154M4751j27157
$$ 102074 719 -77292 -12042 64828 -15589 -188257 -243132 -109746 68408 113159 -13998
31892a3998j87230j01249L5302J03871R2266P5051P0850K0690p1607j05444l9159
$$ -13998 -201228 -302477 -267175 -163304 -71038 4013 74863 95553 23946 -81498 -120657
31881a20657M6646R2611J28459J45719P1311n6655p4793L8047P7912n8304j68236
$$ -120657 -74011 18600 147059 292778 364089 307434 232641 270688 348600 290296 122060
31870A22060n6175J35130J41755j3639r3246l4819l946q5798j67220j41628l8672
$$ 122060 65885 201015 342770 329131 235885 201066 197120 111322 -55898 -197526 -236198
31859b36198P2723J54596J59243N5960q5969j49621j08303k8202L7611P3122O2255
$$ -236198 -163475 -8879 150364 206324 120355 -29266 -137569 -165771 -128160 -55038 7217
31848G217J5356j6723k6153o7962j29405j02352J8319O1077n6645j49185l7680
$$ 7217 22573 5850 -20303 -88265 -217670 -320022 -301703 -240626 -297271 -446456 -484136
31837d84136J44850J56377L1539m647P3360Q2015j8825o0206J9572O4105k4069
$$ -484136 -339286 -182909 -151370 -156017 -82657 -642 -19467 -79673 -60101 4004 -20065
31826b0065j25046j10015k1943L8653N3307L6473j6808p0206n2891K2951N8135
$$ -20065 -145111 -255126 -277069 -238416 -185109 -148636 -165444 -235650 -288541 -265590 -207455
31815b07455J0403n8254q5660n6890L4077J46786J53922n574j66406j17266P4799
$$ -207455 -197052 -255306 -340966 -397856 -363779 -216993 -63071 -68645 -235051 -352317 -277518
31804b77518J32079k9032j86295j54895k0605N6580O7629O5803K5009p5887j52084
$$ -277518 -145439 -174471 -360766 -515661 -536266 -479686 -412057 -346254 -321245 -397132 -549216
31793e49216j23321l7320J3153J6068P682l975j6450r929l52m1079j31875k03402
$$ -549216 -672537 -709857 -696704 -680636 -672954 -676929 -693379 -703308 -703660 -744739 -876614 -1080016
31781a080016k20868k21874k33511k40942k51340k97528l72060m45141n29711
$$ -1080016 -1300884 -1522758 -1756269 -1997211 -2248551 -2546079 -2918139 -3363280 -3892991
31772c892991o29019o65553n94776n28397n64803n52235k54199K61634O52465
$$ -3892991 -4522010 -5187563 -5782339 -6310736 -6875539 -7427774 -7681973 -7420339 -6767874
31763f767874P44445O95848O73497O39377N46649M76345M48930L46632J67251
$$ -6767874 -6023429 -5327581 -4654084 -4014707 -3468058 -2991713 -2542783 -2196151 -2028900
31754b028900J13389K61059L74089K50470M3784J3036J29978J79195J10387M2858
$$ -2028900 -1915511 -1654452 -1280363 -1029893 -986109 -973073 -843095 -663900 -553513 -510655
31744e10655J6090k7537p1067m2844K9041N2847K7137J8622L5864M7129O0340
$$ -510655 -494565 -522102 -593169 -636013 -606972 -554125 -526988 -508366 -472502 -425373 -365033
31733c65033P7132N0453j3652k3718K7527P856j16980j63967j5668J55027J46416
$$ -365033 -287901 -237448 -251100 -274818 -247291 -239435 -356415 -520382 -536050 -381023 -234607
31722b34607M5092M2857R1402J9399j22096j33235j5080N0179K6187L6498P4613
$$ -234607 -189515 -146658 -55256 -35857 -157953 -291188 -306268 -256089 -229902 -193404 -118791
31711a18791K488j46054j56859J2728J41525Q4095l4449n4311q38L2096M0654
$$ -118791 -116303 -262357 -419216 -406488 -264963 -180868 -215317 -269628 -270466 -238370 -197716
31700a97716N3759N7493N1385O2032O2919M188o6959n7592J339j299n1003l0828
$$ -197716 -143957 -86464 -35079 26953 89872 94060 27101 -30491 -29152 -30451 -81454 -112282
31688a12282N1323O4064o361l3082R592R643m1818j7832P9704P9717m9139j11197
$$ -112282 -60959 3105 -3256 -36338 -26746 -17103 -58921 -76753 2951 82668 33529 -77668
31676g7668j9436M5040m1620j17718k4790J04498P2277n5930q3964m437M0750
$$ -77668 -97104 -52064 -93684 -211402 -236192 -131694 -59417 -115347 -199311 -203748 -162998
31665a62998P816m5689j03054j45800p9105J08306K22891J10534q4063j17707
$$ -162998 -155182 -200871 -303925 -449725 -528830 -420524 -197633 -87099 -171162 -288869
31655b88869m483O5601O6525J17845J84636J01096r9206j73066m7391O1407J474
$$ -288869 -293352 -227751 -161226 -43381 141255 242351 143145 -29921 -77312 -15905 -14431
31644a4431r3345o8985p811l6856o3277O9492K67805K73409M4365j65153j52499
$$ -14431 -107776 -176761 -184572 -221428 -284705 -215213 52592 326001 370366 205213 52714
31633E2714j9957J4139p0803j13895m4760K0939j8718r3377q1355P848P7372J02346
$$ 52714 32757 46896 -23907 -137802 -182562 -161623 -180341 -273718 -355073 -347225 -269853 -167507
31621a67507J23340J25775O5179q760l917M3506J5051o5166m7480O1367O0014
$$ -167507 -44167 81608 146787 138027 134110 177616 192667 127501 80021 141388 201402
31610B01402j06105k00506n8948J18151O5386j24716j52560J9496J39369O8804
$$ 201402 95297 -105209 -164157 -46006 19380 -105336 -257896 -238400 -99031 -30227
31600c0227o1678j12018r6744m9330N2051J58841J46870J1791r1343o7050R098
$$ -30227 -91905 -203923 -300667 -349997 -297946 -139105 7765 19556 -71787 -138837 -129739
31589a29739M5996N0820L8602j4018o8077l2661O2825O7735m8712j22244m6365
$$ -129739 -83743 -32923 5679 -8339 -76416 -109077 -46252 21483 -27229 -149473 -195838
31578a95838O6105Q0896M0124L3567K2352n4327j19105p0968K9239N0890M189
$$ -195838 -129733 -48837 -8713 24854 47206 -7121 -126226 -197194 -167955 -117065 -112876
31567a12876Q26N1532N6737j9937r9614j05261l4103O9564J32615Q0556o7005
$$ -112876 -112050 -60518 -3781 -23718 -123332 -228593 -262696 -193132 -60517 20039 -46966
31556d6966j68967j18386J6750R1550O7324N072n6593j02301p9228L2215J29082
$$ -46966 -215933 -334319 -317569 -226019 -158695 -153623 -210216 -312517 -391745 -359530 -230448
31545b30448R9773p495o2148n6130p6683j05071k8497J33184J99590Q8938n2319
$$ -230448 -130675 -138170 -200318 -256448 -333131 -438202 -466699 -333515 -133925 -44987 -97306
31534i7306o1540K4644N8731p918r3132j01482j0637J11661J45966L9263r9090
$$ -97306 -158846 -134202 -75471 -83389 -176521 -278003 -288640 -176979 -31013 8250 -90840
31523i0840j04641K2309J11290O6094j1633k256N7004O8356L2917L452l1149r3377
$$ -90840 -195481 -173172 -61882 4212 -7421 -9677 47327 115683 148600 152052 120903 27526
31511B7526j21436n4482L6895L4453m3858o9371Q9O7320M7672k8392q3287q1953
$$ 27526 -93910 -148392 -111497 -77044 -120902 -190273 -190184 -122864 -75192 -103584 -186871 -268824
31499b68824l6549J4972K8026J313n792L7975O4516P449o1628j5701J17773J64262
$$ -268824 -305373 -290401 -262375 -261062 -266854 -228879 -164363 -156914 -218542 -234243 -116470 47792
31487D7792N0188q2989p5989L9727J12683P7335J183l2834j2825J8735J6090k9212
$$ 47792 97980 14991 -60998 -21271 91412 168747 169930 137096 124271 143006 159096 129884
31475A29884p5537p5931l9876j2354N198M6102Q3245L5704q9188j56034p6223
$$ 129884 54347 -21584 -61460 -73814 -68616 -22514 60731 96435 7247 -148787 -225010
31464b25010N6666R5989M3738J8786O4401J01239O4084j5576p4650q4593l7925
$$ -225010 -168344 -72355 -28617 -9831 54570 155809 219893 204317 129667 45074 7149
31453G149N9774J61132J92921J24850j022j05051j15330j6779J03850J15046Q520
$$ 7149 66923 228055 420976 545826 544804 439753 324423 307644 411494 526540 535060
31442E35060n0238O5301K40778K67132J45747P2312J17698J27253j893j41097
$$ 535060 484822 550123 790901 1058033 1203780 1276092 1393790 1521043 1519150 1378053
31432A378053j45434q2807r5485j62820j72930j30759j10355p7629L4746J25306
$$ 1378053 1232619 1149812 1054327 891507 718577 587818 477463 399834 434580 559886
31422E59886K7842j82627k29554l9699J22783M2812j31353j33138K0119Q7204
$$ 559886 587728 405101 175547 135848 258631 301443 170090 36952 57071 144275
31412A44275j6399j21654q2329M4737J32766J43601R6133K679r1709j05225l0852
$$ 144275 127876 6222 -76107 -31370 101396 244997 341130 343809 252100 146875 116023
31401A16023K4776j3046p3347n3444J6551K6803l1782n7189p484L0146j8488r1239
$$ 116023 140799 127753 54406 962 17513 44316 12534 -44655 -52139 -21993 -40481 -131720
31389a31720p5225L1615J11770P0235n7385j41197q7325N9766J47353P6022p2916
$$ -131720 -206945 -175330 -63560 6675 -50710 -191907 -279232 -219466 -72113 3909 -69007
31378f9007j25349l7675M7202R482p1429m4036P5049J18225J2510j21451j43792
$$ -69007 -194356 -232031 -184829 -175347 -246776 -290812 -215763 -97538 -85028 -206479 -350271
31367c50271n7517M9702J25178J47883R3039j4681p3506j9107P1549P3913j3483
$$ -350271 -407788 -358086 -232908 -85025 8014 -6667 -80173 -99280 -27731 46182 32699
31356C2699p4077l7069M0456O1807M984o3006n7147L4879J18864Q6602l6750j01284
$$ 32699 -41378 -78447 -37991 23816 28800 -34206 -91353 -56474 62390 148992 112242 10958
31344A0958l4742M2915p357j28825j49858l6023P8151R6330N7711J9678j2753
$$ 10958 -23784 19131 11774 -117051 -266909 -302932 -224781 -128451 -70740 -51062 -63815
31333f3815j2524O6656J61715J22464n7749j74305q3199Q4681J16207J6943m4749
$$ -63815 -76339 -9683 152032 274496 216747 42442 -40757 43924 160131 177074 132325
$$ [...]
##END NTUPLES=NMR SPECTRUM
##END=
