##TITLE=31Pdec_LR-762-2-CH1
 CCl4, 24 sc
 11.4.2023
##JCAMPDX= 6.0         $$ Bruker NMR JCAMP-DX V2.0
##DATA TYPE= NMR SPECTRUM
##DATA CLASS= NTUPLES
##ORIGIN= UXNMR, Bruker Analytische Messtechnik GmbH
##OWNER= root
$$ XWIN-NMR		Version 3.5
$$ Tue Apr 11 13:46:20 2023 Russian Standard Time (UT+4h)  she@DPX200
##.OBSERVE FREQUENCY= 81.013821
##.OBSERVE NUCLEUS= ^31P
##.ACQUISITION MODE= SIMULTANEOUS
##.ACQUISITION SCHEME= undefined
##.AVERAGES= 24
##.DIGITISER RES= 16
##SPECTROMETER/DATA SYSTEM= spect
##.PULSE SEQUENCE= zgpg30
##.SOLVENT NAME= CDCl3
##.SHIFT REFERENCE= (INTERNAL, CDCl3, 0, 248.564)
##AUDIT TRAIL= $$ (NUMBER, WHEN, WHO, WHERE, WHAT)
$$ ##TITLE= Audit trail, XWIN-NMR		Version 3.5
$$ ##JCAMPDX= 5.01
$$ ##ORIGIN= Bruker BioSpin GmbH
$$ ##OWNER= she
$$ F:/spectra/data/she/nmr/P31/1/pdata/1/auditp.txt
$$ ##AUDIT TRAIL=  $$ (NUMBER, WHEN, WHO, WHERE, WHAT)
(   1,<2023-04-11 13:44:40.64 +0400>,<she>,<DPX200>,
      <created by zg, POWCHK disabled, PULCHK disabled
       configuration hash MD5:
       00 E9 B6 7A A2 85 ED C7 34 08 36 98 17 FE 4E 26
       data hash MD5: 32K
       37 5C 19 B9 53 AE 0B 34 44 8E 36 93 EE 19 6B 9B>)
(   2,<2023-04-11 13:44:42.89 +0400>,<she>,<DPX200>,
      <Start of raw data processing
       efp BC_mod = 2 LB = 1 FT_mod = 6 PKNL = 1 PHC0 = -10786.78 PHC1 = -399.3155 SI = 64K 
       data hash MD5: 64K
       29 52 52 A0 71 2E 19 3B ED 67 BA 37 FE 0F 27 79>)
(   3,<2023-04-11 13:44:53.85 +0400>,<she>,<DPX200>,
      <pk PHC0 = 28.37615 PHC1 = 0 
       data hash MD5: 64K
       FE 92 59 BF FD BF C2 C7 8C E6 40 A3 6E 95 72 A1>)
(   4,<2023-04-11 13:44:56.96 +0400>,<she>,<DPX200>,
      <abs ABSG = 5 
       data hash MD5: 64K
       7D 33 97 C8 47 FD ED 6C 91 9C E4 B9 E8 C3 CC 5A>)
(   5,<2023-04-11 13:45:42.12 +0400>,<she>,<DPX200>,
      <pk PHC0 = -389.9941 PHC1 = 902.2009 
       data hash MD5: 64K
       19 70 38 8B 13 F0 80 4F F1 4C CC DC 5A 32 A3 6A>)
$$ ##END=
$$ 
$$ hash MD5
$$ FD D5 ED ED 7F 0E 46 32 5D 50 4E 7D 59 DA 90 A9
##$RELAX= 
##$RELAX= 
##$RELAX= 
##$RELAX= 
##$RELAX= 
##$RELAX= 
##$RELAX= 
##$RELAX= 
##$RELAX= 
$$ Bruker specific parameters
$$ --------------------------
##$DU= <F:/spectra>
##$EXPNO= 1
##$NAME= <P31>
##$PROCNO= 1
##$TYPE= <nmr>
##$USER= <she>
##$AMP= (0..31)
100 100 100 100 100 100 100 100 100 100 100 100 100 100 100 100 100 100 
100 100 100 100 100 100 100 100 100 100 100 100 100 100 
##$AQSEQ= 0
##$AQ_mod= 1
##$AUNM= <au_zg>
##$AUTOPOS= <>
##$BF1= 81.014009
##$BF2= 200.13
##$BF3= 200.13
##$BF4= 200.13
##$BF5= 200.13
##$BF6= 200.13
##$BF7= 200.13
##$BF8= 200.13
##$BYTORDA= 1
##$CFDGTYP= 0
##$CFRGTYP= 5
##$CHEMSTR= <none>
##$CNST= (0..31)
1 1 145 1 1 1 1 1 1 1 1 1 1 1 1 1 1 1 1 1 1 1 1 1 1 1 1 1 1 1 1 1 
##$CPDPRG= <waltz16>
##$CPDPRG1= <>
##$CPDPRG2= <waltz16>
##$CPDPRG3= <>
##$CPDPRG4= <mlev>
##$CPDPRG5= <mlev>
##$CPDPRG6= <mlev>
##$CPDPRG7= <mlev>
##$CPDPRG8= <mlev>
##$CPDPRGB= <>
##$CPDPRGT= <>
##$D= (0..31)
$$ [...]
##$SUBNAM3= <"">
##$SUBNAM4= <"">
##$SUBNAM5= <"">
##$SUBNAM6= <"">
##$SUBNAM7= <"">
##$SUBNAM8= <"">
##$SUBNAM9= <"">
##$SW= 501.771253377433
##$SWIBOX= (0..15)
0 1 3 0 0 0 0 0 0 0 0 0 0 0 0 0 
##$SW_h= 40650.406504065
##$TD= 32768
##$TD0= 1
##$TE= 0
##$TE2= 300
##$TE3= 300
##$TEG= 300
##$TL= (0..7)
0 120 53 12 22 120 120 120 
##$TP= (0..7)
150 150 150 150 150 150 150 150 
##$TP07= 0
##$TPNAME0= <>
##$TPNAME1= <>
##$TPNAME2= <>
##$TPNAME3= <>
##$TPNAME4= <>
##$TPNAME5= <>
##$TPNAME6= <>
##$TPNAME7= <>
##$TPOAL= (0..7)
0.5 0.5 0.5 0.5 0.5 0.5 0.5 0.5 
##$TPOFFS= (0..7)
0 0 0 0 0 0 0 0 
##$TUNHIN= 0
##$TUNHOUT= 0
##$TUNXOUT= 0
##$USERA1= <user>
##$USERA2= <user>
##$USERA3= <user>
##$USERA4= <user>
##$USERA5= <user>
##$V9= 5
##$VALIST= <valist>
##$VCLIST= <CCCCCCCCCCCCCCC>
##$VD= 0
##$VDLIST= <DDDDDDDDDDDDDDD>
##$VPLIST= <PPPPPPPPPPPPPPP>
##$VTLIST= <TTTTTTTTTTTTTTT>
##$WBST= 1024
##$WBSW= 4
##$XGAIN= (0..3)
0 0 0 0 
##$XL= 0
##$YL= 0
##$YMAX_a= 29479
##$YMIN_a= -34398
##$ZGOPTNS= <>
##$ZL1= 120
##$ZL2= 120
##$ZL3= 120
##$ZL4= 120
##$ABSF1= 248.5645
##$ABSF2= -253.2056
##$ABSG= 5
##$ABSL= 3
##$ALPHA= 0
##$AQORDER= 0
##$ASSFAC= 0
##$ASSFACI= 0
##$ASSFACX= 0
##$ASSWID= 0
##$AUNMP= <proc_1d>
##$AZFE= 0.1
##$AZFW= 0.5
##$BCFW= 0
##$BC_mod= 2
##$BYTORDP= 0
##$COROFFS= 0
##$CY= -3
##$DATMOD= 1
##$DC= 0
##$DFILT= <>
##$DTYPP= 0
##$F1P= 0
##$F2P= 0
##$FCOR= 1
##$FTSIZE= 65536
##$FT_mod= 6
##$GAMMA= 0
##$GB= 0
##$INTBC= 1
##$INTSCL= 6.047779e-11
##$ISEN= 30
##$LB= 1
##$LEV0= 0
##$LPBIN= 0
##$MAXI= 10000
##$MC2= 0
##$MEAN= 0
##$ME_mod= 0
##$MI= 50
##$NCOEF= 0
##$NC_proc= -3
##$NLEV= 6
##$NOISF1= 182.463
##$NOISF2= 159.3651
##$NSP= 0
##$NTH_PI= 0
##$NZP= 0
##$OFFSET= 248.5645
##$PC= 4
##$PHC0= -11148.39
##$PHC1= 502.8854
##$PH_mod= 1
##$PKNL= yes
##$PPARMOD= 0
##$PSCAL= 0
##$PSIGN= 0
##$REVERSE= no
##$SF= 81.0140089999694
##$SI= 65536
##$SIGF1= 159.3651
##$SIGF2= -187.1042
##$SINO= 113.3802
##$SIOLD= 16384
##$SREGLST= <1H.CDCl3>
##$SSB= 0
##$STSI= 65536
##$STSR= 0
##$SW_p= 40650.406504065
##$SYMM= 0
##$S_DEV= 0
##$TDeff= 32768
##$TDoff= 0
##$TI= <>
##$TILT= no
##$TM1= 0
##$TM2= 0
##$TOPLEV= 0
##$USERP1= <user>
##$USERP2= <user>
##$USERP3= <user>
##$USERP4= <user>
##$USERP5= <user>
##$WDW= 1
##$XDIM= 65536
##$YMAX_p= 328715231
##$YMIN_p= -1495461
$$ End of Bruker specific parameters
$$ ---------------------------------
##NTUPLES= NMR SPECTRUM
##VAR_NAME=  FREQUENCY,     SPECTRUM/REAL,   SPECTRUM/IMAG
##SYMBOL=    X,             R,               I
##VAR_TYPE=  INDEPENDENT,   DEPENDENT,       DEPENDENT
##VAR_FORM=  AFFN,          ASDF,            ASDF
##VAR_DIM=   65536,         65536,           65536
##UNITS=     HZ,            ARBITRARY UNITS, ARBITRARY UNITS
##FACTOR=    0.620285442955139, 1,           1
##FIRST=     20137.2065510682, 0,            0
##LAST=      -20513.1999529968, 0,           0
##MIN=       -20513.1999529968, -1495461,    0
##MAX=       20137.2065510682, 328715231,    0
$$ Real data points
##PAGE= N=1
##DATA TABLE= (X++(R..R)), XYDATA
$$ [...]
40413B58591l1356J57288J42442k7796j06438J89J26925J10084l14n7749l2313
40402E39553j272M693K1393L4222l1632j64544k15554q2545J15032J59160K1801
40391D00307q7441l449J70332K09851P1926p5106j00226n4466l6077l5823J721
40380D61549N1528N1336K4406M4766R4028O8548n1360j46857j24495m4624j4439
40369D14386k4582J2266R8155J30483M9720p6949j40686j00672N236J03775J27876
40358E99008P0692P899P968K2950m4164j56630j54379Q8J22816O2534o7704o6239
40346D04839M3479P1967j0262l4331N9362J05636n557j34355j10063J3866P7970
40335D82551O2884M9207L4352k3165m8837N3629J85550J42999o3909j87454r4099
$$ plain form
40413 258591 227235 384523 526965 499169 392731 392920 519845 629929 629615 571866 539553
40402 539553 538281 542974 564367 598589 566957 402413 186859 104314 219346 378506 400307
40391 400307 312866 309417 479749 689600 761526 686420 586194 531728 495651 459828 461549
40380 461549 513077 564413 588819 633585 727613 796161 744801 597944 473449 428825 414386
40369 414386 389804 402070 500225 630708 680428 603479 462793 362121 367357 471132 599008
40358 599008 669700 677599 685567 708517 664353 507723 353344 353432 476248 538782 471078 404839
40346 404839 448318 520285 510023 475692 535054 640690 635133 500778 390715 404581 482551
40335 482551 545435 594642 628994 605829 556992 610621 796171 939170 875261 687807 593708
40324E93708M9492L9772p3975r9012R428J14425J05595J3220p2052r5723n3084
40313E31794K3671Q3375R9591Q9512O6903J1914p4762j31257j04807l1140J4649
40302E79443J8072J4430Q939j4694k6457J6773P0432L5640q0165j35734m4909
40291D41770R3465J31492O6329R64l2079p9823j22610o7712P5648J51739O8342
40280G27525n6446o0405L3496P6863K7834j6399L802M3988P2598J16265J56965
40269A126086J15105j1425j08323j06911p4631p7303p1059k1118m861p0724j01510
40258E93326K2986K01888K27395Q2465n6113r6732j20318j65784j33480J0138
40248E65771J08450L2883r9678q7855M9614J03258p957j15892n5014R6461J33435
$$ plain form
40324 593708 643200 682972 608997 509985 519413 633838 739433 752653 680601 584878 531794
40313 531794 555465 638840 738431 827943 894846 906760 831998 700741 595934 564794 579443
40302 579443 597515 611945 620884 606190 579733 596506 666938 702578 622413 486679 441770
40291 441770 535235 666727 733056 734020 701941 622118 499508 431796 507444 659183 727525
40280 727525 671079 610674 644170 721033 748867 732468 736270 780258 852856 969121 1126086
40269 1126086 1241191 1229766 1121443 1014532 939901 862598 791539 770421 765560 694836 593326
40258 593326 616312 818200 1045595 1128060 1071947 975215 854897 689113 555633 565771
40248 565771 674221 707104 607426 519571 569185 672443 664486 548594 493580 590041 723476
40237G23476J3709r7294p1205J6676K7011l2292m5139J1004L7955p295m5615k1068
40225E09923J6948L3991P8297J45539J18968l2828j35662n1618P7837L3984j24697
40214F70682j51820j3106O7938j8213j09113n5596O4870J20153J09092O6761k9748
40203G21900j41366j29961K3247J24413L6855j08739j28037n5422k5016k0194
40193B97680N0650J37692J29649P0090P0561P1931o3924k54817k53272k9941J44940
40182C71239Q2645p4428r7048J2721R0558P5295N0210P3598R7962N6666m3423
40171F95995j25693j13583l999J21511J73851J35409M3475o5789j49190j41813
40161E70174l3491P0874N8642m2206j09110r0704k7949N1590J31369J28446k0010
$$ plain form
40237 723476 737185 639891 568686 585362 612373 580081 534942 545946 583901 576606 530991 509923
40225 509923 526871 560862 639159 784698 903666 870838 735176 683558 761395 795379 670682
40214 670682 518862 505756 573694 555481 446368 390772 455642 575795 684887 751648 721900
40203 721900 580534 450573 473820 598233 635088 526349 398312 342890 317874 297680
40193 297680 348330 486022 615671 685761 756322 828253 764329 509512 256240 226299 371239
40182 371239 453884 379456 282408 295129 385687 460982 511192 584790 682752 739418 695995
40171 695995 570302 456719 452720 574231 748082 883491 926966 861177 711987 570174
40161 570174 536683 607557 666199 623993 514883 424179 396230 447820 579189 707635 687625
40150F87625j93704j89181j1920J13926P9867L5892J01165J41991J1363j59111
40140F17913j36266M1469J12102j3628j36741q7751M3452Q4380L2056O487M4885
40129F08358O9660L0840k1766j9306L4357P4513N2704j5744p4571q5834o0022
40118E93189l0359j3084k582P053J0481j466k5594l2808J4011J01075J39597N6116
40106H15629r0409j50049o5645N3902Q4886L9822K897j3909n1670q7073n2845
40095D85536L1178O2320J2596k1523K8242Q9630N9791l5369p7274k6038K6165
40084F35254j1722r9916j14181p572J18642J32472L6204l9407j3214M0422J0462
40073F87444q3385j22158n8623L2635P3323O3435L2842o351l3385j8176K2222
$$ plain form
40150 687625 493921 304740 292820 406746 486613 522505 623670 765661 777024 617913
40140 617913 481647 523116 635218 621590 484849 397098 440550 524930 556986 563473 608358
40129 608358 678018 708858 687092 667786 702143 776656 829360 813616 739045 653211 593189
40118 593189 562830 549746 547164 554217 564698 563232 537638 504830 518841 619916 759513 815629
40106 815629 725220 575171 509526 563428 648314 688136 691033 677124 625454 538381 485536
40095 485536 516714 579034 591630 570107 598349 687979 747770 712401 635127 609089 635254
40084 635254 623532 523616 409435 401863 520505 652977 689181 649774 636560 676982 687444
40073 687444 604059 481901 423278 455913 529236 592671 625513 619162 585777 567601 589823
40062E89823K9855p903m3304n2659n3084k2217Q5518K06566J87678J3421j22209
40051H11485q1810J2229j1021q5448l7617R0389R7404k8485q4313m442K8499q5782
40039F21088j75600q5051O5081Q9957L6592N3330J03105M6583p8243j06728l2412
40028E37702J066k2621K7959J50178J57134r415j44403q4039M7540N3406l1209
40017F83298l6232M8284P9092J6099k2848K8732Q7007P0343J9184J944L188j8918
40005I59173l7728p142L9054L0126j3441O140R7190J24093m425j65012j59597
39994H68431p04R2318J3293p7723k1382P5023J7298j32930j32865M4019J39832
39983H84610Q284j54972j16456M8565J02648J2545m6975J982M6871M565n1523
$$ plain form
40062 589823 619678 611775 568471 515812 462728 440511 526029 732595 920273 933694 811485
40051 811485 729675 741904 730883 645435 607818 698207 795611 767126 682813 678371 706870 621088
40039 621088 445488 360437 425518 515475 552067 605397 708502 755085 676842 570114 537702
40028 537702 538768 516147 544106 694284 851418 842003 697600 613561 661101 714507 683298
40017 683298 647066 695350 774442 790541 767693 796425 883432 953775 972959 974903 978091 959173
40005 959173 921445 914303 953357 983483 970042 976182 1073372 1197465 1193040 1028028 868431
39994 868431 867727 960045 973338 895615 874233 949256 966554 833624 700759 744778 884610
39983 884610 892894 737922 621466 670031 772679 785224 738249 740231 787102 791667 740144
39972G40144l9229Q85m53j8026J0174O4856O8476K0p6859r4135m6079K3470P0979
39959G04223Q3883P5089N4183Q992p2326j57113j66904n2401J22281K05785J13924
39948I19616n3809j13132k2201O4347J0409j14825j48681o5648J9432L6685J6483
39937E48676k2047r1886j41739r0171J6673L3445o0159j24059r3883o6895p7910
39926a69955m962J70427K31883O0231r8217M0252L43509M43270K86083J76111
39916A478632K80017M21925M34041M05865M64372N64405O42063P59741R57344
39907F408405J166589J405748J794698K149679J834966M25801j549392k920023
39899A0716471l013533k226859j403972r47345p14032n12515l58757k92635k41488
$$ plain form
39972 740144 700915 701800 701347 683321 693495 758351 826827 826847 749988 655853 609774 633244 704223
39959 704223 788106 863195 917378 926370 854044 696931 530027 477626 599907 805692 919616
39948 919616 865807 752675 730474 794821 805230 690405 541724 476076 495508 532193 548676
39937 548676 526629 434743 293004 202833 219506 252951 192792 68733 -25150 -92045 -169955
39926 -169955 -174917 -4490 227393 287624 189407 229659 573168 1016438 1302521 1478632
39916 1478632 1758649 2180574 2614615 3020480 3484852 4049257 4691320 5451061 6408405
39907 6408405 7574994 8980742 10775440 12925119 14760085 15185886 13636494 10716471
39899 10716471 7702938 5476079 4072107 3124762 2410730 1898215 1539458 1246823 1005335
39890A005335j57358j12109j51670j79401j00145R918J2443o6513p0311L6304
39880B26493J07523M8675m1426m2429L896p02k6489J5659Q7786O7253n0187j40456
39868B55596j39660j00357n5616K3544J08620J01647j856p0058k3449N1611N4543
39857B04565K5520N4612J24483J45384Q8488r58p4552r6399m5078L3099L6211
39846D95375n4196j12604l4521R9514J27303K8893o2336n2949R772L2832j0878
39835D66205p7549r9600l7422O6195J00106J3039r2475o9830P4169J72976J08393
39824F24207m5152j19266m9856O1802P2062m2104j50745j16143L3322J23596N5342
39813D47065o0838n8027N1615J03494K8132n5549l3281L4700K3983n4578q2829
$$ plain form
39890 1005335 847977 735868 584198 404797 304652 314570 327013 260500 190189 226493
39880 226493 334016 382691 341265 298836 302732 302030 275541 291200 378986 446239 396052 255596
39868 255596 115936 15579 -40037 -16493 92127 193774 191918 121860 98411 150022 204565
39857 204565 230085 284697 409180 554564 643052 642094 567542 471143 426065 459164 495375
39846 495375 441179 328575 294054 393568 520871 549764 487428 434479 444251 477083 466205
39835 466205 388656 289056 251634 317829 417935 430974 338499 268669 342838 515814 624207
39824 624207 579055 459789 409933 471735 543797 501693 350948 234805 268127 391723 447065
39813 447065 386227 328200 379815 483309 511441 455892 422611 457311 481294 426716 343887
39802C43887k8976J4073k219J281Q2237J47820Q3025n4393j00884l0279J6435
39791D72007l1013n9951J9413R9195M1578q2049r1881J5393P1170J6811j4306
39780D56367N7762J14420L5814j00293j39253o7402J5844O6633J04698J03091
39770F47681J2290j12580j36230k2166J10012J44641J07632R1295J04311P5745
39760A022631j2508q2926p8562n2673p9654j23088q7479J2127N0509j1259n8357
39749D98761j6827J9515l3026p6452k27Q9577K1597j31014j34940L1044J44231
39738D12239R9753M1553O6640O1870m8011j29943p1207K6953M0726J8697K8981
39727E48251O596p3107o8774P8185J67754M7059j01374m8520Q6133N0299q2922
$$ plain form
39802 343887 314911 328984 326765 328046 410283 558103 641128 586735 485851 455572 472007
39791 472007 440994 381043 400456 499651 541229 459180 367299 382692 453862 470673 456367
39780 456367 514129 628549 664363 564070 424817 357415 373259 439892 544590 647681
39770 647681 659971 547391 411161 388995 499007 643648 751280 842575 946886 1022631
39760 1022631 1010123 927197 848635 795962 716308 593220 505741 517868 568377 557118 498761
39749 498761 481934 501449 468423 391971 391744 481321 502918 371904 236964 268008 412239
39738 412239 511992 553545 620185 682055 634044 504101 432894 459847 500573 519270 548251
39727 548251 554847 481740 412966 491151 658905 705964 604590 556070 642203 692502 609580
39716F09580m9547J05650Q0515j42184k24984k5111J76891J38527j905k9558K606
39705F40480m2419j03150o3106Q284q328n1279l822P2430M9079k3475l465P9357
39693E50586P0580l2165o4873K9396J03784L6007r3256j24636l0350P2344P4802
39682E92219p110o3927k1941P0189J04320N0560j9400m7758n6086p2800p4987
39671D53279m5585j7614j3803q931M347j0299m2001o410J13653J86579R3798q5430
39659F21583j60816p1263O3904J19459R2608M9012K2739L144k2999m8781n7410
39648F11180m3962k0767M710M0071P3806N8913k3254j08876j22522p7756l6266
39637C55277k48O0010J05703P9344K9887M2441O1620l3597j75643j50767N0899
$$ plain form
39716 609580 560033 665683 746198 604014 379030 353919 530810 669337 667432 637874 640480
39705 640480 598061 494911 431805 440089 431761 380482 376660 449090 498169 474694 471229 550586
39693 550586 621166 589001 524128 553524 657308 693315 600059 475423 445073 517417 592219
39682 592219 585109 521182 499241 569430 673750 724310 704910 657152 601066 528266 453279
39671 453279 407694 390080 376277 367346 371693 361394 319393 312983 426636 613215 707013 621583
39659 621583 460767 389504 453408 572867 665475 714487 737226 740370 717371 668590 611180
39648 611180 567218 546451 551161 591232 665038 723951 700697 591821 469299 391543 355277
39637 355277 355029 415039 520742 600086 629973 672414 734034 700437 524794 374027 424926
39626D24926J67491N9064o8876o168J16719N8545j22876j64390j1398J30337J27215
39615G10589O3062M4059N8695N7648J9029p3749j87670j98033l4587J64685K03087
39604H26815R1582j562k0878m5983q0170m5778J4031l0449j36199j11985M6251
39593E05675J06019k0988j11142P405J61522J08474p8992j36976o609J19085Q9469
39582G42942n0325j72713j86909p2357Q5359J30746K0585q6165l7867Q0920P8687
39571E32903m2102r4259m256Q5119N2198k5714j8209M9365M4455o4656j50403
39560C64441q6824Q4997J89154J11217o8551j70601j25003k4734K6307K9976K6358
39549C56737M617m7471p9134m7632P45N574k128L9437J01043J03061M8280J1847
$$ plain form
39626 424926 592417 651481 582605 576437 693156 751701 628825 464435 453037 583374 710589
39615 710589 773651 817710 876405 934053 953082 879333 691663 493630 459043 623728 826815
39604 826815 918397 916835 895957 849974 769804 724026 738057 707608 571409 459424 505675
39593 505675 611694 590706 479564 486969 648491 756965 677973 540997 534388 653473 742942
39582 742942 692617 519904 332995 260638 345997 476743 497328 411163 373296 454216 532903
39571 532903 490801 396542 392286 477405 529603 503889 485680 535045 579500 514844 364441
39560 364441 277617 362614 551768 662985 594434 423833 298830 274096 300403 330379 356737
39549 356737 361354 313883 234749 187117 187862 193436 191308 230745 331788 434849 483129 494976
39537D94976J7330K3098K0059M0586P1024N3916j3416p0674r1580j02748j01180
39526C41391m7540M0750P9491K8800n7911j11988j05579k8732R7981J79798J23296
39515E39757j6941p3674J1230J07373R0148L199m8993o6053j03940j37705r1048
39504B13353L0317J33445J51704R2714j830p6062o8708K3307J07138Q6779j8536
39493F73621j03113j02037l7055L8187Q0712O9869L1424K3567N0254L3389o5607
39482F93211j51877j14395P212P7351N4473J3451p3j1426j6783K5074Q2286O1312
39470G19816l5998r0557m6777O155r999m6213l6672r631k410K6279J01196J46229
39458G21418J01623L4769K0472J350r8437j99185j61899j0928R5641R2158N4115
$$ plain form
39537 494976 512306 535404 555463 596049 667073 720989 707573 636899 545319 442571 341391
39526 341391 293851 334601 414092 442892 384981 272993 167414 138682 236663 416461 539757
39515 539757 522816 449142 460372 567745 657893 661092 612099 546046 442106 304401 213353
39504 213353 243670 377115 528819 621533 619703 543641 474933 498240 605378 692157 673621
39493 673621 570508 468471 431416 469603 550315 620184 651608 675175 725429 758818 693211
39482 693211 541334 426939 434151 511502 565975 579426 579353 567927 551144 576218 658504 719816
39470 719816 683818 593261 546484 552639 542640 496427 459755 450124 447714 473993 575189 721418
39458 721418 823041 857810 878282 879632 781195 582010 420111 409183 504824 596982 651097
39447F51097L7169J6035j6021k4123j4217j7725o185N0608P3486j7727j18071
39436F14326o4033O7911M1644j28128j41918R3824K48085N4887k39056k18468
39426C29074Q2248K48188R6103j24940j59676o3890p950j1109k160K3590L1438
39415D40916K3245M781l1008m4548J8100J01022P6997m6973j07069k9141N2556
39404D58878J6774m6465J1685J54318K10669J13109m3626j45900j61447j18873
39394D49122o7186m0439j7509M6413J23524J25237M8435O115M6062N5766n0166
39383G25374j61161j28263k234M7582l569k4342M2801J05540Q5840J8160l9046
39372F66682p1175o8521k6282P056j4995l6996K6333J25197J20749N236p3702
$$ plain form
39447 651097 688266 704301 688280 664157 649940 632215 626030 676638 750124 732397 614326
39436 614326 550293 618204 659848 531720 389802 483626 731711 786598 547542 329074
39426 329074 411322 659510 755613 630673 470997 407107 399157 388048 385888 409478 440916
39415 440916 464161 468942 437934 393386 411486 512508 589505 542532 435463 406322 458878
39404 458878 475652 429187 440872 595190 805859 918968 875342 729442 567995 449122
39394 449122 381936 341497 323988 370401 493925 619162 667597 673712 719774 775540 725374
39383 725374 564213 435950 433716 481298 477729 453387 496188 601728 687568 705728 666682
39372 666682 595507 526986 500704 507760 492765 455769 482102 607299 728048 733284 659582
39361F59582l7722K5134L1766J5511M159n1448j37259j22255L5679J70243J31429
39350G24819O992l2166N434p82m7326l8333O164j5216p0529l2911O4239M0690
39338F11075j15972j80765l7001J20178P6610p8093j09234N307Q7099N9558K4247
39327D63009M7091O5821M1456L1988N8425M1082n8510j51924j56349j05442m9332
39316B27315M2472J72177K15489Q1221r9565j13579L0603J12339K4643q9715q6600
39305E16800l0662m0415o5390J3599J41488J36662k4741j45355p6935Q1083J34456
39294F40590M9120m7840o8267n2912o1550o8018j4125P8130J13850M9809l7806
39283E80981m5829K2758O9424L6749k6626n0852k9571J0874N8834Q5497L5760
$$ plain form
39361 659582 621860 646994 678760 694271 698430 646982 509723 387468 423147 593390 724819
39350 724819 731811 699645 705079 704297 656971 618638 624802 609586 539057 506146 570385 611075
39338 611075 495103 314338 277337 397515 474125 396032 286798 292105 379204 438762 463009
39327 463009 510100 575921 617377 649365 707790 748872 690362 538438 382089 276647 227315
39316 227315 269787 441964 657453 738674 639109 525530 556133 668472 693115 603400 516800
39305 516800 486138 445723 380333 393932 535420 672082 647341 501986 425051 506134 640590
39294 640590 689710 641870 573603 520691 459141 391123 376998 455128 568978 618787 580981
39283 580981 535152 557910 627334 664083 637457 586605 557034 567908 626742 712239 747999
39272G47999p8535j41334p7981K0492K6250k7059j2120O4188O9609j7501o3560
39261E10448r542L7224J0701J273N7071N3637q2522j81722o5464J43012J72201
39250F46317K931j19706n8702N8927Q2262K0397o6165j61898k08251j02344J12112
39239B05880K11412P4460j29571j66364l9639P1210Q5753P4978Q8560Q6984M2150
39228F05813j6129n9664p5235k9117Q3294J60665Q1060j16148k35900j56950K4221
39217B65910J28330J05636M8422L2966K9347k0592r2556r6649n76J11011J34792
39206F46041P8125L3551L4434J5486n8795j10966o0904M0483P1085L205o8246
39195F23499n4334L3826J15510J16845L0249n9941m2018P8121J40230K0756j76818
$$ plain form
39272 747999 669464 528130 450149 470641 496891 469832 457712 521900 591509 574008 510448
39261 510448 500906 538130 548831 550104 607175 660812 578290 396568 331104 474116 646317
39250 646317 649248 529542 470840 529767 612029 632426 566261 404363 196112 93768 205880
39239 205880 417292 491752 362181 195817 156178 227388 313141 388119 476679 563663 605813
39228 605813 589684 530020 454785 425668 508962 669627 750687 634539 398639 241689 265910
39217 265910 394240 499876 548298 581264 610611 590019 497463 400814 400238 511249 646041
39206 646041 724166 757717 792151 807637 748842 637876 576972 617455 688540 691745 623499
39195 623499 569165 602991 718501 835346 865595 805654 763636 841757 981987 1002743 825925
39184H25925k33912j04441L8779N9854J7847J1209R203m5699p9464O917J26663
39173F32881Q6043j11911k19044p8782J32498J38961m7631j49964k0009J71106
39163E34148J99489Q4737m511k2405m8543p7830j1921J23652J51036N443j39105
39152G94190j21222k3874j1500n9054k7144O9848P6114m2382j36213r5605K1563
39141D44721J11696J34944Q1826k5868q0058J2324J45822J09063r3940k11590
39131F28940j13101K2529J3896l9651K6157J25162P0898p7541r2148N2911J46114
39120G64166O9666o7197j41225j45974q5977M7712J60146J20628p918k4771P3443
39109G62699O2539j15728k06040m6955J38163Q9678p3015p2198O3775R0125l087
$$ plain form
39184 825925 592013 487572 526351 586205 604052 615261 624464 578765 499301 506218 632881
39173 632881 718924 607013 387969 309187 441685 580646 533015 383051 363042 534148
39163 534148 733637 818374 813863 791458 742915 665085 653164 776816 927852 933295 794190
39152 794190 672968 649094 637594 578540 551396 621244 697358 654976 518763 423158 444721
39141 444721 556417 691361 773187 747319 667261 679585 825407 934470 840530 628940
39131 628940 515839 538368 552264 512613 538770 663932 734830 657289 565141 618052 764166
39120 764166 833832 766635 625410 479436 393459 441171 601317 721945 714027 689256 762699
39109 762699 825238 709510 503470 456515 594678 684356 611341 539143 602918 693043 689956
39098F89956O879J39661J44013o2290k17113j20732O0215P9982k0107m6891J1626
39087F65199J9939m1954o9338l4733j0484j6345l896K6566L2116K7062M9284O1333
39075G04749J7317j6873L5509Q4651j3378j84058j90044J0464J79122J44423K4528
39064G96410o958J9918m02l3701r183m108j08657j98877q3556J60680K45780Q3308
39052H60654r0652p1255L9809L4930q1823j33909m3473Q4211J20892N1656m6827
39041G24213r4500p0997k5291j3832k2281Q516P0575P5731j0955j02582j11662
39030D26935o7042l6812l992Q0835J67465J42345n880j52010j78811q4693N7028
39019C45368J70596J95921J11114k5322j04130p3078J0575N1154J3881n0276n3679
$$ plain form
39098 689956 696835 836496 980509 918219 701106 580374 640589 720571 700464 653573 665199
39087 665199 685138 643184 573846 539113 528629 512284 508388 534954 567070 594132 643416 704749
39075 704749 722066 705193 740702 825353 811975 627917 437873 448337 627459 771882 796410
39064 796410 789452 809370 808968 775267 766084 761976 653319 454442 370886 531566 777346 860654
39052 860654 770002 698747 738556 773486 691663 557754 514281 598492 719384 771040 724213
39041 724213 629713 558716 533425 519593 497312 505828 576403 652134 641179 538597 426935
39030 426935 359893 323081 319089 399924 567389 709734 703854 551844 373033 288340 345368
39019 345368 515964 711885 822999 797677 693547 620469 631044 682198 696079 645803 592124
39008E92124M5508J78007K02634O2778j16642j57776m3950P6966R9846O9037N2768
38997A061300K4714n7907j43145j42048n1777N2897J14187J15872N7371l0526
38987A000938q4038q1737p2655p1410o890J29833J83118L5641j55293j32310O7319
38976H12516J31999n6466k27040j28258R2217J29716j9610j02723k2151P0037
38966F80237P2215O1972Q5672O1434k6555n0798L5162Q7304J2657n9658k817P7760
38954A034585K8625p4732n6823M9116O4748j3689j6711Q0291J03643J059l7817
38943A162295J02575K43008J70960l4916j28735m6934N1626M7274r596k7946j445
38932A528166K2765J5290j7795m2164k4638J4197J3574k5819k0207N5112Q1670
$$ plain form
39008 592124 637632 815639 1018273 1081051 964409 806633 762683 839649 939495 1008532 1061300
38997 1061300 1086014 1028107 884962 742914 691137 744034 858221 974093 1031464 1000938
38987 1000938 916900 835163 762508 691098 684208 814041 997159 1032800 877507 745197 812516
38976 812516 944515 888049 661009 532751 624968 754684 735074 632351 610200 680237
38966 680237 752452 814424 900096 961530 934975 884177 919339 1006643 1019300 959642 956825 1034585
38954 1034585 1063210 988478 931655 980771 1045519 1031830 1015119 1095410 1199053 1200112 1162295
38943 1162295 1264870 1507878 1678838 1643922 1515187 1468253 1519879 1567153 1557557 1529611 1528166
38932 1528166 1550931 1566221 1548426 1506262 1481624 1495821 1509395 1483576 1463369 1518481 1600151
38921A600151m0629k08546k21685m8513J40135J97649J39884N2215j5048l0486
38911A565127K1339Q0586M9411o5180j40020j14371p7995j17015j76316j68610
38901H56956j29623j42625j71356j13545K35J7300r4935j62308m8448J21430J16084
38890B49165o6656j73547l5458K00044K65893J14481o5353j22836q7465l4372
38880B43896L1022R2543P2980l1408q5901j3678N1498l1719j51581r3159J03164
38869A87657J75883M5227o9196m639J10172J00476J1770l1989n0636r5931p8667
38858C00127O7485J78922P4879j12392j02871P7930J19147p5989k26483j19845
38848A80910O3662O0388o5300o0163R9091J79693N2237j34002j66333k0534J48018
$$ plain form
38921 1600151 1559522 1350976 1129291 1080778 1220913 1418562 1558446 1610661 1595613 1565127
38911 1565127 1586466 1667052 1716463 1651283 1511263 1396892 1318897 1201882 1025566 856956
38901 856956 727333 584708 413352 299807 300042 317342 222407 60099 11651 133081 249165
38890 249165 182509 8962 -26496 173548 439441 553922 488569 365733 278268 243896
38880 243896 274918 367461 440441 409033 323132 309454 360952 329233 177652 84493 187657
38869 187657 363540 408767 339571 334932 445104 545580 557350 525361 474725 378794 300127
38858 300127 367612 546534 621413 509021 406150 484080 603227 527238 300755 180910
38848 180910 244572 304960 239660 179497 278588 458281 510518 376516 210183 189649 337667
38837C37667J86885Q7044k6194l7546K3966L8978j8997n1947j4951L085n2720
38826D75270q8619k7131L9746O933m9071r310N4063N35r2561k3293J72532K29790
38814F88884P0162o7202j5469O6417K92q6546J8561K32387K83825J22366l6916
38803A276761n0546O296M2402Q1280J31166J06778k7360j61355j75646r0288j8294
38792A121194l6408j35925k31026k00351j0164J88292J93021J0783j37499j12839
38782F49078k2241j2585m6311j2616N1830K2750q6814j30389m9189N6916R4787
38771E15216Q4964P0808L6920k7401p2983o0635k2984m142P338L3933M7267R411
38759F17712n5237q2942m8446J8327P2867P9865K4022n9176q4996l615J22708
$$ plain form
38837 337667 524552 611596 585402 547856 571822 610800 591803 539856 524905 527990 475270
38826 475270 386651 359520 399266 406199 357128 347818 401881 402416 309855 286562 459094 688884
38814 688884 759046 691844 676375 742792 743084 656538 675099 907486 1191311 1313677 1276761
38803 1276761 1226215 1232511 1274913 1356193 1487359 1594137 1566777 1405422 1229776 1139488 1121194
38792 1121194 1084786 948861 717835 517484 507320 695612 888633 899416 761917 649078
38782 649078 626837 614252 567941 555325 607155 629905 543091 412702 363513 420429 515216
38771 515216 600180 670988 707908 680507 607524 546889 523905 519763 527101 561034 608301 617712
38759 617712 562475 479533 431087 449414 522281 602146 626168 566992 481996 478381 601089
38748F01089J72075R5563l7958j27611j31055o7839J8442P9856Q4622M8271K0102
38737G55557J4657j3787r4172j65309j35185q462J03105J13660N6577J5935J1662
38726F54238L886j7048j2076L0783O1888L9226r387l0868k6008l7891p1691p8231
38714E06821l2650J4503R64n6918q2844m4842N879J3336r373j3035J5783N2675
38702C70299P5811O5109p058j20577j66589n2157J45663K26693J10515n3263q2016
38691E12430O844M9980k2369j08065r0540J6306J06628J09766M9102k107o779
38680F21196o20k5503m4042J0880R6996Q1979m7055j18132k1314J00755O4276
38669G19416n7130n4061O0078O6060p8119j39952J4192J90653J59969j6612j26139
$$ plain form
38748 601089 773164 868727 830769 703158 572103 504264 522706 602562 687184 735455 755557
38737 755557 770214 756427 662255 496946 361761 353299 456404 570064 626641 642576 654238
38726 654238 658124 641076 629000 659783 721671 760897 751510 720642 694634 656743 585052 506821
38714 506821 474171 488674 489638 432720 349876 305034 310913 324249 314876 301841 317624 370299
38702 370299 446110 511219 504161 383584 216995 164838 310501 537194 647709 594446 512430
38691 512430 519274 569254 546885 438820 348280 364586 471214 580980 630082 627975 621196
38680 621196 620576 595073 551031 561911 658907 740886 693831 575699 554385 655140 719416
38669 719416 662286 608225 668303 734363 656244 516292 530484 721137 881106 864494 738355
38658G38355j19049r5031q1256k2799N9775P8930K7189j8745k2482r300P657K8842
38646E72086L5340L2824O4912J09260O2380p4457j25741o35J17172L1341j41116
38635F83366j46168R49O6574L248o113Q8572J16445J9567l5269K0574K4326q9045
38623G47026j22615K5904J25842j5666j88106r1781J62114K11923Q459j34758
38613G28342m0003J12664J17168J9847l1998q806L8882P9447P7561L396p8579
38602A017921o0326L2497O3262J9263M1393J55835J84703M5685o2331M3114K12990
38591A694006J85116O196l7352J24701K42641J48499K467J2697J15074J11592
38581B605637o079p2377l0064q895j15122k84394l78293l34932k01276q4977p4803
$$ plain form
38658 738355 619306 524275 443019 420220 479995 558925 586114 567369 544887 535587 543244 572086
38646 572086 607426 640250 705162 814422 876802 802345 676604 675969 793141 824482 683366
38635 683366 537198 538147 604721 607969 601856 690428 806873 826440 791171 811745 836071 747026
38623 747026 624411 650315 776157 760491 572385 480604 642718 854641 863100 728342
38613 728342 688339 801003 918171 938018 906020 897214 936096 1015543 1093104 1096500 1017921
38602 1017921 957595 990092 1053354 1072617 1114010 1269845 1454548 1500233 1437902 1481016 1694006
38591 1694006 1879122 1885318 1847966 1972667 2215308 2363807 2366274 2378971 2494045 2605637
38581 2605637 2599558 2527181 2497117 2488222 2373100 2088706 1710413 1375481 1174205 1089228 1014425
38570A014425j43001j50196l0057P8554J5187j28036j08379Q3229J72211J7279
38560H21216j61261j30185k087j1359j03583m7418J36529J85696K6822j16486
38550E97884r8979m2460n4209l6586P7020J44511N4609o5185p3359n4451j18394
38539C30401j42364K1296K17910J74913n8270j65547m7679N6754j6623j16724
38529B54067o4400O4167J04289O8156O1203O3942j0041j12523j07181p96M2672
38518C63555m6152j15802m531K06993K70958R2563j35467j75162l8317O7032M0636
38507E26306j1128L481J6670l1604m4391N8203J42680M3040j40703j57329P456
38496D12681J04123J1385r1774l7424P3452P0473r797k5755J9734K1137j9760
$$ plain form
38570 1014425 871424 721228 691171 769725 784912 656876 548497 631726 803937 821216
38560 821216 659955 529770 527683 516324 412741 365323 501852 687548 714370 597884
38550 597884 498905 456445 402236 365650 442670 587181 641790 576605 503246 448795 330401
38539 330401 188037 209333 427243 602156 543886 378339 330660 387414 370791 254067
38529 254067 189667 253834 358123 426279 487482 551424 541383 428860 321679 320883 363555
38518 363555 317403 201601 197070 404063 675021 767584 632117 456955 418638 485670 526306
38507 526306 515178 518659 535329 503725 459334 517537 660217 703257 562554 405225 412681
38496 412681 516804 528189 436415 398991 472443 542916 533119 507364 527098 548235 528475
38485E28475j1179M1941M0684k6127n4526M606P4786Q0690M0003n195n7521j18487
38473E38150j41298q3818K3105R8751R5141M2793J5088M1108N9740m244j16487
38462E68029j50548o0184M1494L7671k9846m4198K866K9715K6608N5416R4497
38451E71520M3241p8960r6503O6614K23863J54891q0356k07904r9182P7553R3033
38440F67810o5394k09785j81730q882J42166J33874r661j26696q8712N9625J61075
38429D73690J31369L1272m0854n5603l2771Q412L4973J439p5840r8570p155J21043
38417D91405J63520J04183J8672n0226j06056j15919l2379R5385J44021P7476
38407G90082j1373m9913p3447j17153j26027n1388M2337O0409K1484L0397J21792
$$ plain form
38485 528475 517296 559237 599921 573794 519268 523874 598660 679350 719353 714158 656637 538150
38473 538150 396852 313034 336139 434890 530031 572824 587912 629020 688760 684516 568029
38462 568029 417481 357297 398791 436462 406616 362418 365284 394999 421607 477023 571520
38451 571520 614761 535801 439298 505912 729775 884666 804310 596406 497224 574777 667810
38440 667810 602416 392631 210901 202019 344185 478059 468398 341702 252990 312615 473690
38429 473690 605059 636331 595477 539874 507103 515515 550488 551927 476087 377517 370362 491405
38417 491405 654925 759108 777780 727554 621498 505579 473200 568585 712606 790082
38407 790082 778709 728796 655349 538196 412169 360781 403118 463527 485011 515408 637200
38396F37200J98001J35451o5569k42828k14152M775J75185J13073o4113j09892
38386E67131j9991j3739j35016j48297N3270K11345Q7906j35815j24648R8317
38376D40463K13224R7331n1773o9885j8828n67k2249p7998j52844j38296L5142
38365B53720J92417R9040j48130k11369k5100J10847L2960m3379O1350J74095
38355D96451R3900o0359r0004n5583r6219j29413l0863P4988K0691o9484J4862
38344A68967J65603J19589o8022j00958M6817R4564m6333j29079j6845R4934M9928
38333C79165k111R0792J82678P2000j47706k20135r1781O2731J06694N9836l292
38322D88871l5535k2014Q166M728k3499j4317L0020K9751k4676l3147M0034Q0834
$$ plain form
38396 637200 835201 970652 905083 662255 448103 452878 628063 741136 677023 567131
38386 567131 547140 533401 398385 250088 303358 514703 602609 466794 342146 440463
38376 440463 653687 751018 699245 629360 610532 609965 587716 509718 356874 218578 253720
38365 253720 446137 545177 397047 185678 160578 271425 304385 261006 322356 496451
38355 496451 590351 529992 439988 384405 288186 158773 127910 202898 223589 154105 168967
38344 168967 334570 454159 386137 285179 331996 426560 380227 251148 234303 329237 379165
38333 379165 377054 467846 650524 722524 574818 354683 262902 325633 432327 492163 488871
38322 488871 453336 431322 439488 444216 420717 406400 436420 466171 441495 408348 448382 529216
38310E29216N200r6337j01936l8972l252N111L3951M8342p779p2531l4728Q0078
38298C46363J25247L8865p6683j01882m1894J1847Q378j4435J43L4611J4159o1742
38286B82977p0693O1796J97235J36637p6130j84678q6309L3522J7234k7437M0620
38275C24774J19415M1379j05181q8570R1701J95526J07152k0227k7271M3118P6044
38264G57860O4694O4902P8106P2342O0245R0274J84038K98645L31766K00184l3294
38253B169762j68355r2170O2189R7570K9182J9530Q3938P1239m7799r5052L0122
38242B160156J71913J48448J5357m2547J8206P9285N2452l0923r5244r7133m4741
38231B335229L635j2482p7830j19566j21450j39961j79100j56463n3030J3950
$$ plain form
38310 529216 534416 438079 336143 297171 293919 299030 332981 381323 373544 301013 266285 346363
38298 346363 471610 510475 433792 331910 290016 301863 310241 295806 295949 330560 344719 282977
38286 282977 212284 274080 471315 607952 531822 347144 260835 294357 311591 284154 324774
38275 324774 444189 485568 380387 291817 383518 579044 686196 665969 638698 681816 757860
38264 757860 822554 887456 965562 1037904 1098149 1188423 1372461 1671106 2002872 2203056 2169762
38253 2169762 2001407 1909237 1971426 2068996 2098178 2117708 2201646 2272885 2225086 2130034 2160156
38242 2160156 2332069 2480517 2495874 2453327 2471533 2550818 2603270 2572347 2477103 2379970 2335229
38231 2335229 2338864 2326382 2248552 2128986 2007536 1867575 1688475 1532012 1478982 1492932
38221A492932m2687j35354j29264l8990J6652P17j8052K401K6262J2168l8739
38210A148046r5747j11294n5428K1890K3670n2264q9054l1539J7318k0790l9902
38199G14906P4730K07295J44005r5108k57603j97432k8467Q8240J30252J26061
38189I06879M9873q8635j66622q2069Q9676J67754P3309r1214j58764o7158P9923
38178G12952J25010L9926m5215k9366J8703j0869p8375o4902J8042M7182l541
38167G29547l6458j4640p181l2562k5219J0856j1800q0014o0884O9789J58399
38156F99833J12161L0507P701j3775q1025j03160k2258N3172K9345j5597R21R563
38144G07388m1502m2260O6566J23033R342r8039j0755J15455L1186j44389r4511
$$ plain form
38221 1492932 1450245 1314891 1185627 1146637 1163289 1164006 1145954 1148355 1174617 1186785 1148046
38210 1148046 1052299 941005 885577 907467 931137 878873 789819 758280 775598 754808 714906
38199 714906 789636 996931 1140936 1045828 788225 590793 562326 650566 780818 906879
38189 906879 956752 868117 701495 619426 709102 876856 950165 858951 700187 633029 712952
38178 712952 837962 877888 832673 803307 822010 811141 732766 667864 685906 733088 729547
38167 729547 693089 678449 671268 638706 613487 624343 612543 532529 471645 541434 699833
38156 699833 811994 842501 850202 836427 755402 652242 629984 683156 712501 696904 697825 707388
38144 707388 665886 623626 690192 813225 822567 724528 713773 829228 860414 716025 621514
38133F21514J41132K01665k854j55619o8922M7581L344n7831K9108J33403P3871
38122I66392o1819r4244n2529n4920n8290K7781J15640P2560k9183k9798L8963
38111H40553K2172p8993j22713p7290m1040l5517J8815J24877J86787J67428J12070
38100A117149K7150j05159k04118j52767Q716J10301Q8288M5564N9271P8327M6099
38089A118821r089m6477o5221n8729k0596m169o2999j32680j02289l407K3850
38078F37015l3836l6303N8221J00618n00j09443p1998M4381P1371K526k6762L2805
38066F68095R0971P6237J9890j9927j7236L7510J19511J38824K7189j32705j68128
38055H40231m3931O7509J1651j31345j56877k4394Q8871M3268p3198r1448j3562
$$ plain form
38133 621514 762646 964311 961457 805838 736916 784497 787841 730010 759118 892521 966392
38122 966392 904573 810329 757800 702880 644590 672371 788011 860571 831388 801590 840553
38111 840553 862725 783732 661019 583729 542689 507172 525987 650864 837651 1005079 1117149
38100 1117149 1144299 1039140 835022 682255 690971 801272 889560 935124 994395 1072722 1118821
38089 1118821 1109732 1063255 998034 939305 918709 914540 851541 718861 616572 613165 637015
38078 637015 603179 566876 625097 725715 725215 615772 543774 588155 659526 662052 635290 668095
38066 668095 759066 835303 855193 835266 818030 855540 975051 1113875 1141064 1008359 840231
38055 840231 796300 863809 875460 744115 587238 562844 651715 694983 621785 530337 516775
38044E16775R768p0668j19052k3865J28495J74110Q6246k5649p9509q3291o1258
38033D52102j5884L5615O0585N2162K3116k4030p0664o3390Q535N8683J7657l7334
38021D97153J4707J28136J28333k2216j46346j04377R663K5484n0367o9027K2048
38010D33191J09336Q9875R806k1163J2719K9580j4936n8582k8468M1479N2433
37999F55270j4073p0164n6786k2395k3056k5297K0438P8819R0626P7989Q9007
37988H00378Q5118p54j23261j63998j01094k2263K5478P4210J16353Q1441l0234
37977G41374j06638p1287J5393N0131J3218l5146k9230M8371J38823J45808N8744
37966I69561q435J4395K2350q8303j93185r9535J08063J44038l3144j39320k2075
$$ plain form
38044 516775 526543 455875 336823 312958 441453 615563 701809 676160 596651 513360 452102
38033 452102 436218 471833 532418 584580 607696 583666 513002 449612 458147 516830 534487 497153
38021 497153 511860 639996 768329 746113 599767 495390 505053 530537 480170 411143 433191
38010 433191 542527 632402 642208 621045 633764 663344 648408 589826 561358 602837 655270
37999 655270 641197 571033 514247 491852 468796 443499 463937 542756 633382 711371 800378
37988 800378 885496 884742 761481 597483 496389 474126 499604 573814 690167 771608 741374
37977 741374 634736 563449 578842 628973 642191 607045 577815 626186 765009 910817 969561
37966 969561 961126 975521 997871 909568 716383 616848 724911 868949 835805 696485 674410
37955F74410R1696j6487j81719j25436Q5339J46036j1350j43659q1320O6858J32560
37944F36928J06696O7887M0015L267l8372o1746n5048k2786J2695K6253K8709
37933G44498N1094O9989K3583o2429p0966J8184N8705l8900j36768o8028R6524
37922F85486J54039P0558j0006j5868j4251l7941l1403P731j187o9200r4755k1045
37910F22158P6893J05133N8796j0049m9308k0375O1945J03433L2165q2836j10044
37899G87911l8327K4875K4463P524M643j4855n3684o3509l1775j011N852l98j9256
37886F32453l4994R599J10330J36666R313j26923q9123M3675M1186r5915j27775
37875E08492K4006J42468P0087n7074o1157J4062M6878N2394Q2433P1385l9551
$$ plain form
37955 674410 766106 749619 567900 442464 527803 673839 662489 518830 437510 504368 636928
37944 636928 743624 811511 851526 854793 816421 754675 699627 676841 689536 715789 744498
37933 744498 795592 865581 889164 826735 755769 773953 832658 793758 656990 588962 685486
37922 685486 839525 910083 900077 884209 869958 832017 800614 808345 807158 737958 643203 622158
37910 622158 699051 804184 862980 852931 803623 783248 845193 948626 980791 897955 787911
37899 787911 749584 774459 798922 806446 811089 796234 742550 679041 647266 646255 652107 651709 632453
37886 632453 597459 607058 717388 854054 863367 736444 647321 690996 732182 636267 508492
37875 508492 532498 674966 745053 687979 626822 640884 687762 740156 822589 893974 854423
37864H54423j48852j30430j9352P6653J36922J66000J05371l8402j10816k9302
37854H62215M3819n2387j81536j02779J23704J96278K0039j66484j52555j4570
37844E75744O3402M2899M400k024J6688L8708L5419j521j9964L2957J08257J04934
37832I99899K5817k1645Q917M9559N1360N0914O5430M2070k7426n1356K2001R9328
37820A314868P2225j3510k3768O2411J24079P7001j0733k5396K9207M6539j7095
37809A635828p2974l7624K7644N568q2185r4462Q41N8053k0269j23392j10796
37798A186232l5494l7485r6501p1668M7945J18296P1070m659m1343q5038j50294
37787I01061j41248j3061J09655Q6292m5862j27078p0848P0373J84822J83894
$$ plain form
37864 854423 705571 575141 555789 632442 769364 935364 1040735 1002333 891517 862215
37854 862215 906034 853647 672111 569332 693036 889314 909353 742869 590314 575744
37844 575744 639146 682045 686445 684421 701109 739817 775236 773715 753751 786708 894965 999899
37832 999899 1025716 1004071 1012988 1062547 1113907 1164821 1230251 1272321 1244895 1193539 1215540 1314868
37820 1314868 1387093 1373583 1349815 1412226 1536305 1613306 1602573 1577177 1606384 1652923 1635828
37809 1635828 1562854 1525230 1552874 1558442 1476257 1381795 1382636 1440689 1420420 1297028 1186232
37798 1186232 1150738 1113253 1016752 945084 993029 1111325 1182395 1177736 1136393 1051355 901061
37787 901061 759813 746752 856407 942699 896837 769759 698911 769284 954106 1138000
37777A138000N5635j03880j57228p4683K7579L6822k7515p7044p5884l9241K2473
37766G25034Q4955Q9916K1050m3136k7926K5711K7187k0128l1306J9206N8912
37755I29475K9403l3897n6474j4898M4734N5095m620p4026o7617J2863O3479J6065
37743H99582n6289l6765O8741J42435J12424J7947p1645j14938p8686L8383J42875
37732A064064J12697l1609j21440o6419J6417r306q0510m3387Q1261J17781J9006
37721A058555n3803P081Q4419L9470n5432m8170K8134J7233p6996q3984L8937
37710I55444J17876M4401m7305j1118O7332K6462r2448j18627l3759K3551Q270
37699I40079J8502P8355O8999o0081j76798j52596l6109M6905O0081L7773k237
$$ plain form
37777 1138000 1193635 1089755 932527 857844 885423 922245 894730 817686 741802 702561 725034
37766 725034 809989 899905 920955 877819 849893 875604 902791 882663 851357 870563 929475
37755 929475 958878 924981 868507 853609 898343 953438 948818 874792 807175 820038 883517 899582
37743 899582 843293 806528 875269 1017704 1130128 1148075 1076430 961492 882806 921189 1064064
37732 1064064 1176761 1145152 1023712 957293 973710 964404 883894 840507 921768 1039549 1058555
37721 1058555 1004752 1011833 1096252 1135722 1080290 1032120 1060254 1077487 1000491 916507 955444
37710 955444 1073320 1117721 1070416 1059298 1126630 1153092 1060644 942017 908258 931809 940079
37699 940079 958581 1036936 1105935 1045854 869056 716460 680351 727256 787337 825110 822873
37688H22873l7802j8681M8312O7636o119p6014m2960L7524M6186j4669m4333j1926
37676G70027J2959k1523r4976j59373j60647n4471J13664J93659J00368m8550
37666F51137q2084j6546m172p4037r5144m750R7690J22189R5181M5840n2767j57692
37654E24845j36139K1902J21427K8994j09284q2505N6105P7029n7475j30031Q05
37643C15673J91193K14479M8700j31303j76956r7885l233K6426P070R951N7478
37632D61593Q6396M0987l6950o9115n7563o0792p5777m3497K8252N5918J8092
37621C47544l950L2041M9850j4662r1680p3380K9743J14252J18525N2847n5183
37610E05947j53945j51084j5754J22663R7665o5618j62303p8024O8226J08807
$$ plain form
37688 822873 785071 766390 814702 882338 876219 800205 757245 794769 840955 826286 781953 770027
37676 770027 782986 761463 666487 507114 346467 291996 405660 599319 699687 651137
37666 651137 569053 552507 548335 474298 379154 374404 472094 594283 689464 735304 682537 524845
37654 524845 388706 410608 532035 561029 451745 369240 425345 502374 444899 314868 315673
37643 315673 506866 721345 770045 638742 461786 363901 360668 387094 394164 404115 461593
37632 461593 547989 588976 552026 482911 425348 364556 288779 245282 273534 329452 347544
37621 347544 343594 375635 425485 410823 319143 245763 275506 389758 508283 561130 505947
37610 505947 352002 200918 185164 307827 405492 339874 177571 99547 167773 276580
37600B76580M6697n206k2256p4724j62189j77525p2111M6709N3031k7068o5610
37589a83672k2129J0573l7706r7609n3990Q9316K03730J84735N7533o3921q2934
37578C926J1979J42790K02652J57428Q2599O0236O1665M898q5556q7922J9263
37567E73958R1135K4874p3762m5884Q1574J53182J28793J08202J25448R1800j7733
37556A241587p8556K647J40363J94636J50950Q4752K6206l6206p3542m6922M944
37545A610859L111n3855q5102m0564M0133Q3785N6332j6217o8646n1261J3972
37534A492547N5371M2549J1722j2102m7247q1226n6246J5672K3883p0271j37683
37523A236969p2135K5038O014o5628j8555J16247J36718J5706m0567N0409Q8859
$$ plain form
37600 276580 323277 318071 295815 221091 58902 -118623 -190734 -144025 -90994 -118062 -183672
37589 -183672 -205801 -195228 -232934 -330543 -384533 -295217 -91487 93248 150781 86860 3926
37578 3926 15905 158695 361347 518775 601374 661610 723275 728173 642617 554695 573958
37567 573958 665093 689967 616205 570321 651895 805077 933870 1042072 1167520 1259320 1241587
37556 1241587 1163031 1165678 1306041 1500677 1651627 1736379 1762585 1726379 1652837 1605915 1610859
37545 1610859 1613970 1560115 1475013 1434449 1474582 1558367 1614699 1598482 1529836 1478575 1492547
37534 1492547 1547918 1590467 1602189 1590087 1542840 1461614 1405368 1421040 1444923 1374652 1236969
37523 1236969 1164834 1189872 1195886 1130258 1111703 1227950 1364668 1380374 1339807 1390216 1479075
37512A479075o3696k10500j07522J35463K01478L4514j06042n6360L9467J500
37502A347377j09331j20222k0324M7076J2661l2325J5231J24479J73986J05216
37492A543824j1173p1302o6797o7878q5163l5702J03433J96489J12802o2864j22388
37481A433281k6175M9362j1288r5349n8217M6431O5517j0199n1545l669N0010
37470A388159L9835K619m609J4918L7979O1318O6382J6263p3461j23599r0072
37459A335732j8905L0293N4660O3362L0208n0379j14655j02565l8258K2297P6571
37448A288361J35325J45849N6564o2902p7310K7475J14393Q2141r449m9404l1400
37437A619643l0173p3195j09027q3722L742J07344J56602R8013l9242j38580j10016
$$ plain form
37512 1479075 1415379 1204879 1097357 1232820 1434298 1468812 1362770 1306410 1345877 1347377
37502 1347377 1238046 1117824 1097500 1144576 1157237 1124912 1140143 1264622 1438608 1543824
37492 1543824 1532651 1461349 1394552 1326674 1241511 1205809 1309242 1505731 1618533 1555669 1433281
37481 1433281 1407106 1456468 1445180 1349831 1291614 1338045 1403562 1393363 1341818 1338149 1388159
37470 1388159 1427994 1430613 1426004 1440922 1478901 1540219 1606601 1622864 1549403 1425804 1335732
37459 1335732 1316827 1347120 1401780 1465142 1495350 1444971 1330316 1227751 1189493 1211790 1288361
37448 1288361 1423686 1569535 1626099 1563197 1485887 1513362 1627755 1709896 1700447 1651043 1619643
37437 1619643 1589470 1516275 1407248 1323526 1327268 1434612 1591214 1689227 1649985 1511405 1401389
37426A401389r15O0590L2697Q500P3545J74266J87766R3364k574k0231k155q728
37414A997514J446Q6336J65985J00290o9250j18413M7201K31606K23201R5108
37404B761024O1446J42034J87630J75724K26359L23737K90108J03349j1677P7002
37394D336736K04414J84735P6131J101q4977k29496k80375j17609N9871j8779
37384D131752k59127l32740j93222j13249j95632k13582m1224R6760o545j93023
37374B680168j93601l8544K9624o5222j70194j61302p1992J5387O0081N1965J2688
37363B149058n623J2594K1541K751K25J4438k7249j16555j15560J9258J05647
37352B060525j96j31870l3135K21760K94359P6721j44683j08191O8230J07015
$$ plain form
37426 1401389 1400474 1461064 1493761 1502261 1575806 1750072 1937838 2031202 2028628 2008397 2006242 1997514
37414 1997514 1998960 2085296 2251281 2351571 2282321 2163908 2211109 2442715 2665916 2761024
37404 2761024 2822470 2964504 3152134 3327858 3554217 3877954 4168062 4271411 4259734 4336736
37394 4336736 4541150 4725885 4802016 4803117 4718140 4488644 4208269 4090660 4150531 4131752
37384 4131752 3872625 3539885 3346663 3233414 3037782 2824200 2782976 2879736 2873191 2680168
37374 2680168 2486567 2448023 2477647 2412425 2242231 2080929 2008937 2024324 2084405 2136370 2149058
37363 2149058 2143435 2156029 2177570 2180321 2180546 2194984 2167735 2051180 1935620 1954878 2060525
37352 2060525 2060329 1928459 1895324 2117084 2411443 2488164 2343481 2235290 2303520 2410535
37342B410535j8402r3247q222J04420R7963J8667R585R4104J52510R6973j0373
37331B854513m2466L5462J38381J72945J29254N9981J3820J1195N5988J39653
37321C568726K34673K97208K90277K23613J65210J70974J96565J46670L6483K311
37311E332710Q1403J03955n7453k40602k00040N832Q5844l4587j17138k2496P5045
37300E012473K1364m4285M4570J73411J56103P1468J11386K24081K07391P9949
37290F057911N5753J73467K44338J88629J48180K07070K54306K15803J99679K91940
37280H037076L90139L72304K93532K88304L78584M87040N62160O00075O04843
37271A2014057N99326O28780P09167Q14107R24744J035454J121948J186807J316048
$$ plain form
37342 2410535 2392133 2298886 2290664 2395084 2493047 2511714 2521299 2615403 2767913 2864886 2854513
37331 2854513 2812047 2847509 2985890 3158835 3288089 3348070 3361890 3373085 3429073 3568726
37321 3568726 3803399 4100607 4390884 4614497 4779707 4950681 5147246 5293916 5330399 5332710
37311 5332710 5414113 5518068 5460615 5220013 5019973 5025805 5111649 5077062 4959924 4937428 5012473
37300 5012473 5033837 4989552 5034122 5207533 5363636 5435104 5546490 5770571 5977962 6057911
37290 6057911 6113664 6287131 6531469 6720098 6868278 7075348 7329654 7545457 7745136 8037076
37280 8037076 8427215 8799519 9093051 9381355 9759939 10246979 10809139 11409214 12014057
37271 12014057 12613383 13242163 13951330 14765437 15690181 16725635 17847583 19034390 20350438
37262B0350438J578324J884401K086988K222592K495456K991070L568796M095967
37254D1274032M630056N287678O082649P003335Q125672R520758J1136401J2896640
37246A05957221J4866574J7206632J9979084K3048394K6082634K8495775K9354970
37239B64991284K7492698K1986591J2844571J400087j0064323j9363885k5344458
37232B73942565k8015206k8053328k6339612k3750070k0964871j8292776j5778021
37225A12748681j3486893j1550481r968575q606732p420300o471013n699820m932759
37217D4612108m171937l618848l312344l008776k556139k128007j914183j820392
37209B2081482j672720j495788j367798j208458r57263p78106q19880r26411q56992
$$ plain form
37262 20350438 21928762 23813163 25900151 28122743 30618199 33609269 37178065 41274032
37254 41274032 45904088 51191766 57274415 64277750 72403422 81924180 93060581 105957221
37246 105957221 120823795 138030427 158009511 181057905 207140539 235636314 264991284
37239 264991284 292483982 314470573 327315144 328715231 318650908 299287023 273942565
37232 273942565 245927359 217874031 191534419 167784349 146819478 128526702 112748681
37225 112748681 99261788 87711307 77742732 69136000 61715700 55244687 49544867 44612108
37217 44612108 40440171 36821323 33508979 30500203 27944064 25816057 23901874 22081482
37209 22081482 20408762 18912974 17545176 16336718 15379455 14601349 13781469 12855058 11998066
37200A1998066o63585n67529n73784n07084l57071k88204l41096l98649m25199
37191G875865m77532n00384l79466j95552j60685k82524l42111k33467q6027j8106
37181E200011n364l3024j41179k63586k48022j01697o803l7978p9265o9807r1108
37170D122178j38915o6298J31895K25200Q7941q7986r0849R19J04o9991n7700
37159D056498L3964O2575k1372j36093k12238k28051j59958l9926j119j19525
37149C234755k63616k53027j21763n8074j06487j14793n694P7458r988j75696
37139B203075k05789o5664N2823K628j17807j15645J6039R2215L253j39486j70335
37128A555307p1963N5835J28819J01109l5270j72248j26919J01852K40014Q3683
$$ plain form
37200 11998066 11334481 10766952 10193168 9686084 9329013 9040809 8699713 8301064 7875865
37191 7875865 7398333 6897949 6518483 6322931 6162246 5879722 5537611 5304144 5218117 5200011
37181 5200011 5194647 5161623 5020444 4756858 4508836 4407139 4400336 4362358 4283093 4213286 4122178
37170 4122178 3983263 3916965 4048860 4274060 4362001 4274015 4183166 4184085 4184189 4114198 4056498
37159 4056498 4090462 4153037 4131665 3995572 3783334 3555283 3395325 3355399 3354280 3234755
37149 3234755 2971139 2718112 2596349 2538275 2431788 2316995 2311301 2388759 2378771 2203075
37139 2203075 1997286 1931622 1984445 1987073 1869266 1753621 1769660 1861875 1865128 1725642 1555307
37128 1555307 1483344 1539179 1667998 1769107 1733837 1561589 1434670 1536522 1776536 1860219
37118A860219j72563j84874M0163J72070O1298q3846p5528j0693l8556j06019
37108A461671q7918N695Q7553J15893O4299p5300j81498q4080J47776K07881k2210
37097A639762k59727k06068M1485J69146Q6678l6130p0457m7092k6513k9920o9469
37086A191695j17972r3998K3612J37384J69827J57961J33455N4747m3499j2954
37076A600258J58706K51052J38064J6923R6090K50008K51106J71852K33938L78134
37066C546131L37206Q5209j29504j93316k42335l43883l78050k98972k29331k17605
37056A935550j61791n2329l4190j35568j82949r0675M032O667K2218J09849J22402
37045A543216l1846j79978j39789o731K7283j2729J2633O3857l898j33680j03096
$$ plain form
37118 1860219 1687656 1502782 1542945 1715015 1776313 1692467 1616939 1606246 1567690 1461671
37108 1461671 1373753 1379448 1467001 1582894 1647193 1571893 1390395 1306315 1454091 1661972 1639762
37097 1639762 1380035 1173967 1215452 1384598 1471276 1435146 1364689 1317597 1291084 1261164 1191695
37086 1191695 1073723 979725 1003337 1140721 1310548 1468509 1601964 1656711 1613212 1600258
37076 1600258 1758964 2010016 2148080 2165003 2261093 2511101 2762207 2934059 3167997 3546131
37066 3546131 3883337 3968546 3839042 3645726 3403391 3059508 2681458 2382486 2153155 1935550
37056 1935550 1773759 1721430 1687240 1551672 1368723 1278048 1282080 1288747 1310965 1420814 1543216
37045 1543216 1511370 1331392 1191603 1184872 1212155 1199426 1212059 1275916 1272018 1138338 1035242
37034A035242J15119K65156J57294p5435j78211j05952k3903m2747r3431p5539
37024I77593j4829m88k7178j862R6097J62809J14870L615o6908o2986j0989N1857
37012A221601N8164n3254k01775j91212J3268J73785J05688l0702J3430J57068
37002A266061J22077q7019j76212m3106Q0659M2451j2277L4398M8615o4581j33730
36991A077336j9909J01671K8016j05589m5724J41156J72126R138j00081k6567
36981A231573Q5674J03058Q1535Q8560O3092l9431j22712q6910J2568M5673j3692
36970A448988o9371l6024N8705J02528K3428j11791j57148o6068M5445N6869n027
36959A290534m2655m4492o1884p9068l0583O4666J03489M7306k2580k3131K9823
$$ plain form
37034 1035242 1150361 1415517 1572811 1497376 1319165 1213213 1189310 1146563 1053132 977593
37024 977593 962764 962276 935098 933236 1029333 1192142 1307012 1310627 1243719 1180733 1169744 1221601
37012 1221601 1279765 1226511 1024736 833524 846792 1020577 1126265 1095563 1108993 1266061
37002 1266061 1388138 1301119 1124907 1081801 1162460 1204911 1192634 1227032 1275647 1211066 1077336
36991 1077336 1057427 1159098 1187114 1081525 1035801 1176957 1349083 1358221 1258140 1231573
36981 1231573 1317247 1420305 1501840 1590400 1653492 1614061 1491349 1404439 1417007 1462680 1448988
36970 1448988 1379617 1343593 1402298 1504826 1528254 1416463 1259315 1193247 1238692 1295561 1290534
36959 1290534 1247879 1203387 1141503 1062435 1031852 1096518 1200007 1247313 1224733 1201602 1231425
36948A231425O6053N2889J7650Q852M5649Q8837P1884j9782j17936j39360o7152
36937A239009M1488J00306N4945n0670q3812K3803J47504J06491p1001j64240
36927A343823p2477N4909O9563K8358L1366K6229o0847j35684p0875O2054Q6641
36916A363060j4904j11138j40490j42324j13760k0508P1888N3005n5273j31458
36906G58098j43693j50208j41980o0526M6680P1458L6484N5970J11354O7443p6721
36895E74359j63197j32530r4819r8125m7721O8039R4416l2109j43727r9265p280
36884h1959l1808j21081j06946K5457J37804J48489J00274N8254N2118Q5079J15415
36873C81096P1996m4936j34280j21370m5116K9132Q9243J14476N2090o3345q8298
$$ plain form
36948 1231425 1297478 1350367 1368017 1376869 1422518 1511355 1583239 1563457 1445521 1306161 1239009
36937 1239009 1280497 1380803 1435748 1385078 1301266 1325069 1472573 1579064 1508063 1343823
36927 1343823 1271346 1326255 1395818 1424176 1455542 1481771 1420924 1285240 1214365 1276419 1363060
36916 1363060 1348156 1237018 1096528 954204 840444 819936 891824 944829 889556 758098
36906 758098 614405 464197 322217 261691 308371 379829 416313 472283 583637 651080 574359
36895 574359 411162 278632 183813 85688 37967 106006 200422 168313 24586 -74679 -81959
36884 -81959 -113767 -234848 -341794 -316337 -178533 -30044 70230 128484 180602 265681 381096
36873 381096 453092 408156 273876 152506 107390 136522 225765 340241 392331 328986 240688
36862B40688K8006J33649Q4248m4004q4648k5213K8537M6897O8779O5211j0776
36851E31374p5841k779J49125J69517n577j88382j88363m1503P8217Q1627K1575
36840E28990j5876n026K2715L4453L1471K4315n434o6178q7098J5044J68897J71996
36828H18269l2260k19513j61646N3460J49179N0986m4241J4315J38140J73883
36818I40572J10495L1110k5122o6374q9792r1448q5842p2354k8070L9956Q3813
36807G46944P4619L2941k86J3945Q6671J42482N3232j69645k93337j33791J46781
36796G00556K20605N7644m1130Q0438K00201R4118j08574j58010p3113m3008p7370
36785H52357l5542O9293P9161j2230m1971K1386K1908p9629j04209L1733J37904
$$ plain form
36862 240688 268694 402343 486591 442587 357939 332726 361263 408160 476939 542150 531374
36851 531374 455533 452754 601879 771396 765819 577437 389074 347571 425788 507415 528990
36840 528990 513114 508088 530803 565256 596727 621042 615608 549430 462332 477376 646273 818269
36828 818269 786009 566496 404850 458310 607489 658475 614234 628549 766689 940572
36818 940572 1051067 1082177 1057055 990681 900889 809441 723599 651245 623175 663131 746944
36807 746944 821563 854504 854218 868163 954834 1097316 1150548 980903 687566 553775 700556
36796 700556 921161 978805 937675 1018113 1218314 1312432 1203858 1045848 972735 929727 852357
36785 852357 816815 886108 965269 953039 911068 932454 954362 874733 770524 802257 940161
36774I40161M7297j04739r5955L7336R1020L0439K459N3264O5918p704o0987k9072
36762I69437Q032j0066j5814L9774P4945K4061k5971K0255Q4736L2914r4119j32586
36750I75598n1139J8723Q837m906J3266k7750j55702k11572n9741J74843K37457
36739I17914P0655j31211j82373r0151L0898J04920J10739M9279l8697p6843l2033
36728G33097L7707M8648j4749r0182j03577l8039M5569O4452J0814l3246j1635
36717F48859K1580p65l1004J5049Q6108M8584q2405j30236k6346P4269M2328j9853
36705F46168L4609J34633R9254p2329k10568k31966j94584j19511L4448J94545
36695C14699J82275k1060j87316j26411P1723J85994J43331L4987n3924j03447
$$ plain form
36774 940161 987458 882719 786764 824100 915120 945559 948018 1001282 1067200 1059496 998509 969437
36762 969437 977469 967403 951589 991363 1066308 1090369 1064398 1084653 1169389 1202303 1108184 975598
36750 975598 924459 943182 952019 947113 960379 932629 776927 565355 505614 680457 917914
36739 917914 988569 857358 674985 584834 615732 720652 831391 880670 841973 765130 733097
36728 733097 770804 819452 804703 714521 610944 572905 618474 682926 693740 660494 648859
36717 648859 670439 669674 638670 653719 739827 788411 706006 575770 549424 623693 666021 646168
36705 646168 680777 815410 914664 842335 631767 399801 205217 85706 120154 314699
36695 314699 496974 475914 288598 162187 233910 419904 563235 598222 544298 440851
36685D40851j01135m3981J9278L0988K58j3962K4257R7952J42859P9645q5135
36674E91875j92112q6495J34384J92346J3203j47003q4303M3821l579j33086o5130
36663B63921J81754K73042M9218k43045k96601j05342J17047K05119J32921j8833
36653E59201j02617k9950R2599Q1056n0997j06354k3798L0293l6040p7867J8332
36642C53858J22081Q7823R136M4696J41771J42388M6345l3557p5681j15066j06270
36631F17524j6152M7218k960n2110J7587P5307m9319k18898j64527O1567J54949
36620D70186N6684J3564J09621J23153m1698j51098m3992R0127N2216l6249Q133
36609F50647R2715M6707m7443j6199O8587J9050j14396j22127L24O3918K8498
$$ plain form
36685 440851 339716 295735 315013 346001 346259 332297 356554 454506 597365 677010 591875
36674 591875 399763 313268 447652 639998 653201 506198 421895 465716 462137 329051 263921
36663 263921 445675 718717 767935 524890 228289 122947 239994 445113 578034 559201
36653 559201 456584 426634 519233 600289 549292 442938 419140 449433 413393 335526 353858
36642 353858 475939 563762 572898 617594 759365 901753 948098 914541 838860 723794 617524
36631 617524 601372 648590 645630 593520 611107 686414 637095 418197 253670 315237 470186
36620 470186 526870 540434 650055 773208 731510 580412 536420 626547 678763 642514 650647
36609 650647 743362 790069 742626 726427 795014 814064 699668 577541 577865 641783 670281
36598F70281M0718J23752J14674l2524j38110q4955J253k2498r0301o3668L8435
36587E57057Q9650N4765R817O293J9095J3627j0023l5756m5817k0296M1989J01096
36575G81497J00671L0027m5933m5354K3079M5674m7548j48293q5478J18102K31649
36564I58093J13837r9581j95280j52943r4494o4246j7253L5167L4781O677K7720
36553E52478P4422M7390n0445j01191n4292Q950J8882O510J6474L5722M2496L9199
36541F36595J6406l2096n2647J5377J23369J49229O0693n1459j08838j15872r2232
36530E48525l9835J3834L6314N1564Q3131O3349p0207k11606j81914Q638J59050
36519D60843J54905P9771K8597p596l3005j1603R873o2705j60147r4327J13191
$$ plain form
36598 670281 710999 834751 949425 916901 778791 693836 695089 672591 582290 518622 557057
36587 557057 646707 701472 711289 717582 736677 750304 740281 704525 658708 638412 680401 781497
36575 781497 882168 912195 866262 820908 843987 889661 842113 693820 608342 726444 958093
36564 958093 1071930 972349 777069 624126 529632 465386 448133 483300 518081 524758 552478
36553 552478 626900 674290 623845 522654 468362 477312 496194 502704 519178 554900 597396 636595
36541 636595 653001 620905 568258 583635 707004 856233 916926 865467 756629 640757 548525
36530 548525 508690 522524 558838 610402 693533 756882 686675 475069 293155 301793 460843
36519 460843 615748 695519 724116 716520 683515 671912 681785 619080 458933 364606 477797
36508D77797J95515N0288p9517o750Q6984j4757j58766p3613J46875J77791n655
36497G96192j05385k441Q1744k097q7178m911J21053Q7836n9194j13021j8577
36486F94021Q0884P4586J8383K1617Q3613R0413k9283j77620j79898j9621J12856
36475G69951P2727m5391p9614n2890p7696j03650R74J54481J23680q7291j88126
36464D87155l8544J30682Q6446n6054o3508K6889J1536j03797j12701L8396J60121
36453E66621J15472k426n1675l6768l9511p3730r4921p9663k9181N1131J28222
36442D53571J46943R7466L2318j0822n0030r2619r0734j7501O1393O2988J0019
36431F02992K800O6400J03397L4885p5059j03563m2620l98k9136n2292p450L5517
$$ plain form
36508 477797 673312 723600 644083 637333 724317 709560 550794 477181 624056 801847 796192
36497 796192 690807 688366 770110 768013 680835 675924 796977 884813 825619 712598 694021
36486 694021 774905 849491 867874 889491 973104 1063517 1034234 856614 676716 657095 769951
36475 769951 842678 797287 717673 664783 587087 483437 484411 638892 762572 675281 487155
36464 487155 448611 579293 665739 609685 546177 573066 584602 480805 368104 406500 566621
36453 566621 682093 679667 627992 591224 551713 477983 383062 303399 274218 325349 453571
36442 453571 600514 697980 730298 719476 669446 576827 486093 468592 529985 592973 602992
36431 602992 605792 672192 775589 810474 735415 631852 589232 588834 559698 507406 499956 535473
36419E35473q844p7049l7689Q8583J32731K3228j05018j05108p511O3607O6672
36408E69075L9317l304n5985o3149J2070R0332O4961k7467m8079K7017N9704l6551
36396F27941j51709j28834J8163J30824J14447L1411j1109O984K6760Q647j7864
36385F55661k774N0145Q1925N6480J3625J4136M7925M5316j4132n7309j3918Q2111
36373I59191J31531Q7406r794r7019j37247j11687k5494O4555Q3796K7544l1846
36362I40936m9885o0892q3337n2356O6262J58067Q7111p9675j27818k818R5334
36351H90929M128j60683j85491o6164L0873M4120O4355J25072J37257O6533M463
36340I55392n51l0791j30061j84991r6203L7446M8358m9517q8021j209Q8325O3462
$$ plain form
36419 535473 526629 449580 411891 500474 633205 656433 551415 446307 438796 502403 569075
36408 569075 608392 605088 549103 485954 498024 588356 653317 625850 577771 604788 664492 627941
36396 627941 476232 347398 365561 496385 610832 642243 631134 638118 664878 673525 655661
36385 655661 652887 703032 784957 841437 855062 869198 917123 962439 948307 890998 877080 959191
36373 959191 1090722 1178128 1168334 1071315 934068 822381 796887 861442 945238 972782 940936
36362 940936 891051 830159 746822 694466 760728 918795 1005906 926231 798413 795595 890929
36351 890929 895057 734374 548883 482719 513592 557712 622067 747139 884396 950929 955392
36340 955392 954841 924050 793989 608998 512795 550241 598599 549082 461061 459852 548177 611639
36328F11639k4470m7779J6106P3252O0225K7801M8628Q8480M2504r2400j67610
36317F36376p3741Q3153J07833j0410q6907j7746Q0044O6144j7693m1321J2189
36306G37921N3805L5687j4081n9758p1423j5407Q4822J29596P0931k22Q608L6149
36294I96628k4497j23312j18253j6319K4081n2261j09172m0990O5535P9115K0092
36283G00647K354M9953P8684L4879l0931l4831L8447J13478R8257r728j00977
36272I40232o8966N9000J45618R7088m3251j48381j20327L1037J79039J79350
36262A250439L3683q3026l2678R3612J01207k2196r1885r098R9041R0111K1288
36251A450498M1313J53276K13114J38213J1633l4623K6734J08579J23576P8896
$$ plain form
36328 611639 587169 539390 555496 628748 688973 716774 765402 853882 896386 803986 636376
36317 636376 562635 645788 753621 743211 656304 638558 718602 784746 767053 725732 737921
36306 737921 791726 827413 813332 753574 682151 666744 751566 881162 952093 951871 960479 996628
36294 996628 972131 848819 730566 714247 738328 686067 576895 535905 601440 680555 700647
36283 700647 703001 752954 831638 866517 835586 800755 839202 952680 1050937 1041209 940232
36272 940232 871266 930266 1075884 1172972 1129721 981340 861013 892050 1071089 1250439
36262 1250439 1284122 1201096 1168418 1262030 1363237 1341041 1249156 1240058 1339099 1429210 1450498
36251 1450498 1491811 1645087 1858201 1996414 2008047 1973424 2000158 2108737 2232313 2311209
36241B311209M7533N8577N9255R320l9536j8790M2185N6393R636l8403o8249j14873
36229B314257j66168j52334o0217L1953O0770M1870J2631j0266p140K6163L1724
36218B123243m7061j57000j92996j57434j40376j48900j05777k5278j8286r0743
36208A039392j18461p2454p3677j50821j56366l4146M7500j8119p0661L7597J52608
36197E82392O0157j34126j52978J2576J05457J5629r0096p3941j0298p55j6186
36186B97831n659K222j1140P204P9946J33604R2597k5890j33407j36494p204J48345
36174D41955J55084m110j17178l2441R1634K5133j44430j33266O9342J65269K0557
36163E37549j37159j04726Q2j015l4278N6771K04133K14984P8746l8255n1945
$$ plain form
36241 2311209 2358742 2417319 2476574 2485894 2446358 2427568 2469753 2526146 2535782 2497379 2429130 2314257
36229 2314257 2148089 1995755 1935538 1967491 2028261 2070131 2082762 2072496 2065356 2091519 2123243
36218 2123243 2076182 1919182 1726186 1568752 1428376 1279476 1173699 1148421 1130135 1039392
36208 1039392 920931 848477 774800 623979 467613 433467 480967 462848 392187 429784 582392
36197 582392 642549 508423 355445 368021 473478 489107 399011 325070 314772 314017 297831
36186 297831 292172 294394 283254 290458 370404 504008 596605 570715 437308 300814 293610 441955
36174 441955 597039 592929 475751 443310 534944 560077 415647 282381 351723 516992 537549
36163 537549 400390 295664 295746 294731 260453 317224 521357 736341 815087 776832 724887
36152G24887l3571m8605p1697o1784j8577L4424O1473L3732k1847m1307k0755
36141E36373j9070l6580j84Q4803R9319M170o4683J126J08384J13247L3653k3646
36129H36912m5334p2738p0922L049P0717L2629n7110p4276k8943k0373l7697O726
36117E42640P4320L6712p9183r2508M1479J44907R7863J2941J5269K6981o2311
36106G59110j49488n9059J35544J67409k9364k02604j50855j3908k7626j35571
36096B93588r1904J02537J62139j8142j50395O277K36711J88410o3060j29164
36086E36997O6668J78392J7215j47663m8746J52638J58336l932j05382j11334
36076F93189j35325j34552J3959K03238J92142k671j17262o0076k1030j04965
$$ plain form
36152 724887 691316 642711 571014 509230 490653 525077 586550 620282 598435 557128 536373
36141 536373 517303 480723 480539 565342 664661 668831 604148 605274 713658 826905 860558 836912
36129 836912 791578 718840 647918 650967 721684 754313 697203 622927 593984 573611 535914 542640
36117 542640 616960 653672 574489 481981 523460 668367 766230 779171 794440 821421 759110
36106 759110 609622 550563 686107 853516 824152 621548 470693 456785 429159 293588
36096 293588 201684 304221 466360 448218 297823 304100 540811 729221 666161 536997
36086 536997 603665 782057 799272 651609 602863 755501 913837 909905 804523 693189
36076 693189 557864 423312 437271 640509 832651 829980 712718 652642 631612 526647
36066E26647j49777k7149J24553J22200O001o6704n2310o416M4688Q9314Q0842
36055F91889J4770k5447O277K9921l2374j19311j19333l2920M6640O6293M4961
36044E71366J0091k5455m5554l9911j5594J8704M9949M3986j6374q2489r4840
36033C73879p2857o6589m2520O3514J88044J80589K7278j09819j16899n0021J0926
36022C85525P0817J14675O0833q0460j52728p3759K8972K6218j3486K0487O6029
36011D53123J3829o5018k7815P6199P2875l6421o1937P0534K01039J72616K6654
36000H95678j01215j48176j20641l5673N7077P3425j3387j23100j55600r4772
35990B33616m362M3906K7428j0011j377N4236P3361M033q1503p8325M738P2345
$$ plain form
36066 526647 376870 349721 474274 596474 602475 535771 483461 477045 521733 611047 691889
36055 691889 706659 681212 687489 717410 685036 565725 446392 413472 460112 526405 571366
36044 571366 581457 556002 510448 470537 454943 473647 523596 567582 551208 468719 373879
36033 373879 301022 234433 191913 255427 443471 624060 651338 541519 424620 374599 385525
36022 385525 456342 571017 631850 551390 398662 324903 353875 380093 366607 387094 453123
36011 453123 466952 401934 374119 450318 523193 486772 424835 495369 696408 869024 895678
36000 895678 794463 646287 525646 489973 547050 620475 607088 483988 328388 233616
35990 233616 229254 273160 300588 290577 289200 343436 416797 420830 339327 261002 265740 338085
35978C38085Q2048O2083K1476m4218p4681r04J13537J17686j0782j18718r1797
35967C93815L132N1342N1731N8188N3870n990p9988p6090J5658J04136J03037
35956F72841L238j39054k32683j95446l3887J27932J59809O9864j2406k273M6778
35945D64713L9886j9751m2654J2490P7433O8090o500p0256q4068o7668l5692J5169
35933C51192N2404K4478m1912m6066L9282J08709P4691p449m5196n1790p7762
35922C80581q3749j7652M8840J8881m6086k0705M4825n836j32408j14569P6308
35911A48430J84555O8576n9938K1035J83873J78693N0075L5830J49931J79249
35901A140309P3598L1492J47373K51043K03248J15110J30696J82556J33420K0171
$$ plain form
35978 338085 420133 482216 503692 459474 384793 383889 497426 615112 604330 485612 393815
35967 393815 396947 448289 500020 558208 612078 606088 526100 450010 465668 569804 672841
35956 672841 676079 537025 304342 108896 75009 202941 362750 432614 420208 417935 464713
35945 464713 504599 484848 442194 454684 532117 600207 593707 523451 439383 371715 336023 351192
35933 351192 403596 428074 386162 340096 379378 488087 562778 555329 510133 458343 380581
35922 380581 296832 279180 328020 346901 300815 280110 324935 319099 186691 72122 148430
35911 148430 332985 401561 341623 362658 546531 725224 775299 811129 961060 1140309
35901 1140309 1213907 1245399 1392772 1643815 1847063 1962173 2092869 2275425 2408845 2429016
35891B429016k3550M181k744o0872q7888o8164p4539j18987j22037o6134n4559
35880A753723j46889k29631j55413K7228R8047n2190k51437k39952K159K22036
35870A027681K03267Q497j41621j41415o0351K633R987l2793p5934l8295O7488
35859H29144P6629j09266k99433k22651N6165J88752N8513n1531O6120K02579
35849G95021R6391j21761j58451m4031l2754j27635r0232R9558J76742M0716p9528
35838E54036k1580O3050J0840p7860m7529N1745R6676R2677P0335l1427j96577
35827E64386k33218m9897J40270J15924j2056q614Q1365L8441j09753j03116J14984
35816E38716K81521K00979J312r3436n3940k557j4992n9468n7159L6870J54627
$$ plain form
35891 2429016 2405466 2409647 2406903 2346031 2258143 2189979 2115440 1996453 1874416 1808282 1753723
35880 1753723 1606834 1377203 1221790 1249018 1347065 1294875 1043438 803486 805645 1027681
35870 1027681 1230948 1239445 1097824 956409 896058 898691 908678 875885 799951 761656 829144
35859 829144 905773 796507 497074 274423 330588 519340 577853 526322 592442 795021
35849 795021 891412 769651 611200 567169 534415 406780 316548 416106 592848 633564 554036
35838 554036 532456 595506 606346 528486 480957 532702 629378 722055 792390 760963 564386
35827 564386 331168 281271 421541 537465 525409 516795 598160 636601 526848 423732 538716
35816 538716 820237 1021216 1022528 929092 875152 872595 857603 798135 740976 777846 932473
35805I32473J42932l8970k09177j87117n9399l7661j11430q3106O7385J28870
35795E44800J8431p9271l5301J8545m0608q3802M1058K14464K07302K9173j02733
35784G32058q5960l0084m7240j03595r8157O198J40368J74586M2451j47655j99178
35773C83792o9330P2633Q5969L3845K6825K4361o3231j73776j65101m0581N4941
35762A70347M9771K1549N5452J32663J72948J19197j6965j47331j74070j03044
35752B80517l6843k0238J7915J13230J70009J09781P638l2582l6439o5718p1894
35741D35376N629Q6820O4394p368j2545J2688l6293r8780k6834J29730J56838
35730G09655R735j17078r6187k4508r839j0072K3944L3747j2366l4401N067J6513
$$ plain form
35805 932473 1075405 1036435 827258 640141 580742 543081 431651 348545 415930 544800
35795 544800 563231 483960 448659 467204 426596 342794 383852 598316 805618 834791 732058
35784 732058 646098 616014 568774 465179 367022 373220 513588 688174 730625 582970 383792
35773 383792 314462 387095 473064 506909 533734 558095 494864 321088 155987 115406 170347
35762 170347 220118 241667 297119 429782 602730 721927 704962 557631 383561 280517
35752 280517 243674 223436 241351 354581 524590 634371 642009 609427 572988 507270 435376
35741 435376 441005 527825 592219 584851 572306 584994 548701 449921 423087 552817 709655
35730 709655 719390 602312 506125 481617 471778 461706 485650 519397 507031 472630 477697 494210
35718D94210m1229n9947K1067P4156q811j06972m9331J01910J43560M4180l3910
35707E78883m825L6834L817n2745n3224j0754J8538K2521J4854q500m5003o0395
35695D40001k9602K2968N1920M1397J0734j3539j9748j7613k7904n6136p8782
35684C23696o6620j7238M5776R7377J23455J19659R2442N4740J2378l3173o2437
35673F90055m3579J6481M7977j2774j28361j78057r9363J9695M2094l3081o0670
35662B60417M2741J58189J16772n4596j58882r7497J5275M4439J5793K7699Q2842
35651D53192J07677P1611l225r0494j39028q0128N3946J06464K656j13708q7271
35640B81692M836k661o1629Q739J73401J84541k2277j91088j12454Q5179J50285
$$ plain form
35718 494210 452981 393034 414101 488257 479446 372474 323143 425053 568613 612793 578883
35707 578883 574058 610892 614709 561964 508740 497986 516524 539045 553899 545399 500396 440001
35695 440001 410399 433367 485287 526684 537418 523879 504131 486518 458614 402478 323696
35684 323696 257076 239838 285614 382991 506446 626105 718547 773287 785665 752492 690055
35673 690055 646476 662957 710934 698160 569799 391742 292379 312074 354168 321087 260417
35662 260417 303158 461347 578119 523523 364641 267144 282419 326858 342651 370350 453192
35651 453192 560869 632480 629255 538761 399733 319605 373551 480015 482671 368963 281692
35640 281692 286528 283867 222238 230977 404378 588919 566642 375554 263100 348279 498564
35629D98564M6540p5208j15810q6750j8389N4853P5009K8736j5023l111L2781
35618D22192N2789O1489M1679m0787j16526n3811J05372J34913l5360j70139q4777
35607C17034N3601J0956j12747o8230Q5955O5895j39160k19175m3034J38402J06526
35596A96023j4232l0195M55o0545j39399p5266Q8770J70382J25000N3662j287
35585C13368o5257q3123K4100J64700J50615p921q6826J3540J16257O2777k4611
35574E77619N0963K19488K29394L6493j12454l2854J43079J73630M3398n4798
35564A273958j4522O6091P1007L1513L6806P5117O4543j5l5074o491J4375k7559
35552A549749o4890K990J44374K04595J00921n7959j00504p196P0816J2543j16814
$$ plain form
35629 498564 545104 469896 354086 267336 248947 303800 378809 407545 392522 389411 422192
35618 422192 474981 536470 578149 537362 420836 367025 472397 607310 571950 401811 317034
35607 317034 370635 381591 268844 200614 286569 352464 213304 -5871 -48905 89497 196023
35596 196023 181791 151596 152051 91506 -47893 -123159 -34389 135993 260993 314655 313368
35585 313368 248111 164988 189088 353788 504403 496482 409656 423196 539453 602230 577619
35574 577619 628582 848070 1077464 1113957 1001503 968649 1111728 1285358 1328756 1273958
35564 1273958 1259436 1325527 1396534 1428047 1464853 1539970 1604513 1604498 1569424 1562933 1577308 1549749
35552 1549749 1484859 1487849 1632223 1836818 1937739 1879780 1779276 1772080 1842896 1855439 1738625
35541A738625j52297l8983R8929J03233m0492j91119k06470r1313J6934M482r8285
35530A143244j68079j36442m5205L2101O0708K8642n9636j32601p6945J06728
35520G52515K37557J53512n4893j34886p05J54547J22978n2111j58320r3410L4649
35509I61433O6732k7294j40776j58274o8312M2194Q9981P1202K8205k0454p2129
35498G72508r0214l2452O9487J23120Q2767n311p0667p9290k9281M6536P0313
35487H57516j0528j27325j44594l4951Q0119R5135M4007J7313L5187N5010M1865
35476I08754j4194r3033j27452o2975M3115P4269K9149K3244P9530P4224k9421
35465I05210p1444L9651J23685p77j77581j13302J48188K50836M8073j90492j91571
$$ plain form
35541 1738625 1586328 1547345 1646274 1749507 1709015 1517896 1311426 1220113 1237047 1241529 1143244
35530 1143244 975165 838723 793518 825619 886327 914969 855333 722732 645787 752515
35520 752515 990072 1143584 1088691 953805 953100 1107647 1230625 1178514 1020194 926784 961433
35509 961433 1028165 1000871 860095 701821 633509 675703 765684 836886 865091 844637 772508
35498 772508 682294 649842 719329 842449 925216 919905 849238 769948 740667 787203 857516
35487 857516 846988 719663 575069 540118 620237 715372 759379 776692 811879 866889 908754
35476 908754 894560 801527 674075 611100 654215 728484 757633 780877 860407 934631 905210
35465 905210 833766 873417 997102 996325 818744 705442 853630 1104466 1152539 962047 770476
35454G70476m1625J9911l4037n9723j1330M1398Q1230J29447J15558l7243k14553
35443G59509k04257j1325J19395N5560m3352o526P6093L7990n1720K505J64078
35432H97950J75526m2876k44635k04757j8701Q4032O5084M4017N6215L8764l761
35421H46858q100J26n6110j30826r4622L8803R9549J3897q8882p6583K0951J05645
35409F70706J37217J04288r21j12298j17832k5126K3810l3327q7663n7414k5454
35398D75986p0864j08230l3980Q3336J06938L8510j6590j7706P71J8265K0278
35387D96714k0145o1460j785J34701J63803K5314o6581N7072K15295J38448r8662
35376I82714j97673j06070m2919q3258n9055P9272J32877J678j23455p0148N0088
$$ plain form
35454 770476 728851 748762 714725 655002 643672 685070 766300 895747 1011305 974062 759509
35443 759509 555252 543927 663322 718882 675530 669004 745097 783087 731367 733872 897950
35432 897950 1073476 1030600 785965 581208 562507 646539 711623 755640 811855 850619 846858
35421 846858 838758 838884 782774 651948 557326 596129 695678 709575 620693 544110 565061 670706
35409 670706 807923 912211 911290 798992 681160 656034 679844 646517 558854 501440 475986
35398 475986 405122 296892 262912 346248 453186 491696 475106 457400 458171 476436 496714
35387 496714 476569 415109 413324 548025 711828 737142 670561 727633 942928 1081376 982714
35376 982714 785041 678971 636052 552794 493739 573011 705888 707566 584111 513963 564051
35365E64051N7356j2162j9800L3482N8620M9041L3422l1162j52864j93091m0636
35354C46257J74845K24232Q7836n1188r1181j04521j41584j30787l3141O0712
35344C41480P8885Q8390J53173J74987L2882j69910j89312K515J34677J8199j60158
35333E05808j10304J12917J88487K2655j24767o7704L9399R062o3862j5311O7017
35322E63397O869j21512j10017J7192N1587l1000m6771N5036J14902N7484k459
35311E54708M118N512k1235m406L5931J17n9214R325J33880P2570j38355j56933
35299D36018J00623K55616N7895j92557j36854N8785J7741j92663j88784P0828
35289B86648K21324P6466j34268j71478q1137P179Q5306J57935J60036Q8015L4196
$$ plain form
35365 564051 621407 609245 589445 622927 681547 730588 764010 732848 579984 386893 346257
35354 346257 521102 745334 833170 781982 690801 586280 444696 313909 280768 341480
35344 341480 420365 508755 661928 836915 869797 699887 510575 513090 647767 665966 505808
35333 505808 395504 508421 696908 719563 594796 527092 566491 575553 511691 496380 563397
35322 563397 570266 448754 338737 355929 407516 376516 329745 384781 499683 557167 554708
35311 554708 558826 564338 543103 538697 574628 574745 515531 524856 658736 731306 592951 436018
35299 436018 536641 792257 850152 657595 520741 579526 597267 404604 215820 286648
35289 286648 507972 584438 450170 278692 197555 204734 290040 447975 608011 696026 730222
35278G30222K3413j3999o7051l2943P2591R2695j8525j12668r0231l9898m6968
35267D96638m5881K3942P9002L8783k1264K899O8228O3737j4913q2641r2823n4900
35255D60807J3858P3650O2235j7966p8469p1570n5355o4515k1610J17347K24038
35244F42450J48449m3609j35368n3355M4955Q334j03371j22419j0191R6122O5442
35233E37439o2463j29637n7224O2095R4852M1571J0163L6209L4491l9799q7753
35222D39944q891J25512J53793N1271m0652k4568K4844m201q5484j02679k7789
35211E01100M6012M6471O371k0501m4468q3693q7105Q83J27013J69678R3373j4957
35199G40177p2176q2567p4897l8518L2376R3291R6894M3607m1956j30461j65092
$$ plain form
35278 730222 753635 739636 672585 639642 712233 804928 786403 673735 583504 543606 496638
35267 496638 450757 474699 553701 592484 571220 574119 642347 706084 691171 608530 515707 460807
35255 460807 474665 548315 610550 592584 514115 442545 387190 322675 301065 418412 642450
35244 642450 790899 747290 611922 558567 603522 611856 508485 386066 375875 471997 537439
35233 537439 474976 345339 288115 350210 445062 486633 496796 533005 567496 527697 439944
35222 439944 431053 556565 710358 761629 720977 696409 721253 717052 631568 528889 501100
35211 501100 547112 593583 599954 579453 534985 451292 364187 365070 492083 661761 755134 740177
35199 740177 668001 585434 510537 472019 504395 597686 694580 738187 696231 565770 400678
35188D00678r8808J2099M3902j6328l4759N4276J19867L9911p8166n0702Q3205
35177D75175J16170K967p4374p040P4028K3840q3097p6079N2979J49952J17594
35166G72115K0266l0919j7297p565m4976p6637k3305Q5257J10455r856j41346
35155F36192j13943L9408J27418P0473j3575j6286J0588k3481q9907r2691q995
35144E25201R0768J15679J6621j55818k39388j08133J36606K44231J32957q746
35134G49978j2744L7103r245j03957j07111m4068m1851p6173j5655J03590R3274
35123E73141o4502j49201m2406Q1669L9116p6511o6070N3821J05345M8090J4729
35112E17221O6767J05726N6688j6978l6297j9807j2090j332K3246J5995m7992
$$ plain form
35188 400678 301870 313969 357871 341543 306784 361060 480927 520838 442672 391970 475175
35177 475175 591345 594312 519938 512898 586926 610766 527669 451590 504569 654521 772115
35166 772115 792381 761462 744165 736600 691624 614987 591682 676939 787394 777538 636192
35155 636192 522249 561657 689075 759548 745973 729687 740275 716794 626887 534196 525201
35144 525201 615969 731648 748269 592451 353063 244930 381536 625767 758724 749978
35134 749978 737234 774337 765092 661135 554024 509956 468105 391932 376277 479867 573141
35123 573141 508639 359438 317032 398701 437817 361306 295236 349057 454402 502492 517221
35112 517221 583988 689714 746402 729424 693127 673320 661230 659898 683144 699139 651147
35101F51147j05338r0024l6108j8725l2831j3501M5475P7850M9744M190j3422
35090E18457j2803j7352j4378J9229O8682Q9533N6783q041n5772n4432j9738N300
35078E75468K898o428o816o933k651K8457O2041K0906j01348j74677r1341N5618
35066C55194Q3567q149l6293O8901J36684J9585j62049j84094l4756R5085R4120
35055D27795M0420K6173K3878j9896o7333m4364M0127R4711N1490n6513j19471
35044C97017n7233Q0685J45423N7873q2040j16744l5489L1974J9811P866N8168
35033E07311Q6166n769j41180j47049k467J19605R2280L033N321Q6528J00255
35022G04034k921j06972j12768o7943n3229m3962J5091P3254M0598m5916n9784
$$ plain form
35101 651147 545809 455785 419677 400952 368121 354620 400095 477945 527689 531879 518457
35090 518457 505654 488302 473924 493153 561835 651368 708151 700110 644338 589906 570168 575468
35078 575468 578366 571938 565122 558189 555538 583995 646036 666942 565594 390917 299576 355194
35066 355194 438761 430612 394319 463220 599904 619489 457440 273346 238590 333675 427795
35055 427795 468215 494388 518266 498370 431037 386673 426800 521511 573001 516488 397017
35044 397017 339784 420469 565892 623765 541725 424981 389492 421466 441277 449143 507311
35033 507311 593477 587708 446528 299479 297012 416617 508897 511930 517251 603779 704034
35022 704034 701113 594141 481373 413430 360201 316239 331330 404584 445182 399266 339482
35011C39482J5642O2287K3905j1197K3917N9518K3512k5772r461K3885j2413p4997
34999D38308n3340L6113O5269J706m0105J1961P0205K5053q6581j33647o8367
34988B66575K5487N2869J5284j8471q414K7275O3497R6309J04269M0984q1724
34977E83940j53937r3615K0479M4615k0742m5183P839K9055k3029k8893P5194
34966C95723J46373M5102j26589j64127n4509M0178M0248J7817K9868M1211K2494
34955D33789n54q211n202J3593M0691L7608J3681M8523J39549J34560l8046j86302
34943F23679j03870R0754J13904l9586j02806J0072P2370m8517j53602m7486J28296
34932E43208J09917r5987k42319j78987P400J40303J17462k8668j51489j22536
$$ plain form
35011 339482 355124 417411 441316 430119 454036 513554 537066 511294 501833 525718 513305 438308
34999 438308 384968 421081 486350 488056 447951 459912 530117 555170 468589 334942 266575
34988 266575 292062 344931 360215 341744 333330 360605 424102 520411 624680 665664 583940
34977 583940 430003 336388 356867 401482 380740 335557 343396 372451 349422 320529 395723
34966 395723 542096 587198 460609 296482 241973 282151 322399 340216 370084 411295 433789
34955 433789 433235 425024 419822 433415 474106 511714 525395 573918 713467 848027 809981 623679
34943 623679 519809 610563 724467 684881 582075 592147 664517 616000 462398 414912 543208
34932 543208 653125 557138 314819 135832 143232 283535 400997 372329 220840 98304
34922I8304P684O0351k5941j15906q8280J5031J13891K05846K66141J95703o602
34911G26222j66244j62431r7465r8199r8899M052J19091R1241l0117o8930j039
34900B17282N1669N4325P8239J18092R3594K1959j536J3594k1971p9542m4538
34889E01167M6514K3836j15734j51355K4747K10788J70130m5697j91871j44607
34879C27918J3391J47407J84144J13617j3343j00889q9634j2326O1884R9483R2364
34868H24016L5915m0039p5783o2537o1047r2307p7899L9122J69359J67655L1371
34857H57826p9873m0203Q7749J30477J1203j57082j98820p9584N4855N9583l2892
34846F13239o9980J2811J16268J16994J3245r5135j21350n9845K0526L6096j8442
$$ plain form
34922 98304 105988 166339 140398 24492 -63788 -48757 65134 270980 537121 732824 726222
34911 726222 559978 397547 300082 201883 102984 107036 226127 317368 287251 218321 217282
34900 217282 268951 323276 401515 519607 613201 635160 633624 647218 625247 545705 501167
34889 501167 547681 571517 455783 304428 329175 539963 710093 664396 472525 327918
34879 327918 341309 488716 672860 786477 773134 672245 582611 570285 632169 731652 824016
34868 824016 859931 819892 744109 681572 620525 528218 450319 489441 658800 826455 857826
34857 857826 777953 737750 825499 955976 967179 810097 611277 531693 586548 646131 613239
34846 613239 543259 556070 672338 789332 802577 707442 586092 526247 546773 582869 564427
34835E64427l7175P1115K19659K06051j3649k14781j68362N1102J53565J3940
34825H45892j74878j74820j0085R9035M4956n5734o5533j5820j7914o6663n2916
34814C55520M5590J12281O9627N97J5007P8446Q0092J5498k4190k1513n0877j13450
34802E62628r9184K7100J32105J02235J9581K6095R1404P0673m0209q0599J5863
34791H27692R9590K9257j04539j07415L2010J25786N3259q4550j25193o4498l1395
34780F50004q7035j45081j06413P0O3151M1793O336K1748N1478K0568o2665j09657
34768C44297o9075J7756Q6698J17193J09443N8149j2502m4640k6944k4546o9968
34757D85861q6143n954Q5698N1175q0369j30154k4736R6777P9788n0835j53539
$$ plain form
34835 564427 527252 598367 818026 1024077 1010428 795647 627285 678387 831952 845892
34825 845892 671014 496194 486109 585144 630100 574366 508833 493013 475099 408436 355520
34814 355520 401110 513391 583018 583615 598622 677068 757160 772658 748468 726955 676078 562628
34802 562628 463444 490544 622649 724884 744465 770560 861964 932637 892428 811829 827692
34791 827692 927282 956539 852000 744585 776595 902381 955640 871090 745897 681399 650004
34780 650004 562969 417888 311475 311545 374696 416489 422825 444573 496051 516619 453954 344297
34768 344297 275222 292978 379676 496869 606312 664461 651959 607319 580375 555829 485861
34757 485861 399718 393764 479462 530637 450268 320114 295378 392155 471943 421108 267569
34746B67569j38482j7765J27288J80028Q3934m6733k4367J42399K13458N0529
34736H37858j58954j60429Q282J04649M2738m6235p4324r4727j25567q2671N0300
34725C00920J46788J09273J970m8887l83R4975J43130O8854r0490j69512o2131
34714D94507J06665J33947K7655l3832o306k2165j09234j13061J8968J07582K1696
34703F26422j09905j11273j3120N5406P3818P5210K9101n8252o2971O3495J48991
34692G16922L9852j27962j12182O2920J46869M0478r0706r1385r994K9107n5l6579
34680E67285k7100K7469O8105K8629o5263r5879j2058Q2144P5017J486m3876n5057
34668E50902o1442k6550N8858P9784l7818j50018p7981R5827J31312k468r4792
$$ plain form
34746 267569 129087 111322 238610 418638 502572 455839 431472 573871 787329 837858
34736 837858 678904 518475 526757 631406 674144 627909 553585 458858 333291 250620 300920
34725 300920 447708 556981 558951 510064 509681 604656 747786 816640 726150 556638 494507
34714 494507 601172 735119 762774 728942 722636 700471 591237 478176 497144 604726 626422
34703 626422 516517 405244 392124 447530 521348 596558 625659 567407 504436 567931 716922
34692 716922 756774 628812 516630 579550 726419 766897 676191 584806 574812 603919 603864 567285
34680 567285 540185 567654 635759 664388 599125 503246 491188 573332 648349 649835 605959 550902
34668 550902 489460 462910 521768 601552 563734 413716 335735 431562 562874 560406 465614
34657D65614l3808N1158L7017j6696k4981k9184p9261j03790k1893J03800J38091
34646D86067N2183m8284n5458K3006P4186J0254j05134j13844J5944J14569M5718
34635D99207p8225n8827Q1636J37369L4614q2141r2450m6150k3344r559K4825
34624C86955M9490M1768K9446K5682J3816J2427M8594O1770l4349j78219j93918
34613B63462l7449J27730J53152P7982K2590K2954L3040N056p4265j54751j30469
34602C09032K7152J67659J30152q500k9857Q5202J24936m027j24661q3281J5580
34591F09387P667p0248p9042j0018L8263K9096K583j0561P578P1270J28612Q2368
34579H06955n7157j48876j20343o4390o0404m7987J9186N0727j5052p0129j7079
$$ plain form
34657 465614 431806 482964 519981 503285 478304 449120 369859 266069 244176 347976 486067
34646 486067 538250 489966 434508 457514 531700 541954 436820 322976 338920 453489 499207
34635 499207 420982 362155 443791 581160 615774 533633 441183 395033 371689 362130 386955
34624 386955 436445 478213 507659 533341 547157 559584 608178 669948 635599 457380 263462
34613 263462 226013 353743 506895 584877 607467 630421 663461 668517 594252 439501 309032
34602 309032 336184 503843 633995 625495 595638 680840 805776 801749 677088 593807 609387
34591 609387 617054 546806 467764 457746 496009 525105 527688 517127 524705 595975 724587 806955
34579 806955 749798 600922 480579 416189 355785 307798 326984 377711 362659 292530 275451
34568B75451M4435j2785j07402q1820K1621L1207o1559r4869r970O2294P862j32287
34556e7822k52635k88248k21805r8768l3334r0835j74610j38433P162J18222J28592
34545a102514J09417J22645J44304J44660J28628Q4568R03o1169k4359O9981J04391
34534b78545P2338Q7776J78116K12347J03751m2121p6581r226M2083K9953l583
34523C16308l7422q2554j00748l1315Q3825J11995J6906o1724n75J10108Q8011
34512D12815n5257j11251P216J14309L0727j25661j09144P3826J70217N7994r8076
34501C67715j19247m3760R137L3793O8322O7862o107p1330m4477P951j4679n5296
34489A99884R455J33106J40437O913q0998K771J37645J29014k9745j66928j57150
$$ plain form
34568 275451 319886 307101 199699 117879 139500 170707 109148 14279 4309 66603 74465 -57822
34556 -57822 -310457 -598705 -820510 -919278 -952612 -1043447 -1218057 -1356490 -1349328 -1231106 -1102514
34545 -1102514 -993097 -870452 -726148 -581488 -452860 -368292 -367389 -428558 -452917 -382936 -278545
34534 -278545 -206207 -118431 59685 272032 375783 333662 257081 247855 289938 319891 316308
34523 316308 278886 196332 95584 64269 148094 260089 276995 215271 214696 324804 412815
34512 412815 357558 246307 253523 367832 398559 272898 163754 237580 407797 465791 367715
34501 367715 248468 204708 213845 247638 315960 383822 377715 306385 261908 269859 255180 199884
34489 199884 209339 342445 482882 489795 408797 411568 549213 678227 648482 481554 324404
34478C24404m6540L8679L8385r501m0858k8381J6843O4763P6390L2163l0081m6297
34466C89969j8539j7933n7645m7159M9853J06696J2990j14664p8062Q6362J43743
34455D55611K2008q1629j8679R1646P3229m3079j01101m9702L1509N9070J0709
34444D49592o9737q6870L589R5748O0026l6906j5992J04833J17364j5658p6275
34433E29714K9985R6312k1695j40992o7676O9234N6009m5268m8717K1075K6206
34422E04187p990J0142J2850p6755j20644R863J38222M0900j40126j10604O6096
34411C26141P8245q3565j15705O3190J90262J21873K2005M903l8025j44975j60101
34400B64248k9733P9802P3789N4861O6957Q495j10037j25665l0458p384p4520
$$ plain form
34478 324404 277864 316543 354928 345427 304569 276188 293031 357794 434184 466347 436266 389969
34466 389969 371430 353497 295852 248693 298546 405242 418232 303568 225506 311868 455611
34455 455611 477619 395990 377311 468957 542186 499107 398006 348304 379813 438883 449592
34444 449592 379855 292985 296574 392322 452348 415442 399450 504283 621647 605989 529714
34433 529714 559699 656011 634316 493324 425648 494882 550891 505623 456906 477981 504187
34422 504187 496197 506339 519189 442434 321790 331653 469875 510775 370649 260045 326141
34411 326141 404386 320821 205116 268306 458568 580441 602446 607349 569324 424349 264248
34400 264248 234515 314317 388106 442967 509924 518419 408382 282717 252259 244875 170355
34389A70355l4967J21059J42397k0645q0672P8979J73518K8863r0829L2461J57428
34378F77947K2791j56968o1522J61570J52629n1351j30539m6124k9040j07667
34368D31726r0276L5369R1473O2053P8276R7239k3348j71490j03696R5858R5994
34357E99178j23008k17417m9267J15733Q8727K5826O2050O6889l6683o6982O9910
34346E34956J51333J6463j17091j1544J62362Q9911j65783k52760n8632J62427
34336E11642J75103K1220j24374j59482q4771L4861J13879J23866J04402N7230
34326G73576p0659k28986k35387l5069J52269J18228k5050k7261J07973J53552
34316F83186L1004r5959j00287l5617K5960Q7953J13463J4532j68900k50565j40252
$$ plain form
34389 170355 135388 256447 398844 378199 297527 376506 550024 578887 488058 520519 677947
34378 677947 700738 543770 482248 643818 796447 745096 614557 568433 539393 431726
34368 431726 341450 376819 468292 530345 608621 705860 682512 511022 407326 503184 599178
34357 599178 476170 258753 209486 325219 413946 439772 501822 568711 532028 465046 534956
34346 534956 686289 702752 585661 574117 736479 826390 660607 407847 349215 511642
34336 511642 686745 707965 583591 424109 339338 374199 488078 611944 716346 773576
34326 773576 702917 473931 238544 203475 355744 473972 448922 421661 529634 683186
34316 683186 714190 618231 517944 482327 508287 596240 709703 724235 555335 304770 164518
34305A64518L7873J35802J46240J12400K9845p3676j05094m9961j7092m8099k9079
34294C03677R7579J88477J10688m1031j01447q1568p7869n8764M2558J21559L4047
34283E37906j25897j33909R966R3795M7231M009P65p7118j90541j19731J31438
34272A77914K31897J7770k12855j48333O7208J16156K4728L6975J39125J07287
34262E57872n2373j05608j5482R213q1177q6346N6462J36990M0701n8806k0682
34251C80764L2775k6495r7262n3043L8974Q0494J14893J60689Q9657j22315k31607
34240C67524n9542J85836J88105j4300j23421m1304N7105O1599N1993Q0540P9678
34229H33813K6058n506Q519N917k1268j0842K7576J1931n0651n6622J0803M0038
$$ plain form
34305 164518 202391 338193 484433 596833 626678 553002 447908 397947 380855 332756 303677
34294 303677 401256 589733 700421 659390 557943 476375 398506 339742 382300 503859 537906
34283 537906 412009 278100 288066 381861 429092 433101 433866 356748 166207 46476 177914
34272 177914 409811 427581 214726 66393 133601 249757 274485 311460 450585 557872
34262 557872 505499 399891 384409 393622 312445 226099 282561 419551 460252 401446 380764
34251 380764 413539 387044 289782 236739 275713 356207 471100 631789 721446 599131 367524
34240 367524 307982 493818 681923 667623 544202 502898 560003 621602 673595 754135 833813
34229 833813 859871 854365 862884 868801 847533 836691 864267 876198 825547 768925 779728 819766
34217H19766k5577r3970o3312M6887J40007J37601K4177j21153j55550l2853R7500
34206G73523P0277n2722o8040O0712J49805O8202r6880j86915j47802k0637J15803
34195F65326J55558L8377j48197k38713j78290m6429Q3566J74671J50756k0448
34185F36177j74569j00733J22444J78653k3009j88724q0304J27651J37986j6128
34175F19444o9252M0949J12500K5417r6977j10562m4483l510p755p055J9615M1461
34163E19792K2895l2256p2986m9955J3753L8895L007j7950L3760R8379Q2897r77
34151F39254n8691m6969j5853k4845o8550q7881l6308N3317P7838j1448j06817
34140C13047n6491J13089K01520J00770o1725j12595n0419J2621K1823p555n6335
$$ plain form
34217 819766 794189 700219 636907 683794 823801 961402 985579 864426 708876 676023 773523
34206 773523 843800 791078 723038 783750 933555 1001757 904877 717962 570160 549523 665326
34195 665326 820884 859261 711064 472351 294061 247632 331198 505869 656625 636177
34185 636177 461608 360875 483319 661972 638963 450239 369935 497586 635572 619444
34175 619444 550192 591141 703641 729058 632081 521519 477036 473526 465771 458716 478331 519792
34163 519792 542687 510431 437445 387490 401243 440138 443145 425195 458955 557334 640231 639254
34151 639254 580563 533594 517741 492896 424346 336465 300157 353474 431312 419864 313047
34140 313047 256556 369645 571165 671935 610210 497615 447196 459817 481640 474085 417750
34129D17750p8794n074J31582J71815N0554p2323m5190K8179l8318j88696k00027
34118A71458l4522J18252J44072J18564R7350K3042r6335j30335m0948K9577j1377
34107C88798n7239K051Q9283P9938N496k6777j8449m0809q2308p0475k766N4948
34095C21691O8158N1300K7555L1371Q6868J30544N1700j19782j86240m8736J21442
34084E35871J18632j095l3657N1607J07586P8161N7148Q2212P2171k43m8395k3149
34072I96849K7953P7086J34336J36412O341j43463q7028J61006K97669J63847
34062A771008o920M0610J76938J16919r5038j50986J8089J34189J9599j37892
34052A886516j00423O1600J08512j0266j27537j23777n0621P86J4834P351k9273
$$ plain form
34129 417750 338956 333882 465464 637279 687833 615510 570320 598499 560181 371485 171458
34118 171458 136936 255188 399260 517824 615174 638216 541881 411546 370598 400175 388798
34107 388798 331559 333610 422893 502831 508327 481550 463101 422292 339984 269509 266743 321691
34095 321691 389849 441149 468704 500075 586943 717487 769187 649405 463165 414429 535871
34084 535871 654503 653408 619751 671358 778944 857105 914253 996465 1068636 1068393 1019998 996849
34072 996849 1024802 1101888 1236224 1372636 1378977 1235514 1148486 1309492 1607161 1771008
34062 1771008 1764088 1804698 1981636 2098555 2003517 1852531 1870620 2004809 2024408 1886516
34052 1886516 1786093 1847693 1956205 1945939 1818402 1694625 1644004 1644790 1659624 1666975 1637702
34041A637702q4498r7345k8233O2738O8287l0361j29090j29499o3097l7490q2244
$$ plain form
34041 1637702 1553204 1455859 1427626 1490364 1558651 1528290 1399200 1269701 1206604 1169114 1086870
$$ [...]
##END NTUPLES=NMR SPECTRUM
##END=
