##TITLE=31Pdec_LR-761-RM3
 , 24 sc
 17.1.2023
##JCAMPDX= 6.0         $$ Bruker NMR JCAMP-DX V2.0
##DATA TYPE= NMR SPECTRUM
##DATA CLASS= NTUPLES
##ORIGIN= UXNMR, Bruker Analytische Messtechnik GmbH
##OWNER= root
$$ XWIN-NMR		Version 3.5
$$ Tue Jan 17 13:56:39 2023 Russian Standard Time (UT+4h)  she@DPX200
##.OBSERVE FREQUENCY= 81.013821
##.OBSERVE NUCLEUS= ^31P
##.ACQUISITION MODE= SIMULTANEOUS
##.ACQUISITION SCHEME= undefined
##.AVERAGES= 24
##.DIGITISER RES= 16
##SPECTROMETER/DATA SYSTEM= spect
##.PULSE SEQUENCE= zgpg30
##.SOLVENT NAME= DMSO
##.SHIFT REFERENCE= (INTERNAL, DMSO, 0, 248.564)
##AUDIT TRAIL= $$ (NUMBER, WHEN, WHO, WHERE, WHAT)
$$ ##TITLE= Audit trail, XWIN-NMR		Version 3.5
$$ ##JCAMPDX= 5.01
$$ ##ORIGIN= Bruker BioSpin GmbH
$$ ##OWNER= she
$$ F:/spectra/data/she/nmr/P31/1/pdata/1/auditp.txt
$$ ##AUDIT TRAIL=  $$ (NUMBER, WHEN, WHO, WHERE, WHAT)
(   1,<2023-01-17 13:55:26.06 +0400>,<she>,<DPX200>,
      <created by zg, POWCHK disabled, PULCHK disabled
       configuration hash MD5:
       00 E9 B6 7A A2 85 ED C7 34 08 36 98 17 FE 4E 26
       data hash MD5: 32K
       5A 5B 1B 04 88 27 7C 35 F0 11 CE 84 E0 3D CE 09>)
(   2,<2023-01-17 13:55:28.59 +0400>,<she>,<DPX200>,
      <Start of raw data processing
       efp BC_mod = 2 LB = 1 FT_mod = 6 PKNL = 1 PHC0 = -11333.54 PHC1 = 1367.658 SI = 64K 
       data hash MD5: 64K
       37 06 58 9A 4F 96 FA BF 42 84 1B 4A 46 F8 7B C1>)
(   3,<2023-01-17 13:56:03.31 +0400>,<she>,<DPX200>,
      <pk PHC0 = 351.5851 PHC1 = -1209.4 
       data hash MD5: 64K
       A9 C9 29 1D F3 21 1C 44 84 B6 31 6E 36 3D 8C B6>)
(   4,<2023-01-17 13:56:06.04 +0400>,<she>,<DPX200>,
      <abs ABSG = 5 
       data hash MD5: 64K
       B1 7D 57 53 92 39 2E CD F8 3F B5 F0 F4 85 5E F2>)
$$ ##END=
$$ 
$$ hash MD5
$$ AA 21 F8 B3 C5 7D 83 61 77 EA 23 C8 D3 D1 4C D0
##$RELAX= 
##$RELAX= 
##$RELAX= 
##$RELAX= 
##$RELAX= 
##$RELAX= 
##$RELAX= 
##$RELAX= 
##$RELAX= 
$$ Bruker specific parameters
$$ --------------------------
##$DU= <F:/spectra>
##$EXPNO= 1
##$NAME= <P31>
##$PROCNO= 1
##$TYPE= <nmr>
##$USER= <she>
##$AMP= (0..31)
100 100 100 100 100 100 100 100 100 100 100 100 100 100 100 100 100 100 
100 100 100 100 100 100 100 100 100 100 100 100 100 100 
##$AQSEQ= 0
##$AQ_mod= 1
##$AUNM= <au_zg>
##$AUTOPOS= <>
##$BF1= 81.014009
##$BF2= 200.13
##$BF3= 200.13
##$BF4= 200.13
##$BF5= 200.13
##$BF6= 200.13
##$BF7= 200.13
##$BF8= 200.13
##$BYTORDA= 1
##$CFDGTYP= 0
##$CFRGTYP= 5
##$CHEMSTR= <none>
##$CNST= (0..31)
1 1 145 1 1 1 1 1 1 1 1 1 1 1 1 1 1 1 1 1 1 1 1 1 1 1 1 1 1 1 1 1 
##$CPDPRG= <waltz16>
##$CPDPRG1= <>
##$CPDPRG2= <waltz16>
##$CPDPRG3= <>
##$CPDPRG4= <mlev>
##$CPDPRG5= <mlev>
##$CPDPRG6= <mlev>
##$CPDPRG7= <mlev>
##$CPDPRG8= <mlev>
##$CPDPRGB= <>
##$CPDPRGT= <>
##$D= (0..31)
0 1 0 0 0 0 0 0 0 0 0 0.03 2e-05 3e-06 0 0 0 0 0 0 0 0 0 0 0 0 0 0 0 0 
0 0 
##$DATE= 1673949325
##$DBL= (0..7)
120 120 120 11 120 120 24 19 
##$DBP= (0..7)
150 150 150 150 150 150 150 150 
##$DBP07= 0
##$DBPNAM0= <>
##$DBPNAM1= <>
$$ [...]
##$SUBNAM3= <"">
##$SUBNAM4= <"">
##$SUBNAM5= <"">
##$SUBNAM6= <"">
##$SUBNAM7= <"">
##$SUBNAM8= <"">
##$SUBNAM9= <"">
##$SW= 501.771253377433
##$SWIBOX= (0..15)
0 1 3 0 0 0 0 0 0 0 0 0 0 0 0 0 
##$SW_h= 40650.406504065
##$TD= 32768
##$TD0= 1
##$TE= 0
##$TE2= 300
##$TE3= 300
##$TEG= 300
##$TL= (0..7)
0 120 53 12 22 120 120 120 
##$TP= (0..7)
150 150 150 150 150 150 150 150 
##$TP07= 0
##$TPNAME0= <>
##$TPNAME1= <>
##$TPNAME2= <>
##$TPNAME3= <>
##$TPNAME4= <>
##$TPNAME5= <>
##$TPNAME6= <>
##$TPNAME7= <>
##$TPOAL= (0..7)
0.5 0.5 0.5 0.5 0.5 0.5 0.5 0.5 
##$TPOFFS= (0..7)
0 0 0 0 0 0 0 0 
##$TUNHIN= 0
##$TUNHOUT= 0
##$TUNXOUT= 0
##$USERA1= <user>
##$USERA2= <user>
##$USERA3= <user>
##$USERA4= <user>
##$USERA5= <user>
##$V9= 5
##$VALIST= <valist>
##$VCLIST= <CCCCCCCCCCCCCCC>
##$VD= 0
##$VDLIST= <DDDDDDDDDDDDDDD>
##$VPLIST= <PPPPPPPPPPPPPPP>
##$VTLIST= <TTTTTTTTTTTTTTT>
##$WBST= 1024
##$WBSW= 4
##$XGAIN= (0..3)
0 0 0 0 
##$XL= 0
##$YL= 0
##$YMAX_a= 9409
##$YMIN_a= -10286
##$ZGOPTNS= <>
##$ZL1= 120
##$ZL2= 120
##$ZL3= 120
##$ZL4= 120
##$ABSF1= 248.5645
##$ABSF2= -253.2056
##$ABSG= 5
##$ABSL= 3
##$ALPHA= 0
##$AQORDER= 0
##$ASSFAC= 0
##$ASSFACI= 0
##$ASSFACX= 0
##$ASSWID= 0
##$AUNMP= <proc_1d>
##$AZFE= 0.1
##$AZFW= 0.5
##$BCFW= 0
##$BC_mod= 2
##$BYTORDP= 0
##$COROFFS= 0
##$CY= -3
##$DATMOD= 1
##$DC= 0
##$DFILT= <>
##$DTYPP= 0
##$F1P= 0
##$F2P= 0
##$FCOR= 1
##$FTSIZE= 65536
##$FT_mod= 6
##$GAMMA= 0
##$GB= 0
##$INTBC= 1
##$INTSCL= 6.047779e-11
##$ISEN= 30
##$LB= 1
##$LEV0= 0
##$LPBIN= 0
##$MAXI= 10000
##$MC2= 0
##$MEAN= 0
##$ME_mod= 0
##$MI= 50
##$NCOEF= 0
##$NC_proc= -5
##$NLEV= 6
##$NOISF1= 182.463
##$NOISF2= 159.3651
##$NSP= 0
##$NTH_PI= 0
##$NZP= 0
##$OFFSET= 248.5645
##$PC= 4
##$PHC0= -10981.96
##$PHC1= 158.2579
##$PH_mod= 1
##$PKNL= yes
##$PPARMOD= 0
##$PSCAL= 0
##$PSIGN= 0
##$REVERSE= no
##$SF= 81.0140089999694
##$SI= 65536
##$SIGF1= 159.3651
##$SIGF2= -187.1042
##$SINO= 113.3802
##$SIOLD= 16384
##$SREGLST= <1H.CDCl3>
##$SSB= 0
##$STSI= 65536
##$STSR= 0
##$SW_p= 40650.406504065
##$SYMM= 0
##$S_DEV= 0
##$TDeff= 32768
##$TDoff= 0
##$TI= <>
##$TILT= no
##$TM1= 0
##$TM2= 0
##$TOPLEV= 0
##$USERP1= <user>
##$USERP2= <user>
##$USERP3= <user>
##$USERP4= <user>
##$USERP5= <user>
##$WDW= 1
##$XDIM= 65536
##$YMAX_p= 346272280
##$YMIN_p= -9874188
$$ End of Bruker specific parameters
$$ ---------------------------------
##NTUPLES= NMR SPECTRUM
##VAR_NAME=  FREQUENCY,     SPECTRUM/REAL,   SPECTRUM/IMAG
##SYMBOL=    X,             R,               I
##VAR_TYPE=  INDEPENDENT,   DEPENDENT,       DEPENDENT
##VAR_FORM=  AFFN,          ASDF,            ASDF
##VAR_DIM=   65536,         65536,           65536
##UNITS=     HZ,            ARBITRARY UNITS, ARBITRARY UNITS
##FACTOR=    0.620285442955139, 1,           1
##FIRST=     20137.2065510682, 0,            0
##LAST=      -20513.1999529968, 0,           0
##MIN=       -20513.1999529968, -9874188,    0
##MAX=       20137.2065510682, 346272280,    0
$$ Real data points
##PAGE= N=1
##DATA TABLE= (X++(R..R)), XYDATA
$$ [...]
41963g21898J93357J66854k86764k49467N01866R72694M80676k53107k60396J91458
41953G35273J85020k98525m53465m9189K78441J66688J0273J03911J50195m9397
41943G79225j63468j880N0359k54080m84373k52487O6774l4103l00429j55366
41933g49828K98491M52505J62035j55797k55895k35563r6296J96544L28007M251
41923e1546l92120k70070J34841N9228m62571n57858M0646N41354M16964J52751
41913c88381J81661R2699m08563o89890k09849M39153M50479R7621J07056L30932
41903B918J51776k54594k38261P1024L0197k35657q1046K74748r173p23461o50780
41892a662309L95513J018141L32668o74794p02370M7978N38982M89158K96832
$$ plain form
41963 -721898 -528541 -361687 -648451 -897918 -396052 576642 1057318 804211 543815 735273
41953 735273 920293 621768 168303 119114 397555 564243 574516 678427 828622 779225
41943 779225 615757 613877 664236 410156 -74217 -326704 -259930 -294033 -594462 -749828
41933 -749828 -451337 1168 163203 7406 -248489 -484052 -580348 -383804 -55797 -51546
41923 -51546 -443666 -713736 -578895 -519667 -982238 -1540096 -1499450 -958096 -541132 -388381
41913 -388381 -206720 -114021 -522584 -1212474 -1422323 -983170 -532691 -435070 -328014 2918
41903 2918 154694 -99900 -338161 -267137 -236940 -472597 -553643 -278895 -288068 -1011529 -1662309
41892 -1662309 -1266796 -248655 84013 -590781 -1293151 -1245173 -706191 -217033 79799
41883G9799Q0267j94284j62588L78733P79909L48322m76635o80230j57566K65259
41873B60986J40384j59487k64614k46636j74887M6777K90772K44156p3281l15176
41863b51006l40547k79934j39129J62712M35485M11285K18044J66899J93972L2684
41853F10465k29670l31560l56113m46161k91481L24255P68398L24156n05496n90009
41843g23216L7742K81266p9113n3559N91594O65629l56447j116802m35765P08098
41833d80573P18898j08899k85621L52956O05804R0693k98083j62214j81449o14984
41823c63472p08009r8114M75533M49013K57854K68940L3495o29310q84728j81008
41813a379806O10627M40346k58946l28210K43458M70725R4177j54504K7595Q5028
$$ plain form
41883 79799 160066 -34218 -196806 181927 961836 1310158 833523 153293 -4273 260986
41873 260986 401370 241883 -22731 -269367 -444254 -397477 -106705 137451 64170 -251006
41863 -251006 -591553 -871487 -1010616 -847904 -412419 -1134 216910 383809 577781 610465
41853 610465 380795 49235 -306878 -753039 -1044520 -720265 48133 372289 -133207 -723216
41843 -723216 -685474 -404208 -483321 -536880 54714 720343 363896 -752906 -1188671 -480573
41833 -480573 238325 129426 -156195 196761 802565 893258 595175 432961 251512 -363472
41823 -363472 -1071481 -1169595 -694062 -245049 12805 281745 315240 -314070 -1198798 -1379806
41813 -1379806 -769179 -328833 -587779 -915989 -672531 -201806 -107629 -262133 -234538 -149510
41803a49510k03985k60825J55680L55464j46245p15791n40416J14684L62724M0848
41793i87372j76171J19989N36207N22400O6018m00080m86271j43721L25442N05543
41783a18016K58680j20459k48162q2252J16405J50264M6894o2260o6771L7719
41773h7958O9925j76775n44583n19077R7104P41639P17767J19775l22896k55670
41763a60749k5423L8610P4054J94229J18827k91955n75970k66890L30557N22759
41753d1951K21267l4881o153o3290m20443o57954l69497J59570L83173L06210
41743e23949L31491M46554J89260m69860q08299l00275N07962O05843j41046q12443
41733i74762o64993k3813L23077K00316P2268K19205L94431L03077j35k96963
$$ plain form
41803 -149510 -353495 -614320 -458640 -103176 -249421 -965212 -1505628 -1390944 -1028220 -987372
41793 -987372 -1163543 -1043554 -507347 15053 81071 -319009 -805280 -949001 -623559 -118016
41783 -118016 140664 20205 -227957 -310209 -193804 -43540 3354 -58906 -125677 -87958
41773 -87958 -18033 -194808 -739391 -1258468 -1161364 -419725 298042 417817 94921 -160749
41763 -160749 -186172 -147562 -73508 120721 239548 -52407 -628377 -895267 -564710 -41951
41753 -41951 179316 144435 138282 74992 -345451 -1003405 -1372902 -1213332 -830159 -523949
41743 -523949 -192458 254096 443356 -26504 -834803 -1135078 -627116 -21273 -162319 -974762
41733 -974762 -1639755 -1663568 -1340491 -1140175 -1067907 -848702 -454271 -151194 -151329 -448292
41723d48292m64734m26596j29541K74465M67729L52358J92572K17869K88514J38679
41713D63023k12602m74982m01676R984M86415O00434J72350l80924m26319K9773
41703a34524K76715q0848n12469l71330J29814L13854P5276j34698j40157j46764
41693g25131j23342J71766N29880M16004j16196l78625j37592J0770k94489m93807
41683a140762l5925O39711P42224L08070j494n071j25716m76384n63290q6816
41673g45453N02341N54805M7105m16045l25844J83252N35981L93532N284j81880
41663E53078q5575P0471J93943L01188J81168l57597r04878p73174m0820M32582
41653d29614K63033K8876J49803J82103j79916l33319J42106M87152l3220o76566
$$ plain form
41723 -448292 -913026 -1339622 -1469163 -1194698 -726969 -374611 -182039 35830 324344 463023
41713 463023 250421 -224561 -626237 -616253 -129838 470596 642946 262022 -164297 -134524
41703 -134524 142191 61343 -451126 -822456 -692642 -378788 -303512 -438210 -578367 -725131
41693 -725131 -848473 -676707 -146827 269177 152981 -225644 -363236 -352466 -646955 -1140762
41683 -1140762 -1176687 -536976 205248 513318 511824 506753 381037 -95347 -658637 -745453
41673 -745453 -243112 311693 358798 -57247 -383091 -199839 336142 729674 734958 553078
41663 553078 467503 537974 731917 1033105 1214273 856676 -48202 -821376 -862196 -429614
41653 -429614 -166581 -137705 12098 194201 14285 -319034 -176928 310224 277004 -399562
41643c99562l30766M87300L51373o12738p77762L09046J108049N42015l88594
41634B88361l93726J18519O8325l72179k81051K79554M20325l1428l81256l07014
41624e91570j64511j09431R7283L67060K65744j54778l00440R351K40067L4465
41614c06760k21806n2264L73449N22388K30192j66505l04516j88818j03887j84168
41604d02695j77331J73042N70062M10061k89301p23704l85488K02472L06065L7134
41594b79683l8826P1127n7751l39996k58639J86875M09301J72382j07372j03871
41584c46453K1728R4980J87854K51967O5070k81206l63302o9068K18292K24438
41574D300J08652O3488N5044P2195J73033J99752o9603m19420l69955O7396L47449
$$ plain form
41643 -399562 -730328 -243028 108345 -504393 -1282155 -973109 134940 676955 288361
41634 288361 -105365 13154 81479 -290700 -571751 -292197 128128 96700 -284556 -591570
41624 -591570 -756081 -865512 -768229 -401169 -135425 -290203 -590643 -581292 -341225 -306760
41614 -306760 -528566 -580830 -207381 315007 545199 378694 74178 -114640 -218527 -402695
41604 -402695 -580026 -406984 163078 573139 283838 -439866 -825354 -622882 -316817 -279683
41594 -279683 -318509 -247382 -305133 -645129 -903768 -716893 -307592 -135210 -242582 -346453
41584 -346453 -324725 -229745 -41891 210076 275146 -6060 -369362 -438430 -220138 4300
41574 4300 112952 176440 231484 303679 476712 676464 606861 187441 -182514 -115118 232331
41563B32331J90166j24907l25831m13812l03896J27749N36235L67552k23840m61665
41553c99918j16634K23650K46712L35617N69598L35491n09898j072843p38985
41544a127210j69683j60087l30466O3682P04984P10306J11730k46600n1107K16629
41534b77822K23772J38837J10638R8211J28943J67171m6522n02207o56702k57258
41524h72939P9202j63609m39021o9640M39985J81659n05948m86077L00541P68685
41514g67162M60180N2343R821K4871k5467J59806L61502m7561p60168o68091K57262
41503i42664O54549o4385p17045l51826K16670K0042k57397M20271J356234J071290
41493A405739k25976q61521k35631M71337K95830k42232l14257n3248q577j65640
$$ plain form
41563 232331 422497 297590 -28241 -442053 -745949 -618200 -81965 285587 61747 -399918
41553 -399918 -516552 -292902 -46190 289427 859025 1194516 684618 -388225 -1127210
41544 -1127210 -1296893 -1456980 -1787446 -1723764 -1018780 -308474 -196744 -443344 -494451 -277822
41534 -277822 -54050 84787 195425 293636 422579 589750 543228 41021 -615681 -872939
41524 -872939 -793737 -957346 -1396367 -1466007 -1026022 -844363 -1350311 -1836388 -1535847 -767162
41514 -767162 -306982 -254639 -244818 -219947 -245414 -85608 275894 228333 -531835 -1199926 -942664
41503 -942664 -288115 -352500 -1069545 -1421371 -1204701 -1184659 -1442056 -1021785 334449 1405739
41493 1405739 1179763 318242 82611 553948 849778 607546 293289 240041 231464 65824
41483F5824j95476j44129k36524l19565q5716K87856K62900k19821m68654O9190
41473i84115Q88809R21071P912p27426l97920L39168K65513n12313p50656o9134
41463a019091M89489K16369j85053N7482M63001K53203k43610k36303J06541K7310
41453g0662m18843m68120K1548L80299K41633l8397j11075m1214M4382J00621
41443c59828M219k20786k09444J63371L43285q6015n45548k71748L87715M99285
41433b95494Q2010k7613K86740K67380k55746m93634p2189L57942K79023M9046
41423A77465M3977M292k68850m15057k09724M548J7972J20982L66092K82608k13715
41412h9410m60803j22673J94747k8334l76513k93784L7375K47462M48944O90387
$$ plain form
41483 65824 -129652 -273781 -510305 -829870 -915586 -627730 -364830 -584651 -1053305 -984115
41473 -984115 -95306 825765 833677 106251 -291669 47499 313012 -199301 -949957 -1019091
41463 -1019091 -529602 -313233 -498286 -440804 22197 275400 31790 -204513 -97972 -70662
41453 -70662 -489505 -957625 -936077 -555778 -314145 -352542 -463617 -504831 -460449 -359828
41443 -359828 -355609 -576395 -785839 -622468 -279183 -365198 -910746 -1182494 -794779 -295494
41433 -295494 -213484 -241097 45643 313023 57277 -436357 -508546 -150604 128419 177465
41423 177465 221442 225734 -43116 -458173 -667897 -663349 -645377 -524395 -158303 124305 -89410
41412 -89410 -550213 -672886 -478139 -506473 -882986 -1176770 -1139395 -891933 -442989 247398
41402B47398N27977j20117m75871p1851L61346P9885l91413k18756K32803Q4595
41392B55996m41681m39223M3613J60384j53859j49202K51315L03127j28515l16221
41382f14266n7544j8061l65912l49964K70265O02165R4846m62491k21095L85912
41372g36145M79977J48817N8121K20098J32407j98202k78251p098K20894J98278
41362B38896O8013r4944l07085l74773r1065L23389M30705J78904q5668j30051
41352A56321j9789R5830P5831j80247n08615n17080j40333J52333N7632n3731
41342h81848J88884M19293J45525k86731j86005K83005L53511R187N166M28445
41332D78432L90060m32437j026644n15202M70062P25106J57652l37631k50740
$$ plain form
41402 247398 775375 655258 179387 107536 468882 548767 157354 -61402 171401 255996
41392 255996 -185685 -624908 -581295 -420911 -574770 -723972 -472657 -169530 -298045 -614266
41382 -614266 -671810 -689871 -1055783 -1405747 -1135482 -533317 -438471 -900962 -1122057 -736145
41372 -736145 -256168 -107351 -49230 170868 303275 105073 -173178 -180276 40618 238896
41362 238896 306909 211965 -95120 -469893 -560958 -237569 193136 372040 286372 156321
41352 156321 136532 232362 308193 127946 -380669 -897749 -1038082 -885749 -828117 -881848
41342 -881848 -692964 -273671 -128146 -414877 -600882 -317877 35634 44821 49987 478432
41332 478432 868492 436055 -590589 -1105791 -635729 89377 247029 -90602 -341342
41323c41342J41239M48942M80686J14403m45419n56961M430M23351p8440q80000
41313f89111p37998K57196P34727J40657m92122k47225L89771N47736K46794n0982
41303I9443k91417m87918l22167J65352K57293k91765o04600n9316N50576L10570
41293f73949k18569k0255N25769L82446j44962M7316O71312M14312n45973n76694
41283a39247N03629Q28293l71961j254197l48343R40561O30827o36404q35062
41274f81904J14156N34102p6162n39935k83798n1256j79177k4354N25747O30852
41264c1729P2108k38690J30713L98140N6900k23488P3837L12038r1936n35456
41254g7563k87889K21033K11688p6801Q2256N33981N01208p9557m77933l15008
$$ plain form
41323 -341342 -200103 248839 729525 843928 398509 -158452 -154022 269329 190889 -689111
41313 -689111 -1427109 -1169913 -435186 -294529 -786651 -1033876 -644105 -96369 150425 99443
41303 99443 -191974 -679892 -1002059 -836707 -579414 -871179 -1475779 -1535095 -984519 -673949
41293 -673949 -892518 -912773 -387004 -4558 -149520 -102204 569108 983420 437447 -139247
41283 -139247 364382 1192675 820714 -433483 -781826 158735 789562 153158 -681904
41274 -681904 -567748 -33646 -109808 -649743 -933541 -984797 -1163974 -1188328 -662581 -31729
41264 -31729 40379 -198311 -67598 330542 387442 163954 237791 549829 457893 -77563
41254 -77563 -365452 -144419 67269 -9532 72724 606705 1107913 1028356 550423 235415
41244B35415L7913J76398J07578j8617r3158R577K57596L30100K4541l71656m58787
41233B36900k45986L7021L26687N26197L00318m02296r47177p31211o0464K81754
41223f78257J26858m4686J9794J15860J48831K51369L20004O5860l95038n69770
41213f39175l03027N0134K37750L65920M47789K64426j32395k98253m0358K46189
41203A99000J61056j49945l04960k30562j03207N619J31547K18089J58661l5514
41193D9784k42594l32967k28572P318J36760o500k32645j85993J60365M50907
41183d24137M28436K08210J7826o4861l8320Q3286J57639O022k70061l20903j9205
41172b36068L50261M91732M24808K71771J2023l36664n43365m34114j66575o65
$$ plain form
41244 235415 273328 449726 557304 538687 445529 455106 712702 1042802 1067343 695687 236900
41233 236900 -9086 27935 354622 880819 1181137 778841 -168336 -899547 -960011 -678257
41223 -678257 -551399 -596085 -576291 -460431 -311600 -60231 259773 325633 -69405 -639175
41213 -639175 -942202 -892068 -654318 -288398 159391 423817 291422 -6831 -47189 199000
41203 199000 360056 210111 -94849 -325411 -428618 -422999 -291452 -73363 85298 49784
41193 49784 -192810 -525777 -754349 -747031 -610271 -616771 -849416 -1035409 -875044 -424137
41183 -424137 4299 212509 230335 165474 127154 210440 368079 374101 104040 -216863 -236068
41172 -236068 114193 605925 1030733 1302504 1314527 977863 434498 384 -166191 -166856
41162a66856M6796Q3460M8336j52971l23474j54490K42633L51672k5462l70546
41152d20902j15927M54840M62050l15948r62963o14106K63613M63924k15331o71228
41142a671978j48554O74902Q10418M15346K82848M08070J32875m85999n97756
41133a79828J4925M73300J48435m10321m12989K5860K88022K39128J64955J10895
41123D62382q4873l36809m20676l60075k84300j16971J89144L55094J60990r0679
41113e26773L0613L93853M85253J63395k14697l50224k72225j04271N5296N8197
41103b81583j41644k93669j12140L14819O33408O43088L76527n3077m10841l93781
41093B81107p4367j2816m87339r01850n32714L55099Q10060N06339M1042q2560
$$ plain form
41162 -166856 -120060 -36600 11736 -141235 -464709 -619199 -376566 -24894 -50356 -420902
41152 -420902 -536829 -81989 380061 64113 -898850 -1512956 -1249343 -785419 -1000750 -1671978
41142 -1671978 -1820532 -1145630 -335212 80134 362982 771052 903927 417928 -179828
41133 -179828 -164903 308397 456832 46511 -366478 -340618 -52596 186532 351487 462382
41123 462382 377509 40700 -379976 -740051 -1024351 -1141322 -952178 -597084 -436094 -526773
41113 -526773 -496160 -102307 382946 546341 331644 -18580 -290805 -395076 -339780 -281583
41103 -281583 -423227 -716896 -829036 -514217 119191 762279 1138806 1085729 674888 281107
41093 281107 206740 193924 -293415 -1195265 -1727979 -1372880 -562820 -56481 -15439 -97999
41083i7999k2946q993Q8640K92546K47300j93398n86908m98552r1200K32840M02719
41072b35951N08463M02451o2097n85017o51095j67132M26690O55901M28231R104
41062G29548k57041k33368p2404K9600R4377J97021J51257k66521p84340q04040
41052a215911k52099K25247J89353M6181L19662P00656M56621l74154q81720n04362
41042a290526K08135L83873J7863j15713L36931P32484L45273n01529p80740j88515
41032h52464M23658K98558j76718k07791J35081J62437k05852l53819o4979J84462
41022f57427J49109J76313M04321M20032O1459k09593j38011j20268l60926l71579
41012f46570J01574M19917O0539m01481j79798M06391M40060j54631o07617m86546
$$ plain form
41083 -97999 -120945 -129938 -41298 251248 498548 305150 -281758 -780310 -871510 -638670 -235951
41072 -235951 272512 674963 612866 27849 -623246 -790378 -363688 292213 720444 729548
41062 729548 472507 239139 166735 196335 290712 487733 638990 372469 -411871 -1215911
41052 -1215911 -1468010 -1242763 -1053410 -1007229 -687567 13089 469710 95556 -786164 -1290526
41042 -1290526 -1082391 -698518 -680655 -796368 -459437 273047 618320 116791 -663949 -852464
41032 -852464 -428806 -130248 -306966 -514757 -379676 -217239 -423091 -776910 -841889 -657427
41022 -657427 -508318 -332005 72316 492348 553807 344214 206203 85935 -274991 -646570
41012 -646570 -544996 -125079 -64540 -466021 -645819 -239428 200632 46001 -561616 -1048162
41002a048162m2723M08064O64995M48410j81471m90728O30N71585K48856n90105
40992a0649p10433L0121M99410J44377k66154p7644K72677K23200n780o0515j20507
40981h1897l24538l18998M4960K88182J12493q9074l4591o6585k98353j34877
40971i03278O00013R28663J00117r89521q95548K89775J093451O97948k41008
40962F80612p62890o22518o8347N47350P61529K95854m34497o33163r2797N67349
40952B38482O89989K16045m50877q13862n60969J19945N58989L15255k34314l92108
40942c13425m8466L37164M48159L01349n4269m57373m62292J07925O15473L35021
40932H09266l98574n64087O1958O40290N61788J43287j59389l79974n60549m27930
$$ plain form
41002 -1048162 -1090885 -682821 -17826 430584 249113 -241615 -240985 330600 579456 -10649
40992 -10649 -721082 -690961 -191551 -47174 -313328 -390972 -118295 104905 99125 38610 -81897
40981 -81897 -406435 -725433 -680473 -392291 -279798 -368872 -403463 -470048 -768401 -903278
40971 -903278 -303265 625398 725515 -264006 -1159554 -869779 223672 921620 680612
40962 680612 -82278 -704796 -773143 -225793 535736 831590 397093 -236070 -328867 238482
40952 238482 928471 1144516 693639 -120223 -681192 -561247 -2258 312997 78683 -313425
40942 -313425 -361891 -24727 423432 724781 670512 213139 -249153 -141228 474245 809266
40932 809266 410692 -153395 -91437 548853 1110641 1253928 1094539 714565 154016 -273914
40922b73914K1060K69754M5732k50857k68189k33493l35327k26126L02232P27181
40912b21947N27077L9143p9866J36870J84376k817q0297j9065p6390j66522K0233
40901B60795L09075J70615l70012o44013l41339L5183R982j40251O9223M82572
40891a58170N25473Q0981l54161l79656j56236m8484j03326j03249J3251N4504
40881f29073p8325j71807K3988M20095O66091N45570J28865l91840p87883p77787
40871a052106k65074L58330N07448J44099j35800M2345K86883R7061l05418l27396
40861f49628K9206J72348j20434l63218j68471J35268M3776l19786l72443R6022
40851a517360O36884P14157L16472r4627j42264N0760M5343l05591n61274k10619
$$ plain form
40922 -273914 -252854 16900 62632 -188225 -456414 -689907 -1025234 -1251360 -949128 -221947
40912 -221947 305130 344273 264407 401277 585653 582836 502539 483474 407084 240562 260795
40901 260795 569870 740485 370473 -273540 -614879 -579696 -569714 -709965 -640742 -158170
40891 -158170 367303 448284 94123 -285533 -441769 -490253 -593579 -696828 -683577 -629073
40881 -629073 -707398 -879205 -855217 -435122 230969 776539 905404 513564 -274319 -1052106
40871 -1052106 -1317180 -958850 -451402 -307303 -443103 -400758 -113875 -16814 -322232 -649628
40861 -649628 -620422 -448074 -568508 -931726 -1100197 -964929 -921153 -1240939 -1613382 -1517360
40851 -1517360 -880476 -166319 150153 55526 -86738 -35978 9365 -296226 -857500 -1068119
40841a068119N59454R39905M74493l45683p09488m49556l6461J81705K55345K11555
40831A3150q2721m79078m80974N4613N45009M23318m9983j97850O7949K20248
40821C3681J6707j87054j19433j2703j05596k09542q7536J11559J27859J306q7824
40810e18576j03967j6658K85026O36684N56799k7739m21000p1366N04794L90938
40800A214935l70279q51019n93028r4811J29004J90181K92123K60611k2044k69196
40790a13523k53511j56625j17441R4709N61825Q19211M58832j96549n04250l48877
40780B43801j27879q0040q2006j9880L6888K5145j9803m6685q541J02066J39099
40769A62165o9682l69487l52984L5156L16819J52312j76501k67881j86555j38287
$$ plain form
40841 -1068119 -508665 431240 905733 560050 -149438 -598994 -635455 -453750 -198405 13150
40831 13150 -69571 -548649 -1029623 -975010 -430001 -6683 -56666 -254516 -186567 33681
40821 33681 50388 -136666 -256099 -268802 -374398 -583940 -671476 -559917 -432058 -430752 -518576
40810 -518576 -622543 -639201 -354175 282509 839308 811569 390569 319203 823997 1214935
40800 1214935 844656 -6363 -599391 -694202 -565198 -375017 -82894 177717 155673 -113523
40790 -113523 -367034 -523659 -641100 -546391 15434 834645 1293477 1096928 592678 243801
40780 243801 115922 35882 -46124 -66004 -29116 -3971 -23774 -70459 -79000 23066 162165
40769 162165 92483 -277004 -629988 -594832 -278013 -125701 -302202 -570083 -756638 -894925
40759h94925L5044M76177P50474L42555m38020p35373l15438J91206K76540J42302
40749a69458J16935R1194j16916k83209r4534K92336L99261O6443l32793l49587
40739c80328N912K64131M7924m23176n37819n6512N51337O96659L62461l9182
40729D91407k57907l05304j74343J02925K45522L8406k20185p8832L04713L18201
40719D64603j49354n03347l47565l085J27615J39040J97743P6611l70404o79733
40709a047876l45446L07373M49466r6120o04331m54690J11021M62106M25907L26599
40699d65991L81668M32052K84839L7092r6030j20757k14133l66750l26973p921
40689d62904K72861J85932j20275k15587k0688R5923p9418k40774j4350M46037
$$ plain form
40759 -894925 -859881 -383704 366770 709325 271305 -464068 -779506 -588300 -311760 -169458
40749 -169458 -52523 38671 -78245 -361454 -455988 -163652 235609 302052 -30741 -380328
40739 -380328 -374416 -110285 -62361 -485537 -1023356 -1079868 -528531 168128 530589 491407
40729 491407 233500 -71804 -246147 -143222 102300 140706 -79479 -158311 146402 464603
40719 464603 315249 -188098 -535663 -538748 -411133 -272093 -74350 2261 -368143 -1047876
40709 -1047876 -1393322 -1085949 -636483 -732603 -1336934 -1791624 -1680603 -1218497 -792590 -465991
40699 -465991 -84323 347729 632568 669660 573630 452873 238740 -128010 -454983 -462904
40689 -462904 -190043 -4111 -124386 -339973 -360661 -264738 -344156 -584930 -599280 -153243
40679a53243O03481K28085k97781m40046j49883J00480o6610m22629m15827O6044
40669i47929M93218L89095m1719k56602j44559o6344j95029k38798P6974N64507
40659c67186P71856M61854j81021o90451o72690j83073K87377L58092J75531Q1261
40649D1550P8857j2334q2376Q4402K79666J21473k16907k04789Q9287K4200m52152
40638b49123n43158Q2156N78128J90395m97341m41890K60623O13396K58609j87346
40628F4449k43161j03225j2253J00406K20100J68141O4148K26538M94553L33096
40618A312792k21199m52757q3461K41670j907l88346l11773K4833Q0008m6526
40608A53334R3979L28455O5229n88383p76272j56175N23975M86273j0733j70338
$$ plain form
40679 -153243 450238 678323 380542 -59504 -209387 -108907 -175517 -598146 -1013973 -947929
40669 -947929 -454711 -65616 -107335 -363937 -508496 -574840 -769869 -1008667 -931693 -367186
40659 -367186 404670 866524 685503 -4948 -677638 -860711 -573334 -215242 -39711 41550
40649 41550 120407 108073 25697 110099 389765 511238 294331 89542 178829 203029 -249123
40638 -249123 -792281 -710125 -131997 58398 -438943 -880833 -620210 -6814 251795 64449
40628 64449 -178712 -281937 -294190 -193784 26316 194457 258605 485143 979696 1312792
40618 1312792 1091593 638836 555375 797045 795138 406792 95019 119852 199860 153334
40608 153334 247313 575768 640997 52614 -723658 -879833 -355858 130415 119682 -50656
40598e0656J49106L36318K3457l77791k97640K07625N75358M69039J01649j46388
40588I90077j68121r5421k4610M4262R0129P0781Q774n5238j48236k69082k83212
40577A60103j02556Q7220J3941k79040m56972l27825j6207K81388M27844K60320
40567D8216k23869n52286j53551P51959J162368N54019l51247n68042j67210L2085
40557E32442k18402l81988j74291L338j44856k76609j8749L96693M92852K17359
40547D27789q3527j45175k001J10764l9382l82931m64288J1685N90411N26550
40537E49895j31556n41620l07066P188p8833j86060R2467L31172L0185l65971
40527f00199j48425L83245L62685j77564l75690j5529J83494j04079k66208J15333
$$ plain form
40598 -50656 98450 434768 458225 80434 -217206 -9581 565777 1034816 1136465 990077
40588 990077 821956 726535 701925 746187 836316 907097 915871 860633 712397 443315 160103
40577 160103 57547 144767 158708 -120332 -577304 -905129 -921336 -639948 -212104 48216
40567 48216 -175653 -727939 -881490 -129531 1032837 1586856 1235609 667567 500357 532442
40557 532442 314040 -67948 -242239 -238901 -383757 -660366 -679115 -282422 210430 427789
40547 427789 344262 199087 197086 307850 268468 -114463 -578751 -567066 23345 549895
40537 549895 418339 -123281 -430347 -423159 -501992 -688052 -595585 -264413 -234228 -600199
40527 -600199 -748624 -365379 -2694 -180258 -555948 -571477 -387983 -492062 -758270 -642937
40517f42937N39358M59285R4759j10843j50984j16163J31532M71461L84291j91627
40507H68132n39008k54772M2110k32637n70644k15681N27034P83977M69442J57414
40497A035367m2906m17523o92733k97631M60120O13520M8234k94780L2839L16480
40487G60987k6013m81985l80380L8053J84772J11942K06498L67961K12910j87659
40477H07086l91588k25420J17458M11925M60357J01141m56699o34629k44578J13159
40467E8212q8035m26953j82657M42555N71413M5128l05354K6539M33819J65282
40457G39949n08597p07247k08931L20612L20431k049j66373j47321k55300m99908
40447a114734n00441o9256M61218O57726M86133K06864J774o5085N1749K19967
$$ plain form
40517 -642937 -103579 355706 450465 339622 188638 72475 204007 675468 1059759 868132
40507 868132 329124 74352 116462 -116175 -686819 -902500 -375466 408511 877953 1035367
40497 1035367 992461 574938 -117795 -415426 44694 658214 706448 411668 444507 760987
40487 760987 734974 252989 -127391 -89338 95434 207376 413874 781835 994745 807086
40477 807086 415498 190078 307536 719461 1179818 1280959 824260 189631 -54947 58212
40467 58212 -29823 -456776 -639433 -196878 374535 419663 114309 140848 574667 739949
40457 739949 231352 -475895 -684826 -364214 -43783 -45832 -212205 -359526 -614826 -1114734
40447 -1114734 -1615175 -1684431 -1223213 -565487 -79354 127510 129284 64199 115948 335915
40437C35915J04735l20663m85206M0630P12870O05037k16443o95484l09455K35418
40427G354J86987j63942j46796J84966L14650J70545O6041N5245J188l79J10861
40416G86720q180n18156p91051k26657N98762N91713j65431m89026L4370M38504
40406B51568N3493l58576Q0730Q30368P50333q5477n17053p1675M39382K47787
40396A620880l26405n49910l61538k40239l42055l56105j50181k8440j77238k60833
40386a172064P7977N54436N62992J16964r8737K13998M60668J32972k78950o8449
40376E01807M05404J86443o45316r05569j11907O97202N04050k24402l92075Q7247
40366A02884M15022K35552q5917k70944l40788j59376L88664Q22273N14641k54038
$$ plain form
40437 335915 440650 119987 -365219 -324589 388281 993318 776875 81391 -228064 7354
40427 7354 194341 30399 -116397 68569 383219 553764 619805 675050 676238 675859 786720
40416 786720 778540 260384 -530667 -757324 -158562 433151 267720 -221306 -186936 251568
40406 251568 305061 -53515 27215 857583 1607916 1522439 1005386 933711 1373093 1620880
40396 1620880 1294475 744565 383027 142788 -199267 -555372 -705553 -733993 -911231 -1172064
40386 -1172064 -1094087 -539651 23341 140305 41568 255566 716234 849206 570256 501807
40376 501807 907211 1093654 448338 -457231 -569138 128064 632114 407712 15637 102884
40366 102884 517906 753458 667541 396597 55809 -103567 285097 1107370 1622011 1367973
40356A367973n41746j42176J40976j70676n28663l81500m7668j9854j35812p5467
40346e34613m0701k40723k72196K06849O70974M54416j02484j63651K27185K91769
40336D96825j05476l06297j18693j15547m39870m09432K38250P17192M26597p8087
40326C05462q0350J32348l2197k95918o3368L48616J69787m04584m31537J79128
40316a72613M58583j3615m07507k3740N66077M50455k22978n62510k70153Q3428
40306a14573N882l04805l67679m9647L41321M26485J54720j42486j36731R8863
40296h8650K28124J22637o3932k39834m34664n08982k35253K34243M22869K10907
40286c52535J7555J08310J97247R245k38862k57531j27978L8882L89400Q19133
$$ plain form
40356 1367973 826227 684051 825027 654351 125688 -255812 -303480 -323334 -459146 -534613
40346 -534613 -575314 -816037 -1088233 -881384 -210410 244006 141522 -22129 205056 496825
40336 496825 391349 85052 -33641 -149188 -589058 -998490 -760240 -43048 383549 305462
40326 305462 225112 357460 325263 29345 -34023 314593 484380 79796 -351741 -172613
40316 -172613 285970 272355 -135152 -158892 407185 857640 634662 72152 -198001 -114573
40306 -114573 -108691 -413496 -781175 -830822 -489501 -63016 91704 -50782 -187513 -88650
40296 -88650 139474 262111 198179 -41655 -476319 -985301 -1220554 -986311 -563442 -352535
40286 -352535 -334980 -226670 -29423 -20178 -259040 -516571 -644549 -605667 -216267 602866
40276F02866P16634j47473r35936p39896N2436K59404l68897q61085n19203J96540
40266a744610N24764L61122J6173l04249l81210M4033P33823R40903M16168r3598
40256E13319Q4265M91236K81144l71923n24201Q81K98344j92305q09757o86401
40246i15398L147M19647K82663N8939J01108K23922J70287k340j32324j86173
40236B3478j57710l6212L5507j18143l42784k65301J17222L66287K95096K56981
40226A74421M46441M45065l5544m52008j88423L29514J64534o15138r21260k84292
40216i36690M41558L90006j27977k94942R301L04534L32510J68302j26697m01164
40206b41259k92595K45453O12220L18953k18357k48429K04955M49467J82901j92243
$$ plain form
40276 602866 1319500 1172027 236091 -503805 -451369 -191965 -560862 -1421947 -1941150 -1744610
40266 -1744610 -1219846 -858724 -842551 -1146800 -1528010 -1483977 -750154 190749 606917 513319
40256 513319 597584 1088820 1369964 998041 473840 474721 773065 580760 -228997 -915398
40246 -915398 -912251 -492604 -209941 -151002 -49894 174028 344315 341975 209651 23478
40236 23478 -134232 -170444 -134937 -253080 -595864 -861165 -743943 -377656 -82560 174421
40226 174421 620862 1065927 1030383 578375 389952 719466 884000 268862 -652398 -936690
40216 -936690 -495132 -105126 -233103 -528045 -518744 -214210 118300 286602 159905 -241259
40206 -241259 -533854 -288401 323819 642772 424415 175986 380941 830408 1013309 821066
40196H21066k53420j1230K78221L12069j12276p23138q05253j18156N46774L79869
40186C14526k25517k89038K20106M70654K30960R5631K19166M7297m41271m73219
40176A69295Q0293K43972l90544p31126J01851J162048J003782j26557p73358
40167G39656m81674j25905k07779k24618J13569K96496M8048q4035K91323O52898
40157A017979L90681k24910m95632k77302M6200K43373L57683L50417R6739l25284
40147A179944o53702o89614l63184K43158P51338O74324O1580l35378K8316O50988
40137A547770N95524j78265p35645m99409N654M8282k63650l60254k04324k18588
40127b62905m02393k65325K85679O73286N12625J67600R6900J65428O8847j3885
$$ plain form
40196 821066 567646 556416 834637 1146706 1034430 311292 -493961 -612117 -65343 314526
40186 314526 89009 -200029 20077 490731 721691 817322 1036488 1083785 642514 169295
40176 169295 249588 493560 103016 -628110 -526259 635789 1639571 1513014 739656
40167 739656 257982 132077 -75702 -300320 -186751 109745 157793 73758 365081 1017979
40157 1017979 1408660 1183750 688118 410816 457016 700389 1058072 1408489 1505228 1179944
40147 1179944 526242 -163372 -526556 -283398 467940 1142264 1203844 868466 896782 1547770
40137 1547770 2143294 1965029 1229384 729975 735629 783911 520261 160007 -44317 -262905
40127 -262905 -665298 -930623 -644944 28342 540967 708567 805467 970895 1039742 1025857
40117A025857K04291M17094J03844n32881p27512k64383K48629L30673J89006
40108I94618J16018k5539l56711n71541m10899j20289q115N4776K40119K68825
40098A81262j14993m88793k47673L87138N59266J8709m86920k79009L44445O28700
40088E02132M08465J79190K76944M45941L23581K1192p6925K7080j09943o24823
40078A372834r48265n70032P3144J15513l97625m83317K40972Q34245M15253m42253
40068B10469n38643J83276O70943L81758j12506j99493O085K00908L93634N20904
40058A717335K62970l30906o23297k57528K56012K94621L721r4499L9690Q8257
40048A356376N2469J71885L39387K10740j58971l35764j66388O7394J77319K82819
$$ plain form
40117 1025857 1230148 1647242 1751086 1218205 490693 226310 474939 805612 994618
40108 994618 1110636 1085097 728386 156845 -254054 -374343 -382458 -327682 -87563 181262
40098 181262 66269 -422524 -670197 -283059 276207 294916 -192004 -471013 -126568 502132
40088 502132 910597 1089787 1366731 1812672 2136253 2157445 2080520 2107600 1997657 1372834
40078 1372834 424569 -145463 -72319 43194 -354431 -837748 -596776 237469 652722 210469
40068 210469 -328174 -144898 526045 907803 795297 595804 601889 802797 1196431 1717335
40058 1717335 1980305 1649399 1026102 768574 1024586 1319207 1322928 1228429 1268119 1356376
40048 1356376 1408845 1580730 1920117 2130857 1971886 1636122 1469734 1537128 1714447 1997266
40038A997266M16584L44394o3118n75383q39551o77171j57718L86146N03797J09234
40028A444480k79825j69812J73310J30465k38738k68713J59291L47153o0597m56112
40018G80902k88118N2772K7713n9688K71284N77145J20237p12243p89862M501
40008a5357N77296L60392O4908K77744M49665M902n17843l88483j5092k54507
39998E43625q63038q05565O2730P54131O56490K60675J46441J67450M4488j2458
39988I54969K08682M08791K78690M6777K2068Q274k83058n81802m24379M9199
39978F88211K65499P7388j22537j17701j19688k27431j89135R1990K92046J95800
39968H34442R0848K65742M34349J28556n02627p93365m69496p84Q4179j54147
$$ plain form
40038 1997266 2413850 2758244 2695126 2119743 1280192 603021 445303 831449 1335246 1444480
40028 1444480 1164655 994843 1168153 1298618 1059880 791167 950458 1297611 1237014 780902
40018 780902 492784 545556 573269 513581 784865 1362010 1482247 770004 -19858 -15357
40008 -15357 561939 922331 987239 1264983 1714648 1719550 1201707 813224 798132 543625
39998 543625 -319413 -1124978 -1062248 -308117 348373 609048 755489 922939 967427 954969
39988 954969 1163651 1572442 1851132 1897909 1919977 1928251 1645193 1063391 639012 688211
39978 688211 953710 1031098 908561 790860 671172 443741 254606 346596 638642 834442
39968 834442 925290 1191032 1625381 1753937 1251310 457945 -11551 -12335 71844 -82303
39958h2303l15681k30700N070L10046N90345O10184K62374j33503j82777L256
39948H36311l101k09642j70005K24651M76530K59669n0316j8848J17893j15746
39938A347396n84697p11280l44859J00009L28132M46313N17854L54517o7809l86519
39928I99057k88126P3897K88562J61212j45179l28301k32827J1468J38187P3968
39918G51918J1472P4584J10033j9619j59903j19239K3083J33889K95175N25619
39908A627012N24956J37340j97559O227M87627N95314L00136K04256N85082J060701
39898E331092J206236R07214J48221q78473j496251j157821l76707k05621o82109
39889B795781p50574R023O26461K52364n33653o82244j84484K20107K68820K33748
$$ plain form
39958 -82303 -397984 -628684 -623614 -313568 276777 886961 1149335 1015832 833055 836311
39948 836311 833210 623568 453563 678214 1154744 1414413 1364097 1345249 1463142 1347396
39938 1347396 762699 51419 -293440 -193431 134701 581014 1098868 1453385 1385576 999057
39928 999057 710931 784828 1073390 1234602 1089423 761122 528295 539763 677950 751918
39918 751918 763390 837974 948007 928388 768485 649246 672329 806218 1101393 1627012
39908 1627012 2151968 2289308 2091749 2097976 2585603 3180917 3481053 3685309 4270391 5331092
39898 5331092 6537328 7444542 7592763 6714290 5218039 4060218 3683511 3477890 2795781
39889 2795781 2045207 2054230 2680691 2933055 2399402 1717158 1532674 1752781 2021601 2255349
39879B255349J57551j16370l95570l77624k56288m02914o05402l13692M25045
39870C70085R06450O65011n1778o87917q50971m60792J65243M53012J61785k69456
39860D00672k79459R9866M22035M68429L10040n286l58551m03695k5240K76529
39850I05340K7765l94546k37436M33544P30101K01077n57839p57242l47117J70844
39840A74491M58457N47833N57635M97248L33800J24624J9084Q8614K22626L49051
39830C373463O56536J260028J708589J368254L99045k85796k98766l16308q92911
39821F972134j468711j263846n59249k16746l41000l46884r9558l8457k59429
39812B378254l63390k27826j19835j0178M18096R71006R40347J27055p79290j077795
$$ plain form
39879 2255349 2412900 2296530 1900960 1523336 1267048 864134 258732 -54960 370085
39870 370085 1276535 1941546 1889768 1201851 350880 -109912 55331 508343 670128 400672
39860 400672 121213 221079 643114 1111543 1421583 1416297 1057746 654051 628811 905340
39850 905340 933105 538559 301123 734667 1464768 1665845 1108006 350764 3647 174491
39840 174491 632948 1180781 1738416 2235664 2569464 2694088 2713172 2801786 3024412 3373463
39830 3373463 4029999 5290027 6998616 8366870 8765915 8480119 8181353 7865045 6972134
39821 6972134 5503423 4239577 3680328 3463582 3122582 2775698 2676140 2637683 2378254
39812 2378254 2014864 1787038 1667203 1657025 2075121 3046127 3986474 4113529 3334239 2256444
39802B256444p74928k59673J96712M20243L05348L4155l9786J29436K29223O3430
39792B560604k40596m87623n52564l31019J05069M04810L29377R2686k608m515
39782A873621m3072r778P1631j47875o34141o85855n9856L39648j49034o21176
39772f5887M2260J136443J045759j66918q47953l60933K14783J76312J34918M11571
39762A720355L10240l07275m23611K99671P01505J16432l78492J35752P74324
39753B948901M60173j80622o8054L64795J20093m15068k18084M09089L99708j04413
39743C716518j12635K57670j9755q74520j082968l01699M27800M02828N0370k23616
39733B239993n89490r09352o22833J08768L61418p0486l29945j4831J88968j06836
$$ plain form
39802 2256444 1481516 1221843 1418555 1838798 2144146 2178301 2138515 2267951 2497174 2560604
39792 2560604 2320008 1832385 1279821 948802 1053871 1458681 1788058 1880744 1878136 1873621
39782 1873621 1830549 1820771 1892402 1744527 1110386 424531 364675 704323 555289 -65887
39772 -65887 -23627 1112816 2158575 1991657 1143704 782771 997554 1173866 1308784 1720355
39762 1720355 2030595 1723320 1299709 1599380 2300885 2417317 2038825 2174577 2948901
39753 2948901 3409074 3228452 3160398 3525193 3645286 3230218 3012134 3421223 3820931 3716518
39743 3716518 3603883 3861553 3841798 2967278 1884310 1582611 2010411 2413239 2463609 2239993
39733 2239993 1650503 741151 118318 227086 588504 518018 188073 173242 362210 255374
39723B55374k08733L54430Q53325N42287q8298j66106J70600J79586j90361l24711
39713A377393N531L73939L68081J9957l19156k45643L05605P59915M33309m39314
39703B639617q13572k73419L75593M23768L33427P16995J004343K64394j068747
39694C602399j559480q22385j7785o1103m26927k40284L50360O25043N00211M56908
39684B406957N71972M16606j34918o63577q41674p47782m35282K31903J048012
39675A852217J315738O93311j83886m65945k07732j02878k66997q9233N84542
39666C129137R60353M47511l63421n35451j44709k9254m15206o41010k89330J95011
39656B313631K79243R1588N758k4449k20269l81752p9305O39354J181638J111977
$$ plain form
39723 255374 46641 401071 1254396 1796683 1708385 1542279 1712879 1892465 1702104 1377393
39713 1377393 1382924 1756863 2124944 2144901 1825745 1580102 1885707 2645622 3078931 2639617
39703 2639617 1826045 1552626 1928219 2351987 2685414 3402409 4406752 4671146 3602399
39694 3602399 2042919 1220534 1202749 1141646 714719 474435 824795 1449838 1950049 2406957
39684 2406957 2978929 3395535 3260617 2597040 1755366 1007584 572302 804205 1852217
39675 1852217 3167955 3861266 3677380 3211435 3003703 2900825 2633828 2544595 3129137
39666 3129137 4089490 4537001 4173580 3638129 3493420 3464166 3048960 2407950 2118620 2313631
39656 2313631 2592874 2684462 2690220 2665771 2445502 2063750 1984445 2623799 3805437 4917414
39646D917414O20101K00695Q9024J31045O4637k07666n64289p72798o72955l43643
39636C461565q8318j51295m05490m37529n4647L96929M13794j2470l85412l85193
39626B351934k50162k97356l53191k1552N96516Q66882M19474l09339n60341j57934
39616B284931L09308K47609k09946m27735j47308J66163P12m57452n92743k39253
39606I34286J37381J74234R7987K72921N91979O28262K45165k07329k83666Q8782
39596B680002N13043N04803O3943k41188P013M04217J93829o16787j157411q75804
39586A475660k63427o4453k45045k38838J02566L49224J73885k35641m40384j79129
39576D34418M03199P98120N66047j18700n73254m11637L2927K57455K00353O1667
$$ plain form
39646 4917414 5537515 5738210 5827234 5958279 6022916 5815250 5250961 4478163 3805208 3461565
39636 3461565 3373247 3221952 2816462 2378933 2324286 2721215 3135009 3122539 2737127 2351934
39626 2351934 2101772 1804416 1451225 1429673 2026189 2893071 3312545 3003206 2442865 2284931
39616 2284931 2594239 2841848 2631902 2204167 2056859 2223022 2223734 1766282 1173539 934286
39606 934286 1071667 1245901 1343888 1616809 2208788 2837050 3082215 2874886 2591220 2680002
39596 2680002 3193045 3697848 3761791 3520603 3527616 3931833 4125662 3508875 2351464 1475660
39586 1475660 1212233 1147780 902735 663897 766463 1115687 1289572 1053931 613547 434418
39576 434418 837617 1635737 2201784 2083084 1509830 1098193 1131120 1388575 1588928 1650595
39566A650595r2537k11891j11867J84160K87817M446l01742k86767j68098k33123
39556G20993k47447P1162L96712K90801J2224P9694L04649J06156l73325l87691
39546I73928J65498N27169K86016l4110P9410L15557J19308m37486q19561p37707
39536D38022l45191M7591K15322J55697J12907K84820M92654L96249J9581k58117
39526A559535k39127j04655o0322r9229j29879o6984J53243L86961K73820k43158
39516A430205o09728l30804K60455M47276J60559n0437O2433K30826K86192K88554
39506B175531J06155l79229o98428k81201M61887M96002k51326o80664k16838
39497G31889L31559J49688l19659k51493J96364K79168q4656l20476j65814R9186
$$ plain form
39566 1650595 1558058 1346167 1234300 1418460 1706277 1710723 1408981 1122214 954116 720993
39556 720993 473546 544708 941420 1232221 1244445 1324139 1628788 1734944 1361619 973928
39546 973928 1139426 1666595 1952611 1918501 1997911 2313468 2432776 1995290 1175729 438022
39536 438022 92831 140422 355744 511441 624348 909168 1401822 1798071 1817652 1559535
39526 1559535 1320408 1215753 1155431 1056202 926323 859339 1012582 1399543 1673363 1430205
39516 1430205 820477 489673 750128 1197404 1357963 1307526 1369959 1600785 1886977 2175531
39506 2175531 2281686 1902457 1204029 922828 1384715 1880717 1629391 948727 731889
39497 731889 1063448 1213136 893477 641984 838348 1117516 1032860 712384 546570 645756
39487F45756K20247J93407O5840m4023Q5945M23658N42177J91490k75689l95646
39477A653162j86739R5888M12720P28398P29900K55659k78418l52186j1696L12796
39467C359484L73273J25549m50866j113325j283819p02780J25281N61891N80945
39458A575633M77481K67925q9706l02142j83515j18213m43472p47664m88860N3778
39448A245K34924J13346J86982L45161R0451l59589k87604K16013K95744j75226
39438F61447l12247K37767O34994K83273j54925N6195M60009K62071k77738l44594
39428A506252L8451J73874n1908j06310J23650J85615j9391r7005j4773j74780
39418A563675m57170j60728P23667J124307L96300n84047o44087j2729J78180
$$ plain form
39487 645756 866003 1059410 1125250 1081227 1167172 1590830 2133007 2324497 2048808 1653162
39477 1653162 1466423 1562311 1975031 2703429 3433329 3688988 3410570 3058384 3046688 3359484
39467 3359484 3732757 3858306 3407440 2294115 1010296 307516 432797 994688 1575633
39458 1575633 2053114 2321039 2231333 1929191 1745676 1627463 1183991 436327 -52533 1245
39448 1245 236169 349515 536497 881658 972109 612520 324916 540929 836673 661447
39438 661447 349200 586967 1221961 1505234 1350309 1406504 1866513 2128584 1850846 1506252
39428 1506252 1544703 1718577 1666669 1560359 1684009 1869624 1850233 1753228 1738455 1563675
39418 1563675 1106505 945777 1669444 2793751 3190051 2606004 1961917 1949188 2127368
39409B127368l03568n91682k49531J19309M2737l9236L07890O16484K58935m45669
39399A843037o47007j94459K85271L89751L01184J74034j18604m84256m97729
39390A051222o4278L12086K37885j7678k0552J59429J85062N5761Q355K824j98184
39379A711932m96059m85638r2650K29058J05773k59956m00199j55575K62710N84231
39369A003627O27027L12271j83131m07640j02670L56847L57288j00245l71981
39360A491393j21100K01857J31184o4121P5858L22299J44778k63314k10915K61407
39350A969326L19695k66187o01567l9605P41772P31575L6000m36334l00537O1069
39340B215207K62635J93141k03144p26029p68702q7423N65490L76871k48679k90168
$$ plain form
39409 2127368 1823800 1232118 982587 1101896 1144633 1105397 1413287 2029771 2288706 1843037
39399 1843037 1196030 1001571 1286842 1676593 1977777 2151811 2033207 1548951 1051222
39390 1051222 986944 1299030 1536915 1519237 1498685 1658114 1843176 1898937 1907292 1910116 1711932
39379 1711932 1215873 730235 637585 866643 972416 712460 312261 156686 419396 1003627
39369 1003627 1630654 1942925 1759794 1352154 1249484 1606331 1963619 1863374 1491393
39360 1491393 1370293 1572150 1703334 1639213 1715071 2037370 2182148 1918834 1707919 1969326
39350 1969326 2289021 2022834 1421267 1381662 2123434 2855009 2891009 2454675 2154138 2215207
39340 2215207 2477842 2670983 2467839 1741810 973108 885685 1451175 1828046 1579367 1289199
39330A289199K28735L13857k62112n26775P3476P66049P12716K01988r8243k46349
39320B452541n73012p63458l10495M66783P12055K15628l80926n27203l32929
39311I58984j60226j20312q9657P2080L98063P21888P24063K66077l34701n51778
39301A884481k01153L84700P69521Q70428Q67958P25807J32377q26571j271734
39292C335814m64163Q95814J152591j86018j653855j746697q14870j70955q5556
39283B62105J00739L95756J68715l95631l49719L47852O17683N3218m09342j14106
39273F77270K94576J43202j40291K0701K62940M0121l35357k86777L8657J70467
39263H85509J23231R2917p0336l99816m10807J47514O99039O63430L09844J48333
$$ plain form
39330 1289199 1517934 1831791 1569679 1042904 1116380 1882429 2595145 2797133 2698890 2452541
39320 2452541 1879529 1116071 805576 1272359 1984414 2200042 1819116 1291913 958984
39311 958984 798758 678446 588789 660869 1058932 1780820 2504883 2770960 2436259 1884481
39301 1884481 1683328 2068028 2837549 3707977 4575935 5301742 5434119 4607548 3335814
39292 3335814 2871651 3767465 4920056 4734038 3080183 1333486 518616 347661 262105
39283 262105 362844 758600 927315 531684 181965 529817 1147500 1200718 791376 677270
39273 677270 971846 1115048 974757 995458 1258398 1298519 963162 676385 715042 885509
39263 885509 1008740 1101657 1031321 631505 220698 368212 1067251 1730681 2040525 2188858
39253B188858P3655j97008m20383k74350K2482J79401L44537N55877M03443q0370
39243B796142k2807R27253J657915J077492j61455o08697j43946J03286l78753
39234E246430r43861r99801o83563l38061j58625k78742n25938l58427K96612
39225A256024O13902O2015n74331l56758K31469R7881n64380o06221J16860N79466
39215H55927L50857J14569K76120L53387L6669k77551l13258k85730k24353J11886
39205I98523M71759K69112l04448l61711K24909M97481q2828p86209p44455r4423
39195H7710M84064O51585M03134j51750n93682l85866L53204Q05193N02729q5713
39185B070608l05060j46925l4138j86334m73293o20830m28344M633L09457L18681
$$ plain form
39253 2188858 2262513 2065505 1645122 1370772 1393254 1572655 1917192 2473069 2876512 2796142
39243 2796142 2773335 3700588 5358503 6435995 6274540 5665843 5521897 5625183 5246430
39234 5246430 4302569 3302768 2619205 2281144 2122519 1843777 1317839 959412 1256024
39225 1256024 1869926 1931941 1357610 1000852 1232321 1330202 765822 159601 276461 855927
39215 855927 1206784 1321353 1597473 1950860 1987529 1709978 1396720 1110990 886637 998523
39205 998523 1470282 1739394 1434946 1073235 1298144 1795625 1712797 926588 182133 87710
39195 87710 571774 1223359 1626493 1474743 881061 495195 848399 1653592 2156321 2070608
39185 2070608 1765548 1618623 1584485 1398151 924858 304028 -124316 -119683 189774 508455
39175E08455K77842L19002J57522k49314l17406K16773N74142O6667o15673l85603
39165E52407M16255M98904k95712p78950l15022L80545N38159K69917l2616k29583
39155A004304j81348J33681K27303k54270o50472j46460P04613O47946k21346
39146A263951n78462n1508L33438P6207r7565J65620J97502k17413k98374J90572
39136I83968L88444j6984j29075M35509P13769J42732l79735j45976J28311k04324
39126A916639m36313P3076N24790P2219n86143m04251K30646L13582n1877j16629
39116A535739O6683l0249k76286k64064k02528l35352j75402N70406J069749N53586
39106B512282k88294l50722J30023J78723j70981j30951K89246L79960J05744
$$ plain form
39175 508455 786297 1105299 1262821 1013507 696101 912874 1487016 1553683 938010 552407
39165 552407 968662 1467566 1171854 392904 77882 458427 996586 1266503 1233887 1004304
39155 1004304 822956 956637 1183940 929670 279198 132738 837351 1485297 1263951
39146 1263951 685489 633981 967419 1043626 946061 1111681 1309183 1091770 793396 983968
39136 983968 1372412 1355428 1226353 1661862 2375631 2518363 2138628 1992652 2120963 1916639
39126 1916639 1480326 1553402 2078192 2150411 1564268 1160017 1390663 1704245 1652368 1535739
39116 1535739 1602422 1572173 1295887 1031823 829295 493943 318541 888947 1958696 2512282
39106 2512282 2223988 1873266 2003289 2182012 2011031 1880080 2169326 2549286 2655030
39097B655030Q7756L78577M17082R2187j69362k45635l34095l07821P2691M99694
39087C146104M73739J07491j24856j36710p7164J51830N54811O95517L64422N7807
39077E212991J30290J25095l17315o19147j94140M83187O29417L00726n5679m34361
39067E261064p81804n48918K81319O46566j8224o33225j46722O47579M25464m47864
39057D685235o51511j30794J30206P891J83313N61553M19486q8706j09704L86209
39047E393178O39360M64577L24663L18792K63359L72394P45730P83337K49591
39038I554981R9395R85625J964784K120571K236612L132408L766009L159089K737480
39029B9756954M097977N849142N883895N593783P982692J2429171J6064603K0543471
$$ plain form
39097 2655030 2742786 3121363 3538445 3630632 3461270 3215635 2881540 2573719 2646410 3146104
39087 3146104 3619843 3727334 3602478 3465768 3388604 3540434 4095245 4790762 5155184 5212991
39077 5212991 5343281 5468376 5151061 4531914 4337774 4820961 5450378 5751104 5695425 5261064
39067 5261064 4479260 3930342 4211661 4858227 4840003 4206778 4060056 4707635 5133099 4685235
39057 4685235 4033724 3902930 4033136 4041027 4224340 4785893 5205379 5116673 5006969 5393178
39047 5393178 6032538 6497115 6821778 7140570 7403929 7776323 8522053 9305390 9554981
39038 9554981 9654376 10640001 12604785 14725356 16961968 20094376 23860385 27019474 29756954
39029 29756954 33854931 39704073 45587968 51181751 59164443 71593614 87658217 108201688
39021A08201688L1794604N0126150O4351966N9823513L1974359q943417m4897586
39014B92431277o1585611n6619905l9415229k2406256j1310554m226978J770360
39007I8637104P466935J4722175K6657512M1032290M7580717L6892070J0730117
39000B83718920j9347180m1795910n1032170m7012164l4266032k0749154j2905749
38993E6610561j0623681r290982o484933l874941l034598k966875k461853j954690
38985A5918008j950071j824982j194667o88696n98526l38222J67255J06097o70061
38976H926135j186531r36214n56773n05033m24371k22645l94475q41280p30185
38967C128628Q049L66956o3026m25486j50854J29164r9918k33107K91443Q48552
$$ plain form
39021 108201688 139996292 190122442 254474408 314297921 346272280 337328863 292431277
39014 292431277 230845666 174225761 134810532 112404276 101093722 96866744 98637104
39007 98637104 106104039 120826214 147483726 188516016 236096733 272988803 283718920
39000 283718920 264371740 222575830 171543660 124531496 90265464 69516310 56610561
38993 56610561 45986880 36695898 30210965 26336024 23301426 20334551 17872698 15918008
38985 15918008 13967937 12142955 10948288 10259592 9661066 9322844 9490099 9596196 8926135
38976 8926135 7739604 6803390 6246617 5741584 5317213 5094568 4700093 3858813 3128628
38967 3128628 3136677 3503633 3440607 3015121 2864267 2993431 2893513 2660406 2951849 3800401
38957C800401N71728k90090q03443o21453j45661J75678J70343j22749m58019
38948B276735n59469m41841k70712L1737N64644R56374P50913K21259N7886K63317
38938C850843J74391l52029o57496l96636r3524k38559n36395m61093l0401L38819
38928A597920L72813J03647k10097k35690P7039L36383K02306j46118l83751n43853
38918A170599o78375m59337K25749P40089N61976K28074M73414Q91378N97135
38909C750702j48782l18298R3697J23218l36885l29724L19224N42669o5384l86416
38899C244021M19206J545916J865209J489546J057666M55054o50972j728337j948179
38890E749130j411448q93556p01338n69647l87887k87829k17987n2537M7844j16977
$$ plain form
38957 3800401 4372129 4082039 3278596 2657143 2511482 2687160 2857503 2734754 2276735
38948 2276735 1717266 1275425 1004713 1036450 1601094 2557468 3308381 3529640 3587526 3850843
38938 3850843 4025234 3673205 3015709 2619073 2525549 2286990 1750595 1289502 1259101 1597920
38928 1597920 1970733 2074380 1864283 1628593 1705632 2042015 2244321 2098203 1714452 1170599
38918 1170599 492224 32887 258636 998725 1560701 1788775 2262189 3153567 3750702
38909 3750702 3601920 3283622 3377319 3500537 3163652 2833928 3153152 3695821 3630437 3244021
38899 3244021 3663227 5209143 7074352 8563898 9621564 10076618 9425646 7697309 5749130
38890 5749130 4337682 3444126 2742788 2173141 1785254 1497425 1279438 1226901 1274745 1157768
38880A157768l70448m06678k34560k6788J96738L96689L37903n0179m11592l96060
38870A92793j05445J53828K77840K82612J32294r2280j46439K4894J58844P5287
38860I54228p9281j20199n7252M3118J09582k8703m04956o26588l01929K92302
38850b19678N16145K82237M8236k8482j87118l49185j54680K31889K35832j02894
38840B72302j43283J93304K83717J32o9659J41395m5674o41476o67955J53416
38830e23781P37195M24592O8866L70273N37290j23959o22291J17472J188287J098891
38820C272835L97027P90923K079583K203381M82080j294778j570789j002210q90023
38811D468029j151683r70473l88978n9237j4271K65809Q55445J267861J217953
$$ plain form
38880 1157768 787320 380642 146082 119294 316032 712721 1050624 1000445 588853 192793
38870 192793 87348 241176 519016 801628 933922 841642 695203 720097 878941 954228
38860 954228 874947 754748 697496 740614 850196 821493 416537 -210051 -511980 -219678
38850 -219678 296467 578704 626940 598458 411340 62155 -92525 139364 375196 272302
38840 272302 129019 322323 606040 606172 536513 677908 632234 -9242 -677197 -523781
38830 -523781 213414 638006 706872 1077145 1614435 1490476 868185 985657 2173944 3272835
38820 3272835 3669862 4460785 6540368 8743749 9225829 7931051 6360262 5358052 4468029
38811 4468029 3316346 2345873 1956895 1897658 1883387 2149196 3004641 4272502 5490455
38802E490455R09019N98007K86169j41612o85807j141094j204593q00141k83409
38793C026994j25624l95107p39450q25586n87341j37819L09492N25132M92314
38784A543005M08900K88571j25393p68236j001551m35350L65186N72127J85833
38775A033092j75308k58361k49611j57432Q6163J45612k37865n01514K4295Q08941
38765E18012O72864l30571q36685k38595M35957K41269k96406k84526P1538P5448
38755B8305j73984j29006J36947J95896J63438L56550M24323j37412q38775o79497
38745f53215K35601O73960Q8459n77873l49931L98913O77937L35984j136o5593
38735G63106j67798l54742j60741N42031J046626O35863l97997j043049p78594
$$ plain form
38802 5490455 6399474 6997481 7283650 7142038 6456231 5315137 4110544 3310403 3026994
38793 3026994 2901370 2506263 1766813 941227 353886 216067 525559 1050691 1543005
38784 1543005 1951905 2240476 2115083 1346847 345296 -90054 275132 847259 1033092
38775 1033092 857784 599423 349812 192380 278543 424155 186290 -315224 -290929 518012
38765 518012 1190876 860305 23620 -214975 220982 462251 165845 -118681 -47143 28305
38755 28305 -145679 -274685 -137738 58158 221596 578146 1002469 865057 26282 -653215
38745 -653215 -417614 256346 344805 -233068 -582999 -184086 493851 829835 828699 763106
38735 763106 595308 240566 79825 621856 1668482 2304345 1906348 863299 84705
38726H4705n1945M57732N68848M18657M2993m52155o30699j89295M39928M99287
38716A188056o4661n02025k93011K29522M81223L59289R7546j55886k65169k6977
38706A047907M23580N20515P5013j98565L95906J361748J528940O57234l03579
38697E508699o32990o45169p81105p84083l82252o0876l23699o84651l53513L52790
38687A213151L52862m52708q98792l41157L35223J41161m61945l57572M46779
38678b2998R00691N53590P7871P0547K37349O8200l60985o29347n41261j66972
38668A86685K97869N13203K34758k60374m08173j50598l470j87083k86693l8948
38658a02824J80420N4266r1722R0624L04203J48729j24084m4597K40292K31153
$$ plain form
38726 84705 32760 490492 1059340 1477997 1520990 1068835 438136 248841 688769 1188056
38716 1188056 1123395 621370 328359 557881 1039104 1398393 1495939 1340053 1074884 1047907
38706 1047907 1471487 1992002 2067015 1868450 2264356 3626104 5155044 5812278 5508699
38697 5508699 4875709 4230540 3449435 2665352 2283100 2222224 1898525 1213874 860361 1213151
38687 1213151 1566013 1113305 214513 -126644 208579 349740 -112205 -469777 -22998
38678 -22998 877693 1431283 1509154 1579701 1817050 1885250 1524265 894918 353657 186685
38668 186685 484554 997757 1232515 972141 563968 413370 409900 222817 -63876 -102824
38658 -102824 77596 131862 40140 130764 434967 583696 459612 415015 655307 886460
38648H86460q0727k67370j72583J883J32875J80972o304l81441m86641j14492
38638c07368J91351m4227l32362J1175N86657M51377k75562n23700R847M50095
38628B17283K53796m6111R630L0020k80518l88606J33463P19482O07406n9315
38618A196530n92908p11638n34032j26414L54367N21320K96312J34366K50893
38609G88796K03819k32539m63638m8548L87462R4425n05813m77236Q1662K53405
38599H1795j39470l18914R4519N65338O45161N40340M19052L1490n96374q49975
38589D72962l87961K61110M32977J93899K0972J3092q1896k98966l93273k68672
38579c5756j08680o3670m0725J25200L84993M46986J11708l69552m66407l8298
$$ plain form
38648 886460 805733 538363 365780 367663 500538 681510 675206 293765 -192876 -307368
38638 -307368 -116017 -160244 -492606 -481431 105226 556603 281041 -242659 -232812 217283
38628 217283 471079 424968 434598 464618 184100 -204506 -71043 648439 1255845 1196530
38618 1196530 603622 -108016 -642048 -768462 -414095 107225 403537 537903 788796
38609 788796 992615 760076 296438 247890 635352 729777 223964 -253272 -171610 81795
38599 81795 -57675 -376589 -282070 283268 928429 1468769 1887821 1919311 1322937 472962
38589 472962 85001 346111 779088 972987 993959 1007051 925155 626189 232916 -35756
38579 -35756 -144436 -208106 -248831 -123631 261362 708348 820056 450504 -15903 -54201
38569e4201L85536K60488k18320l78221L428M35241L99694m5655m43026m50860
38559a05896j02473K72471L50277J48403r867L9183P8162o8859j88336o2174J00685
38548D51576K7952j07910l5107N0059j41340l09563L918M75086L41024l30210
38538D25485o22530j76750K93866J96524j07081j12999j8501j59785k78116k7167
38528e87054K99899K38714l3819q549L24033N45249M71377K20245j30667m51489
38518H87939m17029R050K53475j09942n86026m28057J73095L74081L1754j13436
38508G4904L01983O72104L95546k47236n94356m68385j40792J68539L58198L04856
38498H25361K5166k11658k08703j02387q3402p5066O1535K01946J29594q6528
$$ plain form
38569 -54201 331335 591823 373503 -4718 -1290 433951 833645 787990 344964 -105896
38559 -105896 -208369 64102 414379 562782 552915 592098 670260 601401 413065 350891 451576
38548 451576 479528 371618 336511 386570 245230 -64333 -60415 414671 755695 425485
38538 425485 -197045 -373795 -79929 116595 9514 -103485 -121986 -281771 -559887 -587054
38528 -587054 -287155 -48441 -82260 -90809 233224 778473 1249850 1470095 1339428 887939
38518 887939 470910 479960 733435 623493 37467 -390590 -217495 156586 188340 74904
38508 74904 376887 1048991 1444537 1197301 602945 134560 -6232 162307 520505 825361
38498 825361 850527 638869 430166 327779 244377 169311 230846 432792 562386 475858
38488D75858j56684L6514L11588M11722K05422k49402o67406o55104j05436N43025
38478A50097O80770K23139k72955k97486K559J05383j33113l29952j93874O0431
38468e001J07681K0485N6007J45361K6108k02449j41423K38585M59538K14675
38458I19567k37694n29377n95945m35099M9227O46236P79476K73287k69320l16243
38448B84115j55672k34321k71221J75855O75665M45804k77624m46460J92613P32000
38438A120754N34188K3741k70648m63364o17297k83589N58499R57028K68470o79177
38428A148605o87751L3475K69104k92486o97211l11950K97968L98588J26632O317
38418B91291N6557l8459k33464j67292K06169M71722K96460j32781l32102r0977
$$ plain form
38488 475858 319174 355688 667276 1078998 1284420 1035018 367612 -287492 -392928 150097
38478 150097 830867 1054006 781051 483565 486124 591507 458394 128442 -65432 -5001
38468 -5001 102680 123165 179172 324533 350641 148192 6769 245354 704892 919567
38458 919567 681873 152496 -443449 -878548 -829321 -183085 596391 869678 600358 284115
38448 284115 128443 -105878 -377099 -201244 474421 920225 642601 196141 388754 1120754
38438 1120754 1654942 1678683 1408035 944671 327374 43785 602284 1559312 1827782 1148605
38428 1148605 460854 494329 763433 470947 -226264 -538214 -240246 158342 284974 291291
38418 291291 347848 309389 75925 -91367 114802 586524 882984 750203 418101 327124
38408C27124K96983M18151K59328J59803K52626K50237n9565m03743m09275j83905
38398I07764j43845l73345n29996l66589k1136K35238K80224J54804J984k8623
38388A16480K6137m6132k58359k78393O2186L74449K47018n5798J7463L63109
38378E68160L37544j67715m78825j79050K57057K30586j16118k48973n4842J73220
38368C21044K83573L29883K64982J1197k47210k22648M1746J94249L3020k85991
38358G23845m94190m76032k96905j12072l7801k4055Q9987L27338M87564L95360
38348E83039J14146j72813l43060k98396M8809N59742P98693M43416k63437o87768
38338G82371m76539O6408L37893J07344k60262k93476k2991J07226o7622j81612
$$ plain form
38408 327124 624107 1042258 1301586 1461389 1714015 1964252 1904687 1500944 1091669 907764
38398 907764 763919 390574 -139422 -506011 -527147 -291909 -11685 143119 145103 116480
38388 116480 142617 96485 -161874 -440267 -378081 -3632 243386 187588 205051 568160
38378 568160 905704 737989 259164 80114 337171 567757 451639 202666 147824 321044
38368 321044 604617 934500 1199482 1210679 963469 740821 782567 976816 1009836 723845
38358 723845 229655 -246377 -543282 -655354 -693155 -717210 -627223 -299885 187679 583039
38348 583039 697185 524372 181312 -117084 -68275 491467 1290160 1733576 1470139 782371
38338 782371 305832 372240 710133 817477 557215 263739 240748 347974 280352 98740
38328I8740K5682K14409O319k87580j12972L49576M01110o030j51909K19333M16416
38317A173094m2107n77198m49730J24086M26874L00317O3538j79854m17167l00094
38307A21759L45876Q76029N48661k91328o33577l07603j19340m32007o05286j52247
38297f49063M31330M90810J88636R0946K57518L12726J34321l2560j6343R1779
38287A300100J25794J399k41546m28957l89055j60492N8710J54517J17203r0035
38277D47638m01824m86781r7821M51245N83341K36020j05273j70879j90313l13392
38267d8039k91339L8545M04684M92752L24997O2540k03629l17400j26639J60307
38257D96779J37241j16751k9328N51975R74152O59297q2483n06338l35890J29292
$$ plain form
38328 98740 124422 338831 345150 57570 -55402 294174 695284 689254 537345 756678 1173094
38317 1173094 1130987 553789 104059 228145 655019 955336 1018874 839020 421853 121759
38307 121759 467635 1343664 1892325 1600997 967420 659817 540477 108470 -496816 -649063
38297 -649063 -217733 273077 461713 552659 810177 1122903 1257224 1224664 1208321 1300100
38287 1300100 1425894 1427293 1185747 756790 367735 207243 265953 420470 537673 447638
38277 447638 45814 -440967 -538788 -87543 495798 731818 626545 455666 265353 -48039
38267 -48039 -339378 -300833 103851 596603 921600 984140 780511 463111 336472 496779
38257 496779 634020 517269 487941 1039916 2014068 2673365 2590882 2084544 1748654 1877946
38247A877946M77262M55742R9744j80415J1757M30372M18117r1306m26822k65707
38237B806690j12307k99202l31103J59195N69565K45593l90253n09672j65515
38228A972991J3399l2128N6804J18919k45732o84507m83691J51948L18437r4838
38218A091602k73961M0316J37781k67086l98953K33448Q66719O26533j33654m72561
38208A450184k63828q6854r6536Q7404M73169N23492N3959l39526r7338M54470
38198B158596N16071m4502m33727j4118P24781P63492q949o13324l99770O6711
38188B715261M600l60587l16549P0271J32060j97310l26163j13400p7715l70065
38178A160403m41419j8014L77253K38167k31104n68244o27592m10500J16142P17587
$$ plain form
38247 1877946 2355208 2810950 2910694 2730279 2742036 3172408 3590525 3499219 3072397 2806690
38237 2806690 2694383 2395181 2064078 2223273 2792838 3038431 2648178 2138506 1972991
38228 1972991 1986390 1954262 2011066 2129985 1884253 1199746 716055 868003 1186440 1091602
38218 1091602 817641 857957 995738 728652 329699 563147 1429866 2056399 1922745 1450184
38208 1450184 1186356 1099502 1002966 1090370 1563539 2087031 2140990 1801464 1704126 2158596
38198 2158596 2674667 2630165 2196438 2182320 2907101 3670593 3661644 3048320 2648550 2715261
38188 2715261 2719861 2359274 2042725 2112996 2245056 2047746 1721583 1608183 1530468 1160403
38178 1160403 718984 700970 1078223 1316390 1085286 517042 -110550 -521050 -404908 312679
38168C12679R02560N22870m6722m62804o70684n72117p6525M30425L86314n5473
38158F70523k01563P046p0219m72819l91682L48037P32658J81264m02202j14720
38148B86323M31802K13402m44325n15947o9823l234l37427k16725M52298P30605
38138E26949K17325l07235j85777J70368J28647j67406k06894L4577J81275O7676
38128D59505j46472k70110k16369Q774K79870M23897L99187L04349K03265N6023
38118A501919j82014m65280o35555n19362j71201P8802P2194J53286O12044R82872
38108A427705O04878j92403l91971J05442K72477k93315o25157p1476M84551Q5359
38098A406090o89177p72035l48699j97213j03678N22483J090184N93062m59080
$$ plain form
38168 312679 1215239 1738109 1691387 1228583 557899 -14218 -90743 339682 725996 670523
38158 670523 468960 476006 405787 -67032 -458714 -110677 621981 803245 401043 286323
38148 286323 718125 931527 487202 -28745 -98568 -101802 -439229 -655954 -203656 526949
38138 526949 744274 437039 251262 421630 550277 382871 175977 210554 391829 459505
38128 459505 313033 42923 -173446 -164672 115198 539095 938282 1242631 1445896 1501919
38118 1501919 1319905 854625 219070 -300292 -471493 -392691 -320497 -167211 444833 1427705
38108 1427705 2032583 1840180 1448209 1553651 1826128 1532813 907656 836180 1320731 1406090
38098 1406090 716913 -55122 -403821 -601034 -704712 -182229 907955 1501017 1041937
38089A041937o50512j0663R3557n58141o18689L74877J035965L90316n46390m57622
38079I4635L46639P75518O60638N20810M44184K36710R1026K46089M80077O22059
38069D518385J021698J886592K723049L024226K910047K510350J409769n64372
38061A9439744k582530l604234l516204k884395k068213j219065o73599o25889
38053B265615p08669m71250R08L50587M47590K73445j91652o14459m50402J63275
38043A064988L60999j31378m36497Q6676P39585O04193K747j58052J13730J38591
38033B385582j35246j83299J8115K1205j46141m6685K42918K01227j78606l62496
38023A816574k12192j37025k76094l00094j11831m3098k32955m00349l26951p5341
$$ plain form
38089 1041937 391425 380762 474319 -83822 -702511 -327634 708331 1098647 552257 94635
38079 94635 441274 1216792 1877430 2398240 2842424 3079134 3170160 3416249 3896326 4518385
38069 4518385 5540083 7426675 10149724 13173950 16083997 18594347 20004116 19439744
38061 19439744 16857214 13252980 9736776 6852381 4784168 3565103 2891504 2265615
38053 2265615 1556946 1085696 1086604 1437191 1884781 2158226 1966574 1352115 901713 1064988
38043 1064988 1425987 1294609 858112 944788 1684373 2288566 2291313 2133261 2246991 2385582
38033 2385582 2250336 2067037 2085152 2106357 1960216 1913531 2156449 2357676 2179070 1816574
38023 1816574 1604382 1467357 1191263 891169 779338 736240 503285 102936 -224015 -299356
38013b99356K58782N29818M00659k10209o74832l16002N36825Q42344K26043n91355
38003G02717q21573m46493R2767M68579N41510L22353M6763k5736N2950O4436
37993I98273K6218Q9970J53310R909j97540j37916J38938K42566L3623k34359
37983A122992l42848l06889j91485o8386p5957k15948k31829J7750K85127L37107
37973C29634L13293L17452P0233n19192q60665m26513L38773N69211K00728p3822
37963B59132J07515M39818N73552M21155j5866n19529n74353m7116L49612k790
37953I91130n69669m16944K79253N00093j979m40091l38707q5822k7044P015Q9495
37942a3270M706j61172n8849J85925R7485k37334k60226L8998J52598J02089L61312
$$ plain form
38013 -299356 -40574 489244 889903 679694 4862 -311140 225685 1068029 1294072 702717
38003 702717 -118856 -565349 -472582 -4003 537507 859860 906623 880887 933837 998273
37993 998273 1024491 1114461 1267771 1277680 1080140 942224 1081162 1323728 1357351 1122992
37983 1122992 780144 473255 281770 213384 137427 -78521 -310350 -292600 -7473 329634
37973 329634 642927 960379 1030612 511420 -349245 -775758 -436985 132226 332954 259132
37963 259132 366647 806465 1380017 1801172 1785306 1265777 691424 644308 993920 991130
37953 991130 421461 4517 283770 783863 781884 341793 3086 -82736 -109780 -102765 -13270
37942 -13270 -8564 -169736 -228585 -42660 54825 -182509 -442735 -403737 -251139 -149050 212262
37931B12262O89681K99787o05307q10605j3331N83955J98886l41617j37929L04239
37921C80021J49278k76866k32264K9085j90066o43981n10055J90936O16787L85995
37911a01130o1626k92388l00122j47629J61358M31938L73128k8749m79989o23285
37901a068494k18409O03135J172036Q48479q8169o62903m78015j05561k4676Q382
37891a4195J92347J79459j46096k48622R4468K48916j73562n11086j40772M35110
37881h4033M75720K15728K32506L18917L9739k46726n9275J18907l38522q28755
37871a55794l57775O25353P38527j31042o71882k90743J10743j42197m27662j09375
37861h11847L15614J66986k24996j37699L51362N89431L56806l7749l79405o46844
$$ plain form
37931 212262 901943 1201730 596423 -214182 -227513 356442 555328 213711 75782 380021
37921 380021 529299 252433 20169 49254 -140812 -784793 -1294848 -1103912 -487125 -101130
37911 -101130 -162756 -455144 -755266 -902895 -741537 -309599 63529 34780 -445209 -1068494
37901 -1068494 -1286903 -683768 488268 1336747 1248578 585675 107660 2099 -22577 -14195
37891 -14195 178152 357611 211515 -37107 57361 306277 132715 -378371 -519143 -84033
37881 -84033 391687 607415 839921 1158838 1198577 951851 892576 1011483 672961 -155794
37871 -155794 -513569 111784 850311 719269 47387 -243356 -132613 -274810 -702472 -811847
37861 -811847 -496233 -329247 -554243 -691942 -340580 248851 605657 567908 188503 -458341
37851d58341o64043k20029M62275P88981M36629k73608p28489o47509k66616P0787
37841a499963L30469O24494P87942N16463n1688l61389k12087k3848r5355j29586
37831a14548J41820M03164L03559O9848L7207L5586j79379l52388k14668o6136
37821F4065j83741j64322L30663O98299K53988m65374m02771K92184M80278j14672
37811G88597n56578l18884J2r9861k31369k0794J91138P2426j04871q0021o3332
37800d23537j42607J8045M36695N21247J3358m87838m56916j93877j05425L1739
37790g89116M30698O12896J72060l38762j75744L36656K64308m13079o98226o7707
37780f66016P69271Q92202L36734j57899j93680o1206j44790l57131l21450M5368
$$ plain form
37851 -458341 -1122384 -1342413 -880138 -91157 345472 71864 -656625 -1304134 -1570750 -1499963
37841 -1499963 -1169494 -545000 242942 759405 707717 346328 134241 110393 15038 -114548
37831 -114548 27272 430436 733995 803843 841050 876636 697257 344869 130201 64065
37821 64065 -119676 -283998 46665 744964 998952 533578 130807 422991 903269 788597
37811 788597 232019 -86865 -86853 -186714 -418083 -438877 -247739 -175313 -280184 -360205 -423537
37800 -423537 -566144 -548099 -111404 409843 423201 -64637 -521553 -715430 -820855 -789116
37790 -789116 -358418 254478 426538 87776 -87968 248688 512996 99917 -598309 -666016
37780 -666016 103255 995457 1332191 1174292 980612 919406 774616 417485 96035 141403
37770A41403L79243L37581n2l32379n15373n34448l42147k7499Q9958q7887j44714
37759a036314K21719N63462L11980k04494k02867K18114J86007m07266n91284
37750i40943O4951O16796K24315m76409m17569K01762L55904j01497l30239J6083
37740g86846L01783O9232k37702p3015L75405N75539L97658O6961k71876n41413
37730a24274n31057j20996L90421N25986J98877k00130k96820j01245J48101K80954
37720A69817K38599L2754j70370j08459K01438L09384j17547o98564p16671q9448
37710i49067N10500N88759L52483J18020j91919n78693n88452J3031O31851N69768
37700D76281L1511k56172j47067p0081j38029o1389J30686P6826j82470j97238
$$ plain form
37770 141403 520646 858227 858175 525796 10423 -524025 -866172 -893671 -803713 -891600 -1036314
37759 -1036314 -814595 -251133 60847 -143647 -346514 -128400 57607 -349659 -940943
37750 -940943 -875992 -259196 -34881 -511290 -928859 -727097 -371193 -472690 -802929 -786846
37740 -786846 -485063 -415831 -653533 -726548 -351143 224396 622054 689015 417139 -124274
37730 -124274 -655331 -776327 -385906 140080 338957 138827 -157993 -259238 -111137 169817
37720 169817 408416 441170 270800 162341 363779 673163 555616 -142948 -859619 -949067
37710 -949067 -438567 150192 502675 620695 428776 -149917 -738369 -725338 -93487 476281
37700 476281 507792 251620 104553 34472 -103557 -164946 -34260 42566 -139904 -337142
37690c37142Q3301J87403p6692l39551l19994j56497J8410K49723M15668K89954
37680A4583J7047m0867O3941p425j80531j03829Q6971m2625l25795k09823J44238
37669e84115L8032m17561l30304L72254O59474J40031k31951J73637N79085K24152
37659F22734l19581k61517L8753q5654l25783j12288K10770J18800M9084N49191
37649D84509R86014M82741m27062n39048N5073K47459j29095k06536J45590P4778
37639A174423n43878o91713O4043P61654N32762k13512o70126p22776n81201j89742
37629a080066L77635O38619L78942K8093o0049r5099k49614k41547N5418K33595
37619a4073M6183j33050j5492N5417k04824l77319j4118N29917O02514K20135
$$ plain form
37690 -337142 -253841 -66438 -143130 -482681 -802675 -959172 -940762 -691039 -275371 14583
37680 14583 31630 -9237 54704 47279 -133252 -237081 -150110 -192735 -518530 -728353 -584115
37669 -584115 -546083 -963644 -1293948 -921694 -262220 -122189 -354140 -180503 398582 622734
37659 622734 303153 41636 80389 -5265 -331048 -443336 -232566 -113766 -64682 484509
37649 484509 1470523 1953264 1526202 987154 1042227 1289686 1160591 954055 1099645 1174423
37639 1174423 630545 -61168 2875 764529 1297291 1083779 413653 -309123 -890324 -1080066
37629 -1080066 -702431 -63812 315130 343223 283174 188075 -61539 -303086 -247668 -14073
37619 -14073 32110 -100940 -116432 -61015 -265839 -643158 -657276 -127359 475155 695290
37609F95290j14670k55460m14278n37985l52906L8563K07471P5762L8188L13242
37599c06783N90478M83729M7231l24310l44088p0213J99349J95612r1757m00023
37589b0775m29314j28851K21185K29765k00978o56806n67536Q9806O44144N17349
37579c02011l4980k99971o7343K17707J92805j6779j74578k36928j63151J22487
37569g62742M15634L28813q5217k63770L1161K73837k5731m96958m30274J36474
37559h78773M71900K30177j22502r0740J44348R9008k51733m56671k35508J69561
37549i20933L42512J90993k2928m6335J04623K25863J61659m4038j61883K0628
37539a49839M07841N80530K65420k42300m25587k96629l56522o80051o20026J51461
$$ plain form
37609 695290 580620 325160 -89118 -627103 -980009 -941446 -733975 -658213 -620025 -306783
37599 -306783 283695 767424 814655 490345 146257 76044 275393 471005 379248 -20775
37589 -20775 -450089 -578940 -357755 -127990 -328968 -985774 -1553310 -1463504 -819360 -302011
37579 -302011 -336991 -636962 -704305 -486598 -293793 -310572 -485150 -722078 -885229 -762742
37569 -762742 -347108 -18295 -103512 -367282 -336121 -62284 -88015 -584973 -1015247 -878773
37559 -878773 -406873 -176696 -299198 -389938 -245590 -146582 -398315 -854986 -1090494 -920933
37549 -920933 -578421 -387428 -410356 -456691 -352068 -126205 35454 -8584 -170467 -149839
37539 -149839 258002 838532 1103952 861652 436065 139436 -217086 -897137 -1517163 -1365702
37529a365702Q40704N08236m35238o16852L53355J227893Q11577m22652j050714
37520a49393n84166J10246J57873k61526l91879L4805N62576O62625L19715m7512
37510D13364p9766J91922M34669L40601j09366o03778p18871l14123K38042L68877
37500A61571l5789m52530l42304J85069N37765L76032n9762l20135k24496M2357
37490a32222J51408m8652l28501k88474J08559M01626K52634k2671P3750L83874
37480E51331K63428l82475q06022m19103L58092O45728K34960k58338k71222Q0796
37470b825L17324K09127j09699m46922o79944o07483k7496Q14428J136676M41824
37460A045010o38169q74661J4392R14786P71493m1281l90665q737L46871J86265
$$ plain form
37529 -1365702 -524998 -16762 -452000 -1068852 -715497 512396 1323973 901321 -149393
37520 -149393 -733559 -623313 -465440 -726966 -1118845 -1084040 -521464 141161 460876 413364
37510 413364 333598 525520 960189 1300790 1191424 587646 -131225 -445348 -207306 161571
37500 161571 125782 -326748 -669052 -483983 53782 429814 370052 49917 -174579 -132222
37490 -132222 19186 -29466 -357967 -646441 -537882 -136256 116378 93707 167457 551331
37480 551331 814759 432284 -373738 -792841 -434749 210979 445939 187601 -83621 -2825
37470 -2825 314499 523626 413927 -32995 -712939 -1320422 -1347918 -533490 603186 1045010
37460 1045010 406841 -467820 -453428 461358 1232851 1191570 800905 792168 1139039 1325304
37450A325304j18198j25843O0266K24842M07509N08218J48651o33570j080868
37441G16311o28849K67667P35668N76404K24601p3136l92425o03700l96690J19756
37431E45607M11495K40912o3661j76196j58846j23184L6321L09584L65143K0114
37421A407289l69228l52550k8126J23126p4279l25798l42654j51480Q0692K38676
37411B05668K30313J6088k61301l64908k22393N2113L48527N61487M89246O2007
37401A116847l64704l45208K361J32730n8125n6087L68320O94965M93950J48222
37391B133271J67875K88435k3336n37828n69678j19958J37134m8415k45140k09701
37381I72659j94435k71555j51086J48244K28921J14995K89478O67412M60678m75807
$$ plain form
37450 1325304 1207106 1081263 1141529 1366371 1773880 2282098 2430749 1797179 716311
37441 716311 87462 355129 1090797 1667201 1891802 1818666 1426241 822541 425851 545607
37431 545607 957102 1198014 1134353 958157 799311 676127 712448 1022032 1387175 1407289
37421 1407289 1038061 685511 657385 780511 706232 380434 37780 -113700 -33008 205668
37411 205668 435981 452069 190768 -174140 -396533 -344420 4107 565594 1054840 1116847
37401 1116847 752143 406935 409296 542026 483901 427814 796134 1491099 1985049 2133271
37391 2133271 2301146 2589581 2566245 2028417 1458739 1338781 1475915 1427500 1182360 972659
37381 972659 778224 506669 355583 503827 732748 847743 1137221 1804633 2265311 1789504
37371A789504j090078n99823K93059M74000L2156j43806J01037J20666k61954
37362G14761m43803r3314L18726K94546J7965k6725K22356L68145J15399l25448
37352A162608m68885j96525J7490k19805n16876j90423O06283R50968M79496j11865
37342A512466j78414L0730N5413k5685o1942k93122p12296p01085k9153M95612
37332I2524K04696k91693r2768M97727N48985O1817k21922j86982k97125m33823
37322a18564n7934N52412M95818k31948o09813j96290K60453J48463j00811R6932
37312B38718N14500N73381J97623k23384l46267j16900J85780J29036l10483n40489
37302C01515j78297K35268K9906m24339k55288M26108O50141J67664k13628l3743
$$ plain form
37371 1789504 699426 99603 392662 866662 898818 755012 856049 976715 714761
37362 714761 270958 177644 496370 790916 808881 782156 1004512 1372657 1488056 1162608
37352 1162608 693723 497198 514688 294883 -221993 -412416 193867 1144835 1624331 1512466
37342 1512466 1334052 1364782 1420195 1394510 1332568 1039446 327150 -373935 -403088 92524
37332 92524 297220 5527 -87241 410486 959471 1021288 799366 612384 315259 -118564
37322 -118564 -176498 375914 871732 639784 29971 -166319 94134 242597 141786 238718
37312 238718 753218 1326599 1524222 1300838 954571 837671 1023451 1152487 842004 301515
37302 301515 123218 358486 388392 -35947 -291235 134873 785014 952678 739050 705307
37292G05307J71672k8131k08662M7014L37334R0874n08232p70091l73131L35924
37282b00122P22254M46082j46600l22569J15685N14331L32111n7760r1185J3035
37272A325262k11249m89852l13767J1754j15124m06286j57732M14049N23088K26876
37262H07019K08678L83794R7304m43652l86363J66827K46441k57225m29075O575
37252D00323L23413K36584K45062L74050O5696m85370m02408K43299L95694j54231
37242A242112m46894j19974P9945j58650k24182O8774J72516O0903K50227M87148
37232A411925N2093o64704o43027r2029Q8751K66569J223119J982682J261337
37223D886716L44694J165759K361276J436827J7802J556812M360314L995556L172419
$$ plain form
37292 705307 876979 848848 640186 687200 1024534 1115408 607176 -162915 -536046 -200122
37282 -200122 522132 968214 821614 499045 614730 1129061 1461172 1403412 1312227 1325262
37272 1325262 1114013 624161 310394 322148 207024 -199262 -356994 57055 580143 807019
37262 807019 1015697 1399491 1496795 1053143 666780 833607 1080048 822823 393748 400323
37252 400323 723736 960320 1205382 1579432 1645128 1159758 757350 1000649 1396343 1242112
37242 1242112 795218 675244 755189 596539 372357 441131 613647 674550 924777 1411925
37232 1411925 1464018 799314 156287 64258 153009 419578 1642697 3625379 4886716
37223 4886716 5231410 6397169 8758445 10195272 10213074 11769886 16130200 20125756 23298175
37214B3298175R900657K2103536K4124155O721120j6975937k5905632j6993012
37207B6273062n701776l196830n119426m050855j210042p93642j541144l77837
37199D281510J216617L86530j463415j326546P2004J18413q79111q29987O0205
37190A636220R1870n01505k84455L87946J26289o94259o05111K62863N69127J69884
37180A158869n798J42277K0314k17750m6538K23014P0531j15626J36092K93786
37170A659171j61019n84102l10364P3716j26798l91636j14387J02504l23126o07604
37160g83645J2520O90834L62234l45593k50563L19128L07348j06046n9857K35356
37150C81716K2266l84829j84355K98748K11940j66330K3004N24145M30232j04173
$$ plain form
37214 23298175 33198832 55302368 79426523 86147643 69171706 43266074 26273062
37207 26273062 20571286 17374456 12255030 8204175 6994133 6200491 4659347 4281510
37199 4281510 5498127 5884657 4421242 3094696 3166700 3285113 2406002 1576015 1636220
37190 1636220 1728090 1226585 942130 1330076 1456365 762106 156995 419858 988985 1158869
37180 1158869 1153071 1295348 1315662 1097912 1051374 1274388 1344919 1229293 1365385 1659171
37170 1659171 1498152 914050 603686 677402 550604 158968 44581 147085 -176041 -783645
37160 -783645 -771125 -80291 281943 -63650 -314213 4915 312263 206217 146360 381716
37150 381716 403982 19153 -165202 133546 345486 179156 202160 726305 1156537 1052364
37140A052364k01178P6176l9397m41721l47157J70813L10826K4806j2639K49483
37130H42376K43346o893P6267M91924O85689N25946K41557k73897j039234j317491
37120D69590n51373M60148N46750r0170l77776j67124j49352l46816j49619L45673
37110a0069M30220Q8568p4912m3907k61701n13635k40343K47488J94251j78813
37100c62853m1015M79183N21976J00133j4459J54129q0559m83122j36550O95990
37090H32853P08703k24935p21916j75494L45139M7177l70816j90022J33890Q6001
37080D70580O9100L81511M26839j31493n21456j34449L30357P224o81180p55377
37070e38344k15426J78070J82472J66348K38303J59264l5967o5603K5672n9044
$$ plain form
37140 1052364 851186 927362 887965 446244 99087 269900 580726 605532 592893 842376
37130 842376 1085722 1078829 1155096 1647020 2332709 2858655 3100212 2826315 1787081 469590
37120 469590 -81783 378365 925115 834945 457169 290045 140693 -206123 -355742 -10069
37110 -10069 420151 508719 433807 389900 128199 -385436 -625779 -378291 -184040 -362853
37100 -362853 -403868 75315 597291 697424 682965 837094 756535 273413 136863 832853
37090 832853 1541556 1316621 594705 419211 764350 811527 440711 250689 384579 470580
37080 470580 539680 921191 1348030 1216537 695081 560632 890989 898213 217033 -538344
37070 -538344 -753770 -575700 -393228 -226880 11423 170687 134720 69117 94789 35745
37060C5745k20817O0164R23451J647335J300276j05219j374914j368901l79629
37051E17491K46338p0234m53653q0184N05556L71255k47783m45176j88658j71685
37041a6733m06643k13048M42474P67995M12875j01668l35501l99843l86209j73037
37031d09338J34821L01751L98464M62516J09096o51331q04507K36972J207469
37022I85913N76704r14401j204848j48903L85416k40305m82588M67117J159252
37013E83357M15339o59633o18981N5415J54073j83463j57527O0318q9647k66706
37003g07455N6145M10637J87899j32344R4480L46351r9874o43263k84746N41253
36993b30917O00550j02533m38128n5742K70866J27036l1951R1133K19755K03853
$$ plain form
37060 35745 -185072 -124908 798543 2445878 3746154 3640935 2266021 897120 517491
37051 517491 763829 693595 239942 159758 665314 1036569 788786 343610 154952 -16733
37041 -16733 -423376 -636424 -193950 574045 986920 885252 549751 149908 -236301 -409338
37031 -409338 -274517 27234 425698 888214 997310 345979 -458528 -221556 985913
37022 985913 1562617 648216 -556632 -705535 -320119 -560424 -1043012 -575895 583357
37013 583357 998696 339063 -279918 -224503 -70430 -253893 -411420 -351102 -440749 -707455
37003 -707455 -651310 -240673 -52774 -185118 -90638 255713 155839 -487424 -772170 -230917
36993 -230917 369633 267100 -171028 -226770 44096 171132 139181 230314 450069 653922
36983F53922K03283J49348j60104n00305n14572l87873m57746m43956N4836N95334
36973h07833M22370k33003m24199M2126M31279L48884J68438J19276p1416m28655
36963d32733m86136o7305L74834M36687K32680M3781p637J31364L94643M64992
36953A085170J34170k87401l57867j32319N6702J84240L51333L19724j21609n84679
36943F47464n52916j80440M0743J05331K62382L14665r132l18786j28466J61131
36933C41976j21766o17642m33367K49316L88796j00741j56044N80793J096360
36924A227681O55163j28594m44095l90690l03871k6379M33323M70740j07617m98813
36914H86848j27072L50773J43370l07685p5036O92518J041471P32837M39221N24879
$$ plain form
36983 653922 857205 1006553 846449 346144 -168428 -556301 -1014047 -1458003 -1403167 -807833
36973 -807833 -385463 -618466 -1042665 -1000539 -569260 -220376 -51938 67338 -4078 -432733
36963 -432733 -918869 -986174 -611340 -174653 58027 101808 94171 225535 620178 1085170
36953 1085170 1219340 931939 574072 441753 498455 682695 1034028 1353752 1232143 647464
36943 647464 94548 -85892 -45149 60182 322564 637229 628097 309311 180845 341976
36933 341976 220210 -397432 -830799 -581483 -192687 -293428 -449472 131321 1227681
36924 1227681 1882844 1754250 1310155 919465 615594 589215 1022538 1493278 1385661 886848
36914 886848 759776 1110549 1253919 946234 871198 1563716 2605187 3338024 3777245 4302124
36904D302124N91426L44561J18252K72047O07378O74277L54645p9420l44633m43673
36894F396984n79760p99599q63181o35313m12276m90966n91529k70002K04041
36885A958399J35535l90425m86964R6981M75688M9366n13170m20712k7754n6166
36875H20778k78443m3943M13747L44256j75532m08438k70046l23124n40622k69020
36865g30387M67275P86523L50416j18829q5999L8622j53429l19195j38118K2317
36855A19196j36623j95173J71617M41148R6170l89098k87600J61537K06796j22886
36845F5084j65288J58096K68894K3333o7723J98766L76276J62051j85462l89522
36835D44505m66524l71647P733L90684L24342j8029q593L38036L12073k12577
$$ plain form
36904 4302124 4893550 5238111 5356363 5628410 6235788 6910065 7264710 7185290 6840657 6396984
36894 6396984 5817224 5017625 4154444 3519131 3106855 2615889 2024360 1754358 1958399
36885 1958399 2093934 1703509 1216545 1313526 1789214 1838580 1325410 904698 876944 820778
36875 820778 542335 498392 912139 1256395 1080863 672425 402379 79255 -461367 -730387
36865 -730387 -263112 523411 873827 754998 668999 707621 554192 234997 96879 119196
36855 119196 -17427 -212600 -40983 400165 496335 107237 -180363 -18826 187970 65084
36845 65084 -100204 57892 326786 350119 282396 481162 857438 1019489 834027 444505
36835 444505 -22019 -393666 -385933 4751 329093 311064 302471 640507 952580 740003
36825G40003m35212l709K85728j62536o60861m01851J42944Q5022k92815p5296
36815g78583N89233O87060P3997l29658j39299l758k50607k78092K34948O23344
36805D28585L54600r3478j52571j17644m15260o48559k50300M40669O45454L32386
36795E23882R4692Q6177q3144m72770o09673k54140K21195L67175J76610l5574
36785A4430p215K40438L93407J75195k14550k77567K8923J69083q3084k19238
36775B19822Q4632K74404j50578o16726l42129K47177J45414m45136l29621O03341
36765c09400R85951J32661p82723n63851J68576J39260m48976l58136N32519R82603
36755D78484L44896n21539o43336j95745J39259K39060L24822K93199l7215l87358
$$ plain form
36825 740003 304791 301082 586810 424274 -236587 -638438 -495494 -410472 -703287 -778583
36815 -778583 -189350 497710 571707 242049 102750 98992 -151615 -429707 -194759 428585
36805 428585 783185 689707 537136 419492 4232 -644327 -894627 -453958 191496 523882
36795 523882 618574 704751 621607 148837 -460836 -714976 -493781 -126606 50004 14430
36785 14430 7215 247653 641060 816255 601705 324138 353061 522144 439060 219822
36775 219822 304454 578858 428280 -188446 -530575 -283398 -137984 -583120 -912741 -309400
36765 -309400 676551 809212 26489 -537362 -368786 -229526 -678502 -1036638 -504119 478484
36755 478484 823380 301841 -341495 -537240 -397981 -158921 165901 459100 421885 34527
36745C4527l66190j15686m2348j15638j6070J76921Q7237k12177k21060J31788
36735f58696L05400L6298k04707Q364L61926L42464M0057j03888l3440k4645j13307
36724d4174j03634r202O59j7610R0174J93162Q8670m5579O9795K24719J923m40163
36712H740n23467j75482Q7071N1799P0210K87936L47902J00568q4050r053L300
36701A65474k20896l45731j87130q6563k31712k58028L7940K51521J16669J8288
36691g40168K20323K97563k3872j92827K20815O07058K69692l17607k70787J80973
36681B51163J13744m55748o01539q0404L16062J27011j55048q5996O3597j4326
36671e21484j21831m4109P1394J22207K61609M61170L93417l8840n05675o90102
$$ plain form
36745 34527 -331663 -447349 -489697 -605335 -621405 -444484 -357247 -569424 -790484 -658696
36735 -658696 -353296 -316998 -521705 -513341 -151415 191049 231106 127218 93778 69133 -44174
36724 -44174 -147808 -157010 -156351 -173961 -83787 109375 198045 152466 222261 446980 448903 8740
36712 8740 -514727 -690209 -603138 -551339 -481129 -193193 154709 255277 171227 162174 165474
36701 165474 -55422 -401153 -588283 -674846 -906558 -1164586 -1126646 -875125 -758456 -740168
36691 -740168 -519845 -222282 -246154 -438981 -218166 388892 658584 340977 70190 251163
36681 251163 364907 -90841 -692380 -772784 -456722 -329711 -484759 -570755 -507158 -521484
36671 -521484 -643315 -687424 -616030 -493823 -232214 228956 622373 583533 77858 -612244
36661f12244n16432q26O23460P91525K58866l18143k14824J74208n7336p12606
36651e84352o98726J10640N72432J64327j79800K66985P88285N03887j74833l54379
36641D14466r2261j8937j85025k53712l00024m91677m51524J48145P67603O75719
36631B12773J00457j58581M4230K09612J43035M5293j02851m06177n21388r6500
36621e30097M49078M23937l9602k49124j15657j05608j87389R4066N05648K56969
36611E02221n57317q10748o5255O44716L77931l08558l44738J83800L24643j71748
36601b25053n33351j78103N09952P76235L92272k25660n31648l52704J5715J77206
36591a75139Q9116K7508J09170J26516l2831j25309M3281K19252M5772l52171
$$ plain form
36661 -612244 -1128676 -1129502 -506042 285483 544349 226206 11382 185590 128254 -584352
36651 -584352 -1283078 -1172438 -600006 -435679 -615479 -348494 439791 943678 768845 414466
36641 414466 322205 303268 118243 -135469 -435493 -927170 -1378694 -1230549 -462946 212773
36631 212773 313230 154649 198879 408491 551526 596819 493968 87791 -433597 -530097
36621 -530097 -81019 342918 303316 54192 -61465 -167073 -354462 -260396 245252 502221
36611 502221 -55096 -865844 -931099 -286383 91548 -217010 -561748 -377948 -53305 -225053
36601 -225053 -758404 -936507 -426555 349680 741952 516292 -15356 -368060 -352345 -175139
36591 -175139 -86023 -58515 50655 177171 144340 19031 62312 281564 327336 -24835
36581b4835m91855k02253J60025K16083J9541j14070m8802P0283R0469O3074J26075
36570a36265K56054K58902M8850j59509p1669K72203M44930J09702m97871p26132
36560b00805k45585M66947N97817j0084n98047m39630J89474L97225o1828m51094
36550c55610j34024N28558P41815L65348n9763j80513j90869l10473l79321j67062
36540a41914J96296L34931Q6252l02909m50451k53443L4990J62286J75217K10765
36530E2020J56285j38381l93918j40205M98971P98341M27427q8078k24033k05491
36520G42938m16326o06860l54466Q8886J54971r3306j18582J58795L25382K55078
36510A36510J83451Q8559k28615m94911k28710L24949M01076m1768k16514J46768
$$ plain form
36581 -24835 -516690 -718943 -558918 -342835 -323294 -437364 -486166 -415883 -325414 -262340 -136265
36570 -136265 119789 378691 427541 268032 196363 468566 913496 1023198 525327 -200805
36560 -200805 -446390 20557 618374 608290 10243 -429387 -239913 157312 95484 -355610
36550 -355610 -489634 38924 780739 1146087 1086324 905811 714942 404469 25148 -141914
36540 -141914 54382 389313 475565 172656 -277795 -531238 -496248 -333962 -158745 52020
36530 52020 208305 69924 -323994 -464199 34772 833113 1260540 1172462 948429 742938
36520 742938 326612 -280248 -634714 -545828 -390857 -484163 -602745 -443950 -118568 136510
36510 136510 319961 408520 179905 -315006 -543716 -218767 182309 140541 -75973 70795
36500G0795L43901l5010l77522j70733P4282k04991n06363o2384P79208R65702
36490H76885K62815n17289o96286l81495J6234K56142K39653L0906q4053N7987
36480F1499K05129J09119J681J86113M06144J98216l02715n17325k84526J1831
36470G5166J11547J04558L3272j69950l54688k72680k234K07980L90422O29821
36460G53214N95279o812o79604o61441j32905K4323k97612k57765L97192P47601
36450D81470J87024n25578m58665Q1693K25454k0438J0979L88922N19590J76352
36440A066803k39700m15757m12317k76244J4030K52646K06284M7944P7480J36840
36430D58009j21528n07480m88854p0793J95778J19008R5953L10616L74404K5183
$$ plain form
36500 70795 414696 379686 2164 -168569 -94287 -299278 -805641 -868025 -88817 876885
36490 876885 1139700 622411 -73875 -455370 -439136 -182994 56659 87565 3512 61499
36480 61499 266628 375747 377428 563541 969685 1167901 865186 347861 63335 75166
36470 75166 186713 291271 324543 154593 -200095 -472775 -475009 -267029 123393 753214
36460 753214 1348493 1341681 662077 636 -132269 -107946 -405558 -663323 -266131 481470
36450 481470 668494 142916 -315749 -234056 -8602 -29040 -18061 370861 890451 1066803
36440 1066803 827103 411346 -971 -277215 -263185 -10539 195745 243689 321169 458009
36430 458009 336481 -170999 -659853 -730646 -534868 -415860 -319907 -9291 365113 390296
36420C90296l81381m01947j02888J59484K16827J19962j1795j6845J43566J79720
36410B94999j97565o95164o60443j2120N58475N25755J74508L4407J42810K15583
36400C81245J54109J9129j79028l45000k57142O4583K73886K16573J36082J23047
36390E87484j15308n70933o15123N7998O87366L96975m61337p52502j73227M34660
36380e23947L97916J5584j51169q6182o8085j21366r8837o419N5285Q8280J51990
36369c46950K57308L72644L95280J64300k81410n60294l74475J6419J22370o5605
36359c00413j41981k868N1206m3748J7877K47628J91563k74493n55934j83082
36349i94245M26670N72303K81118J30952K71604K59172j25584m62984l11598J33711
$$ plain form
36420 390296 8915 -393032 -495920 -336436 -119609 353 -11442 -28287 115279 294999
36410 294999 97434 -597730 -1258173 -1270293 -711818 -186063 -11555 22852 165662 381245
36400 381245 535354 554483 375455 30455 -226687 -162104 111782 328355 464437 587484
36390 587484 472176 -98757 -713880 -655882 31484 428459 -32878 -785380 -958607 -523947
36380 -523947 -126031 -110447 -261616 -347798 -415883 -537249 -636086 -642505 -587220 -498940 -346950
36369 -346950 -89642 283002 678282 842582 561172 878 -373597 -357178 -234808 -300413
36359 -300413 -442394 -445262 -394056 -437804 -419927 -172299 19264 -255229 -811163 -994245
36349 -994245 -567575 4728 285846 416798 688402 947574 821990 359006 47408 181119
36339A81119K98174j6011m04258m10661j05109N9559r6169k30226j3449L43059
36329c93972L84712P0588k34990l30979l10783j68224K08211N78812M67855m8033
36319B23197k43746K01026N96259K11521n88099q33183l14082K52541L34138J53987
36309f441O1722j5618k17652l42270j66193J28051J95684K6528r0472J5643K61175
36298a49843M95675N85009L72533j62618o80987o95027j54621L81626L72444m8788
36288C15403l12976k15173p9806q0401J00895O10918Q67260K60300p82007j130497
36278d46084m28944M19863M93690j2027l02665j51282L9428O1152J25965K91471
36268I0567K49950j25048m40903k73469K38597N58954M17493O9454j17584j20982
$$ plain form
36339 181119 479293 463282 59024 -351637 -456746 -397187 -493356 -723582 -737031 -393972
36329 -393972 -9260 61328 -173662 -504641 -815424 -983648 -775437 -196625 271230 223197
36319 223197 -20549 180477 776736 988257 400158 -433025 -747107 -494566 -160428 -6441
36309 -6441 55281 39663 -177989 -520259 -686452 -558401 -362717 -336189 -426661 -411018 -149843
36298 -149843 345832 930841 1303374 1140756 459769 -235258 -389879 -8253 364191 315403
36288 315403 2427 -212746 -292552 -372953 -272058 338860 1206120 1466420 684413 -446084
36278 -446084 -875028 -455165 38525 26498 -276167 -427449 -388021 -326869 -200904 90567
36268 90567 340517 215469 -225434 -498903 -260306 298648 716141 785595 668011 547029
36258E47029j62031k71226k17426Q0222L42834L24541J81066J61066J34663j71683
36248I49055n96517o73755l17784R4670L24062M26136L06526k19484p93549o96524
36238a197164L1320M26362J9440l77659K5938O70658N47612j50341l86338L7818
36228c52354L21969R9620j18819l7312j5429j69402o7437L08919K96637k57332
36218I060m98400P3809O26371K35529o03699p16180j3818N37821M58792J89679
36208B98964M0941k30318o02334n13404J78495P24224M92459j24946l62220j72986
36198b71125o6903j76682j62558O2124J49067o2130k53301j32043J61638L37779
36188d14134L23161J63541j28360m11266m09251j37591k9886k91456m35337L6511
$$ plain form
36258 547029 384998 113772 -103654 -23432 319402 643943 825009 986075 1120738 949055
36248 949055 352538 -321217 -639001 -544331 -220269 205867 512393 292909 -500640 -1197164
36238 -1197164 -1165844 -739482 -720042 -1097701 -1071763 -401105 146507 -3834 -390172 -352354
36228 -352354 -30385 69235 -49584 -86896 -102325 -271727 -339164 -30245 266392 9060
36218 9060 -489340 -415531 210840 446369 -157330 -873510 -887328 -349507 109285 298964
36208 298964 339905 109587 -492747 -1006151 -827656 -103432 389027 264081 -98139 -271125
36198 -271125 -338028 -514710 -677268 -615144 -466077 -528207 -781508 -913551 -751913 -414134
36188 -414134 -90973 72568 -55792 -467058 -876309 -1013900 -1043786 -1335242 -1770579 -1734068
36178a734068P23679P64743J30805k80250j6198K55818j08900o38409n08644J10485
36168a300939L64447J17803P9802N00495P00934K17333m12262n12483k65684k14128
36158g24682k68798L0284N38677N93174N6999m31811m01600j24472k441P3258
36148f61412L46657N92606M08575q2961l31486j24952J86852K88443K90256L52790
36138A265368L00228p4615n52032o96907m49014j75635j31140j64646n4208J22055
36128f10546J27868n1927j62965p722K81777L46832p220n27002o88292k27674
36118a526871N40027R97002P82092O8933n89483o61550r5017N13717M60496j85248
36108C04098n66731j89406L28866J69990m01306m40564J75158N78737L13135p1395
$$ plain form
36178 -1734068 -1010389 -245646 -114841 -395091 -411289 -155471 -264371 -902780 -1411424 -1300939
36168 -1300939 -936492 -818689 -738887 -238392 462542 679875 267613 -244870 -510554 -724682
36158 -724682 -993480 -963196 -424519 168655 225654 -206157 -607757 -732229 -734670 -661412
36148 -661412 -314755 277851 686426 603465 271979 147027 333879 622322 912578 1265368
36138 1265368 1565596 1490981 938949 242042 -206972 -382607 -513747 -678393 -732601 -610546
36128 -610546 -482678 -534605 -697570 -705292 -423515 -76683 -83903 -610905 -1299197 -1526871
36118 -1526871 -986844 10158 792250 861183 271700 -389850 -484867 28850 489346 304098
36108 304098 -262633 -452039 -123173 46817 -354489 -795053 -619895 -41158 271977 200582
36098B00582j14059j62843m63053m46685K68628R10368N62503l47773o19001n1999
36088b63332M04604K06366j40584j26430K8927J6831J5042J90480K57342M154
36078E93400k21351l9093K99293K53403j99921n37357m05581k7030J63516P5156
$$ plain form
36098 200582 86523 -76320 -539373 -986058 -717430 192938 755441 407668 -211333 -263332
36088 -263332 141272 347638 207054 80624 109551 126382 141424 331904 589246 593400
36078 593400 372049 332956 632249 885652 685731 148374 -257207 -284237 -120721 -45565
$$ [...]
##END NTUPLES=NMR SPECTRUM
##END=
