##TITLE=31Pdec_LR-761-C2-M2
 CDCl3, 24 sc
 28.6.2024
##JCAMPDX= 6.0         $$ Bruker NMR JCAMP-DX V2.0
##DATA TYPE= NMR SPECTRUM
##DATA CLASS= NTUPLES
##ORIGIN= UXNMR, Bruker Analytische Messtechnik GmbH
##OWNER= root
$$ XWIN-NMR		Version 3.5
$$ Fri Jun 28 13:49:11 2024 Russian Standard Time (UT+4h)  she@DPX200
##.OBSERVE FREQUENCY= 81.013821
##.OBSERVE NUCLEUS= ^31P
##.ACQUISITION MODE= SIMULTANEOUS
##.ACQUISITION SCHEME= undefined
##.AVERAGES= 24
##.DIGITISER RES= 17
##SPECTROMETER/DATA SYSTEM= spect
##.PULSE SEQUENCE= zgpg30
##.SOLVENT NAME= D2O
##.SHIFT REFERENCE= (INTERNAL, D2O, 0, 198.062)
##AUDIT TRAIL= $$ (NUMBER, WHEN, WHO, WHERE, WHAT)
$$ ##TITLE= Audit trail, XWIN-NMR		Version 3.5
$$ ##JCAMPDX= 5.01
$$ ##ORIGIN= Bruker BioSpin GmbH
$$ ##OWNER= she
$$ F:/spectra/data/she/nmr/P31/2/pdata/1/auditp.txt
$$ ##AUDIT TRAIL=  $$ (NUMBER, WHEN, WHO, WHERE, WHAT)
(   1,<2024-06-28 13:48:08.62 +0400>,<she>,<DPX200>,
      <created by zg, POWCHK disabled, PULCHK disabled
       configuration hash MD5:
       00 E9 B6 7A A2 85 ED C7 34 08 36 98 17 FE 4E 26
       data hash MD5: 32K
       D6 56 E0 03 DC D2 24 16 EC 7B 31 40 C8 D9 98 AA>)
(   2,<2024-06-28 13:48:11.68 +0400>,<she>,<DPX200>,
      <Start of raw data processing
       efp BC_mod = 2 LB = 1.5 FT_mod = 6 PKNL = 1 PHC0 = 2673.945 PHC1 = 458.6863 SI = 64K 
       data hash MD5: 64K
       7A 37 19 4D 26 68 63 E3 45 15 51 91 0E 6C 18 3E>)
(   3,<2024-06-28 13:48:34.67 +0400>,<she>,<DPX200>,
      <pk PHC0 = 147.385 PHC1 = -372.6 
       data hash MD5: 64K
       FD FD 2F 65 53 6D 87 E7 0D 24 E7 BC 69 1F 51 78>)
(   4,<2024-06-28 13:48:37.51 +0400>,<she>,<DPX200>,
      <abs ABSG = 5 
       data hash MD5: 64K
       04 1E 78 4B E2 84 91 A6 5B 43 83 EF DB 58 EC A2>)
$$ ##END=
$$ 
$$ hash MD5
$$ 60 B8 84 08 AE 00 10 8A 12 91 A3 C5 E0 D9 3E 84
##$RELAX= 
##$RELAX= 
##$RELAX= 
##$RELAX= 
##$RELAX= 
##$RELAX= 
##$RELAX= 
##$RELAX= 
$$ Bruker specific parameters
$$ --------------------------
##$DU= <F:/spectra>
##$EXPNO= 2
##$NAME= <P31>
##$PROCNO= 1
##$TYPE= <nmr>
##$USER= <she>
##$AMP= (0..31)
100 100 100 100 100 100 100 100 100 100 100 100 100 100 100 100 100 100 
100 100 100 100 100 100 100 100 100 100 100 100 100 100 
##$AQSEQ= 0
##$AQ_mod= 1
##$AUNM= <au_zg>
##$AUTOPOS= <>
##$BF1= 81.014009
##$BF2= 200.13
##$BF3= 200.13
##$BF4= 200.13
##$BF5= 200.13
##$BF6= 200.13
##$BF7= 200.13
##$BF8= 200.13
##$BYTORDA= 1
##$CFDGTYP= 0
##$CFRGTYP= 5
##$CHEMSTR= <none>
##$CNST= (0..31)
1 1 145 1 1 1 1 1 1 1 1 1 1 1 1 1 1 1 1 1 1 1 1 1 1 1 1 1 1 1 1 1 
##$CPDPRG= <waltz16>
##$CPDPRG1= <>
##$CPDPRG2= <waltz16>
##$CPDPRG3= <>
##$CPDPRG4= <mlev>
##$CPDPRG5= <mlev>
##$CPDPRG6= <mlev>
##$CPDPRG7= <mlev>
##$CPDPRG8= <mlev>
##$CPDPRGB= <>
##$CPDPRGT= <>
##$D= (0..31)
0 1 0 0 0 0 0 0 0 0.06 0 0.03 2e-05 3e-06 0 0 0.0002 0 0 0 0 0 0 0 0 0 
0 0 0 0 0 0 
##$DATE= 1719568088
##$DBL= (0..7)
120 120 120 11 120 120 24 19 
##$DBP= (0..7)
150 150 150 150 150 150 150 150 
##$DBP07= 0
##$DBPNAM0= <>
##$DBPNAM1= <>
$$ [...]
##$SUBNAM3= <"">
##$SUBNAM4= <"">
##$SUBNAM5= <"">
##$SUBNAM6= <"">
##$SUBNAM7= <"">
##$SUBNAM8= <"">
##$SUBNAM9= <"">
##$SW= 400.765351723535
##$SWIBOX= (0..15)
0 1 3 0 0 0 0 0 0 0 0 0 0 0 0 0 
##$SW_h= 32467.5324675325
##$TD= 32768
##$TD0= 1
##$TE= 0
##$TE2= 300
##$TE3= 300
##$TEG= 300
##$TL= (0..7)
0 120 53 12 22 120 120 120 
##$TP= (0..7)
150 150 150 150 150 150 150 150 
##$TP07= 0
##$TPNAME0= <>
##$TPNAME1= <>
##$TPNAME2= <>
##$TPNAME3= <>
##$TPNAME4= <>
##$TPNAME5= <>
##$TPNAME6= <>
##$TPNAME7= <>
##$TPOAL= (0..7)
0.5 0.5 0.5 0.5 0.5 0.5 0.5 0.5 
##$TPOFFS= (0..7)
0 0 0 0 0 0 0 0 
##$TUNHIN= 0
##$TUNHOUT= 0
##$TUNXOUT= 0
##$USERA1= <user>
##$USERA2= <user>
##$USERA3= <user>
##$USERA4= <user>
##$USERA5= <user>
##$V9= 5
##$VALIST= <valist>
##$VCLIST= <CCCCCCCCCCCCCCC>
##$VD= 0
##$VDLIST= <DDDDDDDDDDDDDDD>
##$VPLIST= <PPPPPPPPPPPPPPP>
##$VTLIST= <TTTTTTTTTTTTTTT>
##$WBST= 1024
##$WBSW= 4
##$XGAIN= (0..3)
0 0 0 0 
##$XL= 0
##$YL= 0
##$YMAX_a= 14136
##$YMIN_a= -15694
##$ZGOPTNS= <>
##$ZL1= 120
##$ZL2= 120
##$ZL3= 120
##$ZL4= 120
##$ABSF1= 198.0616
##$ABSF2= -202.7028
##$ABSG= 5
##$ABSL= 3
##$ALPHA= 0
##$AQORDER= 0
##$ASSFAC= 0
##$ASSFACI= 0
##$ASSFACX= 0
##$ASSWID= 0
##$AUNMP= <proc_1d>
##$AZFE= 0.1
##$AZFW= 0.5
##$BCFW= 0
##$BC_mod= 2
##$BYTORDP= 0
##$COROFFS= 0
##$CY= -3
##$DATMOD= 1
##$DC= 0
##$DFILT= <>
##$DTYPP= 0
##$F1P= 0
##$F2P= 0
##$FCOR= 1
##$FTSIZE= 65536
##$FT_mod= 6
##$GAMMA= 0
##$GB= 0
##$INTBC= 1
##$INTSCL= 9.790993e-09
##$ISEN= 30
##$LB= 1.5
##$LEV0= 0
##$LPBIN= 0
##$MAXI= 10000
##$MC2= 0
##$MEAN= 0
##$ME_mod= 0
##$MI= 50
##$NCOEF= 0
##$NC_proc= -5
##$NLEV= 6
##$NOISF1= 182.463
##$NOISF2= 159.3651
##$NSP= 0
##$NTH_PI= 0
##$NZP= 0
##$OFFSET= 198.0616
##$PC= 4
##$PHC0= 2821.33
##$PHC1= 86.0863
##$PH_mod= 1
##$PKNL= yes
##$PPARMOD= 0
##$PSCAL= 0
##$PSIGN= 0
##$REVERSE= no
##$SF= 81.0140089999434
##$SI= 65536
##$SIGF1= 159.3651
##$SIGF2= -187.1042
##$SINO= 113.3802
##$SIOLD= 16384
##$SREGLST= <1H.CDCl3>
##$SSB= 0
##$STSI= 65536
##$STSR= 0
##$SW_p= 32467.5324675325
##$SYMM= 0
##$S_DEV= 0
##$TDeff= 32768
##$TDoff= 0
##$TI= <>
##$TILT= no
##$TM1= 0
##$TM2= 0
##$TOPLEV= 0
##$USERP1= <user>
##$USERP2= <user>
##$USERP3= <user>
##$USERP4= <user>
##$USERP5= <user>
##$WDW= 1
##$XDIM= 65536
##$YMAX_p= 317421172
##$YMIN_p= -3536269
$$ End of Bruker specific parameters
$$ ---------------------------------
##NTUPLES= NMR SPECTRUM
##VAR_NAME=  FREQUENCY,     SPECTRUM/REAL,   SPECTRUM/IMAG
##SYMBOL=    X,             R,               I
##VAR_TYPE=  INDEPENDENT,   DEPENDENT,       DEPENDENT
##VAR_FORM=  AFFN,          ASDF,            ASDF
##VAR_DIM=   65536,         65536,           65536
##UNITS=     HZ,            ARBITRARY UNITS, ARBITRARY UNITS
##FACTOR=    0.49542278885378, 1,            1
##FIRST=     16045.7642231865, 0,            0
##LAST=      -16421.768244346, 0,            0
##MIN=       -16421.768244346, -3536269,     0
##MAX=       16045.7642231865, 317421172,    0
$$ Real data points
##PAGE= N=1
##DATA TABLE= (X++(R..R)), XYDATA
$$ [...]
$$ plain form
44902 -567812 -576420 -558596 -511943 -388718 -191256 -10369 45291 -6062 6825 195054 417741
44891 417741 448257 304639 229376 331154 454663 459205 413999 420694 438739 410720 386692
44880 386692 390691 324654 141970 -38832 -128030 -202518 -303851 -297626 -132898 -42561 -220556
44869 -220556 -459486 -421338 -165635 -71952 -281529 -562685 -743450 -917292 -1119775 -1137483
44859 -1137483 -835550 -436290 -250537 -280008 -283096 -134316 61302 153750 94944 -76374
44849 -76374 -280566 -426618 -459989 -380410 -205717 24961 202130 198590 26732 -134325
44839 -134325 -128535 23884 208454 368176 499758 564445 495865 283006 -2577 -244615
44829 -244615 -330459 -215089 25285 248249 390659 522852 735199 1017262 1272544 1401387
$$ packed form
44902e67812q608J7824M6653J23225J97462J80887N5660n1353J2887J88229K22687
44891D17741L0516j43618p5263J01778J23509M542m5206O695J8045k8019k4028
44880C86692L999o6037j82684j80802q9198p4488j01333O225J64728R0337j77995
44869b20556k38930L8148K55703R3683k09577k81156j80765j73842k02483j7708
44859a137483L01933L99260J85753k9471l088J48780J95618R2448n8806j71318
44849g6374k04192j46052l3371P9579J74693K30678J77169l540j71858j61057
44839a34325N790J52419J84570J59722J31582O4687o8580k12859k85583k42038
44829b44615q5844J15370K40374K22964J42410J32193K12347K82063K55282J28843
$$ plain form
44819 1401387 1343272 1092646 714832 319060 -2543 -192303 -213640 -85047 95104 243119
44809 243119 392494 601355 781767 771519 593503 474658 537237 625910 544100 325106
44799 325106 138005 36253 -45723 -120272 -134401 -99779 -86226 -82723 10281 223292 444041
44788 444041 538245 491840 405221 368198 355341 259559 52159 -127949 -126297 12007 111145
44777 111145 148154 279025 517679 609922 388558 62843 -74536 -81848 -226906 -502143
44767 -502143 -617336 -484817 -370689 -454787 -547345 -435231 -263874 -315775 -560579 -706061
44757 -706061 -640162 -556141 -613515 -703315 -642614 -434333 -200440 40804 368874 745367
44747 745367 950946 811873 417374 21240 -240747 -427246 -583658 -607896 -425888 -191913
$$ packed form
44819A401387n8115k50626l77814l95772l21603j89760k1337J28593J80151J48015
44809B43119J49375K08861J80412j0248j78016j18845O2579Q8673q1810k18994
44799C25106j87101j01752q1976p4549j4129L4622J3553L503R3004K13011K20749
44788D44041R4204m6405q6619l7023j2857r5782k07400j80108J652J38304R9138
44777A11145L7009J30871K38654R2243k21364l25715j37379p312j45058k75237
44767e02143j15193J32519J14128q4098r2558J12114J71357n1901k44804j45482
44757g06061O5899Q4021n7374q9800O0701K08281K33893K41244L28070L76493
44747G45367K05579j39073l94499l96134k61987j86499j56412k4238J82008K33975
$$ plain form
44737 -191913 -145094 -295039 -418336 -382389 -301730 -313274 -364780 -342769 -275995 -258388 -259124
44726 -259124 -180797 -63468 -56053 -181133 -286759 -266423 -185858 -136191 -94980 -25882 -10567
44715 -10567 -152226 -391118 -537171 -492985 -360179 -299311 -336167 -338657 -175905 103441 259688
44704 259688 76457 -380303 -765320 -779500 -467290 -126956 40392 89578 143534 182643
44694 182643 103970 -86237 -243325 -237821 -78059 113333 203794 145158 3752 -106974
44684 -106974 -137338 -122561 -97591 -62600 -57693 -166870 -359882 -417927 -155455 310343 633690
44673 633690 577833 185202 -344195 -797693 -994495 -876200 -613023 -479788 -566219 -725875
44663 -725875 -829576 -890451 -885797 -686870 -316757 -74310 -177760 -423416 -448879 -246028
$$ packed form
44737a91913M6819j49945j23297L5947Q0659j1544n1506K2011O6774J7607p36
44726b59124P8327J17329P415j25080j05626K0336Q0565M9667M1211O9098J5315
44715a0567j41659k38892j46053M4186J32806O0868l6856k490J62752K79346J56247
44704B59688j83231m56760l85017j4180L12210L40334J67348M9186N3956L9109
44694A82643p8673j90207j57088N504J59762J91392R0461n8636j41406j10726
44684a06974l0364J4777K4970L4991M907j09177j93012n8045K62472M65798L23347
44673F33690n5857l92631n29397m53498j96802J18295K63177J33235q6431j59656
44663g25875j03701o0875M654J98927L70113K42447j03450k45656k5463K02851
$$ plain form
44653 -246028 -131803 -232114 -299099 -129831 87698 22885 -346004 -712635 -829465 -764252
44643 -764252 -740115 -805405 -751882 -396614 109509 377133 220033 -122607 -295053 -232206
44633 -232206 -119860 -69075 -39933 -27124 -84860 -166063 -153541 -71086 -51517 -69883 54529
44622 54529 330539 517501 478006 365360 319780 221545 -52578 -337049 -392305 -267083
44612 -267083 -192690 -222268 -237916 -248742 -401232 -688701 -899478 -908177 -826340 -804261 -840431
44601 -840431 -845767 -766242 -589976 -345548 -139928 -100043 -230529 -397605 -473330 -437718 -351044
44590 -351044 -296203 -321898 -369319 -311954 -164582 -160782 -457275 -832590 -899520 -600518 -259190
44579 -259190 -116562 -63914 85207 299090 443469 498665 503174 440700 348160 388432 619071
$$ packed form
44653b46028J14225j00311o6985J69268K17529o4813l68889l66631j16830O5213
44643g64252K4137o5290N3523L55268N06123K67624j57100l42640j72446O2847
44633b32206J12346N0785K9142J2809n7736q1203J2522Q2455J9569j8366J24412
44622E4529K76010J86962l9495j12646m5580r8235k74123k84471n5256J25222
44612b67083P4393k9578j5648j0826j52490k87469k10777q699Q1837K2079l6170
44601h40431n336P9525J76266K44428K05620L9885j30486j67076p5725L5612Q6674
44590c51044N4841k5695m7421N7365J47372L800k96493l75315o6930K99002L41328
44579b59190J42628N2648J49121K13883J44379N5196M509o2474r2540M0272K30639
$$ plain form
44568 619071 796884 628198 162679 -258049 -419094 -410713 -387415 -345855 -218813 -55457
44558 -55457 4373 -100898 -274616 -353917 -274041 -136321 -85610 -126643 -132011 -42051 58670
44547 58670 120009 240982 480354 671367 604176 323840 56707 -114042 -283889 -451199
44537 -451199 -456245 -261273 -64473 -19391 -30989 35537 121473 116400 75845 98836 120389
44526 120389 61001 80850 392864 842920 987736 673156 269255 194802 432416 686033
44516 686033 816160 880592 873905 702332 396054 122246 -28716 -93459 -74499 74278
44506 74278 273195 328805 192717 38504 3421 20825 -2207 -21998 -308 -31554 -154410
44495 -154410 -190284 13809 293679 362242 229729 176002 329512 541349 699304 883632
$$ packed form
44568F19071J77813j68686m65519m20728j61045Q381K3298M1560J27042J63356
44558e5457N9830j05271j73718p9301P9876J37720N0711m1033n368Q9960J00721
44547E8670O1339J20973K39372J91013o7191k80336k67133j70749j69847j67310
44537d51199n046J94972J96800M5082j1598O6526Q5936n073m0555K2991K1553
44526A20389n9388J9849L12014M50056J44816l14580m03901p4453K37614K53617
44516F86033J30127O4432o687j71573l06278k73808j50962o4743J8960J48777
44506G4278J98917N5610j36088j54213l5083J7404k3032j9791K1690l1246j22856
44495a54410l5874K04093K79870O8563j32513n3727J53510K11837J57955J84328
$$ plain form
44485 883632 1111132 1180788 947637 575778 339713 289254 267455 167227 23800 -75840
44475 -75840 -51933 126838 356434 451636 406642 476941 832084 1241960 1332409 1083330 818585
44464 818585 720147 635066 426908 240637 254999 372081 362286 212156 131365 253677 491174
44453 491174 676992 721479 615446 388769 106436 -153337 -345607 -459011 -480786 -403651
44443 -403651 -261345 -117185 -15804 35760 59594 98175 171530 207925 75936 -241385
44433 -241385 -547391 -606541 -410556 -174106 -61035 -28328 18656 42682 -39124 -154868
44423 -154868 -112875 143746 426125 498007 323192 67071 -91073 -79656 88336 356610
44413 356610 620177 753899 705578 541316 369360 244178 173200 174766 256871 340098 280914
$$ packed form
44485H83632K27500O9656k33151l71859k36065n0459k1799j00228j43427r9640
44475g5840K3907J78771K29596R5202m4994P0299L55143M09876R0449k49079k64745
44464H18585r8438q5081k08158j86271J4362J17082r795j50130q0791J22312K37497
44453D91174J85818M4487j06033k26677k82333k59773j92270j13404k1775P7135
44443d03651J42306J44160J01381N1564K3834L8581P3355L6395j31989l17321
44433b41385l06006n9150J95985K36450J13071L2707M6984K4026q1806j15744
44423a54868M1993K56621K82379P1882j74815k56121j58144J1417J67992K68274
44413C56610K63567J33722m8321j64262j71956j25182p0978J566Q2105Q3227n9184
$$ plain form
44402 280914 24745 -296637 -478352 -456594 -368769 -382735 -500017 -568880 -482375 -307743
44392 -307743 -187584 -153624 -104790 30637 183225 231969 153566 20957 -119524 -295285
44382 -295285 -525544 -755587 -900682 -915450 -796825 -560582 -254433 28859 192876 195344
44372 195344 59578 -143588 -303274 -295419 -64594 304787 627460 750450 658219 464842
44362 464842 310605 241136 172309 8455 -182037 -174267 147135 568222 718139 484026
44352 484026 135372 -19406 23275 61890 13286 -37179 -50541 -88519 -131453 -46318 176272
44341 176272 329738 269607 140438 157311 276218 294447 210156 220719 341589 295991 -83822
44330 -83822 -553783 -756194 -694662 -676402 -815534 -844756 -517312 -15513 230826 86837
$$ packed form
44402B80914k56169l21382j81715K1758Q7825j3966j17282o8863Q6505J74632
44392c07743J20159L3960M8834J35427J52588M8744p8403j32609j40481j75761
44382b95285k30259k30043j45095j4768J18625K36243L06149K83292J64017K468
44372A95344j35766k03166j59686P855K30825L69381L22673J22990r2231j93377
44362D64842j54237o9469o8827j63854j90492P770L21402M21087J49917k34113
44352D84026l48654j54778M2681L8615m8604n0465j3362l7978m2934Q5135K22590
44341A76272J53466o0131j29169J6873J18907J8229q4291J0563J20870m5598l79813
44330h3822m69961k02411O1532J8260j39132k9222L27444N01799K46339j43989
$$ plain form
44320 86837 -117746 -30084 261269 371585 178052 5612 167856 523631 696362 619821
44310 619821 594109 800160 1032972 1019560 780380 522885 349319 252085 270922 447463
44300 447463 682556 815129 809105 724018 565110 330828 154142 192372 375618 448584
44290 448584 288893 31693 -133272 -128635 51906 355735 589261 514780 133285 -264618
44280 -264618 -420383 -364280 -284233 -275192 -307526 -318001 -232806 -6209 281199 473778 551342
44269 551342 633662 697925 509110 4643 -454347 -479811 -185103 -35607 -236181 -561416
44259 -561416 -777862 -906060 -982886 -879818 -553042 -254101 -249215 -440960 -495722 -304827
44249 -304827 -112884 -163943 -384188 -497738 -373724 -170910 -145891 -363877 -626514 -689011
$$ packed form
44320H6837k04583Q7662K91353J10316j93533j72440J62244L55775J72731p6541
44310F19821k5712K06051K32812j3412k39180k57495j73566r7234J8837J76541
44300D47463K35093J32573o024q5087j58908k34282j76686L8230J83246P2966
44290D48584j59691k57200j64965M637J80541L03829K33526p4481l81495l97903
44280b64618j55765N6103Q0047R041l2334j0475Q5195K26597K87408J92579P7564
44269E51342Q2320O4263j88815n04467m58990k5464K94708J49496k00574l25235
44259e61416k16446j28198p6826J03068L26776K98941M886j91745n4762J90895
44249c04827J91943n1059k20245j13550J24014K02814K5019k17986k62637o2497
$$ plain form
44239 -689011 -517866 -288755 -144269 -36109 158745 444730 707717 862583 907892 847253
44229 847253 663421 414056 272483 383031 686659 959939 1043501 979898 900743 836814
44219 836814 705937 461476 171217 -60453 -178878 -171249 -54479 81470 93338 -70163
44209 -70163 -278178 -346138 -232818 -47774 106319 217891 307134 369634 395240 385159 342002
44198 342002 284694 252148 230252 111672 -163820 -436955 -434109 -99294 286306 393844
44188 393844 179169 -146021 -390411 -517522 -552626 -498967 -383858 -298445 -325304 -449535
44178 -449535 -575622 -620342 -569811 -461719 -346755 -277615 -301952 -418202 -537563 -547677
44168 -547677 -450992 -394261 -503338 -717407 -848112 -776682 -524513 -170123 186052 383487
$$ packed form
44239f89011J71145K29111J44486J08160J94854K85985K62987J54866M5309o0639
44229H47253j83832k49365j41573J10548L03628K73280Q3562o3603p9155o3929
44219H36814j30877k44461k90259k31670j18425P629J16770J35949J1868j63501
44209g0163k08015o7960J13320J85044J54093J11572Q9243O2500K5606j0081m3157
44198C42002n7308l2546k1896j18580k75492k73135K846L34815L85600J07538
44188C93844k14675l25190k44390j27111l5104N3659J15109Q5413k6859j24231
44178d49535j26087m4720N0531J08092J14964O9140k4337j16250j19361j0114
44168e47677R6685N6731j09077k14069j30705P1430K52169L54390L56175J97435
$$ plain form
44158 383487 284655 -31413 -273131 -233772 -14181 141583 164693 198606 344351 484600
44148 484600 394831 -10060 -540728 -838481 -686404 -271449 -52817 -265271 -623332 -665585
44138 -665585 -352583 -130979 -370998 -929306 -1368279 -1444844 -1225631 -844448 -381521 22918
44128 22918 163564 -8417 -280197 -404423 -353086 -244259 -107074 109211 316118 286835
44118 286835 -31580 -364999 -422149 -259154 -157228 -196490 -179665 -6614 117406 -13092
44108 -13092 -265660 -329501 -114141 208352 495925 742593 890097 780714 410810 58954
44098 58954 9054 238096 506504 678134 801549 913514 926316 749292 419459 63099
44088 63099 -212349 -358309 -372818 -286771 -136800 60926 284845 470154 558602 590053
$$ packed form
44158C83487r8832l16068k41718L9359K19591J55764K3110L3913J45745J40249
44148D84600q9769m04891n30668k97753J52077M14955K18632k12454l58061m2253
44138f65585L13002K21604k40019n58308m38973p6565K19213L81183M62927M04439
44128B2918J40646j71981k71780j24226N1337J08827J37185K16285K06907k9283
44118B86835l18415l33419n7150J62995J01926l9262J6825J73051J24020j30498
44108a3092k52568o3841K15360L22493K87573K46668J47504j09383l69904l51856
44098E8954m9900K29042K68408J71630J23415J11965J2802j77024l29833l56360
44088F3099k75448j45960j4509Q6047J49971J97726K23919J85309Q8448L1451
$$ plain form
44078 590053 662189 758819 701627 364551 -104703 -392178 -365077 -214997 -201815 -337514
44068 -337514 -422157 -349855 -240626 -230067 -249457 -126489 147701 381199 423254 334638 265409
44057 265409 248266 199770 87845 5247 62924 261505 483049 582775 493645 277833 79316
44046 79316 -3842 -2882 -13360 -62094 -82606 -22794 72109 105854 32550 -104134 -212464 -224608
44034 -224608 -148585 -59312 -28876 -67412 -131502 -156343 -67629 164752 420414 458194 188440
44023 188440 -122220 -96944 270854 560195 422925 -24769 -417043 -565548 -503269 -271525
44013 -271525 74389 327540 285875 56244 -52125 28694 49876 -115688 -248507 -159994
44003 -159994 -39109 -173643 -495384 -678302 -597593 -421097 -286310 -163894 -69032 -144322
$$ packed form
44078E90053P2136R6630n7192l37076m69254k87475K7101J50080J3182j35699
44068c37514q4643P2302J09229J0559j9390J22968K74190K33498M2055q8616o9229
44057B65409j7143m8496j11925q2598N7677J98581K21544R9726q9130k15812j98517
44046G9316q3158R60j0478m8734k0512N9812R4903L3745p3304j36684j08330j2144
44034b24608P6023Q9273L0436l8536o4090k4841Q8714K32381K55662L7780k69754
44023A88440l10660K5276L67798K89341j37270m47694l92274j48505O2279K31744
44013b71525L45914K53151m1665k29631j08369Q0819K1182j65564j32819Q8513
44003a59994J20885j34534l21741j82918Q0709J76496J34787J22416R4862p5290
$$ plain form
43993 -144322 -420139 -681160 -713799 -577389 -504545 -596991 -728359 -722157 -542718 -302308
43983 -302308 -122868 -19761 65090 139086 143546 84629 68115 114282 52517 -236205 -546495
43972 -546495 -533470 -165020 229983 405444 460958 562385 629657 499513 249743 123594
43962 123594 178201 220264 113086 -19948 29867 274828 505645 524384 352525 186327
43952 186327 152251 155056 24618 -221333 -367319 -268047 -24287 142626 96451 -158603
43942 -158603 -495759 -676951 -491005 263 454167 600302 512700 425939 404379 357985
43932 357985 287023 294555 376757 396794 291074 147826 55537 11502 11013 98611 282854
43921 282854 489317 622456 603557 376096 -4677 -306488 -304961 -64465 109365 39667
$$ packed form
43993a44322k75817k61021l2639J36410P2844r2446j31368O202J79439K40410
43983c02308J79440J03107Q4851P3996M460n8917j6514M6167o1765k88722l10290
43972e46495J3025L68450L95003J75461N5514J01427O7272j30144k49770j26149
43962A23594N4607M2063j07178j33034M9815K44961K30817J8739j71859j66198
43952A86327l4076K805j30438k45951j45986R9272K43760J66913m6175k55054
43942a58603l37156j81192J85946M91268M53904J46135q7602q6761k1560m6394
43932C57985p0962P532Q2202K0037j05720j43248r2289m4035m89Q7598J84243
43921B82854K06463J33139j8899k27461l80773l01811J527K40496J73830o9698
$$ plain form
43911 39667 -141305 -238795 -272160 -397133 -653938 -910457 -1009542 -893274 -620067 -321531
43901 -321531 -117758 -40409 -53941 -127677 -219686 -229757 -102153 28273 -41380 -270747 -365595
43890 -365595 -174379 71444 59626 -190036 -390038 -375829 -242821 -132485 -73188 -53015
43880 -53015 -91156 -176754 -238089 -227779 -178615 -148696 -163034 -213057 -249421 -173647 83751
43869 83751 452609 752973 857942 771093 531962 135733 -384411 -851971 -1032283 -855862
43859 -855862 -506270 -239000 -128590 -42791 131730 311022 324269 163192 23009 72343
43849 72343 255658 367263 275253 35573 -177994 -228005 -137125 -83003 -225811 -519887
43839 -519887 -750977 -780400 -678123 -582277 -527444 -486847 -486354 -551317 -596590 -514069 -361526
$$ packed form
43911C9667j80972r7490l3365j24973k56805k56519r9085J16268K73207K98536
43901c21531K03773P7349j3532p3736r2009j0071J27604J30426o9653k29367r4848
43890c65595J91216K45823j1818k49662k00002J4209J33008J10336N9297K0173
43880e3015l8141q5598o1335J0310M9164K9919j4338n0023l6364P5774K57398
43869H3751L68858L00364J04969q6849k39131l96229n20144m67560j80312J76421
43859h55862L49592K67270J10410Q5799J74521J79292J3247j61077j40183M9334
43849G2343J83315J11605r2010k39680k13567n0011R0880N4122j42808k94076
43839e19887k31090k9423J02277R5846N4833M0597M93o4963m5273Q2521J52543
$$ plain form
43828 -361526 -325030 -458426 -575013 -464200 -141991 182232 341406 346536 312072 314350 336578
43817 336578 312428 198231 18311 -140732 -196318 -164938 -181098 -355218 -585387 -594948 -250231
43806 -250231 209746 389055 178331 -144524 -274734 -195266 -72036 7909 60430 70314
43796 70314 -2435 -108720 -129093 -9154 197135 394697 494875 450437 326597 277342
43786 277342 352225 392112 240422 -4829 -106667 -17886 87206 109018 156110 326812
43776 326812 527077 601240 524917 377771 219933 80089 -10707 -47868 -54860 -13084 122111
43765 122111 287381 304931 93386 -211946 -443371 -611110 -816007 -1038212 -1156587 -1127868
43755 -1127868 -998869 -769882 -406811 2300 262585 299810 251617 270998 344654 372618
$$ packed form
43828c61526L6496j33396j16587J10813L22209L24223J59174N130l4464K278K2228
43817C36578k4150j14197j79920j59043n5586L1380j6160j74120k30169r561L44717
43806b50231M59977J79309k10724l22855j30210P9468J23230P9945N2521R884
43796G0314p2749j06285k0373J19939K06289J97562J00178m4438j23840m9255
43786B77342P4883L9887j51690k45251j01838Q8781J05092K1812M7092J70702
43776C26812K00265P4163p6323j47146j57838j39844r0796l7161o992M1776J35195
43765A22111J65270J7550k11545l05332k31425j67739k04897k22205j18375K8719
43755a127868J28999K28987L63071M09111K60285L7225m8193J9381P3656K7964
$$ plain form
43745 372618 321357 207753 30616 -157669 -188593 47021 377006 471802 234105 -79165
43735 -79165 -198024 -171997 -244546 -487712 -709663 -698585 -437857 -90927 121520 46106
43725 46106 -277027 -599343 -682792 -549661 -419793 -409276 -422172 -341094 -158345 114955
43715 114955 476647 785812 785573 423245 -7859 -212844 -243734 -320851 -449202 -466827 -395328
43704 -395328 -449839 -677540 -837646 -722670 -417109 -155796 -68574 -136069 -273648 -384863
43694 -384863 -416051 -401389 -395251 -382436 -348885 -377561 -509237 -562266 -324560 73165 241348
43683 241348 56786 -164062 -150367 -83048 -304602 -804430 -1235822 -1349977 -1197014 -946263
43673 -946263 -695301 -444520 -126691 316438 785893 1014555 831540 389726 2368 -202320
$$ packed form
43745C72618n1261j13604j77137j88285l0924K35614L29985R4796k37697l13270
43735g9165j18859K6027p2549k43166k21951J1078K60728L46930K12447p5414
43725D6106l23133l22316q3449J33131J29868J0517j2896Q1078J82749K73300
43715A14955L61692L09165k39l62328m31104k04985l0890p7117j28351j7625P1499
43704c95328n4511k27701j60106J14976L05561K61313Q7222o7495j37579j11215
43694c84863l1188J4662O138J2815L3551k8676j31676n3029K37706L97725J68183
43683B41348j84562k20848J3695O7319k21554m99828m31392j14155J52963K50751
43673i46263K50962K50781L17829M43129M69455K28662j83015m41814l87358k04688
$$ plain form
43663 -202320 -325961 -436297 -434421 -239131 6972 11468 -378124 -975382 -1384459 -1382426 -1149566
43652 -1149566 -1035101 -1127142 -1202950 -1098179 -910735 -767479 -615884 -394513 -211850 -164500
43642 -164500 -143623 -37505 19559 -149869 -423220 -504421 -325407 -57836 217322 552802
43632 552802 858813 907329 689801 494469 510892 585239 493920 258395 47873 -58210
43622 -58210 -61426 53432 240435 319920 154252 -143655 -305953 -207840 702 53063 -165934
43611 -165934 -476647 -539746 -209404 263618 489356 385680 224734 234681 350682 420968
43601 420968 447741 479345 427348 185326 -147979 -337185 -278909 -84833 75101 114711
43591 114711 51200 -22048 -4581 96141 149807 65025 -81815 -150048 -116753 -74486 -90864
$$ packed form
43663b02320j23641j10336J876J95290K46103M496l89592n97258m09077K033K32860
43652a149566J14465r2041p5808J04771J87444J43256J51595K21371J82663M7350
43642a64500K0877J06118N7064j69428k73351q1201J79014K67571K75158L35480
43632E52802L06011M8516k17528j95332J6423P4347r1319k35525k10522j06083
43622e8210l216J14858J87003P9485j65668k97907j62298R8113K08542N2361k18997
43611a65934l10713o3099L30342M73022K25738j03676j60946R947J16001P0286
43601D20968K6773L1604n1997k42022l33305j89206N8276J94076J59934L9610
43591A14711o3511p3248J7467J00722N3666q4782j46840o8233L3295M2267j6378
$$ plain form
43580 -90864 -160102 -268170 -414139 -559645 -618618 -522078 -291958 -66085 -25541 -219644
43570 -219644 -456622 -467332 -214609 57213 123668 14303 -122504 -252839 -423816 -593480
43560 -593480 -658491 -620831 -588325 -614574 -652391 -666871 -688379 -732515 -748472 -678288 -528129
43549 -528129 -375207 -327259 -447442 -678414 -866680 -900662 -800440 -654136 -521880 -428900
43539 -428900 -377146 -319730 -205120 -94049 -130109 -326081 -496345 -501159 -444075 -506412 -701484
43528 -701484 -936420 -1191010 -1440793 -1513251 -1271369 -887218 -670439 -641515 -552385 -339978
43518 -339978 -230910 -299482 -264399 57910 379660 325308 8450 -115502 98877 318333
43508 318333 241137 -18877 -165007 -111774 -2045 22956 -72489 -252614 -423680 -474110
$$ packed form
43580i0864o9238j08068j45969j45506n8973R6540K30120K25873M0544j94103
43570b19644k36978j0710K52723K71822O6455j09365j36807j30335j70977j69664
43560e93480o5011L7660L2506k6249l7817j4480k1508m4136j5957P0184J50159
43549e28129J52922M7948j20183k30972j88266l3982J00222J46304J32256R2980
43539d28900N1754N7416J14610J11071l6060j95972j70264m814N7084o2337j95072
43528g01484k34936k54590k49783p2458K41882L84151K16779K8924Q9130K12407
43518c39978J09068o8572L5083L22309L21750n4352l16858j23952K14379K19456
43508C18333p7196k60014j46130N3233J09729K5001r5445j80125j71066n0430
$$ plain form
43498 -474110 -400688 -337780 -370489 -391565 -269748 -106071 -151852 -451531 -722945 -673298 -332988
43487 -332988 10583 133038 30944 -176001 -370536 -464923 -408877 -217330 42544 294378
43477 294378 457714 456895 304409 147092 126228 195566 188085 68958 -16135 8994 -153
43466 -153 -205272 -540263 -796333 -874809 -824217 -693387 -511978 -390596 -455575 -642730 -712744
43455 -712744 -551461 -328628 -251541 -263902 -142404 148485 373987 347289 183061 117067
43445 117067 167714 148661 3022 -71678 85769 354073 525336 613258 747711 841014
43435 841014 647770 191119 -161063 -181077 -94772 -209725 -438934 -473686 -306534 -254246
43425 -254246 -457455 -651914 -534960 -150089 210030 329018 176985 -174232 -588731 -868831
$$ packed form
43498d74110P3422O2908l2709k1076J21817J63677m5781k99679k71414M9647L40310
43487c32988L43571J22455j02094k06945j94535r4387N6046J91547K59874K51834
43477B94378J63336q19j52486j57317k0864O9338p481j19127q5093K5129r147
43466a53k05119l34991k56070p8476N0592J30830J81409J21382o4979j87155p0014
43455g12744J61283K22833P7087j2361J21498K90889K25502k6698j64228o5994
43445A17067N0647j9053j45639p4700J57447K68304J71263Q7922J34453R3303
43435H41014j93244m56651l52182k0014Q6305j14953k29209l4752J67152N2288
43425b54246k03209j94459J16954L84871L60119J18988j52033l51217m14499k80100
$$ plain form
43415 -868831 -865911 -631154 -401628 -389611 -572551 -707855 -595487 -325212 -189973 -324597
43405 -324597 -532447 -551864 -391737 -267943 -282902 -346308 -394536 -501627 -719525 -936610
43395 -936610 -963808 -708732 -265264 108835 154461 -131536 -433192 -430502 -139714 183414
43385 183414 394297 515046 512562 304522 7025 -104159 39187 213611 267612 305811
43375 305811 398085 390942 190683 -24945 -100501 -172212 -383760 -547953 -408928 -85580
43365 -85580 91771 91098 166118 371614 463421 330739 186010 205854 270015 216407 122793
43354 122793 143019 226432 199602 38005 -117940 -184462 -238748 -391507 -623086 -764587
43344 -764587 -645858 -292673 41797 108827 -77841 -283894 -337776 -283545 -260965 -334236
$$ packed form
43415h68831K920K34757K29526J2017j82940j35304J12368K70275J35239j34624
43405c24597k07850j9417J60127J23794j4959o3406m8228j07091k17898k17085
43395i36610k7198K55076M43468L74099M5626k85997l01656K690K90788L23128
43385A83414K10883J20749k484k08040k97497j11184J43346J74424N4001L8199
43375C05811R2274p143k00259k15628p5556p1711k11548j64193J39025L23348
43365h5580J77351o73P5020K05496R1807j32682j44729J9844O4161n3608r3614
43354A22793K0226Q3413k6830j61597j55945o6522n4286j52759k31579j41501
43344g64587J18729L53185L34470O7030j86668k06053n3882N4231K2580p3271
$$ plain form
43334 -334236 -447836 -472511 -313982 -67232 -10016 -293011 -670261 -730413 -404886 -39702
43324 -39702 79252 45575 82892 202397 273799 265319 226211 156795 78927 123691 346923
43313 346923 541828 457378 167357 7303 144760 412940 590201 636892 590878 429030
43303 429030 165903 -44754 -61617 54630 130669 119440 124094 190672 205227 52701 -204974
43292 -204974 -397195 -464792 -520816 -668296 -838513 -881881 -769537 -603475 -442046 -239167
43282 -239167 12282 202830 247774 199127 121399 -33143 -283001 -447085 -323078 -13721
43272 -13721 144907 24976 -131414 -86000 61331 78199 -17541 -14748 115490 151648 -30950
43261 -30950 -246085 -227420 61831 450069 773866 947820 903146 625036 253316 11450
$$ packed form
43334c34236j13600k4675J58529K46750N7216k82995l77250o0152L25527L65184
43324c9702J18954l3677L7317J19505P1402q480l9108o9416p7868M4764K23232
43313C46923J94905q4450k90021j60054J37457K68180J77261M6691m6014j61848
43303D29030k63127k10657j6863J16247P6039j1229M654O6578J4555j52526k57675
43292b04974j92221o7597n6024j47480j70217m3368J12344J66062J61429K02879
43282b39167K51449J90548M4944m8647p7728j54542k49858j64084J24007L09357
43272a3721J58628j19931j56390M5414J47331J6868r5740K793J30238L6158j82598
43261c0950k15135J8665K89251L88238L23797J73954m4674k78110l71720k41866
$$ plain form
43251 11450 -9923 82674 160641 212642 256893 222901 42685 -182937 -241703 -52052 251825
43240 251825 506674 690805 845609 918310 796934 474325 75523 -280460 -562111 -762402
43230 -762402 -849059 -820125 -738948 -660957 -574507 -461470 -367146 -350137 -396984 -445919 -469290
43219 -469290 -475477 -456909 -404543 -357533 -366850 -414530 -436286 -418703 -401395 -389085 -352137 -322186
43207 -322186 -379628 -507039 -561133 -460846 -316252 -283884 -360582 -413456 -362851 -240667 -108590
43196 -108590 -16660 -9661 -70258 -76781 77157 331822 528532 607960 629087 617130 547591
43185 547591 487648 568090 746048 770153 503529 144246 -22745 12308 36116 -47952 -121650
43174 -121650 -71229 79807 276370 495260 647606 585453 317125 91737 124013 304875
$$ packed form
43251A1450k1373R2597P7967N2001M4251l3992j80216k25622n8766J89651L03877
43240B51825K54849J84131J54804P2701j21376l22609l98802l55983k81651k00291
43230g62402q6657K8934Q1177P7991Q6450J13037R4324J7009m6847m8935k3371
43219d69290o187J8568N2366M7010r317m7680k1756J7583J7308J2310L6948K9951
43207c22186n7442j27411n4094J00287J44594L2368p6698n2874N0605J22184J32077
43196a08590R1930O999o0597o523J53938K54665J96710P9428K1127j1957o9539
43185E47591n9943Q0442J77958K4105k66624l59283j66991L5053K3808q4068p3698
43174a21650N0421J51036J96563K18890J52346o2153k68328k25388L2276J80862
$$ plain form
43164 304875 339715 144555 -70582 -148092 -228298 -505127 -846895 -876060 -450060 117641
43154 117641 413523 372668 241585 190980 152853 29116 -128937 -223603 -264972 -322186 -386043
43143 -386043 -362660 -177522 151145 504103 706819 644365 364061 19916 -287898 -549758
43133 -549758 -735676 -768581 -640765 -445539 -256271 -88804 -6755 -97544 -277188 -303821
43123 -303821 -101854 104442 126931 100184 236756 467108 577477 578579 643685 751250
43113 751250 698450 456475 215919 65758 -74847 -171959 -53294 231510 348851 144881
43103 144881 -112937 -161778 -152152 -372744 -770196 -1040897 -1080569 -1052559 -1067811 -1065160 -1000613
43092 -1000613 -924760 -851512 -735598 -599491 -520739 -479725 -371979 -184322 -14926 86599
$$ packed form
43164C04875L4840j95160k15137p7510q0206k76829l41768k9165M26000N67701
43154A17641K95882m0855j31083n0605l8127j23737j58053r4666m1369n7214o3857
43143c86043K3383J85138L28667L52958K02716o2454k80304l44145l07814k61860
43133e49758j85918l2905J27816J95226J89268J67467Q2049r0789j79644k6633
43123c03821K01967K06296K2489k6747J36572K30352J10369J102O5106J07565
43113G51250n2800k41975k40556j50161j40605r7112J18665K84804J17341k03970
43103A44881k57818m8841R626k20592l97452k70701l9672K8010j5252K651O4547
43092a000613P5853P3248J15914J36107P8752M1014J07746J87657J69396J01525
$$ plain form
43082 86599 148362 145008 17185 -146603 -142421 54243 210685 179807 150816 364893 693476
43071 693476 749344 411568 -2491 -170732 -156950 -201204 -287690 -193882 67171 157617 -120448
43060 -120448 -511191 -646337 -525185 -416705 -406605 -337844 -169214 -81658 -165032 -272211
43050 -272211 -292912 -326169 -435655 -455789 -226377 151489 471452 673634 765676 672610
43040 672610 389355 125634 46610 9700 -156597 -251065 49147 589184 809694 494430
43030 494430 58833 -64613 21096 -21631 -207211 -304214 -298415 -404171 -626002 -632449 -185297
43019 -185297 497492 953187 968922 753183 638710 710168 770186 634851 378853 237075
43009 237075 307360 440146 438484 299743 215860 354723 658958 860656 724328 301465
$$ packed form
43082H6599O1763l354j27823j63788M182J96664J56442l0878k8991K14077L28583
43071F93476N5868l37776m14059j68241J3782m4254q6486R3808K61053R0446k78065
43060a20448l90743j35146J21152J08480J0100O8761J68630Q7556q3374j07179
43050b72211k0701l3257j09486k0134K29412L77866L19963K02182R2042r3066
43040F72610k83255k63721p9024l6910j66297r4468L00212N40037K20510l15264
43030D94430m35597j23446Q5709m2727j85580r7003N799j05756k21831o447M47152
43019a85297O82789M55695J5735k15739j14473P1458O0018j35335k55998j41778
43009B37075P0285J32786j662j38741q3883J38863L04235K01698j36328m22863
$$ plain form
42999 301465 -97804 -225967 -132737 -26784 -3577 -31456 -114445 -271774 -381984 -265230
42989 -265230 39151 272157 296500 251238 281693 316342 253498 189863 266054 405583 422031
42978 422031 321145 285286 373917 432685 321500 70571 -223373 -503085 -695506 -690904
42968 -690904 -478135 -217835 -84215 -79441 -82246 -38610 -9441 -35526 -53084 9802 113322
42957 113322 152024 99971 39482 40857 85340 132392 185114 233573 207018 69185 -91175
42946 -91175 -160807 -147545 -118969 -51688 103397 235137 151727 -117881 -301623 -249856 -137609
42935 -137609 -173292 -275334 -219176 17142 261712 429964 579553 707046 709308 587708
42925 587708 502240 538710 565888 429216 183883 15781 -12083 -6483 -36071 6348 251397
$$ packed form
42999C01465l99269j28163R3230J05953K3207k7879q2989j57329j10210J16754
42989b65230L04381K33006K4343m5262L0455L4649o2844o3635P6191J39529J6448
42978D22031j00886l5859Q8631N8768j11185k50929k93944k79712j92421M602
42968f90904K12769K60300J33620M774k805M3636K9169k6085j7558O2886J03520
42957A13322L8702n2053o0489J375M4483M7052N2722M8459k6555j37833j60360
42946i1175o9632J3262K8576O7281J55085J31740q3410k69608j83742N1767J12247
42935a37609l5683j02042N6158K36318K44570J68252J49589J27493K262j21600
42925E87708q5468L6470K7178j36672k45333j68102k7864N600k9588M2419K45049
$$ plain form
42914 251397 602119 749287 507381 79925 -124905 44620 317851 347645 114141 -112643
42904 -112643 -130048 8695 126781 109721 -47254 -259235 -381750 -308114 -89654 82646
42894 82646 46492 -198700 -509990 -706229 -679659 -479267 -285529 -232498 -248033 -142084
42884 -142084 135021 404885 468154 328199 152002 58505 16754 -60540 -187270 -289258
42874 -289258 -290985 -196182 -90772 -77641 -196629 -380196 -482522 -393681 -164504 7855
42864 7855 -26192 -198613 -301881 -223527 -30712 166127 325755 427578 424983 313365 165406
42853 165406 45089 -33434 -27166 126463 346052 397418 181159 -90622 -160200 -55145
42843 -55145 34819 105937 305904 583470 658110 406127 41968 -184226 -265134 -294456 -245011
$$ packed form
42914B51397L50722J47168k41906m27456k04830J69525K73231K9794k33504k26784
42904a12643j7405J38743J18086j7060j56975k11981j22515P3636K18460J72300
42894H2646l6154k45192l11290j96239K6570K00392J93738N3031j5535J05949
42884a42084K77105K69864O3269j39955j76197r3497m1751p7294j26730j01988
42874b89258j727R4803J05410J3131j18988j83567j02326Q8841K29177J72359
42864G855l4047j72421j03268P8354J92815J96839J59628J01823k595j11618j47959
42853A65406j20317p8523O268J53629K19589N1366k16259k71781o9578J05055
42843e5145Q9964P1118J99967K77566P4640k51983l64159k26194q0908k9322M9445
$$ plain form
42832 -245011 -63692 151653 264209 306905 395384 476303 349948 -35084 -453250 -621730
42822 -621730 -468508 -154542 90830 117891 -83662 -387650 -597579 -573938 -344297 -81363
42812 -81363 69585 153571 346533 696928 990241 961457 613626 216901 -8694 -92713
42802 -92713 -173938 -291656 -389391 -422325 -365303 -189208 67452 255369 249605 104075 -19410
42791 -19410 -55732 -79825 -160575 -272295 -362198 -413116 -412020 -341177 -242642 -211840 -263603 -274006
42779 -274006 -146558 13931 21026 -104895 -124322 73082 254531 133582 -215963 -440378
42769 -440378 -379498 -229336 -181955 -153734 -23823 76764 -40664 -271167 -330762 -164060
42759 -164060 27891 143360 277690 432706 426158 208435 14770 35652 137448 93714
$$ packed form
42832b45011J81319K15345J12556M2696Q8479Q0919j26355l85032m18166j68480
42822f21730J53222L13966K45372K7061k01553l03988k09929K3641K29641K62934
42812h1363J50948Q3986J92962L50395K93313k8784l47831l96725k25595q4019
42802i2713q1225j17718r7735l2934N7022J76095K56660J87917n764j45530j23485
42791a9410l6322k4093q0750j11720q9903n0918J096P0843R8535L0802n1763j0403
42779b74006J27448J60489P095j25921j9427J97404J81449j20949l49545k24415
42769d40378O0880J50162M7381K8221J29911J00587j17428k30503n9595J66702
42759a64060J91951J15469J34330J55016o548k17723j93665K0882J01796m3734
$$ plain form
42749 93714 -71275 -168166 -144513 -98421 -78942 -65605 -83087 -152895 -176241 -38844 198237
42738 198237 369964 432282 451536 409670 222967 -33232 -120128 70540 363252 522283
42728 522283 524694 528648 633450 741657 649838 273126 -202118 -437362 -279069 67542
42718 67542 278087 260998 170341 151432 234152 416887 646308 729500 506117 151741 62722
42707 62722 331263 566729 405969 1278 -221415 -138651 9590 61272 127210 293883
42697 293883 394221 229222 -127976 -409344 -469893 -401129 -357163 -386425 -452386 -529542 -619739
42686 -619739 -704618 -736120 -689911 -614160 -608532 -739531 -961542 -1121944 -1073789 -821966 -560966
42675 -560966 -526080 -768693 -1085663 -1199223 -1013040 -683767 -451430 -417273 -482991 -488166
$$ packed form
42749I3714j64989r6891K3653M6092J9479J3337j7482o9808k3346J37397K37081
42738A98237J71727O2318J9254m1866j86703k56199q6896J90668K92712J59031
42728E22283K411L954J04802J08207r1819l76712m75244k35244J58293L46611
42718F7542K10545j7089r0657j8909Q2720J82735K29421Q3192k23383l54376q9019
42707F2722K68541K35466j60760m04691k22693Q2764J48241N1682O5938J66673
42697B93883J00338j64999l57198k81368o0549O8764M3966k9262o5961p7156r0197
42686f19739q4879l1502M6209P5751N628j30999k22011j60402M8155K51823K61000
42675e60966L4886k42613l16970j13560J86183L29273K32337L4157o5718n175
$$ plain form
42665 -488166 -392605 -307219 -338876 -447399 -514476 -522126 -553294 -607412 -567008 -432261 -434934
42654 -434934 -740200 -1122271 -1161814 -768261 -297612 -101441 -154984 -226656 -232006 -258800 -357322
42643 -357322 -479714 -575528 -606595 -508655 -274977 -50199 -1439 -101051 -171525 -157114 -209001
42632 -209001 -447724 -763208 -944332 -935262 -860935 -820467 -748962 -519282 -141744 186956
42622 186956 255827 49445 -242465 -424304 -459067 -420739 -355545 -260511 -156767 -92923 -82423
42611 -82423 -113814 -212110 -395032 -562466 -544980 -316871 -71006 -7701 -110220 -199407 -157551
42600 -157551 -26208 67387 2237 -264632 -614495 -792129 -640601 -307324 -91927 -80192
42590 -80192 -72793 84491 273013 315305 261424 273284 313891 188205 -100861 -269452 -125070
$$ packed form
42665d88166R5561Q5386l1657j08523o7077p650l1168n4118M0404J34747k673
42654d34934l05266l82071l9543L93553M70649J96171n3543p1672n350k6794r8522
42643c57322j22392r5814l1067R7940K33678K24778M8760r9612p0474J4411n1887
42632b09001k38723l15484j81124R070P4327M0468P1505K29680L77538L28700
42622A86956O8871k06382k91910j81839l4763L8328O5194R5034J03744O3844J0500
42611h2423l1391r8296j82922j67434J7486K28109K45865O3305j02519q9187M1856
42600a57551J31343R3595o5150k66869l49863j77634J51528L33277K15397J1735
42590h0192P399J57284J88522M2292n3881J1860M0607j25686k89066j68591J44382
$$ plain form
42579 -125070 148248 219219 20364 -215231 -266913 -128382 87156 305289 516495 726794
42569 726794 922382 1050157 1036282 863482 608282 351545 91062 -180645 -357254 -301470
42559 -301470 -44551 222921 381080 474057 536602 479069 244831 -36876 -185391 -179117
42549 -179117 -109238 -1031 164273 302888 292518 183480 153539 208184 128806 -167370
42539 -167370 -403523 -280647 69252 212090 -13433 -288578 -268174 -45459 4778 -256428
42529 -256428 -567993 -623510 -433041 -261173 -290907 -438908 -492041 -363874 -176052 -86192
42519 -86192 -78918 9424 257723 540658 699614 758935 878515 1139577 1486012 1841307
42509 1841307 2146427 2291588 2176345 1884466 1648597 1564002 1471152 1214323 881956 664516
$$ packed form
42579a25070K73318P0971j98855k35595n1682J38531K15538K18133K11206K10299
42569G26794J95588J27775j3875j72800k55200k56737k60483k71707j76609N5784
42559c01470K56919K67472J58159R2977O2545n7533k34238k81707j48515O274
42549a79117O9879J08207J65304J38615j0370j09038k9941N4645p9378k96176
42539a67370k36153J22876L49899J42838k25523k75145K0404K22715N0237k61206
42529b56428l11565n5517J90469J71868k9734j48001n3133J28167J87822Q9860
42519h6192P274Q8342K48299K82935J58956N9321J19580K61062L46435L55295
42509A841307L05120J45161j15243k91879k35869q4595r2850k56829l32367k17440
$$ plain form
42499 664516 590178 553502 515393 505196 487724 407480 330143 362465 450166 438763 334104
42488 334104 305031 392865 417778 257725 53983 28250 210905 445815 569470 507896
42478 507896 290220 43988 -97015 -128412 -139772 -136246 -33566 143955 240220 208794 184201
42467 184201 213740 137752 -99193 -235380 -36839 300630 379047 140522 -105964 -161122
42457 -161122 -145028 -208547 -310151 -359259 -358232 -305780 -141238 119585 342952 449568 490428
42446 490428 494279 399332 213407 87616 137036 313773 522690 714441 800295 664851
42436 664851 378774 218675 328078 519310 569821 547052 639155 816118 905690 894662
42426 894662 881381 801610 509290 120883 -46802 41685 26762 -322923 -728742 -762155
$$ packed form
42499F64516p4338l6676l8109j0197j7472q0244p7337L2322Q7701j1403j04659
42488C34104k9073Q7834K4913j60053k03742k5733J82655K34910J23655o1574
42478E07896k17676k46232j41003l1397j1360L526J02680J77521R6265l1426k4593
42467A84201K9539p5988k36945j36187J98541L37469P8417k38525k46486n5158
42457a61122J6094o3519j01604m9108J027N2452J64542K60823K23367J06616M0860
42446D90428L851r4947j85925j25791M9420J76737K08917J91751Q5854j35444
42436F64851k86077j60099J09403J91232N0511k2769R2103J76963Q9572j1028
42426H94662j3281p9771k92320l88407j67685Q8487j4923l49685m05819l3413
$$ plain form
42416 -762155 -408349 -24040 161813 239002 322031 322387 120482 -186860 -353436 -263940 -60389
42405 -60389 14737 -141682 -417677 -619746 -652824 -565330 -451272 -352985 -257962 -140139 20044
42394 20044 220074 409701 505905 463515 320956 165556 70086 55716 68355 -16654 -296701
42383 -296701 -702021 -1003783 -1019963 -784033 -468540 -197454 -10174 44117 -83323 -308912
42373 -308912 -416340 -276177 -8047 163653 188351 230966 426953 687865 810490 724274
42363 724274 547429 416200 356422 348289 413336 549830 647876 587658 407087 261517 216867
42352 216867 200236 166984 169154 202831 146152 -41429 -205109 -235128 -286676 -539132 -825782
42341 -825782 -794675 -455744 -270604 -566542 -1091969 -1338962 -1143278 -758772 -453215 -268424
$$ packed form
42416g62155L53806L84309J85853P7189Q3029L56k01905l07342j66576Q9496K03551
42405f0389P5126j56419k75995k02069l3078Q7494J14058R8287R5023J17823J60183
42394B0044K00030J89627R6204m2390j42559j55400r5470j4370J2639q5009k80047
42383b96701m05320l01762j6180K35930L15493K71086J87280N4291j27440k25589
42373c08912j07428J40163K68130J71700K4698M2615J95987K60912J22625q6216
42363G24274j76845j31229n9778q133O5047J36494R8046o0218j80571j45570m4650
42352B16867j6631l3252K170L3677n6679j87581j63680l0019n1548k52456k86650
42341h25782L1107L38931J85140k95938n25427k46993J95684L84506L05557J84791
$$ plain form
42331 -268424 -146429 -64214 6577 112516 218130 196946 -8480 -280834 -434700 -393148
42321 -393148 -230926 -74218 19180 91909 205911 341454 418735 421636 421068 437977 377082
42310 377082 176959 -53684 -151382 -87500 59494 247743 451981 557123 439303 147069
42300 147069 -139284 -324719 -445924 -525284 -536559 -507381 -489261 -429072 -250804 -60095
42290 -60095 -48379 -174249 -195853 -82402 -103378 -373942 -610480 -563448 -427640 -514155 -712886
42279 -712886 -653196 -301953 -9368 50292 109597 368805 641834 640012 404151 232362
42269 232362 273377 381994 361955 218735 134689 243363 466511 597167 540207 405364
42259 405364 325952 286371 233431 260879 503842 880971 1128337 1106764 914256 681491
$$ packed form
42331b68424J21995Q2215P0791J05939J05614k1184k05426k72354j53866M1552
42321c93148J62222J56708R3398P2729J14002J35543P7281K901n68J6909o0895
42310C77082k00123k30643r7698O3882J46994J88249K04238J05142j17820k92234
42300A47069k86353j85435j21205p9360j1275K9178J8120O0189J78268J90709
42290f0095J1716j25870k1604J13451k0976k70564k36538M7032J35808q6515j98731
42279g12886N9690L51243K92585N9660N9305K59208K73029j822k35861j71789
42269B32362M1015J08617k0039j43220q4046J08674K23148J30656n6960j34843
42259D05364p9412l9581n2940K7448K42963L77129K47366k1573j92508k32765
$$ plain form
42249 681491 442246 250351 221493 350150 447483 391420 312109 395944 613509 788895
42239 788895 858311 899946 942303 893054 673355 325257 -30875 -285459 -391250 -382446 -337889
42228 -337889 -286966 -173538 48322 317279 519469 625016 722727 916946 1202914 1430657
42218 1430657 1404144 1072555 630619 360989 355417 459988 510178 517400 573261 678477 762975
42207 762975 801793 806092 746612 590511 392259 258331 229466 262422 305734 326240 289738
42196 289738 200032 147145 231792 429063 593873 623527 566946 550228 628752 742030 807110
42185 807110 832958 912291 1080289 1212176 1121128 762685 293544 -70664 -199258 -66268
42175 -66268 264951 638529 874559 898872 763191 535878 261454 30322 -48861 3030
$$ packed form
42249F81491k39245j91895k8858J28657R7333n6063p9311Q3835K17565J75386
42239G88895O9416M1635M2357m9249k19699l48098l56132k54584j05791Q804M4557
42228c37889N0923J13428K21860K68957K02190J05547R7711J94219K85968K27743
42218A430657k6513l31589m41936k69630n572J04571N0190P222N5861J05216Q4498
42207G62975L8818M299n9480j56101j98252j33928k8865L2956M3312K0506l6502
42196B89738q9706n2887Q4647J97271J64810K9654n6581j6718P8524J13278O5080
42185H07110K5848P9333J67998J31887r1048l58443m69141l64208j28594J32990
42175f6268L31219L73578K36030K4313j35681k27313k74424k31132p9183N1891
$$ plain form
42165 3030 45315 34156 82257 221858 285869 170863 57396 168739 425598 561818 509045
42154 509045 439618 470797 554836 643292 729414 726523 543132 304988 257519 395537 444338
42143 444338 291759 163592 222846 268180 64112 -246872 -353072 -252935 -207923 -278013
42133 -278013 -232201 45075 355117 499749 553405 665061 770723 697914 456121 230869
42123 230869 119839 38620 -97356 -227902 -233080 -83257 143100 347882 490825 607214
42113 607214 753957 906167 927956 720621 400651 230603 331457 560271 738638 887678
42103 887678 1101796 1277222 1181949 818189 508171 504390 660855 651623 432156 291049
42093 291049 430774 662782 622112 220690 -222576 -332354 -102098 105241 -6469 -317204
$$ packed form
42165C030M2285j1159M8101J39601O4011j15006j13467J11343K56859J36220n2773
42154E09045o9427L1179Q4039Q8456Q6122k891j83391k38144m7469J38018M8801
42143D44338j52579j28167N9254M5334k04068l10984j06200J00137M5012p0090
42133b78013M5812K77276L10042J44632N3656J11656J05662p2809k41793k25252
42123B30869j11030q1219j35976j30546n178J49823K26357K04782J42943J16389
42113F07214J46743J52210K1789k07335l19970j70048J00854K28814J78367J49040
42103H87678K14118J75426r5273l63760l10018l781J56465r232k19467j41107
42093B91049J39725K32008m0670m01422m43266j09778K30256K07339j11710l10735
$$ plain form
42083 -317204 -463727 -298737 -26159 123427 175728 292724 519589 771597 961571 1014224
42073 1014224 857054 544141 302227 289758 377947 343506 213682 210348 379314 506492
42063 506492 433815 250622 112589 56227 64005 141019 242883 280467 274193 348901 498123
42052 498123 529275 355285 175127 227727 506935 846285 1121812 1214276 958813 380162
42042 380162 -143500 -231840 27399 217288 175424 155164 368072 658833 770567 703244
42032 703244 620644 554422 408296 186359 29046 23139 108158 191980 269504 395736 585561
42021 585561 758743 779962 582812 270629 44086 -6857 15126 -16342 -75687 -64367 -1005
42010 -1005 2198 -56129 -27583 177000 460927 695884 889676 1083973 1173206 1001158 635899
$$ packed form
42083c17204j46523J64990K72578J49586N2301J16996K26865K52008J89974N2653
42073A014224j57170l12913k41914j2469Q8189l4441j29824l334J68966J27178
42063E06492p2677j83193j38033n6362P778P7014J01864L7584o274P4708J49222
42052D98123L1152j73990j80158N2600K79208L39350K75527R2464k55463n78651
42042C80162n23662q8340K59239J89889m1864k0260K12908K90761J11734o7323
42032G03244q2600o6222j46126k21937j57313n907Q5019Q3822P7524J26232J89825
42021E85561J73182K1219j97150l12183k26543n0943K1983l1468n9345J1320O3362
42010a005L203n8327K8546K04583K83927K34957J93792J94297Q9233j72048l65259
$$ plain form
41999 635899 381840 454701 764286 1086462 1317353 1435869 1336642 916935 327290 -66163
41989 -66163 -58829 173129 315121 274429 199853 229102 351282 486456 568210 535722 354627
41978 354627 85352 -143871 -264740 -306561 -288734 -168343 49627 240218 298930 303523
41968 303523 415217 630988 767853 733794 690040 846253 1171862 1437174 1525046 1584613
41958 1584613 1841109 2328460 2853711 3176672 3178223 2884703 2401298 1870622 1482075 1426180
41948 1426180 1725624 2121784 2276161 2153502 2071503 2265823 2559672 2646993 2559327 2569129
41938 2569129 2699542 2677451 2410048 2150284 2057299 1935465 1630196 1379825 1473632 1781700
41928 1781700 1947981 1891735 1799071 1757588 1749631 1905166 2368964 2932785 3169881 2974446
$$ packed form
41999F35899k54059P2861L09585L22176K30891J18516r9227m19707n89645l93453
41989f6163P334K31958J41992m0692p4576K9249J22180J35174Q1754l2488j81095
41978C54627k69275k29223j20869m1821J7827J20391K17970J90591N8712M593
41968C03523J11694K15771J36865l4059m3754J56213L25609K65312Q7872N9567
41958A584613K56496M87351N25251L22961J551k93520m83405n30676l88547n5895
41948A426180K99444L96160J54377j22659q1999J94320K93849Q7321q7666R802
41938B569129J30413k2091k67403k59764r2985j21834l05269k50371R3807L08068
41928A781700J66281n6246r2664m1483p957J55535M63798N63821K37096j95435
$$ plain form
41918 2974446 2646848 2416328 2219906 2009370 1910720 1948181 1938410 1825075 1826888 2068423
41908 2068423 2329044 2365968 2258329 2214904 2240473 2222406 2189842 2254340 2393053 2482761 2478969
41897 2478969 2429194 2398428 2481417 2760053 3138975 3365959 3339006 3254321 3324938 3496152
41887 3496152 3583703 3575140 3648629 3961190 4502801 5095361 5523417 5771121 6082161 6604920
41877 6604920 7066488 7099944 6842711 6817108 7199270 7649286 7947032 8309164 8913972 9611021
41867 9611021 10337569 11345780 12754016 14345154 16070972 18240621 20933430 23818103
41859 23818103 26886078 30699686 35517858 40941381 46933551 54336445 63740684 74830882
41851 74830882 87698419 103739199 124285560 149769292 181489666 221558593 267030751
$$ packed form
41918B974446l27598k30520j96422k10536r8650L7461r771j13335J813K41535
41908B068423K60621L6924j07639m3425K5569j8067l2564O4498J38713Q9708l792
41897B478969m9775l0766Q2989K78636L78922K26984k6953q4685P0617J71214
41887C496152Q7551q563P3489L12561N41611N92560M28056K47704L11040N22759
41877F604920M61568L3456k57233k5603L82162M50016K97746L62132O04808O97049
41867I611021P26548J008211J408236J591138J725818K169649K692809K884673
41859B3818103L067975L813608M818172N423523N992170P402894R404239J1090198
41851G4830882J2867537J6040780K0546361K5483732L1720374M0068927M5472158
$$ plain form
41844 267030751 304759103 317421172 297922069 256132877 209688980 170013129 138634228
41837 138634228 113469022 93741440 78962417 67388133 57515134 49383209 43288077
41830 43288077 38567323 34508525 31220794 28756337 26401577 23653352 21028312 19139869
41822 19139869 17730585 16336935 15185518 14637836 14340890 13759140 13133006 13113499 13690783
41813 13690783 14166196 14033720 13336221 12300884 11138800 10113640 9373977 8766487 8105684
41804 8105684 7485024 7053596 6704681 6297478 5957633 5815449 5672009 5299373 4868538
41795 4868538 4683066 4662946 4505012 4209576 4013325 3898366 3615930 3166946 2834129 2717980
41785 2717980 2635026 2531334 2622202 3000866 3408011 3533833 3348491 3049554 2863275 2939573
$$ packed form
41844B67030751L7728352J2662069j9499103m1789192m6443897l9675851l1378901
41837A38634228k5165206j9727582j4779023j1574284r872999q131925o095132
41830D3288077m720754m058798l287731k464457k354760k748225k625040j888443
41822A9139869j409284j393650j151417n47682k96946n81750o26134j9507N77284
41813A3690783M75413j32476o97499j035337j162084j025160p39663o07490o60803
41804H105684o20660m31428l48915m07203l39845j42184j43440l72636m30835
41795D868538j85472k0120j57934k95436j96251j14959k82436m48984l32817j16149
41785B717980q2954j03692R0868L78664M07145J25822j85342k98937j86279P6298
$$ plain form
41775 2939573 3243711 3503918 3457695 3196756 3086769 3310929 3686486 3977538 4180972 4410166
41765 4410166 4667068 4849940 4889981 4802215 4669006 4597849 4614235 4600961 4448994 4252223
41755 4252223 4217683 4385883 4586546 4680523 4691662 4676496 4626959 4557456 4544266 4605775 4652349
41744 4652349 4610530 4498273 4344270 4153437 3997305 4009060 4219704 4517786 4857371 5395941
41734 5395941 6296754 7427757 8350550 8623228 8114792 7081821 5975064 5127753 4583182
41725 4583182 4203575 3885921 3607047 3319145 2942910 2486163 2065646 1781711 1647231
41716 1647231 1636793 1701876 1734012 1634974 1446697 1297046 1203791 1068735 881828 757563
41706 757563 722065 666944 611902 787921 1271102 1721613 1751876 1452207 1264273 1362828
$$ packed form
41775B939573L04138K60207m6223k60939j09987K24160L75557K91052K03434K29194
41765D410166K56902J82872M0041q7766j33209p1157J6386j3274j51967j96771
41755D252223l4540J68200K00663R3977J1139j5166m9537o9503j3190O1509M6574
41744D652349m1819j12257j54003j90833j56132J1755K10644K98082L39585N38570
41734E395941R00813J131003R22793K72678n08436j032971j106757q47311n44571
41725D583182l79607l17654k78874k87902l76235m56747m20517k83935j34480
41716A647231j0438O5083L2136r9038j88277j49651r3255j35056j86907j24265
41706G57563l5498n5121n5042J76019M83181M50511L0263k99669j87934R8555
$$ plain form
41696 1362828 1462916 1298449 1009073 896723 1004699 1141385 1200696 1245478 1312882 1328075
41686 1328075 1236747 1088693 951664 844751 795366 864267 1047276 1216632 1232997 1085671
41676 1085671 869524 657785 463813 311309 263928 357445 540076 701645 747740 655792
41666 655792 498911 413006 484556 646735 729565 640619 457372 316153 266610 287060 382460
41655 382460 566279 761758 838731 790922 785564 961608 1231945 1370437 1275725 1072352
41645 1072352 952507 988746 1114411 1218853 1228503 1143661 1027872 925811 788676 557735
41635 557735 339235 366251 688807 1021935 1073736 950965 1011426 1321924 1539322 1433563
41625 1433563 1262388 1409200 1840921 2205042 2353821 2455941 2610075 2678826 2595075 2553048
$$ packed form
41696A362828J00088j64467k89376j12350J07976J36686N9311M4782O7404J5193
41686A328075r1328j48054j37029j06913m9385O8901J83009J69356J6365j47326
41676A085671k16147k11739j93972j52504m7381R3517J82631J61569M6095r1948
41666F55792j56881q5905P1550J62179Q2830q8946j83247j41219m9543K0450R5400
41655C82460J83819J95479P6973m7809n358J76044K70337J38492r4712k03373
41645A072352j19845L6239J25665J04442R650q4842j15789j02061j37135k30941
41635E57735k18500K7016L22556L33128N1801j22771O0461L10498K17398j05759
41625A433563j71175J46812M31721L64121J48779J02120J54134O8751q3751m2027
$$ plain form
41615 2553048 2741793 3104148 3531149 4101564 4892825 5662500 5971396 5632052 4874932
41606 4874932 4068940 3419545 2955458 2670096 2589609 2726984 2994190 3183326 3119517 2880837
41596 2880837 2769494 2962480 3266896 3355581 3201111 3122741 3393844 3930540 4405410 4580492
41586 4580492 4493426 4376875 4428269 4649091 4930790 5283538 5857724 6690337 7619887 8620150
41576 8620150 10011336 11980532 13935741 14761664 13902908 11928214 9851991 8174462
41568 8174462 6829173 5766783 5109358 4772985 4399303 3819918 3283135 3037082 2939146
41559 2939146 2712066 2390062 2204094 2114710 1804826 1195680 674308 638010 1005120 1379460
41549 1379460 1574680 1737723 1990411 2200589 2195914 2040681 1970747 2116924 2379395 2543294
$$ packed form
41615B553048J88745L62355M27001N70415P91261P69675L08896l39344p57120
41606D874932q05992o49395m64087k85362q0487J37375K67206J89136o3809k38680
41596B880837j11343J92986L04416Q8685j54470p8370K71103N36696M74870J75082
41586D580492q7066j16551N1394K20822K81699L52748N74186Q32613R29550J000263
41576H620150J391186J969196J955209Q25923q58756j974694k076223j677529
41568H174462j345289j062390o57425l36373l73682n79385n36783k46053r7936
41559B939146k27080l22004j85968q9384l09884o09146n21372l6298L67110L74340
41549A379460J95220J63043K52688K10178m675j55233o9934J46177K62471J63899
$$ plain form
41539 2543294 2469492 2205965 1946009 1848517 1894263 1963306 2026289 2152605 2329786 2421010
41529 2421010 2361437 2268061 2273603 2368042 2491923 2660060 2878788 3064220 3180914 3344757
41519 3344757 3628373 3881350 3941075 3918895 4032884 4218092 4180288 3840016 3451496 3229786
41509 3229786 3113310 2976110 2833223 2722912 2602420 2483633 2464630 2497759 2352453 1981436
41499 1981436 1699972 1768824 1988356 1986067 1763931 1634148 1681306 1647172 1396360 1174540
41489 1174540 1254635 1542701 1707738 1584965 1313693 1146295 1224358 1504759 1837814 2124168
41479 2124168 2385272 2638021 2764481 2642949 2385207 2261776 2352455 2452931 2406448 2334140
41469 2334140 2386666 2436524 2249319 1887182 1693842 1851396 2149555 2266327 2124791 1879977
$$ packed form
41539B543294p3802k63527k59956r7492M5746O9043O2983J26316J77181R1224
41529B421010n9573r3376N542R4439J23881J68137K18728J85432J16694J63843
41519C344757K83616K52977N9725k2180J13989J85208l7804l40272l88520k21710
41509C229786j16476j37200j42887j10311j20492j18787j9003L3129j45306l71017
41499A981436k81464O8852K19532k289k22136j29783M7158l4134k50812k21820
41489A174540Q0095K88066J65037j22773k71272j67398P8063K80401L33055K86354
41479B124168K61104K52749J26460j21532k57742j23431R0679J00476m6483p2308
41469B334140N2526M9858j87205l62137j93340J57554K98159J16772j41536k44814
$$ plain form
41459 1879977 1678781 1559996 1520151 1543883 1582372 1604180 1671841 1882496 2213214 2492246
41449 2492246 2550630 2360629 2024766 1697180 1528564 1594592 1813486 1995849 2048955 2084943
41439 2084943 2248829 2485833 2588482 2463024 2234363 2064927 1975596 1893067 1780015 1643488
41429 1643488 1478085 1283529 1107752 1004376 962152 924312 860276 780644 707271 667147
41419 667147 687214 756544 825139 873852 934616 992738 939229 714159 447122 327870 347051
41408 347051 305261 114462 -50539 5650 212834 330996 288589 272965 456604 760774
41398 760774 970440 1003786 967885 985317 1071812 1181075 1258463 1215379 961185 547616 208667
41387 208667 147016 309689 471379 510047 481422 435230 318307 119497 -26324 12763
$$ packed form
41459A879977k01196j18785l9845K3732L8489K1808O7661K10655L30718K79032
41449B492246N8384j90001l35863l27586j68616O6028K18894J82363N3106L5988
41439B084943J63886K37004J02649j25458k28661j69436q9331q2529j13052j36527
41429A643488j65403j94556j75777j03376m2224l7840o4036p9632p3373m0124
41419F67147K0067O9330O8595M8713O0764N8122n3509k25070k67037j19252J9181
41408C47051m1790j90799j65001N6189K07184J18162m2407j5624J83639L04170
41398G60774K09666L3346l5901J7432Q6495J09263P7388m3084k54194m13569l38949
41387B08667o1651J62673J61690L8668k8625m6192j16923j98810j45821L9087
$$ plain form
41377 12763 196645 398765 593180 834454 1092406 1250237 1285127 1330696 1500060 1719171
41367 1719171 1804548 1679330 1461263 1339416 1393873 1544945 1664065 1709105 1731916 1770615
41357 1770615 1784966 1718342 1582969 1445497 1347549 1274112 1192810 1104590 1062200 1137942 1342084
41346 1342084 1567995 1665214 1590591 1445342 1340383 1280693 1223975 1195019 1265838 1440669
41336 1440669 1627441 1732266 1747698 1745788 1809821 1977977 2240874 2574157 2936146 3226388
41326 3226388 3332122 3302093 3398820 3816868 4364338 4616161 4436243 4168325 4224638 4664854
41316 4664854 5298126 6005231 6765348 7513982 8216091 9014271 10101761 11502889 13148638
41307 13148638 15053429 17163031 19105042 20398294 20917072 20875578 20361637 19230480 17539355
$$ packed form
41377A2763J83882K02120J94415K41274K57952J57831L4890M5569J69364K19111
41367A719171Q5377j25218k18067j21847N4457J51072J19120M5040K2811L8699
41357A770615J4351o6624j35373j37472r7948p3437q1302q8220m2390P5742K04142
41346A342084K25911R7219p4623j45249j04959n9690n6718k8956P0819J74831
41336A440669J86772J04825J5432j910O4033J68156K62897L33283L61989K90242
41326C226388J05734l0029R6727M18048N47470K51823j79918k67918N6313M40216
41316D664854O33272P07105P60117P48634P02109P98180J087490J401128J645749
41307A3148638J904791K109602J942011J293252N18778m1494n13941j131157j691125
$$ plain form
41298 17539355 15729001 14179515 12858588 11609943 10519480 9721482 9051296 8219111
41290 8219111 7234551 6377888 5814020 5495691 5388226 5488713 5607430 5423510 4865432
41281 4865432 4235819 3853322 3723966 3655145 3544878 3440391 3412419 3485605 3639592 3805404
41271 3805404 3908148 3955440 4017543 4084793 4036170 3810574 3522270 3324936 3231228 3154611
41261 3154611 3066675 3008000 2988956 3003688 3131305 3495288 4091226 4758109 5366676 5948070
41251 5948070 6584958 7275097 7996021 8826257 9872805 11108296 12399535 13665825 14849086
41242 14849086 15722691 15939943 15391933 14380015 13302062 12277945 11219455 10142561
41234 10142561 9199944 8458351 7849580 7322794 6851241 6308778 5572631 4779210 4247111
$$ packed form
41298A7539355j810354j549486j320927j248645j090463p97998o70186q32185
41290H219111r84560q56663n63868l18329j07465J00487J18717j83920n58078
41281D865432o29613l82497j29356o8821j10267j04487k7972P3186J53987J65812
41271C805404J02744M7292O2103O7250m8623k25596k88304j97334r3708p6617
41261C154611q7936n8675j9044J4732J27617L63983N95938O66883O08567N81394
41251E948070O36888O90139P20924Q30236J046548J235491J291239J266290J183261
41242A4849086Q73605K17252n48010j011918j077953j024117j058490j076894
41234A0142561r42617p41593o08771n26786m71553n42463p36147p93421n32099
$$ plain form
41225 4247111 4077202 4040664 3931275 3783477 3630975 3327964 2823802 2386607 2275567 2338317
41215 2338317 2222917 1902822 1703507 1837137 2172849 2469436 2592948 2482075 2135039
41206 2135039 1699523 1394517 1281337 1251456 1248665 1321393 1433112 1428721 1260950 1074274
41196 1074274 988235 958152 923056 927689 1008959 1109575 1192897 1302690 1424066 1433093 1286700
41185 1286700 1130358 1113097 1207935 1292742 1281756 1118104 808818 547993 595607 904533
41175 904533 1089828 951516 803550 1025539 1474131 1667163 1451966 1145673 1027429 1017801
41165 1017801 919748 705284 469978 309723 318642 526324 775509 837300 698423 559037
41155 559037 515304 458579 340615 288792 348419 357591 244363 227988 506527 906854 1080586
$$ packed form
41225D247111j69909l6538j09389j47798j52502l03011n04162m37195j11040O2750
41215B338317j15400l20095j99315J33630L35712K96587J23512j10873l47036
41206B135039m35516l05006j13180k9881k791P2728J11719m391j67771j86676
41196A074274q6039l0083l5096M633Q1270J00616Q3322J09793J21376R027j46393
41185A286700j56342j7261R4838Q4807j0986j63652l09286k60825M7614L08926
41175I04533J85295j38312j47966K21989M48592J93032k15197l06293j18244r628
41165A017801r8053k14464k35306j60255Q919K07682K49185O1791j38877j39386
41155E59037m3733n6725j17964n1823N9627R172j13228j6375K78539M00327J73732
$$ plain form
41144 1080586 946029 722576 611218 653031 833334 1091076 1242815 1117640 795780 543030
41134 543030 487911 519305 515269 500876 534588 590925 619567 603484 511511 309632 65785
41123 65785 -72007 -53555 24236 86839 175114 310654 406795 413657 434672 571615 736971
41112 736971 759597 632320 518475 519191 551879 486801 325940 207950 264579 482266 695312
41101 695312 739268 633536 580119 751667 1111544 1464900 1640042 1595959 1426151 1315427
41091 1315427 1423774 1726110 2004254 2069396 1951072 1798493 1666542 1517677 1385708 1375558
41081 1375558 1483058 1562117 1534631 1521321 1675256 1952470 2137986 2075254 1805457 1493746
41071 1493746 1278232 1205272 1268315 1449886 1690414 1850730 1803894 1613380 1538304 1758761
$$ packed form
41144A080586j34557k23453j11358M1813J80303K57742J51739j25175l21860k52750
41134E43030n5119L1394m036j4393L3712N6337K8642j6083r1973k01879k43847
41123F5785j37792J8452P7791O2603Q8275J35540R6141O862K1015J36943J65356
41112G36971K2626j27277j13845P16L2688o5078j60861j17990N6629K17687K13046
41101F95312M3956j05732n3417J71548L59877L53356J75142m4083j69808j10724
41091A315427J08347L02336K78144O5142j18324j52579j31951j48865j31969j0150
41081A375558J07500P9059k7486j3310J53935K77214J85516o2732k69797l11711
41071A493746k15514p2960O3043J81571K40528J60316m6836j90514p5076K20457
$$ plain form
41061 1758761 2127769 2301550 2114647 1735220 1449807 1391812 1490712 1580802 1524275 1319516
41051 1319516 1132071 1146767 1362837 1610233 1770447 1863004 1896059 1795032 1563446 1366554
41041 1366554 1332055 1388243 1434473 1547267 1829370 2140024 2202555 1968478 1667007 1472681
41031 1472681 1328277 1157483 1056024 1151901 1411151 1696946 1910894 1975262 1810984 1490348
41021 1490348 1308916 1504079 1927849 2179070 2068045 1790060 1628242 1669316 1862595 2149142
41011 2149142 2393790 2363494 1985122 1534397 1348336 1388768 1318377 1006480 698162 610105
41001 610105 630188 584264 557629 692812 844818 769546 579110 646576 1027510 1336342
40991 1336342 1329107 1274530 1507376 1875116 1950518 1650575 1308828 1178609 1184258 1195694 1248629
$$ packed form
41061A758761L69008J73781j86903l79427k85413n7995R8900R0090n6527k04759
41051A319516j87445J4696K16070K47396J60214R2557L3055j01027k31586j96892
41041A366554l4499N6188M6230J12794K82103L10654O2531k34077l01471j94326
41031A472681j44404j70794j01459R5877K59250K85795K13948O4368j64278l20636
41021A490348j81432J95163M23770K51221j11025k77985j61818M1074J93279K86547
41011B149142K44648l0296l78372m50725j86061M0432p0391l11897l08318q8057
41001F10105K0083m5924k6635J35183J52006p5272j90436O7466L80934L08832
40991A336342p235n4577K32846L67740P5402k99943l41747j30219N649J1436N2935
$$ plain form
40980 1248629 1372341 1430873 1303652 1081037 930285 876407 860396 917571 1120647 1387983
40970 1387983 1532431 1523407 1544691 1728739 1962007 2052793 1991494 1902637 1795045 1549114
40960 1549114 1183612 940784 977278 1116766 1100904 993790 1088501 1420404 1648968 1519516
40950 1519516 1200938 1004716 974008 964157 965422 1075426 1237769 1288597 1243607 1273633 1373652
40939 1373652 1317455 1017183 694925 579252 618637 627598 564280 521019 549638 624674 701260
40928 701260 715511 609945 432858 314981 282366 215662 67143 -37529 -19236 7781
40918 7781 -35803 5020 269146 568177 602233 416702 347791 514883 663401 578704 381151
40907 381151 286205 310044 375735 501140 668548 669751 342418 -114921 -321579 -194730
$$ packed form
40980A248629J23712N8532j27221k22615j50752n3878j6011N7175K03076K67336
40970A387983J44448r024K1284J84048K33268R0786o1299q8857j07592k45931
40960A549114l65502k42828L6494J39488j5862j07114R4711L31903K28564j29452
40950A519516l18578j96222l0708r851J265J10004J62343N0828m4990L0026J00019
40939A373652n6197l00272l22258j15673L9385Q961o3318m3261K8619P5036P6586
40928G01260J4251j05566j77087j17877l2615o6704j48519j04672J8293K7017
40918G781m3584M0823K64126K99031L4056j85531o8911J67092J48518q4697j97553
40907C81151r4946K3839O5691J25405J67408J203l27333m57339k06658J26849
$$ plain form
40897 -194730 -6478 66999 189338 526594 883176 899731 521147 52036 -230270 -319886
40887 -319886 -321033 -247755 -92031 49932 66550 -14306 -76215 -78548 -64014 -39491 29746
40876 29746 114104 121919 22937 -122088 -263593 -399218 -497576 -496876 -414631 -354642 -354911 -325204
40864 -325204 -196837 -43522 23345 4824 -19730 -11585 24869 96896 184034 188155 32021
40853 32021 -196875 -286095 -98573 302936 710822 910954 811589 516220 262990 229152
40843 229152 386614 572653 667764 659359 579629 466946 377876 356388 375153 361435 294337
40832 294337 231614 224075 238607 191336 47624 -130117 -250337 -303864 -360880 -423399 -352581
40821 -352581 -53823 301126 401865 188811 -46374 -41288 104868 121285 -30886 -137060
$$ packed form
40897a94730J88252P3477J22339L37256L56582J6555l78584m69111k82306q9616
40887c19886j147P3278J55724J41963J6618q0856o1909k333J4534K4523O9237
40876B9746Q4358P815r8982j45025j41505j35625r8358P00Q2245N9989k69K9707
40864c25204J28367J53315O6867j8521k4554Q145L6454P2027Q7138M121j56134
40853C2021k28896q9220J87522M01509M07886K00132r9365k95369k53230l3838
40843B29152J57462J86039R5111q405p9730j12683q9070k1488J8765j3718o7098
40832B94337o2723p539J4532m7271j43712j77741j20220n3527n7016o2519P0818
40821c52581K98758L54949J00739k13054k35185N086J46156J6417j52171j06174
$$ plain form
40811 -137060 -62027 94509 196654 259513 363410 487198 522096 423019 282338 228997
40801 228997 260507 219679 -697 -260656 -303303 -102392 72973 20177 -125316 -114395
40791 -114395 56650 194125 217634 214422 230703 217725 182698 210303 320392 456843 611851
40780 611851 802213 938617 904644 766786 705604 715744 587702 246042 -99925 -230661
40770 -230661 -157035 11296 256692 575079 840356 893158 704821 387330 124133 111368
40760 111368 410422 796041 918365 707497 455891 402576 422761 277835 2293 -152869
40750 -152869 -51715 229902 548926 772064 795166 655281 558929 650443 822929 895976
40740 895976 878755 885143 889481 781482 599956 483986 420010 267738 44094 -46556 82717
$$ packed form
40811a37060P5033J56536J02145O2859J03897J23788L4898r9077j40681n3341
40801B28997L1510m0828k20376k59959m2647K00911J75365n2796j45493J0921
40791a14395J71045J37475K3509l212J6281j2978l5027K7605J10089J36451J55008
40780F11851J90362J36404l3973j37858o1182J0140j28042l41660l45967j30736
40770b30661P3626J68331K45396L18387K65277N2802j88337l17491k63197j2765
40760A11368K99054L85619J22324k10868k51606n3315K0185j44926k75542j55162
40750a52869J01154K81617L19024K23138K3102j39885r6352R1514J72486P3047
40740H95976j7221O388M338j07999j81526j15970o3976j52272k23644r0650J29273
$$ plain form
40729 82717 261799 303305 223159 143364 110119 99336 108738 161897 268668 417286 565500
40718 565500 648158 652283 649528 674111 632555 462239 311490 374235 576036 647134 526257
40707 526257 450979 569412 704147 653513 526646 571020 791702 957183 921538 743010
40697 743010 507599 229167 -42031 -169647 -70795 176274 423001 591802 677074 658129
40687 658129 497065 242595 77624 184639 536938 874425 942876 735894 454706 274638
40677 274638 238783 344700 592197 908645 1146240 1218459 1155590 984522 672523 272692
40667 272692 9218 82495 442789 866648 1198118 1388221 1355941 1001479 398651 -167709
40657 -167709 -437654 -385056 -161740 77069 243064 301180 273185 220846 173682 114631 75930
$$ packed form
40729H2717J79082M1506q0146p9795l3245j0783R402N3159J06771J48618J48214
40718E65500Q2658M125k755K4583m1556j70316j50749O2745K01801P1098j20877
40707E26257p5278J18433J34735n0634j26867M4374K20682J65481l5645j78528
40697G43010k35411k78432k71198j27616R8852K47069K46727J68801Q5272j8945
40687F58129j61064k54470j64971J07015L52299L37487O8451k06982k81188j80068
40677B74638l5855J05917K47497L16448K37595P2219o2869j71068l11999l99831
40667B72692k63474P3277L60294M23859L31470J90103l2280l54462o02828n66360
40657a67709k69945N2598K23316K38809J65995N8116k7995n2339m7164n9051l8701
$$ plain form
40646 75930 168378 420213 644180 604056 319376 71379 56271 152047 117368 -81923 -281206
40635 -281206 -389369 -473247 -550836 -475808 -138184 317660 600876 570445 337551 99855
40625 99855 -38134 -88088 -108535 -140720 -175514 -175498 -144607 -139172 -164483 -107969 134305 473829
40613 473829 666337 561410 256601 -16191 -101191 -885 176773 296132 255004 32007
40603 32007 -305989 -644767 -871163 -905192 -730279 -412625 -77091 154014 221698 167447
40593 167447 116209 175269 322320 431929 431490 372549 323868 285032 263566 326021 458042
40582 458042 471831 223167 -125147 -243804 -47414 209915 282803 208091 163574 210622
40572 210622 284878 332545 342405 308544 250833 224573 248489 275744 281311 308938 379865 424103
$$ packed form
40646G5930R2448K51835K23967m0124k84680k47997j5108R5776l4679j99291j99283
40635b81206j08163q3878p7589P5028L37624M55844K83216l0431k32894k37696
40625I9855j37989m9954k0447l2185l4794J6L0891N435k5311N6514K42274L39524
40613D73829J92508j04927l04809k72792q5000J00306J77658J19359m1128k22997
40603C2007l37996l38778k26396l4029J74913L17654L35534K31105O7684n4251
40593A67447n1238N9060J47051J09609m39n8941m8681l8836k1466O2455J32021
40582D58042J3789k48664l48314j18657J96390K57329P2888p4712m4517M7048
40572B10622P4256M7667R860l3861n7711k6260K3916K7255N567K7627P0927M4238
$$ plain form
40560 424103 360515 195261 9559 -91968 -20439 204228 387100 324741 79318 -69636
40550 -69636 -12566 33605 -125913 -345477 -358544 -176161 -40167 -57548 -109414 -91906 -30572
40539 -30572 48460 162607 259840 236606 110336 23653 38142 67267 52642 57789 127064
40528 127064 186742 162137 88514 45211 76396 215946 466641 699878 718627 515969 345710
40517 345710 414997 610888 675177 573625 521422 661018 877753 974040 902942 755652
40507 755652 592213 383355 126457 -49143 31569 369690 711504 768290 514417 186639
40497 186639 -14592 -102323 -135417 -28869 306717 708801 848085 608086 234656 40755
40487 40755 76416 178802 252602 363452 572107 798061 892018 790425 570529 384675
$$ packed form
40560D24103o3588j65254j85702j01527P1529K24667J82872o2359k45423j48954
40550f9636N7070M6171j59518k19564j3067J82383J35994j7381n1866J7508O1334
40539c0572P9032J14147R7233k3234j26270q6683J4489K9125j4625N147O9275
40528A27064N9678k4605p3623m3303L1185J39550K50695K33237J8749k02658j70259
40517C45710O9287J95891O4289j01552n2203J39596K16735R6287p1098j47290
40507G55652j63439k08858k56898j75600Q0712L38121L41814N6786k53873l27778
40497A86639k01231q7731l3094J06548L35586M02084J39284k39999l73430j93901
40487D0755L5661J02386P3800J10850K08655K25954R3957j01593k19896j85854
$$ plain form
40477 384675 347528 447623 560860 593166 614303 787976 1145852 1507048 1681433 1683923
40467 1683923 1652093 1602505 1413602 1068297 766733 702937 815766 876918 793733 714522
40457 714522 817820 1074090 1256810 1164395 816282 444959 294360 412029 643614 827554
40447 827554 950926 1086361 1228052 1264625 1113833 832514 578680 482002 536253 591457
40437 591457 477214 181280 -106848 -180213 -37715 125812 148336 54610 -37408 -92691
40427 -92691 -172014 -293508 -369293 -324087 -223015 -196053 -237204 -180272 68566 364973 503025
40416 503025 500721 562966 769158 958236 964019 813097 618255 418445 223713 91415
40406 91415 39779 -2735 -38722 88822 471921 922034 1158723 1144549 1055562 989303 904875
$$ packed form
40477C84675l7147J00095J13237L2306K1137J73673L57876L61196J74385K490
40467A683923l1830m9588j88903l45305l01564o3796J12829O1152q3185p9211
40457G14522J03298K56270J82720r2415l48113l71323j50599J17669K31585J83940
40447H27554J23372J35435J41691L6573j50792k81319k53834r6678N4251N5204
40437E91457j14243k95934k88128p3365J42498J63527K2524r3726r2018n5283
40427i2691p9323j21494p5785M5206J01072K6962m1151N6932K48838K96407J38052
40416E03025k304O2245K06192J89078N783j50922j94842j99810j94732j32298
40406I1415n1636m2514l5987J27544L83099M50113K36689j4174q8987o6259q4428
$$ plain form
40395 904875 796839 693330 502306 116695 -301590 -407074 -123261 227760 357905 348080
40385 348080 406662 514215 524237 465334 494937 610401 625034 440274 183915 44658
40375 44658 65788 128861 92528 -52767 -149288 -28173 286609 597576 765230 813674 783068
40364 783068 632006 373602 163746 121460 164259 147883 69551 -2590 -99784 -286443 -494774
40353 -494774 -591425 -555371 -430229 -164114 303500 820216 1100134 1060383 902331 809650
40343 809650 731934 547736 301473 157291 180100 259890 248522 132967 61601 175848
40333 175848 409658 527955 413555 222033 154329 173177 97144 -95064 -246144 -282542
40323 -282542 -296413 -345824 -358096 -278655 -154945 -25835 116574 214842 173392 60063 90204
$$ packed form
40395I04875j08036j03509j91024l85611m18285j05484K83813L51021J30145r825
40385C48080N8582J07553J0022n8903K9603J15464J4633j84760k56359j39257
40375D4658K1130O3073l6333j45295r6521J21115L14782L10967J67654M8444l0606
40364G83068j51062k58404k09856m2286M2799j6376p8332p2141r7194j86659k08331
40353d94774r6651L6054J25142K66115M67614N16716K79918l9751j58052r2681
40343H09650p7716j84198k46263j44182K2809P9790j1368j15555p1366J14247
40333A75848K33810J18297j14400j91522o7704J8848p6033j92208j51080l6398
40323b82542j3871m9411j2272P9441J23710J29110J42409R8268m1450j13329L0141
$$ plain form
40312 90204 307721 461806 337352 51146 -138758 -180742 -199584 -220791 -138277 74698
40302 74698 308760 481871 616352 733967 786338 714336 508529 220970 -22376 -71472
40292 -71472 85955 251763 220557 31700 -94083 -44660 83594 158073 135088 8046
40282 8046 -204578 -372965 -320533 -69939 106445 4415 -237776 -316275 -147904 67968
40272 67968 147138 121841 110354 117250 47923 -144630 -402320 -614200 -668535 -492854 -123616
40261 -123616 264496 468606 427398 254640 102036 31294 26937 71725 164764 300984 475354
40250 475354 676914 834618 808936 517980 73443 -282926 -410181 -392988 -411676 -528864
40240 -528864 -641566 -618987 -440906 -192038 48488 272144 482323 613999 587381 452458
$$ packed form
40312I0204K17517J54085j24454k86206j89904m1984j8842k1207Q2514K12975
40302G4698K34062J73111J34481J17615N2371p2002k05807k87559k43346m9096
40292g1472J57427J65808l1206j88857j25783M9423J28254P4479k2985j27042
40282H046k12624j68387N2432K50594J76384j02030k42191p8499J68371K15872
40272F7968P9170k5297j1487O896o9327j92553k57690k11880n4335J75681L69238
40261a23616L88112K04110m1208j72758j52604p0742m357M4788R3039J36220J74370
40250D75354K01560J57704k5682k90956m44537l56369j27255J7193j8688j17188
40240e28864j12702K2579J78081K48868K40526K23656K10179J31676k6618j34923
$$ plain form
40230 452458 389691 498437 652243 666138 568017 572453 770526 969110 902038 526601 49930
40219 49930 -287975 -400958 -358051 -252757 -90921 170299 467758 601140 454236 195129
40209 195129 114787 275903 471707 536845 512027 451658 283858 -6493 -237270 -253237
40199 -253237 -163799 -170396 -260582 -275430 -197668 -143104 -107979 29472 243505 331681 209255
40188 209255 30831 -55138 -84472 -118114 -89210 56206 210460 248827 220239 242994 288123
40177 288123 229879 80707 19798 160769 393387 500992 390549 180610 72218 133789
40167 133789 229529 199337 84480 81823 266428 479363 544073 479436 415474 402051 408026
40156 408026 423036 437530 389231 257718 156887 197036 297885 285210 147651 43117
$$ packed form
40230D52458o2767J08746J53806J3895r8121M436J98073J98584o7072l75437m76671
40219D9930l37905j12983M2907J05294J61836K61220K97459J33382j46904k59107
40209A95129q0342J61116J95804O5138k4818o0369j67800k90351k30777j5967
40199b53237Q9438o597r0186j4848P7762N4564L5125J37451K14033Q8176j22426
40188B09255j78424q5969k9334l3642K8904J45416J54254L8367k8588K2755M5129
40177B88123n8244j49172o0909J40971K32618J07605j10443k09939j08392O1571
40167A33789R5740l0192j14857k657J84605K12935O4710o4637o3962j3423N975
40156D08026J5010J4494m8299j31513j00831M0149J00849j2675j37559j04534
$$ plain form
40146 43117 54028 91396 59714 -29480 -134734 -229119 -233217 -58690 222575 400990 392534
40135 392534 334755 344573 352416 299011 318437 530238 777328 802956 622311 482186 476524
40124 476524 451468 323923 243995 330740 444711 374452 118129 -163595 -372202 -501783
40114 -501783 -522846 -399888 -206607 -87765 -87481 -100913 -11367 177126 340760 336893 136856
40103 136856 -109268 -198421 -107419 -16129 -34934 -27641 167715 453743 602759 606882 661124
40092 661124 787100 724991 306586 -258397 -617883 -674566 -608498 -599199 -670502 -758423 -802166
40081 -802166 -778535 -722828 -694736 -685559 -623477 -511296 -454801 -478815 -430701 -180792 185077
40070 185077 508342 791190 1114402 1399369 1463102 1293456 1071473 908485 749443 565373
$$ packed form
40146D3117J0911L7368l1682q9194j05254r4385m098J74527K81265J78415q456
40135C92534n7779R818P843n3405J9426K11801K47090K5628j80645j40125n662
40124D76524k5056j27545p9928Q6745J13971p0259k56323k81724k08607j29581
40114e01783k1063J22958J93281J18842K84j3432Q9546J88493J63634l867k00037
40103A36856k46124q9153R1002R1290j8805P293J95356K86028J49016M123N4242
40092F61124J25976o2109m18405n64983l59486n6683O6068R299p1303q7921m3743
40081h02166K3631N5707K8092R177O2082J12181N6495k4014M8114K49909L65869
40070A85077L23265K82848L23212K84967O3733j69646k21983j62988j59042j84070
$$ plain form
40060 565373 444253 417170 366532 208704 32403 -49469 -73150 -139793 -241436 -270582 -146617
40049 -146617 131271 484096 748284 762485 535913 254636 60359 -83551 -247913 -393606
40039 -393606 -477208 -565745 -686813 -666872 -320237 236317 648824 716958 565321 415882
40029 415882 353641 356721 393316 396368 266395 21360 -123558 50566 496019 899496 969470
40018 969470 685125 258295 -102836 -349637 -527070 -629450 -602714 -474623 -371548 -351415
40008 -351415 -308912 -133895 104373 243039 252919 252084 305235 346507 327199 309553 348508
39997 348508 378898 301613 117161 -103564 -331014 -572566 -776497 -826957 -660630 -344248
39987 -344248 -6903 282387 534671 740945 806177 642974 318120 23749 -130231 -220858
$$ packed form
40060E65373j21120k7083n0638j57828j76301q1872k3681o6643j01643k9146J23965
40049a46617K77888L52825K64188J4201k26572k81277j94277j43910j64362j45693
40039c93606q3602q8537j21068J9941L46635N56554M12507O8134j51637j49439
40029D15882o2241L080L6595L052j29973k45035j44918J74124M45453M03477O9974
40018I69470k84345m26830l61131k46801j77433j02380K6736J28091J03075K0133
40008c51415M2503J75017K38268J38666R880q35N3151M1272j9308j7646L8955
39997C48508L0390p7285j84452k20725k27450k41552k03931n0460J66327L16382
39987c44248L37345K89290K52284K06274O5232j63203l24854k94371j53980r0627
$$ plain form
39977 -220858 -352104 -461188 -381010 -66004 334678 618907 674429 507008 224971 1869
39967 1869 -31824 106272 279114 345718 228645 -46964 -296444 -252418 148101 602192
39957 602192 733657 523796 279670 202763 213813 221627 296335 460024 537534 394025 163493
39946 163493 70944 154878 324051 555988 848235 1073147 1088845 948316 824884 770724
39936 770724 707945 612910 541841 504771 475230 497090 617454 731402 659510 380947 46535
39925 46535 -224462 -410736 -481759 -410388 -298488 -310406 -458200 -614412 -740276 -906968
39915 -906968 -1071052 -1055536 -829553 -597477 -505629 -452016 -310327 -157816 -120486 -143150
39905 -143150 -94608 4838 36216 -14601 -69838 -119209 -212072 -329364 -405676 -453515 -535256
$$ packed form
39977b20858j31246j09084Q0178L15006M00682K84229N5522j67421k82037k23102
39967A869l3693J38096J72842O6604j17073k75609k49480M4026M00519M54091
39957F02192J31465k09861k44126p6907J1050P814P4708J63689P7510j43509k30532
39946A63493r2549Q3934J69173K31937K92247K24912J5698j40529j23432n4160
39936G70724o2779r5035p1069l7070k9541K1860J20364J13948p1892k78563l34412
39925D6535k70997j86274p1023P1371J11900j1918j47794j56212j25864j66692
39915i06968j64084J5516K25983K32076R1848N3613J41689J52511L7330k2664
39905a43150M8542R9446L1378n0817n5237m9371r2863j17292p6312m7839q1741
$$ plain form
39894 -535256 -626281 -626203 -506987 -352811 -248543 -201236 -166436 -93677 40502 203637 339485
39883 339485 445289 545056 570281 401398 97740 -70247 45730 242862 247912 111432
39873 111432 104168 300527 519396 651232 765180 849653 727137 355277 -14841 -156494
39863 -156494 -176822 -312976 -534442 -572472 -316274 24659 199362 209036 236264 365415
39853 365415 481265 441654 266146 98077 18330 -14413 -27768 45157 221925 336498
39843 336498 204972 -92052 -260293 -173199 -57900 -204979 -596397 -942696 -1033303 -921132
39833 -921132 -766167 -622210 -446523 -256183 -164670 -222342 -288517 -167481 118922 305066
39823 305066 195224 -87385 -265313 -243614 -148634 -86860 -38890 5547 -22819 -160322 -353113
$$ packed form
39894e35256r1025P8J19216J54176J04268M7307L4800P2759J34179J63135J35848
39883C39485J05804R9767K5225j68883l03658j67987J15977J97132N050j36480
39873A11432p264J96359K18869J31836J13948Q4473j22516l71860l70118j41653
39863a56494k0328j36154k21466l8030K56198L40933J74703R674K7228J29151
39853C65415J15850l9611j75508j68069p9747l2743j3355P2925J76768J14573
39843C36498j31526k97024j68241Q7094J15299j47079l91418l46299r0607J12171
39833i21132J54965J43957J75687J90340R1513n7672o6175J21036K86403J86144
39823C05066j09842k82609j77928K1699R4980O1774M7970M4437k8366j37503j92791
$$ plain form
39812 -353113 -543018 -686302 -679093 -438347 -106080 13064 -187413 -479863 -622975 -635664
39802 -635664 -617883 -498335 -184096 169002 290783 156864 -832 -20559 47983 110461
39792 110461 131576 59273 -157293 -425531 -549653 -470952 -333358 -265534 -235206 -174448 -116345
39781 -116345 -128149 -202325 -277691 -298005 -220113 -47390 126633 200215 195143 201876 208551 136658
39769 136658 45902 105937 319070 485976 536147 660015 956976 1178108 1059777 749834
39759 749834 613399 700655 712285 483416 198382 50767 -42490 -239683 -477345 -551094
39749 -551094 -390091 -102555 186827 413409 521310 454999 221552 -80487 -286522 -222819
39739 -222819 171912 718083 1067930 1018115 729667 544832 588897 642300 431736 -24267
$$ packed form
39812c53113j89905j43284P209K40746L32267J19144k00477k92450j43112j2689
39802f35664J7781J19548L14239L53098J21781j33919j57696j9727O8542O2478
39792A10461K1115p2303k16566k68238j24122P8701J37594O7824L0328O0758N8103
39781a16345j1804p4176p5366k0314P7892J72723J74023P3582n072O733O675p1893
39769A36658r0756O0035K13133J66906N0171J23868K96961K21132j18331l09943
39759G49834j36435Q7256J1630k28869k85034j47615r3257j97193k37662p3749
39749e51094J61003K87536K89382K26582J07901o6311k33447l02039k06035O3703
39739b22819L94731N46171L49847m9815k88448j84835M4065N3403k10564m56003
$$ plain form
39729 -24267 -417225 -479654 -275631 -141078 -328565 -724599 -952475 -767929 -323738 -19515
39719 -19515 -107847 -465310 -730620 -649328 -298763 11557 63469 -71455 -191390 -265312
39709 -265312 -445816 -770486 -1017775 -972020 -709746 -469692 -326400 -184939 -55763 -99496
39699 -99496 -348640 -589884 -629135 -523442 -446524 -468847 -589968 -833813 -1134343 -1246291
39689 -1246291 -993078 -555014 -297437 -326240 -421748 -414597 -386948 -435922 -478522 -436124 -421443
39678 -421443 -551975 -708486 -686705 -511756 -388685 -371548 -301241 -99851 83550 116500
39668 116500 105956 230088 445524 533845 424186 315285 422678 707243 938036 964998
39658 964998 828585 622239 374577 116386 -45428 -27728 107710 236410 331836 424640
$$ packed form
39729b4267l92958o2429K04023J34553j87487l96034k27876J84546M44191L04223
39719a9515q8332l57463k65310Q1292L50565L10320N1912j34924j19935p3922
39709b65312j80504l24670k47289M5755K62274K40054J43292J41461J29176m3733
39699i9496k49144k41244l9251J05693P6918k2323j21121k43845l00530j11948
39689a246291K53213M38064K57577k8803r5508P151K7649m8974m2600M2398J4681
39678d21443j30532j56511K1781J74949J23071J7137P0307K01390J83401L2950
39668A16500j0544J24132K15436Q8321j09659j08901J07393K84565K30793K6962
39658I64998j36413k06346k47662k58191j61814J7700J35438J28700R5426R2804
$$ plain form
39648 424640 445034 283435 23667 -81567 50331 198780 166685 61113 67891 103364
39638 103364 -54034 -361714 -518641 -378897 -113259 80585 189849 233368 133789 -118724
39628 -118724 -361549 -475702 -559584 -728585 -874941 -809170 -543272 -250744 -21769 156244
39618 156244 243041 185625 86804 111478 209813 152173 -106671 -311576 -255319 -54144 62149
39607 62149 73936 107850 167569 143601 47461 21803 91269 85643 -112439 -375495 -483429
39596 -483429 -384215 -211054 -94898 -49332 -14727 61893 188748 319920 386196 363616 289849
39585 289849 190370 44607 -118657 -159534 27010 327487 500671 470716 407815 473185
39575 473185 609692 670346 640319 597736 524084 318450 2936 -229956 -231363 -72107 48316
$$ packed form
39648D24640K0394j61599k59768j05234J31898J48449l2095j05572O778L5473
39638A03364j57398l07680j56927J39744K65638J93844J09264M3519r9579k52513
39628a18724k42825j14153q3882j69001j46356O5771K65898K92528K28975J78013
39618A56244Q6797n7416r8821K4674R8335n7640k58844k04905N6257K01175J16293
39607F2149J1787L3914N9719k3968r6140k5658O9466n626j98082k63056j07934
39596d83429R9214J73161J16156M5566L4605P6620J26855J31172O6276k2580p3767
39585B89849r9479j45763j63264m0877J86544L00477J73184k9955o2901O5370
39575D73185J36507O0654l0027m2583p3652k05634l15514k32892j407J59256J20423
$$ plain form
39564 48316 12896 -133931 -268862 -300546 -220534 -87109 35010 129206 226906 363067 533538
39553 533538 677423 702016 565362 347814 196640 185412 284022 465329 723798 947353
39543 947353 932616 661058 429784 519448 811211 935003 743261 415177 127741 -106652
39533 -106652 -250824 -182431 64704 239658 192190 46248 -71586 -244075 -520654 -683128
39523 -683128 -504450 -97867 231088 363769 371340 267991 37475 -176977 -199234 -102281
39513 -102281 -93432 -149166 -56045 190656 352459 363697 453572 730949 950502 876928 635194
39502 635194 490059 480759 497460 545130 672307 749592 587166 237167 -46620 -144011 -168063
39491 -168063 -223710 -255589 -185052 -50438 60738 129562 204672 341279 556286 781544
$$ packed form
39564D8316l5420j46827j34931l1684Q0012J33425J22119R4196R7700J36161J70471
39553E33538J43885K4593j36654k17548j51174j1228R8610J81307K58469K23555
39543I47353j4737k71558k31274Q9664K91763J23792j91742l28084k87436k34393
39533a06652j44172O8393K47135J74954m7468j45942j17834j72489k76579j62474
39523f83128J78678M06583L28955J32681P571j03349k30516k14452k2257R6953
39513a02281Q849n5734R3121K46701J61803J1238Q9875K77377K19553p3574k41734
39502F35194j45135r300J6701M7670J27177P7285j62426l49999k83787r7391k4052
39491a68063n5647l1879P0537J34614J11176O8824P5110J36607K15007K25258
$$ plain form
39481 781544 863461 694357 365664 119444 118599 313951 547938 723808 841179 918412
39471 918412 934801 846221 633768 326434 -25778 -384968 -704761 -897726 -898338 -779921
39461 -779921 -723602 -805858 -883199 -773103 -498009 -243403 -102745 8309 169458 314401
39451 314401 336888 249809 152489 87511 17595 -73068 -141570 -165412 -184169 -220094 -215785 -118882
39439 -118882 9354 66839 89086 232630 522348 732412 641753 335936 104424 74615
39429 74615 125530 166488 279597 484394 558165 287660 -190764 -496007 -429043 -145940
39419 -145940 87987 170602 163460 149302 161795 201244 269229 391747 586557 778060 804252
39408 804252 597252 324344 242319 412578 652224 761751 701074 546556 401917 380604
$$ packed form
39481G81544Q1917j69104l28693k46220q45J95352K33987J75870J17371P7233
39471I18412J6389q8580k12453l07334l52212l59190l19793j92965o12J18417
39461g79921N6319q2256p7341J10096K75094K54606J40658J11054J61149J44943
39451C14401K2487q7079r7320o4978o9916r0663o8502k3842j8757l5925M309R6903
39439a18882J28236N7485K2247J43544K89718K10064r0659l05817k31512k9809
39429G4615N0915M0958J13109K04797P3771k70505m78424l05243O6964K83103
39419a45940K33927Q2615p142j4158J2493L9449O7985J22518J94810J91503K6192
39408H04252k07000k72908q2025J70259K39646J09527o0677j54518j44639k1313
$$ plain form
39398 380604 548030 811029 952466 840893 543213 199320 -116680 -360323 -458631 -388390
39388 -388390 -237089 -89694 83668 335380 598270 739831 713001 560355 326830 74105
39378 74105 -91313 -152022 -283794 -637933 -1040209 -1126155 -816841 -443237 -312034 -363763
39368 -363763 -397222 -413869 -513275 -602798 -493730 -226167 -26495 53232 191647 456444
39358 456444 663179 667196 568641 502658 432085 304611 230530 310342 430701 443097 430479
39347 430479 561071 751472 735542 468153 224906 247654 473387 673603 709173 586962
39337 586962 399389 278363 311572 453581 590720 695854 823657 970050 1065526 1099667
39327 1099667 1110114 1058261 883876 684564 648337 778319 874884 822144 686195 503672
$$ packed form
39398C80604J67426K62999J41437j11573k97680l43893l16000k43643r8308P0241
39388c88390J51301J47395J73362K51712K62890J41561k6830j52646k33525k52725
39378G4105j65418o0709j31772l54139m02276q5946L09314L73604J31203n1729
39368c63763l3459j6647r9406q9523J09068K67563J99672P9727J38415K64797
39358D56444K06735M017r8555o5983p0573j27474p4081P9812J20359J2396j2618
39347D30479J30592J90401j5930k67389k43247K2748K25733K00216L5570j22211
39337E86962j87573j21026L3209J42009J37139J05134J27803J46393R5476L4141
39327A099667J0447n1853j74385j99312l6227J29982R6565n2740j35949j82523
$$ plain form
39317 503672 233598 -13092 3208 258919 398434 254356 140100 358250 696834 765636
39307 765636 616359 615979 831016 970617 901298 793621 723282 528723 172302 -101479
39297 -101479 -110494 35670 165593 242938 234919 72194 -132860 -124472 78116 104394 -209966
39286 -209966 -488124 -329551 79154 221489 -35791 -345632 -412192 -264447 -16869 299544
39276 299544 602038 728394 643156 476634 305826 99974 -70768 -16211 274725 534682
39266 534682 569266 525167 631318 831452 898267 814450 786685 893251 955046 818526 578601
39255 578601 419793 374541 354300 315232 261770 156311 -30126 -204673 -228140 -109799
39245 -109799 -7646 -19052 -87096 -136190 -167577 -169323 -72184 110323 219722 154295 38525
$$ packed form
39317E03672k70074k46690J6300K55711J39515j44078j14256K18150L38584O8802
39307G65636j49277l80K15037J39601o9319j07677p0339j94559l56421k73781
39297a01479r015J46164J29923P7345q019j62725k05054Q388K02588K6278l14360
39286b09966k78158J58573M08705J42335k57280l09841o6560J47745K47578L16413
39276B99544L02494J26356q5238j66522j70808k05852j70742N4557K90936K59957
39266E34682L4584m4099J06151K00134O6815q3817k7765J06566O1795j36520k39925
39255E78601j58808m5252k0241l9068n3462j05459j86437j74547k3467J18341
39245a09799J02153j1406o8044m9094l1387j746R7139J82507J09399o5427j15770
$$ plain form
39234 38525 55976 194631 314299 401744 565754 787992 871405 687909 338097 13029
39224 13029 -191704 -286603 -323042 -364383 -443194 -527590 -596497 -711045 -894586 -994997 -849104
39213 -849104 -561726 -396134 -366123 -193136 246982 689943 831670 674132 359124 -89860
39203 -89860 -611778 -907909 -728483 -263366 58464 111389 127289 236759 274704 101599
39193 101599 -159788 -319844 -341315 -255679 -53722 212994 381419 366423 283137 262101
39183 262101 261023 193175 133305 223840 427662 544129 474588 330683 242488 175498 13992
39172 13992 -239350 -438189 -462576 -347671 -214822 -115451 7690 212724 461054 644368
39162 644368 683373 592909 473958 436620 494481 544077 494753 394488 350079 351580 303747
$$ packed form
39234C8525J7451J38655J19668Q7445J64010K22238Q3413j83496l49812l25068
39224A3029k04733r4899l6439m1341p8811q4396o8907j14548j83541j00411J45893
39213h49104K87378J65592L0011J72987M40118M42961J41727j57538l15008m48984
39203h9860n21918k96131J79426M65117L21830N2925J5900J09470L7945j73105
39193A01599k61387j60056k1471Q5636K01957K66716J68425j4996q3286k1036
39183B62101j078o7848n9870R0535K03822J16467o9541j43905q8195o6990j61506
39172A3992k53342j98839k4387J14905J32849R9371J23141K05034K48330J83314
39162F44368L9005r0464j18951l7338N7861M9596m9324j00265m4409J501m7833
$$ plain form
39151 303747 232844 294053 513539 695407 696578 637071 687716 787176 754530 576707 381898
39140 381898 208108 15424 -126861 -98463 43886 118749 96215 100968 142265 90252 -48276
39129 -48276 -95932 -20561 -21539 -185094 -308096 -224975 -76113 -48907 -53014 103709 357858
39118 357858 461119 328187 95118 -104779 -217464 -182748 7396 193910 202330 97442
39108 97442 89613 201197 248254 176651 183739 420536 763473 989192 1023629 913550 698928
39097 698928 446764 296452 323508 427007 476434 502833 612577 769772 820293 714450
39087 714450 554150 406941 220619 -32987 -265626 -401855 -488865 -577408 -584885 -408101
39077 -408101 -122297 76730 127774 170581 328594 541190 664251 641688 516126 356497
$$ packed form
39151C03747p0903O1209K19486J81868J171n9507N0645R9460l2646j77823j94809
39140C81898j73790j92684j42285K8398J42349P4863k2534M753M1297n2013j38528
39129d8276m7656P5371r78j63555j23002Q3121J48862K7206m107J56723K54149
39118C57858J03261j32932k33069j99897j12685L4716J90144J86514Q420j04888
39108I7442p829J11584M7057p1603P088K36797L42937K25719L4437j10079k14622
39097F98928k52164j50312K7056J03499M9427K6399J09744J57195N0521j05843
39087G14450j60300j47209j86322k53606k32639j36229q7010q8543p477J76784
39077d08101K85804J99027N1044M2807J58013K12596J23061k2563j25562j59629
$$ plain form
39067 356497 247629 269359 392171 455366 347697 157879 40489 -13875 -135160 -324386
39057 -324386 -411956 -302230 -116544 -16602 4968 60115 164135 209981 127214 -17101 -91761
39046 -91761 -35734 91240 173867 153547 83825 78682 211394 457017 706146 835889 818563
39035 818563 773537 839315 966524 944181 699741 440281 357365 318081 71035 -308374
39025 -308374 -459000 -254189 -9680 -52362 -302065 -445290 -352935 -136325 87438 276072
39015 276072 369700 319581 213716 221494 381568 546235 566475 462074 378200 410820 502319
39004 502319 517634 423424 344658 392142 496685 525665 508102 568717 657146 568608 279832
38993 279832 27334 -42177 -50142 -71965 81991 520715 925663 877454 426055 30237
$$ packed form
39067C56497j08868K1730J22812O3195j07669j89818j17390n4364j21285j89226
39057c24386q7570J09726J85686R9942K1570N5147J04020M5846q2767j44315p4660
39046i1761N6027J26974Q2627k0320o9722n143J32712K45623K49129J29743j7326
39035H18563m5026O5778J27209k2343k44440k59460q2916l9284k47046l79409
39025c08374j50626K04811K44509m2682k49703j43225R2355K16610K23763J88634
39015B76072R3628n0119j05865P778J60074J64667K0240j04401q3874L2620R1499
39004E02319J5315r4210p8766M7484J04543K8980j7563O0615Q8429q8538k88776
38993B79832k52498o9511p965k1823J53956M38724M04948m8209m51399l95818
$$ plain form
38983 30237 -19696 158338 330361 382163 261544 -22867 -287388 -302683 -102742 48937
38973 48937 49839 88777 321457 644006 880962 986603 960516 779787 547059 508045 760616
38962 760616 1099694 1296898 1384892 1515737 1693289 1830042 1940728 2073313 2138383 2023410
38952 2023410 1831177 1794028 1951637 2103028 2116174 2129021 2374213 2908280 3585633 4241016
38942 4241016 4839597 5474730 6260538 7231682 8339483 9530953 10813340 12260827 14002384
38933 14002384 16186799 18894987 22095988 25750754 29884797 34351938 38472468 41122856
38925 41122856 41407184 39262373 35396983 30769460 26185585 22168797 18910932 16299820
38917 16299820 14128097 12305749 10831243 9655752 8712770 8009702 7530257 7103372 6551570
$$ packed form
38983C0237m9933J78034J72023N1802j20619k84411k64521j5295J99941J51679
38973D8937R02L8938K32680L22549K36956J05641k6087j80729k32728l9014K52571
38962G60616L39078J97204Q7994J30845J77552J36753J10686J32585O5070j14973
38952B023410j92233l7149J57609J51391J3146J2847K45192N34067O77353O55383
38942D241016N98581O35133P85808R71144J107801J191470J282387J447487J741557
38933A4002384K184415K708188L201001L654766M134043M467141M120530K650388
38925D1122856K84328k144811l865390m627523m583875m016788l257865k611112
38917A6299820k171723j822348j474506j175491r42982p03068m79445m26885n51802
$$ plain form
38908 6551570 5930662 5417892 4987031 4448381 3842386 3495216 3533963 3604764 3313847 2775435
38898 2775435 2436550 2443610 2488248 2294377 1969596 1767173 1730247 1738030 1745429 1780852 1789954
38887 1789954 1674639 1468490 1314488 1262237 1222779 1137694 1056542 1010879 944230 836506
38877 836506 795263 943922 1284504 1713523 2085860 2230107 2045105 1681352 1495715 1680333
38867 1680333 2027772 2210740 2198711 2209783 2325663 2400348 2357126 2334388 2453812 2629823
38857 2629823 2717330 2718480 2748119 2892973 3167331 3499577 3708744 3621766 3289113 2971582
38847 2971582 2847589 2852650 2862502 2869878 2874572 2763295 2463106 2108225 1897357 1861300 1904415
38836 1904415 1989215 2135007 2310070 2471419 2641283 2802338 2803953 2548210 2203626 2042848
$$ packed form
38908F551570o20908n12770m30861n38650o05995l47170L8747P0801k90917n38412
38898B775435l38885P060M4638j93871l24781k02423l6926P783P399L5423R102
38887A789954j15315k06149j54002n2251l9458q5085q1152m5663o6649j07724
38877H36506m1243J48659L40582M29019L72337J44247j85002l63753j85637J84618
38867A680333L47439J82968j2029J1072J15880P4685m3222k2738J19424J76011
38857B629823Q7507J150K9639J44854K74358L32246K09167q6978l32653l17531
38847B971582j23993N061R852P376M694j11277l00189l54881k10868l6057M3115
38836A904415Q4800J45792J75063J61349J69864J61055J615k55743l44584j60778
$$ plain form
38826 2042848 2104992 2203964 2237364 2280917 2383132 2484584 2577305 2738086 2930510 2953739
38816 2953739 2691390 2282101 1948741 1758060 1627897 1486266 1348007 1282720 1334916 1427687
$$ packed form
38826B042848O2144R8972L3400M3553J02215J01452R2721J60781J92424K3229
38816B953739k62349m09289l33360j90681j30163j41631j38259o5287N2196R2771
$$ [...]
##END NTUPLES=NMR SPECTRUM
##END=
