##TITLE=31Pdec_LR-761-C1-M
 CDCl3, 24 sc
 27.6.2024
##JCAMPDX= 6.0         $$ Bruker NMR JCAMP-DX V2.0
##DATA TYPE= NMR SPECTRUM
##DATA CLASS= NTUPLES
##ORIGIN= UXNMR, Bruker Analytische Messtechnik GmbH
##OWNER= root
$$ XWIN-NMR		Version 3.5
$$ Thu Jun 27 16:27:53 2024 Russian Standard Time (UT+4h)  she@DPX200
##.OBSERVE FREQUENCY= 81.013821
##.OBSERVE NUCLEUS= ^31P
##.ACQUISITION MODE= SIMULTANEOUS
##.ACQUISITION SCHEME= undefined
##.AVERAGES= 24
##.DIGITISER RES= 17
##SPECTROMETER/DATA SYSTEM= spect
##.PULSE SEQUENCE= zgpg30
##.SOLVENT NAME= CDCl3
##.SHIFT REFERENCE= (INTERNAL, CDCl3, 0, 182.463)
##AUDIT TRAIL= $$ (NUMBER, WHEN, WHO, WHERE, WHAT)
$$ ##TITLE= Audit trail, XWIN-NMR		Version 3.5
$$ ##JCAMPDX= 5.01
$$ ##ORIGIN= Bruker BioSpin GmbH
$$ ##OWNER= she
$$ F:/spectra/data/she/nmr/P31/2/pdata/1/auditp.txt
$$ ##AUDIT TRAIL=  $$ (NUMBER, WHEN, WHO, WHERE, WHAT)
(   1,<2024-06-27 16:26:47.89 +0400>,<she>,<DPX200>,
      <created by zg, POWCHK disabled, PULCHK disabled
       configuration hash MD5:
       00 E9 B6 7A A2 85 ED C7 34 08 36 98 17 FE 4E 26
       data hash MD5: 32K
       F3 41 51 D7 58 6C 11 D4 7B F0 59 11 59 A6 A2 01>)
(   2,<2024-06-27 16:26:50.62 +0400>,<she>,<DPX200>,
      <Start of raw data processing
       efp BC_mod = 2 LB = 1.5 FT_mod = 6 PKNL = 1 PHC0 = 2719.096 PHC1 = 119.4863 SI = 64K 
       data hash MD5: 64K
       A3 C7 C8 44 AB B0 31 E5 8C F8 2E 5B DC E7 98 7B>)
(   3,<2024-06-27 16:27:05.65 +0400>,<she>,<DPX200>,
      <pk PHC0 = 91.3642 PHC1 = 0 
       data hash MD5: 64K
       66 32 AE 8D 84 B6 8C 3C 39 AC 9E B0 4C C0 FB 23>)
$$ ##END=
$$ 
$$ hash MD5
$$ 93 2A 9C 71 6E 12 AE B9 D0 FD F8 8F 61 27 F8 60
##$RELAX= 
##$RELAX= 
##$RELAX= 
##$RELAX= 
##$RELAX= 
##$RELAX= 
##$RELAX= 
##$RELAX= 
$$ Bruker specific parameters
$$ --------------------------
##$DU= <F:/spectra>
##$EXPNO= 2
##$NAME= <P31>
##$PROCNO= 1
##$TYPE= <nmr>
##$USER= <she>
##$AMP= (0..31)
100 100 100 100 100 100 100 100 100 100 100 100 100 100 100 100 100 100 
100 100 100 100 100 100 100 100 100 100 100 100 100 100 
##$AQSEQ= 0
##$AQ_mod= 1
##$AUNM= <au_zg>
##$AUTOPOS= <>
##$BF1= 81.014009
##$BF2= 200.13
##$BF3= 200.13
##$BF4= 200.13
##$BF5= 200.13
##$BF6= 200.13
##$BF7= 200.13
##$BF8= 200.13
##$BYTORDA= 1
##$CFDGTYP= 0
##$CFRGTYP= 5
##$CHEMSTR= <none>
##$CNST= (0..31)
1 1 145 1 1 1 1 1 1 1 1 1 1 1 1 1 1 1 1 1 1 1 1 1 1 1 1 1 1 1 1 1 
##$CPDPRG= <waltz16>
##$CPDPRG1= <>
##$CPDPRG2= <waltz16>
##$CPDPRG3= <>
##$CPDPRG4= <mlev>
##$CPDPRG5= <mlev>
##$CPDPRG6= <mlev>
##$CPDPRG7= <mlev>
##$CPDPRG8= <mlev>
##$CPDPRGB= <>
##$CPDPRGT= <>
##$D= (0..31)
0 1 0 0 0 0 0 0 0 0 0 0.03 2e-05 3e-06 0 0 0 0 0 0 0 0 0 0 0 0 0 0 0 0 
0 0 
##$DATE= 1719491207
##$DBL= (0..7)
120 120 120 11 120 120 24 19 
##$DBP= (0..7)
150 150 150 150 150 150 150 150 
##$DBP07= 0
##$DBPNAM0= <>
##$DBPNAM1= <>
##$DBPNAM2= <>
##$DBPNAM3= <>
##$DBPNAM4= <>
##$DBPNAM5= <>
##$DBPNAM6= <>
##$DBPNAM7= <>
##$DBPOAL= (0..7)
0.5 0.5 0.5 0.5 0.5 0.5 0.5 0.5 
##$DBPOFFS= (0..7)
0 0 0 0 0 0 0 0 
$$ [...]
##$SUBNAM2= <"">
##$SUBNAM3= <"">
##$SUBNAM4= <"">
##$SUBNAM5= <"">
##$SUBNAM6= <"">
##$SUBNAM7= <"">
##$SUBNAM8= <"">
##$SUBNAM9= <"">
##$SW= 369.568048894756
##$SWIBOX= (0..15)
0 1 3 0 0 0 0 0 0 0 0 0 0 0 0 0 
##$SW_h= 29940.119760479
##$TD= 32768
##$TD0= 1
##$TE= 0
##$TE2= 300
##$TE3= 300
##$TEG= 300
##$TL= (0..7)
0 120 53 12 22 120 120 120 
##$TP= (0..7)
150 150 150 150 150 150 150 150 
##$TP07= 0
##$TPNAME0= <>
##$TPNAME1= <>
##$TPNAME2= <>
##$TPNAME3= <>
##$TPNAME4= <>
##$TPNAME5= <>
##$TPNAME6= <>
##$TPNAME7= <>
##$TPOAL= (0..7)
0.5 0.5 0.5 0.5 0.5 0.5 0.5 0.5 
##$TPOFFS= (0..7)
0 0 0 0 0 0 0 0 
##$TUNHIN= 0
##$TUNHOUT= 0
##$TUNXOUT= 0
##$USERA1= <user>
##$USERA2= <user>
##$USERA3= <user>
##$USERA4= <user>
##$USERA5= <user>
##$V9= 5
##$VALIST= <valist>
##$VCLIST= <CCCCCCCCCCCCCCC>
##$VD= 0
##$VDLIST= <DDDDDDDDDDDDDDD>
##$VPLIST= <PPPPPPPPPPPPPPP>
##$VTLIST= <TTTTTTTTTTTTTTT>
##$WBST= 1024
##$WBSW= 4
##$XGAIN= (0..3)
0 0 0 0 
##$XL= 0
##$YL= 0
##$YMAX_a= 14790
##$YMIN_a= -15230
##$ZGOPTNS= <>
##$ZL1= 120
##$ZL2= 120
##$ZL3= 120
##$ZL4= 120
##$ABSF1= 0
##$ABSF2= 0
##$ABSG= 0
##$ABSL= 0
##$ALPHA= 0
##$AQORDER= 0
##$ASSFAC= 0
##$ASSFACI= 0
##$ASSFACX= 0
##$ASSWID= 0
##$AUNMP= <proc_1d>
##$AZFE= 0.1
##$AZFW= 0.5
##$BCFW= 0
##$BC_mod= 2
##$BYTORDP= 0
##$COROFFS= 0
##$CY= -3
##$DATMOD= 1
##$DC= 0
##$DFILT= <>
##$DTYPP= 0
##$F1P= 0
##$F2P= 0
##$FCOR= 1
##$FTSIZE= 65536
##$FT_mod= 6
##$GAMMA= 0
##$GB= 0
##$INTBC= 1
##$INTSCL= 9.790993e-09
##$ISEN= 30
##$LB= 1.5
##$LEV0= 0
##$LPBIN= 0
##$MAXI= 10000
##$MC2= 0
##$MEAN= 0
##$ME_mod= 0
##$MI= 50
##$NCOEF= 0
##$NC_proc= -6
##$NLEV= 6
##$NOISF1= 182.463
##$NOISF2= 159.3651
##$NSP= 0
##$NTH_PI= 0
##$NZP= 0
##$OFFSET= 182.463
##$PC= 4
##$PHC0= 2810.46
##$PHC1= 119.4863
##$PH_mod= 1
##$PKNL= yes
##$PPARMOD= 0
##$PSCAL= 0
##$PSIGN= 0
##$REVERSE= no
##$SF= 81.0140089999434
##$SI= 65536
##$SIGF1= 159.3651
##$SIGF2= -187.1042
##$SINO= 113.3802
##$SIOLD= 16384
##$SREGLST= <1H.CDCl3>
##$SSB= 0
##$STSI= 65536
##$STSR= 0
##$SW_p= 29940.119760479
##$SYMM= 0
##$S_DEV= 0
##$TDeff= 32768
##$TDoff= 0
##$TI= <>
##$TILT= no
##$TM1= 0
##$TM2= 0
##$TOPLEV= 0
##$USERP1= <user>
##$USERP2= <user>
##$USERP3= <user>
##$USERP4= <user>
##$USERP5= <user>
##$WDW= 1
##$XDIM= 65536
##$YMAX_p= 511716751
##$YMIN_p= -12804021
$$ End of Bruker specific parameters
$$ ---------------------------------
##NTUPLES= NMR SPECTRUM
##VAR_NAME=  FREQUENCY,     SPECTRUM/REAL,   SPECTRUM/IMAG
##SYMBOL=    X,             R,               I
##VAR_TYPE=  INDEPENDENT,   DEPENDENT,       DEPENDENT
##VAR_FORM=  AFFN,          ASDF,            ASDF
##VAR_DIM=   65536,         65536,           65536
##UNITS=     HZ,            ARBITRARY UNITS, ARBITRARY UNITS
##FACTOR=    0.456856943014862, 1,           1
##FIRST=     14782.0589164792, 0,            0
##LAST=      -15158.0608439998, 0,           0
##MIN=       -15158.0608439998, -12804021,   0
##MAX=       14782.0589164792, 511716751,    0
$$ Real data points
##PAGE= N=1
##DATA TABLE= (X++(R..R)), XYDATA
$$ [...]
47244 64660 318410 280721 -293506 -1069989 -1366351 -1018581 -553683 -409630 -418091 -216248
47234 -216248 182480 426992 237848 -318921 -825362 -808001 -229421 389198 540670 283146
47224 283146 -34429 -358487 -811455 -1169662 -1028977 -476773 -54987 6522 -289 92003
47214 92003 23626 -347427 -692711 -668533 -322287 174435 767024 1235981 1134107 387299
47204 387299 -395640 -616590 -419552 -345670 -509798 -554318 -269559 165432 515896 727594
47194 727594 840858 916606 1018945 1088749 930054 510446 131326 57792 111809 -88360
47184 -88360 -580654 -1036985 -1219880 -1172810 -995221 -721647 -429561 -198946 57528 469166
47174 469166 881517 929175 532517 93879 59974 443391 895816 1117273 1058661 821231
47164 821231 519465 245296 75129 66784 233297 495830 686132 666975 473149 289843
47154 289843 269428 391522 505358 481533 314983 97268 -95900 -270533 -460817 -654353
47144 -654353 -816727 -936925 -963243 -758110 -270844 272201 551351 552553 555285 649012 539018
47133 539018 29154 -550827 -717976 -505726 -402910 -629795 -822409 -561775 41581 480740
47123 480740 422879 -30985 -566752 -944633 -1061408 -893044 -499324 -62313 191800 193140
47113 193140 122277 209132 431865 536076 408573 290622 467268 819877 889658 426219
47103 426219 -275417 -675096 -543824 -126691 205275 338042 396800 448901 397704 213365
47093 213365 92586 211264 406969 340731 -22334 -331272 -316855 -116625 -14873 -66370
47083 -66370 -143023 -176114 -156656 -38565 151190 225940 74666 -128018 -177568 -203518 -513257
47072 -513257 -1132758 -1774725 -2235973 -2555790 -2788541 -2902367 -2928675 -2931799 -2783118 -2254881
47062 -2254881 -1426551 -720191 -411782 -359797 -333867 -324497 -348198 -234718 110965 426298
47052 426298 368403 -24929 -402648 -556645 -579173 -610877 -647299 -590432 -338222 148881
47042 148881 740993 1163371 1267387 1190436 1093525 872872 372736 -219425 -517080 -481367
47032 -481367 -503468 -843087 -1260378 -1366501 -1124687 -806391 -600763 -487861 -428782 -464033
47022 -464033 -593171 -696236 -640603 -411195 -96869 217616 498593 702575 739596 592163
47012 592163 454958 599211 1017203 1357056 1364624 1242424 1329487 1537830 1455900 1018330
47002 1018330 680944 775193 1039008 1053144 863750 819802 965327 992609 764153 516498
46992 516498 484130 610301 718940 725884 576128 205009 -285398 -588664 -504859 -183317
46982 -183317 78671 183001 251456 392891 595540 800717 950968 982179 870490 685528
46972 685528 530748 437298 353804 219333 35306 -87662 21109 369681 631738 415191
46962 415191 -186070 -532605 -162661 576532 916090 614302 178940 108939 278212 263476
46952 263476 -6127 -240349 -289339 -309883 -407792 -402436 -95723 387971 713315 740334 670354
46941 670354 762372 1008723 1161038 1028925 672979 307712 94699 66884 181988 357859
46931 357859 469143 406372 188615 -20281 -49816 126401 383317 570701 647032 710235
46921 710235 888783 1168163 1333029 1136446 546743 -208471 -848267 -1234615 -1355153 -1209661
46911 -1209661 -815249 -302790 98935 234245 148691 11212 -77429 -161413 -309498 -460955
46901 -460955 -452428 -219504 76641 190599 60951 -131089 -207266 -233140 -426174 -835861
46891 -835861 -1221017 -1302461 -1069922 -758005 -564578 -500324 -490568 -464586 -293241 185907
46881 185907 920707 1522149 1594853 1184846 730951 556957 573740 512682 274849 -28638
46871 -28638 -229969 -205998 39984 309838 357674 187287 47319 49245 13532 -147920 -154146
46860 -154146 251587 815391 1039080 844806 600882 510039 380293 87335 -132417 -56778
46850 -56778 150526 186561 22319 -161878 -292731 -417902 -505515 -454506 -270749 -72661
46840 -72661 54982 106042 98587 60495 5448 -137901 -463463 -873374 -1059872 -823878 -303310
46829 -303310 225387 638455 922495 998011 799407 450334 158006 -23147 -156747 -220933
46819 -220933 -135385 47273 181759 263069 433680 731372 989594 1035234 868423 611716
46809 611716 374860 196128 59329 -20622 98137 581902 1305575 1764246 1529714 784726
46799 784726 197981 219672 642512 893787 629623 -1185 -567218 -765066 -670485 -595492
46789 -595492 -688201 -765775 -610720 -287739 -4429 213448 469841 695766 680453 421139
46779 421139 190816 191850 328836 363308 118504 -463846 -1235176 -1783548 -1733272 -1190054
46769 -1190054 -657463 -431908 -333120 -128347 85417 121340 55820 68240 103296 -31258
46759 -31258 -335323 -626759 -798591 -843346 -700875 -329505 97101 298836 226581 116780
46749 116780 174020 341317 432701 392843 368867 547128 913728 1188653 1091211 693050
46739 693050 365857 318093 371342 321839 300082 519280 824605 827043 454072 53239 -94884
46728 -94884 -86058 -121636 -175528 -84373 194691 565515 922714 1178443 1254343 1172539 1097578
46717 1097578 1172774 1325981 1308441 936507 290116 -303334 -504870 -262221 115631 248851
46707 248851 58159 -215320 -334588 -302197 -279881 -409485 -736166 -1160636 -1411571 -1223865
46697 -1223865 -659698 -136138 -828 -159008 -243277 -66380 252325 540143 731812 765096
46687 765096 546589 141732 -168873 -197037 -108631 -174524 -311577 -133440 475045 1088700
46677 1088700 1229307 934662 597671 386637 173291 -7428 134073 618222 970185
46668 970185 815977 419956 267375 337363 250406 20410 104281 617889 1029319 894844
46658 894844 492511 376219 595416 749910 626574 367603 102269 -168880 -320538 -139311
46648 -139311 272755 465808 197738 -210763 -257347 184977 854057 1457583 1831891 1878955
46638 1878955 1612442 1251146 1053589 1018566 889053 485205 -75984 -511505 -622835 -410122
46628 -410122 -50282 217391 295700 349643 608220 1015995 1235434 1084658 813405 766943
46618 766943 873622 702906 48078 -761589 -1224404 -1190883 -909912 -676749 -597438 -637474
46608 -637474 -713157 -704727 -519855 -210426 55835 180204 201499 143795 -72203 -448553
46598 -448553 -737288 -633195 -151726 331436 475569 312291 140521 190510 470386 843893
46588 843893 1123966 1132545 822808 377266 78460 29949 75986 36857 -59857 -57351 80613
46577 80613 203744 163743 -10663 -166453 -216212 -230238 -338922 -574293 -832882 -985349
46567 -985349 -986226 -872259 -716382 -629957 -736120 -1018866 -1214796 -1008761 -405287 209679
46557 209679 474399 429382 373790 428902 434557 287169 173632 325045 634244 702506 301201
46546 301201 -338991 -792349 -920645 -954874 -1097426 -1216093 -1052334 -615621 -185192 41032
46536 41032 104423 91140 -298 -130183 -173636 -133601 -206106 -461187 -620684 -365701 238224
46525 238224 813753 1063862 903096 351039 -412944 -976467 -1016509 -708301 -518673 -578601
46515 -578601 -580837 -341937 -86743 -19065 34187 291174 599491 662301 505840 404928
46505 404928 428264 355531 49639 -319277 -474209 -321046 -2646 262683 387528 480133
46495 480133 666802 882703 971492 961217 999762 980463 561567 -264317 -937590 -963969
46485 -963969 -541157 -219510 -145819 -60996 80763 -9419 -415867 -800697 -871936 -725192
46475 -725192 -557357 -353134 -70922 115659 33464 -175499 -211487 -42212 36634 -201124
46465 -201124 -571092 -609257 -59779 780463 1283549 1121025 586560 187709 47550 -78053
46455 -78053 -291523 -384712 -208555 97517 360487 592596 793256 759422 316687 -378257
46445 -378257 -944852 -1124105 -929247 -578974 -385958 -565046 -1006103 -1341767 -1353463 -1184780
46435 -1184780 -1052824 -944639 -787002 -726919 -951672 -1313236 -1430818 -1174291 -794364 -541560
46425 -541560 -403157 -296321 -279177 -400382 -500311 -376632 -102659 -1441 -274992 -774527
46415 -774527 -1182758 -1340428 -1328813 -1282412 -1208964 -1004104 -588971 -13462 544118 879674
46405 879674 920546 795041 687716 615779 437256 107619 -200841 -324614 -334216 -402425
46395 -402425 -548291 -674964 -773843 -879884 -869421 -551402 6391 466498 614588 579174
46385 579174 577637 622941 597984 474534 323587 199912 122280 94488 62184 -86665 -410368
46374 -410368 -842104 -1238661 -1432804 -1269988 -733416 -41925 510240 816737 938654 879451
46364 879451 600013 238786 43453 30436 -30316 -224350 -352717 -263572 -43001 212638
46354 212638 488443 591147 186800 -658285 -1319699 -1298616 -777243 -215130 262286 703224
46344 703224 914021 722802 429306 439641 592010 416560 -1227 -29126 576844 1319278
46334 1319278 1697371 1782008 1833474 1810534 1559151 1133937 634295 9783 -687998 -1116700
46324 -1116700 -1009061 -549833 -134794 82214 174927 161345 10206 -180959 -264688 -241870
46314 -241870 -204591 -170469 -135135 -164931 -243588 -151321 261243 748542 865523 480420 -100800
46303 -100800 -502968 -573038 -311731 233612 887246 1314006 1247471 753708 199393 -63982
46293 -63982 14525 195678 226328 87992 -41732 -37271 35807 29074 -118317 -339490 -503339
46282 -503339 -497308 -317970 -106716 -27606 -84941 -134229 -97944 -82386 -226872 -497125 -679109
46271 -679109 -552164 -72383 549694 953318 901921 498794 87562 -73865 -9150 75008
46261 75008 25005 -91846 -21304 385622 865064 907714 393853 -134955 -108615 332206
46251 332206 592682 497562 421668 543059 537754 235418 58634 417484 1032675 1304467
46241 1304467 1123134 885339 860603 955832 1015115 955512 647874 43186 -574676 -808602
46231 -808602 -656516 -485895 -464067 -352701 24787 433488 542569 371056 206423 208319
46221 208319 285522 307313 275709 273160 324842 361157 321126 256956 256090 255309 72190 -303810
46209 -303810 -612545 -660840 -606700 -699891 -870295 -848071 -620898 -456047 -455460 -399860 -126527
46198 -126527 202037 342669 286188 192613 163502 193851 225317 159513 -61026 -320873 -410531
46187 -410531 -282409 -75008 146817 456936 794986 884283 599071 209632 44720 60396
46177 60396 -33181 -343941 -743023 -1138080 -1511894 -1711764 -1504297 -930094 -379841 -194456
46167 -194456 -342881 -593912 -832520 -1038140 -1079797 -783355 -224322 240638 341085 195420
46157 195420 147549 366562 722810 1025470 1230367 1365519 1383938 1216313 926798 699129
46147 699129 646634 692976 653579 402299 -36658 -525164 -928590 -1190548 -1268346 -1040092
46137 -1040092 -408288 460055 1139834 1323177 1112755 826767 598366 321163 -69261
46128 -69261 -442590 -599608 -412503 131819 867313 1452832 1637778 1543902 1495255 1537347
46118 1537347 1337107 650989 -287073 -966572 -1073123 -690836 -184524 23979 -277024
46109 -277024 -881711 -1293314 -1169123 -601986 57756 522359 657329 457034 107274 -46407
46099 -46407 207601 704265 1065488 1070853 795805 476659 352226 550684 980529 1355500
46089 1355500 1432014 1214556 897649 690823 740588 1073189 1497107 1692105 1541917 1280669
46079 1280669 1177955 1195271 1106841 836642 488520 150923 -119930 -216463 -108176 16112
46069 16112 -32926 -144906 -72595 163430 311677 299070 293041 339081 262053 9201 -207414
46058 -207414 -224202 -117507 20019 209103 362696 253200 -83870 -190331 289079 1099422
46048 1099422 1644245 1619139 1169860 597030 155340 -1544 51729 27311 -229569 -545566
46038 -545566 -764945 -1055267 -1546720 -1885256 -1594133 -785480 -54432 305952 517909 737462
46028 737462 784536 593534 445554 524961 661870 749080 985477 1407955 1610728 1327141
46018 1327141 916950 808008 776520 344623 -322080 -539197 -61767 672276 1267156 1738095
46008 1738095 2042383 1856508 1131537 410608 217054 428573 592023 603272 719805 1064841
45998 1064841 1461858 1701688 1723707 1565935 1303887 991034 569070 -33150 -624247 -791425
45988 -791425 -392665 190495 499551 513389 496358 540039 550027 528554 540052 491873 262863
45977 262863 -30841 -213075 -407288 -860609 -1444222 -1704126 -1436426 -877310 -316181 103642
45967 103642 184161 -254382 -951756 -1311745 -1168059 -1030101 -1255017 -1387541 -794940 313167
45957 313167 1052526 978517 533329 337091 482587 693554 817035 886638 889616 737960
45947 737960 436118 125623 -37366 11390 223879 473267 634077 657351 550182 311665
45937 311665 -29675 -331210 -420877 -317781 -252777 -377553 -544664 -503776 -256651 -45105
45927 -45105 22234 135975 472603 879515 1068556 1033604 1027241 1127760 1107933 827976 488730
45916 488730 312454 213680 44862 -40069 180110 516776 529488 142626 -291264 -570119
45906 -570119 -836940 -1065230 -834286 52115 1073987 1530527 1371162 1126204 1162535 1383045
45896 1383045 1559760 1562155 1273892 674355 66800 -119048 129697 342860 169056 -211249
45886 -211249 -415637 -347770 -148025 132056 516536 854712 883185 592325 319703 360263
45876 360263 604905 701525 512807 250047 132787 89064 -80255 -365104 -579637 -683386
45866 -683386 -818974 -989518 -964113 -642858 -283809 -165717 -220410 -248727 -330221 -685380
45856 -685380 -1207925 -1500605 -1416142 -1234719 -1192460 -1121514 -745160 -128668 377448 538559
45846 538559 401983 125804 -188564 -484208 -680860 -677905 -429523 -28643 298291 332918
45836 332918 29040 -457226 -864282 -955396 -669668 -231812 -17578 -185334 -501582 -635519
45826 -635519 -530729 -353887 -207943 -108505 -142511 -384386 -696038 -870195 -942027 -1083795
45816 -1083795 -1225897 -1123836 -823202 -681860 -833341 -997280 -960515 -858199 -775090 -479649
45806 -479649 118600 597233 522086 85877 -165817 -69401 98865 128621 -16113 -460111
45796 -460111 -1246406 -1912360 -1803139 -953437 -165600 1109 -130788 2903 371577 565316
45786 565316 528164 580721 847119 1115601 1243951 1308226 1318946 1147649 816568 548289
45776 548289 422248 270930 39212 -59701 59131 90005 -242449 -711649 -870222 -666477
45766 -666477 -427228 -308616 -166134 18179 13226 -209221 -284622 34894 475709 621542
45756 621542 447501 172599 -183383 -692802 -1104074 -989280 -344586 313149 527572 308416
45746 308416 -74450 -399627 -532573 -455730 -365318 -484944 -711127 -723301 -509004 -430007
45736 -430007 -636737 -798257 -636240 -357495 -240445 -112287 359678 1065775 1554136 1618792
45726 1618792 1429289 1170065 899449 694423 594804 455339 172718 -14848 188060 608990
45716 608990 767295 554603 347105 404510 585960 752277 995594 1278433 1264431 790706
45706 790706 189567 -142152 -224655 -279853 -313842 -238657 -180924 -302317 -458026 -387422 -150408
45695 -150408 -36047 -92132 -71422 163245 466816 646247 613319 325723 -150398 -533970
45685 -533970 -586460 -488800 -635414 -999526 -1064351 -528430 259630 780472 955283 1014950
45675 1014950 1028912 905644 679088 424216 -6616 -777958 -1628858 -2015848 -1755706 -1206546
45665 -1206546 -755433 -466869 -320233 -385079 -543018 -413106 117300 585236 561020 322911
45655 322911 456888 926845 1078420 584281 -117101 -445093 -297018 109124 568897 831089
45645 831089 614419 6371 -484131 -594927 -694267 -1111024 -1432328 -1022184 -33474 709385
45635 709385 775361 472602 118995 -361780 -912004 -1047771 -518107 184972 442919 333137
45625 333137 360603 587874 571794 128069 -338634 -385885 -46285 378288 750365 1099453
45615 1099453 1367359 1415479 1272138 1179266 1312813 1552168 1636724 1524516 1454119 1586069
45605 1586069 1723837 1560102 1123472 757148 659988 694497 704334 755577 926101 1101860
45595 1101860 1183983 1287788 1485158 1523929 1121648 456885 40795 90218 315626 388938
45585 388938 364175 521199 980997 1595278 2085632 2200956 1861616 1252909 704602 420267
45575 420267 393934 591410 1046110 1685421 2211456 2326977 2046852 1662965 1409878 1272969
45565 1272969 1144634 1053739 1122388 1303538 1297171 855565 140685 -375941 -420489 -194095
45555 -194095 -63857 -114245 -142939 11677 326812 714111 1074818 1247717 1103723 727932
45545 727932 345698 40891 -285342 -644303 -845368 -746258 -463597 -225221 -128704 -139035
45535 -139035 -208883 -293251 -337781 -356217 -445976 -643070 -840888 -931537 -937191 -912515 -817018
45524 -817018 -609499 -403300 -392729 -634962 -981977 -1202243 -1118573 -694848 -79651 466293
45514 466293 752573 756050 553446 282158 193058 532876 1205844 1694554 1539695 844948
45504 844948 118911 -324416 -588419 -853271 -1086244 -1169395 -1101110 -950686 -761521 -604371
45494 -604371 -591169 -724902 -857385 -910208 -1010737 -1259176 -1468508 -1331285 -804560 -148979
45484 -148979 394984 775607 964589 859720 478538 78822 -86409 -31727 109060 382840
45474 382840 910145 1499035 1684436 1302305 783652 642337 826327 860399 554794 236680
45464 236680 223894 378651 351283 46270 -359710 -710058 -948275 -984630 -712292 -171521
45454 -171521 442945 941642 1211753 1180187 850217 368573 -60425 -328581 -426631 -368041
45444 -368041 -223596 -139756 -155271 -78527 243304 592663 579114 162711 -301275 -583529
45434 -583529 -838321 -1217312 -1530497 -1520157 -1253309 -984387 -779642 -541983 -309017 -251834
45424 -251834 -393599 -539863 -485553 -140697 479796 1183338 1572291 1360973 764560 339918
45414 339918 349485 470243 239185 -378723 -1008733 -1332317 -1357762 -1250958 -1060104 -705772
45404 -705772 -208719 195153 283972 171834 231846 612877 991536 966417 572842 187335
45394 187335 3350 -130436 -365006 -631292 -825250 -947083 -953653 -730046 -364934 -213370
45384 -213370 -455087 -765763 -699849 -301987 -39460 -121302 -175810 243293 998706 1443264
45374 1443264 1170871 529109 234704 526181 910484 836522 393247 102689 187333 401502
45364 401502 533732 640617 692692 441297 -115204 -518525 -442756 -186484 -177666 -261344
45354 -261344 10814 534482 682640 228526 -286684 -294732 97329 381939 319016 66096
45344 66096 -151980 -250280 -264739 -302593 -445923 -614782 -625592 -447743 -274655 -282229 -455937
45333 -455937 -699531 -939326 -1060972 -942826 -655392 -453400 -462990 -529257 -453255 -209759
45323 -209759 132997 493191 688485 520102 80773 -264663 -362676 -477251 -820897 -1155082
45313 -1155082 -1125174 -756904 -315929 119982 604332 997174 1069380 851676 559362 261708
45303 261708 -52129 -203814 -27157 229881 149129 -205044 -323916 -8473 370028 496293
45293 496293 543765 759032 1031949 1191104 1379990 1750330 2010483 1699310 843728 20835
45283 20835 -236208 102815 646181 940208 818836 565028 648913 1159848 1623059 1558626
45273 1558626 1070754 636534 446891 288576 34073 -118406 15945 317013 550420
45264 550420 646543 653483 586651 484482 483119 650423 799887 641980 147297 -343544 -425678
45253 -425678 -22583 536810 814977 641405 226233 -57291 14820 378398 769164 919149
45243 919149 729828 322014 -76474 -299006 -294639 -72671 308827 706306 959175 1025198
45233 1025198 956653 757230 425217 140817 162405 441501 605449 489311 396359 563532
45223 563532 674620 352394 -62604 182595 1138733 1919107 1792906 1047504 472284 390380
45213 390380 579889 823700 1049080 1081160 746289 222354 -94721 -113294 -123549 -327067
45203 -327067 -605122 -811260 -966305 -1040461 -856332 -422408 -127420 -334319 -891296 -1273160
45193 -1273160 -1160224 -704054 -259031 -17874 82581 223432 510240 865281 1111502
45184 1111502 1175354 1138489 1056634 853020 503394 210423 199221 369747 353809 -40092
45174 -40092 -606251 -1032641 -1244486 -1329365 -1264770 -944783 -456410 -104949 -74033 -212615
45164 -212615 -275716 -242360 -224939 -177518 32920 270880 176360 -280428 -578201 -278425
45154 -278425 287512 325074 -466685 -1584279 -2380294 -2670063 -2586078 -2231826 -1742153 -1377968
45144 -1377968 -1210740 -902216 -158359 713881 1080908 783739 304784 101740 120850 66780
45134 66780 -177814 -581451 -1131844 -1718580 -2019325 -1776430 -1139194 -533461 -211813 -90983
45124 -90983 -15403 5030 -99711 -237372 -199539 31377 146829 -150973 -694524 -957727
45114 -957727 -720515 -392242 -449159 -762171 -837436 -595333 -449479 -595590 -711825 -529724
45104 -529724 -252999 -144922 -99682 32885 44931 -281166 -679635 -720358 -452922 -266800
45094 -266800 -232479 -90992 140840 102701 -274012 -563220 -479907 -311095 -461989 -894999
45084 -894999 -1283405 -1466534 -1491791 -1411803 -1296091 -1285616 -1405589 -1464155 -1345716 -1246626
45074 -1246626 -1371100 -1526126 -1320319 -725457 -152428 75758 93016 229994 541463 735557
45064 735557 538351 29651 -431742 -601964 -596556 -675084 -854163 -899484 -712048 -530082
45054 -530082 -642935 -1038121 -1447857 -1642693 -1571251 -1315659 -1045424 -945260 -1051584 -1188263
45044 -1188263 -1160628 -984366 -850509 -900726 -1092245 -1243960 -1195234 -996082 -941424 -1273994
45034 -1273994 -1819334 -2102113 -1919310 -1609875 -1612378 -1927409 -2193974 -2137361 -1725951 -1027419
45024 -1027419 -191451 473441 676648 444582 89946 -110495 -81609 123496 360716 412430
45014 412430 200878 -19292 100751 558359 995541 1153984 1118424 1077405 1075770 1079159 1065426
45003 1065426 947164 601346 102322 -254752 -318173 -321242 -579768 -1036842 -1286502 -1029367
44993 -1029367 -385633 230061 463361 283410 -16848 -82833 187926 584317 818028 767760
44983 767760 504014 183596 -34762 -61208 72237 275516 526313 838943 1098095 1074572
44973 1074572 687972 134324 -327851 -582281 -554359 -116867 657925 1279091 1217265 561395
44963 561395 16396 113449 644777 1050354 1144611 1172859 1268953 1234940 934384 588630
44953 588630 478251 539559 484152 216364 -82580 -232210 -219423 -125469 -78312 -240638
44943 -240638 -619265 -892425 -690835 -120424 242535 6000 -579594 -939450 -775418 -242713
44933 -242713 269033 393534 40696 -431101 -496108 -102791 189945 -47959 -495711 -546199
44923 -546199 -192919 -6480 -295164 -749686 -980049 -990300 -968417 -934253 -798522 -561062
44913 -561062 -287615 -29370 156635 261628 427074 783585 1153314 1165629 754525 297346
44903 297346 145613 242090 322532 270586 124271 -61458 -181617 -73087 284172 660933
44893 660933 793831 617005 234489 -183230 -431712 -405483 -275514 -331368 -578442 -728475
44883 -728475 -663991 -616422 -749226 -886060 -866873 -865338 -1054766 -1200573 -930430 -275235
44873 -275235 358753 667238 662288 526274 481527 680178 989237 1013042 574494 52164
44863 52164 -18524 416981 926827 1116164 924830 522416 152404 -18516 -99353 -372134
44853 -372134 -794342 -862773 -291680 434311 619928 282251 26380 131339 307290 320668
44843 320668 278426 215258 -43025 -432603 -564365 -308337 -38892 -61543 -188881 -141498
44833 -141498 2071 51972 78723 213157 329086 246606 63171 26 78751 191394
44823 191394 324790 481186 541986 445917 348923 379665 391196 192802 -115753 -294987
44813 -294987 -342568 -472514 -778965 -1123621 -1321869 -1308188 -1175046 -1114993 -1200316 -1196873 -839523
44802 -839523 -343677 -270579 -706272 -1006180 -700562 -244105 -347636 -860586 -969453 -420362
44792 -420362 111016 -23649 -663437 -1211493 -1356480 -1182559 -894040 -684769 -661551 -705485
44782 -705485 -582383 -301878 -151735 -267133 -413350 -349571 -179753 -155320 -310579 -479259
44772 -479259 -532289 -438790 -218627 20044 111302 24468 -83514 -99381 -91460 -121555 -102013
44761 -102013 18719 107567 68178 62745 302337 714315 1021705 1090727 1019072 930785 858208
44750 858208 800681 748728 659044 513797 375218 291378 201872 25520 -227360 -511469
44740 -511469 -817298 -1098736 -1263733 -1351721 -1557007 -1913501 -2132655 -1975728 -1618319 -1367858
44730 -1367858 -1179499 -820867 -422665 -415109 -867837 -1312697 -1358810 -1117401 -851631 -576041
44720 -576041 -252967 -58592 -122472 -227549 -103045 142840 199729 33875 -132705 -226564
44710 -226564 -374775 -600088 -779877 -887198 -971246 -924140 -604578 -202754 -110472 -345518
44700 -345518 -466032 -190206 252228 563059 798761 1076229 1197818 969482 675608 790409
44690 790409 1291788 1671159 1628285 1378327 1202358 1053217 776345 454735 313883 416966
44680 416966 618219 743545 724100 630143 626659 795921 975742 920334 663948 530471
44670 530471 679924 853329 751904 497576 459668 715468 976589 1060320 1141187 1408903
44660 1408903 1706453 1724252 1441224 1141387 1007270 915949 708721 471702 386740 419239
44650 419239 370675 221743 196279 412432 671124 728822 616178 500631 369297 103843
44640 103843 -192159 -240311 -10441 171682 60250 -187933 -289900 -255219 -315766 -540106
44630 -540106 -738434 -732966 -554262 -363657 -311806 -476358 -807544 -1099586 -1120409 -836265
44620 -836265 -466894 -272973 -293409 -309022 -84829 335531 615409 473158 14140 -399111
44610 -399111 -593049 -721773 -914888 -1015394 -842538 -542563 -421911 -501051 -498273 -275142
44600 -275142 -61085 -140276 -477883 -778853 -840225 -751132 -756795 -946094 -1072356 -750646
44590 -750646 91395 1030412 1538712 1506412 1231388 961272 678380 344049 82318 -13020
44580 -13020 -62213 -225520 -465389 -631542 -700123 -797346 -1041078 -1448174 -1917187 -2210503
44570 -2210503 -2062765 -1458908 -756558 -396538 -495543 -789058 -921906 -729656 -327567 -26528
44560 -26528 -73186 -358866 -484255 -243859 79437 93103 -148077 -220725 95563 619073
44550 619073 1121784 1537703 1735366 1451138 682839 -116053 -525606 -678274 -999007 -1536133
44540 -1536133 -1869552 -1679958 -1129012 -610761 -349151 -338404 -496145 -713648 -822890 -657055
44530 -657055 -198139 342893 637382 521059 193589 28183 121103 173812 -61472 -390982
44520 -390982 -438642 -150809 228175 574057 937404 1231034 1265999 1155498 1269848 1634715
44510 1634715 1769444 1368957 794451 565707 651856 634181 353661 -4699 -324233 -633079
44500 -633079 -827666 -710127 -312602 122162 460703 684910 657831 271963 -183550 -225899
44490 -225899 182138 582904 692671 701930 770040 668232 199591 -380140 -684048 -687348
44480 -687348 -613005 -548815 -465243 -418607 -444852 -408938 -231819 -117431 -283770 -607364 -802216
44469 -802216 -812621 -751067 -591615 -248451 137720 316094 270923 162784 10895 -250338
44459 -250338 -494501 -568180 -680373 -1176546 -1876410 -2110563 -1599521 -881391 -590129 -648090
44449 -648090 -534579 -129845 138137 -35288 -371770 -358821 112603 606573 615548 100448
44439 100448 -484899 -696273 -534594 -308791 -173160 6504 341224 692162 837674 714213
44429 714213 412437 78708 -92490 71815 509705 877053 866293 531144 188018 59875
44419 59875 153112 433011 909483 1462524 1739618 1440682 739043 251193 428286 1028732
44409 1028732 1374046 1141011 689600 507104 557949 430298 -87 -369807 -320629 63602
44399 63602 423946 566988 610283 761596 1049020 1269810 1200375 858717 495872 296062
44389 296062 200306 99901 35039 42104 -18982 -235241 -380438 -202836 111434 127850 -198786
44378 -198786 -460487 -415062 -269034 -233219 -214801 -159071 -298407 -743568 -1139279 -1101324
44368 -1101324 -787995 -662396 -828505 -983174 -953665 -892825 -906024 -825085 -490011 -44801
44358 -44801 192011 63224 -285904 -544659 -505620 -253140 -67519 -107120 -264017 -391297
44348 -391297 -533396 -786352 -1048559 -1118605 -987389 -815566 -626425 -255774 305212 706162
44338 706162 560155 -62022 -598264 -523283 118148 760959 904580 574581 163268 -69371
44328 -69371 -181771 -304886 -436908 -528050 -574411 -531984 -290301 152478 586998 755947
44318 755947 563306 113907 -347873 -562324 -489396 -406348 -561613 -758922 -583245 -52967
44308 -52967 338847 349281 335239 650170 1089332 1268746 1220468 1211337 1227935 1068206 760250
44297 760250 479191 208516 -105042 -224373 84463 547330 668345 468585 433331 725141
44287 725141 976623 941806 831479 842388 838944 726810 704249 860422 897158 571355 118624
44276 118624 -97485 -136463 -346448 -814889 -1253389 -1375802 -1176214 -865956 -677525 -691670
44266 -691670 -783281 -805032 -822872 -998830 -1233185 -1192445 -793493 -382016 -255092 -257456 -76887
44255 -76887 275766 556316 707139 887325 1131998 1244156 1066306 702318 417187 371606
44245 371606 458192 406727 119991 -129878 4094 466427 841098 905033 862855 920924
44235 920924 933074 695314 351074 220015 370998 621313 839664 998499 1022830 845411
44225 845411 565917 340785 160952 -71603 -316999 -458239 -530301 -661457 -810896 -790002
44215 -790002 -565144 -349298 -342661 -507465 -630821 -533171 -231839 37812 30798 -200612
44205 -200612 -313131 -89045 286949 508344 549377 587010 664369 689484 671291 676898 619054
44194 619054 390200 179436 316320 750081 1014407 826927 424304 137268 -81469 -449694
44184 -449694 -887197 -1093506 -1044506 -1092389 -1465722 -1879244 -1830499 -1222699 -508953 -167428
44174 -167428 -177773 -149939 128656 495341 750751 920257 1054579 1019070 713115 334292
44164 334292 159629 167967 151170 118133 264622 548314 634137 353717 -67269 -365646
44154 -365646 -568434 -803334 -1005073 -1018794 -849065 -607729 -315293 62858 450750 698662
44144 698662 750781 651599 433961 131404 -133665 -215211 -111868 23131 58842 16820
44134 16820 22215 167404 420608 645987 732604 712906 710217 758832 747499 578676 314873
44123 314873 111226 53212 109839 198049 244497 227241 195556 200659 181156 -4980 -385102
44112 -385102 -786423 -1004333 -974062 -715818 -240112 349966 769118 792940 599794 654634
44102 654634 1159711 1781829 2049132 1884351 1574055 1311049 1023147 675315 462013 507744
44092 507744 546213 176735 -576304 -1219487 -1385657 -1249159 -1191913 -1245560 -1123801 -731484
44082 -731484 -340386 -187582 -137921 96876 549886 989889 1249009 1378836 1479353 1526961
44072 1526961 1437633 1217496 981568 849113 850391 915248 944659 921425 939991 1066443 1173010
44061 1173010 1020783 569286 99787 -95708 -84975 -185224 -487399 -689512 -488734 27149
44051 27149 512554 755417 774728 641465 416106 215979 130422 75791 -69433 -199293
44041 -199293 -80166 274295 598652 806666 1117220 1596661 1887621 1670939 1168686 844450
44031 844450 731944 429511 -260566 -1035980 -1503939 -1595984 -1457134 -1163790 -732420 -274768
44021 -274768 26367 69863 -91235 -272387 -238870 114216 595760 831259 632609 207270
44011 207270 -60217 7958 255591 385808 216052 -222144 -747503 -1144446 -1236012 -930768
44001 -930768 -304622 356274 712385 651383 356187 59420 -160430 -286682 -253958 -102518
43991 -102518 -96443 -431072 -874927 -970332 -616549 -214964 -165692 -429256 -683275 -721560
43981 -721560 -556731 -271836 49962 294452 357670 249647 117728 142668 366099 583772
43971 583772 490683 41542 -407562 -484694 -280990 -225872 -482878 -726545 -603637 -173148
43961 -173148 255398 504874 560317 405456 93597 -114462 37330 444360 723809 694625
43951 694625 572895 606073 702308 594637 274789 50489 137972 360753 374356 118144
43941 118144 -104179 -14086 289812 448115 255818 -118178 -322995 -191177 106976 277188
43931 277188 244573 192215 207544 46796 -530674 -1268769 -1568663 -1196014 -537627 -44714
43921 -44714 248128 459920 495676 298029 176578 435482 848638 976351 887447 1042028
43911 1042028 1474886 1652889 1270377 696093 430586 534090 804286 1123626 1363452
43902 1363452 1292083 896193 546971 566467 831139 1032496 1101824 1132829 1107012 968732
43892 968732 802907 700852 609428 502799 489024 539091 372451 -109040 -519893 -454202
43882 -454202 -46082 279521 427201 609037 840996 894047 710335 482439 320720 191898
43872 191898 185397 466811 903151 1081219 824010 412591 160377 8293 -277951 -662400
43862 -662400 -790726 -394413 325362 776660 527874 -212637 -817220 -978065 -986699 -1153112
43852 -1153112 -1270013 -969178 -366180 68005 158012 125853 95194 -72329 -407121 -690306
43842 -690306 -779543 -761443 -704353 -562753 -397526 -380534 -489089 -492611 -338301 -254236 -364096
43831 -364096 -499967 -524556 -538736 -608814 -570312 -299915 41367 211153 138274 -143280
43821 -143280 -564237 -886895 -786612 -273130 206974 290634 88233 -135516 -372870 -676781
43811 -676781 -832952 -635888 -344562 -439755 -948618 -1372515 -1326389 -947640 -600565 -436749
43801 -436749 -360878 -241550 -28696 241144 487337 692991 960493 1355746 1718517 1775884
43791 1775884 1468829 1039498 763321 709779 794455 931786 1064069 1144418 1184534 1259292
43781 1259292 1388210 1469647 1421759 1341729 1395777 1539810 1494889 1102954 606711 406258
43771 406258 560664 732635 688125 630418 850986 1203536 1211169 688927 -3712 -419698
43761 -419698 -529702 -629049 -877911 -1117099 -1110354 -818856 -389294 44549 455463 814706
43751 814706 989813 867885 570683 407992 554146 868409 1077189 1001915 571197 -158570
43741 -158570 -842675 -950214 -305974 605633 1143250 1187330 1045633 868935 586003 331526
43731 331526 421287 804690 991852 710764 279865 138771 325865 603480 786195 745078
43721 745078 401457 -43179 -156748 185291 562960 558571 276632 53108 -64408 -202000
43711 -202000 -277892 -150648 8302 -93189 -385650 -535063 -474790 -457348 -569474 -564237
43701 -564237 -256033 217107 632425 954384 1263110 1572328 1791253 1762019 1343034 593226
43691 593226 -145133 -494773 -365556 66971 600537 1057607 1225434 1011566 627323 382730
43681 382730 320211 265950 185546 206719 301054 261000 70498 18669 310907 773333 1075120
43670 1075120 1088754 930170 795769 861038 1190230 1611985 1776801 1462163 797654 147144
43660 147144 -187238 -140643 140302 447739 672919 831102 928153 880715 631409 260898
43650 260898 -98126 -371157 -490556 -379469 -116383 49501 29937 70393 353118 614826
43640 614826 496925 135980 -16000 90934 35076 -365775 -738341 -728934 -493289 -366051
43630 -366051 -379292 -408428 -531163 -887988 -1315945 -1435672 -1086329 -489659 -9252 148578
43620 148578 71050 54536 277636 529447 461288 145963 64770 373140 534019 10356
43610 10356 -947094 -1621043 -1773999 -1808761 -2024396 -2194487 -2008746 -1543100 -1084863 -776028
43600 -776028 -652782 -809310 -1247530 -1679695 -1737975 -1363121 -812621 -312915 115813 488998
43590 488998 717416 740063 669776 673386 763610 832408 857157 923892 1025390 1003480 801022
43579 801022 645770 811472 1242543 1592588 1646316 1543002 1538138 1694228 1891084 2022623
43569 2022623 2073083 2062237 2000157 1856014 1535948 977752 322381 -113571 -133669 139370
43559 139370 434981 603843 606475 355940 -208814 -891203 -1275164 -1095775 -500691 99509
43549 99509 377595 278949 -16082 -231506 -150829 269998 905259 1555312 2016084 2107852
43539 2107852 1775150 1216533 791299 661804 591362 260151 -239913 -437887 -86989 469389
43529 469389 704330 520551 215649 -52203 -412371 -861135 -1075900 -880657 -629532 -798296
43519 -798296 -1309204 -1581764 -1241323 -501936 186800 611374 811398 840003 683639 347614
43509 347614 -82240 -431899 -483526 -139001 400799 711658 488869 -196758 -980110 -1477638
43499 -1477638 -1506794 -1159495 -710433 -380670 -158069 104423 444999 755909 972464 1148472
43489 1148472 1307872 1363076 1253666 1061551 918546 882622 952440 1101523 1233217 1203077
43479 1203077 976999 700372 530012 452368 344304 166448 6591 -62276 -92092 -182819
43469 -182819 -305525 -264098 82109 560640 781531 567381 168787 -64604 -98617 -119604
43459 -119604 -139770 30809 424793 792148 903573 782106 570751 359924 221423 232494
43449 232494 364816 481773 516243 532768 591260 703828 929330 1295364 1595154 1520160
43439 1520160 1087718 688857 589744 630615 562837 425401 390565 476073 644608 967697
43429 967697 1410407 1633184 1331249 677845 142098 -62068 -72638 -4029 203102 552118
43419 552118 901144 1155949 1315214 1284274 904708 278308 -159702 -65533 423178 856465
43409 856465 962418 852188 770190 762940 658665 338496 -74026 -368350 -524057 -683528
43399 -683528 -860194 -880895 -696730 -538592 -599169 -732513 -682377 -479315 -362287 -383526
43389 -383526 -359611 -196042 5793 195142 461108 778146 894137 643297 229602 16902
43379 16902 98113 232784 203925 86377 82872 177797 106209 -268591 -655502 -592416 -29083
43368 -29083 520080 536539 109527 -180478 38381 518591 733634 493599 95767 -95698
43358 -95698 -67689 -74619 -235464 -391254 -381697 -270083 -176124 -58748 139331 265258 132647
43347 132647 -145628 -276234 -203465 -117013 -55959 154789 521270 783153 809746 766569
43337 766569 764506 687674 524863 500724 659097 682658 400664 125611 166522 346330 375688
43326 375688 389182 670448 1098358 1330858 1337947 1284046 1065169 478400 -262431 -691226
43316 -691226 -701660 -515617 -141508 567268 1336653 1579863 1209828 793925 711891 665465
43306 665465 279936 -247550 -425875 -99906 473273 957905 1137418 969289 616763 300556
43296 300556 73672 -86841 -32540 374893 848615 872679 412050 9998 25726 190148
43286 190148 131160 -63689 -102905 16235 92394 70216 27456 -10410 -26072 45859 162841
43275 162841 154916 -1762 -111449 -67767 32082 177458 497557 880883 955281 691180
43265 691180 613492 1077775 1697559 1883004 1656418 1533691 1841837 2542283 3505824 4594395
43255 4594395 5719716 7188030 9619601 12939229 15701655 16171457 14133517 11074485
43247 11074485 8530620 6830267 5546883 4479450 3739950 3294721 2938403 2612644 2416590
43238 2416590 2344785 2242978 2006581 1668936 1304024 951203 640098 423076 354666 428113
43228 428113 526007 476781 205408 -193500 -543767 -694502 -557579 -173340 244526 510791
43218 510791 765379 1333642 2176890 2759462 2686664 2231127 1933466 1888640 1790162 1534492
43208 1534492 1348918 1336522 1302287 1111241 881482 701866 440824 -6588 -476647 -680292
43198 -680292 -467261 107780 829689 1380990 1523563 1315459 1047312 921460 889879 811876
43188 811876 644759 464371 410867 609744 1030349 1444897 1650948 1691371 1716283 1706544
43178 1706544 1539344 1273864 1119046 1112543 1085976 997605 1047050 1349887 1703592 1815473
43168 1815473 1620719 1256039 846637 455274 158219 24795 17254 -10354 -172757 -409143
43158 -409143 -508726 -346487 -88585 -44719 -275446 -487670 -392967 -6092 502993 1023921
43148 1023921 1397624 1355244 876297 422730 446690 777470 892417 730279 781584 1326684
43138 1326684 2032811 2462161 2593998 2621918 2546230 2243268 1753731 1268675 930693 783338
43128 783338 801261 880415 932682 1040888 1341462 1719689 1874621 1772167 1746130 1984792
43118 1984792 2187929 1972988 1424017 979567 900017 1076089 1277516 1383360 1411982 1472959
43108 1472959 1642320 1798685 1699841 1324920 974927 863835 763013 286930 -541793 -1238462
43098 -1238462 -1353290 -849070 -392 898552 1675271 2253300 2585506 2637522 2450089 2174111
43088 2174111 1942180 1713704 1383669 1046534 955168 1161171 1416319 1534676 1607452 1692563
43078 1692563 1562520 1048768 430359 117116 63025 -105022 -406341 -394444 169564 937809
43068 937809 1490936 1893551 2409286 2895923 2910518 2390030 1849980 1781752 2100709 2348405
43058 2348405 2264157 1965335 1663067 1418849 1202561 1037588 1003477 1131988 1330323 1405887
43048 1405887 1209362 792786 368586 55883 -238669 -580333 -770263 -569615 -103893
43039 -103893 237701 346236 543753 1057855 1611490 1756226 1440289 1030552 896444 1148959
43029 1148959 1635313 1980088 1787684 1073795 408779 385084 1004250 1788162 2360795 2652677
43019 2652677 2673492 2455330 2188079 2056209 1925149 1516268 911548 532651 548200 644274
43009 644274 504009 209727 26453 55401 247537 516122 696529 632705 446856 489599
42999 489599 867824 1249002 1309494 1169849 1182626 1439100 1677528 1595663 1143830 602795
42989 602795 413039 763603 1305782 1479933 1187185 901696 1032867 1439904 1711086 1669353
42979 1669353 1437771 1243350 1343482 1931588 2908897 3910788 4718087 5467173 6314947
42970 6314947 7111586 7579118 7612605 7231489 6444397 5360343 4246021 3281532 2428682
42961 2428682 1682414 1214093 1081594 1053493 949762 909806 1066009 1199583 1034041 675351
42951 675351 438502 389663 369724 337854 382241 491295 597200 753523 1010234 1212495
42941 1212495 1173612 949289 719802 535567 400859 422171 591541 603160 214463 -346442
42931 -346442 -651671 -611477 -412669 -81550 481151 1111942 1453093 1419017 1251216 1105227
42921 1105227 903572 609691 349952 235527 294072 551532 963316 1339505 1555717 1697429
42911 1697429 1751158 1395161 493433 -415892 -650787 -317396 -178059 -596207 -1144188 -1318448
42901 -1318448 -1111492 -724522 -199009 426488 940292 1144645 991098 494965 -175177
42892 -175177 -556110 -292156 280062 451262 144339 46779 542710 1093705 1035218 491107
42882 491107 51379 -73021 -85875 -62813 134010 506477 858161 1020092 901206 456167
42872 456167 -160739 -578985 -599870 -443520 -386427 -361449 -189328 8075 -23000 -219716
42862 -219716 -278547 -125390 -228 -81492 -273336 -371938 -268711 -21575 139499 -26979
42852 -26979 -459571 -777180 -754571 -640172 -754230 -948420 -813892 -334871 69206 201675
42842 201675 422954 1151108 2257835 3159121 3398401 2996042 2295929 1620024 1092793
42833 1092793 701087 419550 248435 195189 290898 580803 1011959 1391740 1596956 1769406
42823 1769406 2108397 2497592 2589817 2293917 1908182 1696804 1626113 1644346 1894695 2417753
42813 2417753 2929459 3208006 3490175 4125565 4960724 5444866 5341231 5009082 4905352
42804 4905352 5040784 5040253 4623584 3956102 3554497 3813026 4580127 5282671 5510129 5340504
42794 5340504 5047796 4743827 4487286 4480503 4817434 5161703 5035815 4430499 3839972 3665788
42784 3665788 3831460 4018431 4039540 3899371 3678589 3461890 3270305 3017359 2629118 2215891
42774 2215891 2011637 2130935 2475794 2861191 3137235 3241305 3256984 3364146 3584921 3654823
42764 3654823 3352859 2923218 2917547 3554476 4429324 4957471 4977462 4825710 4899343 5226718
42754 5226718 5455998 5263312 4766342 4429212 4485927 4605776 4305074 3572967 2845192 2423795
42744 2423795 2222667 2107560 2161711 2460542 2825630 3020127 3066402 3187445 3501913 3923068
42734 3923068 4314906 4625193 4884357 5162219 5512096 5900165 6215364 6388782 6458092 6475790
42724 6475790 6423668 6287715 6157605 6155002 6281287 6413294 6436256 6310153 6035711 5683791
42714 5683791 5492268 5783359 6621691 7583250 8033213 7709323 6943410 6253603 5834977
42705 5834977 5552512 5291725 5077528 4866771 4492812 3941280 3495963 3428971 3639702 3782789
42695 3782789 3723671 3695733 3970453 4501611 4982090 5199657 5249132 5373149 5639918 5843254
42685 5843254 5742477 5343906 4877748 4527064 4273196 4013874 3726996 3455503 3201955
42676 3201955 2938176 2724484 2738045 3097709 3649966 4024966 4012267 3838345 3927439 4404874
42666 4404874 5037469 5683837 6503972 7556332 8476847 8858080 8751997 8461718 7993464
42657 7993464 7131049 6007319 5178492 5056601 5571855 6403883 7194691 7509227 7010659
42648 7010659 5853079 4624184 3785187 3398747 3390623 3703907 4167274 4647657 5400003
42639 5400003 6763692 8387910 9346952 9295545 8932153 8933374 8986946 8394130 7146103 5783893
42629 5783893 4564007 3446583 2656684 2519464 2807253 2910477 2677868 2512485 2606217
42620 2606217 2668077 2532738 2483601 2731898 2999196 2892861 2418289 1903862 1627601 1668597
42610 1668597 1930021 2171030 2172361 1979024 1864515 2001086 2274316 2449351 2433215 2382000
42600 2382000 2591255 3172186 3772636 3820331 3188973 2400841 1981630 1884850 1816339 1809569
42590 1809569 2065198 2462091 2717111 2886487 3214479 3579331 3607686 3318939 3155528 3343822
42580 3343822 3691024 4047534 4480513 4899728 4990919 4682123 4280220 4005071 3766368 3536803
42570 3536803 3561732 4011030 4720009 5410402 5897077 6019597 5710776 5214026 4882148 4678550
42560 4678550 4250835 3592067 3214418 3492794 4187970 4785303 4982497 4714213 4057709
42551 4057709 3291494 2737555 2403621 2070613 1781146 1836939 2229651 2548991 2612818 2699136
42541 2699136 2945025 3034045 2776179 2488840 2413402 2213784 1522996 612971 8126 -293438
42531 -293438 -693143 -1253826 -1567347 -1291623 -459598 657560 1676106 2201227 2131768
42522 2131768 1801502 1577349 1447390 1245730 1073268 1131767 1277611 1158219 792164 659395
42512 659395 1124375 1993350 2718915 2902973 2569343 2059458 1707464 1596897 1634874 1773094
42502 1773094 1992633 2142697 2091047 2061239 2468205 3279851 3884056 3820162 3360886 3102538
42492 3102538 3209953 3362987 3294210 3086691 2990328 3135253 3409719 3564026 3510708 3476938
42482 3476938 3666674 3868526 3755702 3515626 3666461 4173452 4339834 3812384 3111685
42473 3111685 2803174 2699871 2376162 1983374 1945653 2187296 2294989 2237228 2328605 2613570
42463 2613570 2839090 2958368 3145982 3343849 3252394 2775203 2100510 1386598 725007 340847
42453 340847 440719 881792 1306235 1550243 1657733 1643369 1561903 1629853 1905067 2030063
42443 2030063 1709337 1256271 1190246 1444173 1496197 1187781 860278 719746 625571 536762
42433 536762 633192 917298 1176042 1398071 1743613 2048887 1903143 1343749 931689 939696
42423 939696 984365 719463 391023 351741 452389 351288 137156 193458 581812 938083
42413 938083 941416 626525 267286 147078 393668 857465 1173004 1088067 747684 578380
42403 578380 883703 1565424 2210005 2454206 2316136 2149819 2228469 2438508 2469255 2216023
42393 2216023 1857960 1608610 1557280 1716326 2044604 2408404 2643456 2671210 2500841 2188223
42383 2188223 1877155 1776541 1967107 2306698 2628287 2923885 3224997 3438010 3440373 3229322
42373 3229322 2866307 2413307 2015797 1854591 1897087 1905835 1801361 1750530 1778285 1648458
42363 1648458 1329940 1182213 1377916 1535569 1309400 972708 959310 1162784 1217178 1188375
42353 1188375 1389910 1697524 1662497 1234848 821076 653928 601644 574934 653208 820856
42343 820856 991416 1236017 1593356 1779796 1536336 1126375 1002656 1122219 1117834 995890
42333 995890 1055129 1209376 1045085 540537 102099 -125280 -362920 -596958 -522196 -161680
42323 -161680 89213 143690 344062 798763 1210182 1476436 1830417 2231543 2274598 1926050
42313 1926050 1730715 2012646 2422077 2542514 2430481 2297266 2158240 2062098 2199333 2523474
42303 2523474 2681818 2537817 2388317 2547842 3112106 4114300 5355384 6097686 5657939
42294 5657939 4426748 3554651 3453015 3400160 2862677 2303279 2253308 2459921 2555177 2816554
42284 2816554 3556379 4343274 4539107 4166482 3635778 3065556 2485446 2255066 2583681
42275 2583681 2965671 2761550 2094394 1572559 1362962 1142320 787727 523135 453122 437691
42265 437691 395017 363155 324244 245070 179119 123206 -26164 -188942 -64888 397882 824110
42254 824110 953326 1022113 1335686 1798650 2139115 2243063 2009521 1285912 260085 -483305
42244 -483305 -630101 -495008 -440365 -376591 -149541 56340 82427 118273 282023 330001
42234 330001 176594 247348 895541 1885702 2822504 3628392 4263443 4558230 4737425 5445649
42224 5445649 6700463 7470059 6962668 5754422 4916639 4589942 4256424 3930697 4097286
42215 4097286 4705585 5131690 5060701 4691716 4186401 3584529 3140165 3089234 3172747 2965144
42205 2965144 2555767 2366617 2453189 2527398 2512827 2549983 2610167 2593484 2623072 2785287 2825170
42194 2825170 2569561 2363983 2589538 3042554 3290904 3311739 3266253 3036051 2562175 2244052
42184 2244052 2368135 2526573 2263914 1905126 2026702 2486321 2741994 2786679 2969084 3203456
42174 3203456 3186550 3127904 3421893 3817883 3743848 3250438 2822925 2482681 1935666 1412035
42164 1412035 1436862 1860462 1994245 1666854 1330959 1179571 975422 736035 795005 1156027
42154 1156027 1484765 1726942 2080208 2425706 2446193 2219302 2063706 1933295 1579216 1109903
42144 1109903 766220 425246 1869 -20827 738604 1696194 1967342 1600095 1285673 1170300
42134 1170300 904566 594481 705413 1200437 1681732 2157621 2782958 3161433 2866665
42125 2866665 2314019 2123948 2034587 1527589 1041479 1287475 1802168 1612829 1008929 1123521
42115 1123521 1972390 2505981 2504943 2766917 3377819 3495096 3063606 3094598 3862230 4349842
42105 4349842 3944187 3290315 3009890 2874069 2696504 2826416 3326409 3762704 4107236
42096 4107236 4763331 5548372 5825336 5719321 5928446 6296935 5983882 5100056 4663288
42087 4663288 4832046 4772900 4402996 4556660 5207529 5301963 4674881 4334554 4478260 4094629
42077 4094629 3014327 2455487 2921587 3402491 3319863 3443631 4186417 4791998 4916897
42068 4916897 5220793 5725285 5463907 4446248 4015655 4530313 4713840 4062166 3743356
42059 3743356 4260454 4493531 4055496 4233435 5404167 5910894 4894605 3891295 4096360
42050 4096360 4373817 3650141 2982902 3398522 3846005 3246149 2549208 2823275 3264746
42041 3264746 3012192 2946622 3761868 4273862 3635981 3192588 4101534 5200056 5305040
42032 5305040 5436976 6539629 7251427 6373489 5360500 5821108 6672468 6347304 5677464
42023 5677464 5958745 6338810 5803499 5503247 6412428 7111981 6666491 6975390 9245709
42014 9245709 11136549 10832957 10766154 13364585 16349558 16672394 15931667 17026859 18617542
42005 18617542 18270992 18011953 20871311 24875292 26743339 28586814 34113885 41255386
41997 41255386 46177337 51524949 62147916 75862327 88313722 103632583 128500457
41990 128500457 159618505 193322423 245075525 334960470 444659904 511716751 487303370
41983 487303370 389622323 282676202 210181505 168560138 137877769 113337888 99394810
41976 99394810 92361134 83371887 71057189 60685559 54248390 49026693 43992706 41302989
41968 41302989 41585226 42224641 41187163 39763625 40291252 42789137 45549925 48494568
41960 48494568 53657131 61661129 70552826 80263356 94786883 116084285 140657304 170003569
41952 170003569 219157878 298619467 384532145 424663422 388082309 300063512 214841889
41945 214841889 161231282 129245503 102334559 80421604 68211136 60640001 50778430
41938 50778430 40897633 35971123 33798319 29764413 25232658 23620110 23074241 20063396
41930 20063396 16231161 15185226 15779036 14594514 12274256 11695131 12211202 11120145
41922 11120145 8965000 8332301 8891764 8282192 6655492 6032424 6258008 5628545 4544030
41913 4544030 4729985 5702292 5590068 4677431 4733773 5572809 5539505 4749147 4732479 5467528
41903 5467528 5697929 5566089 6078395 6606257 5757869 4146328 3525501 3751949 3345978
41894 3345978 2492204 2655272 3628854 3767645 2920886 2491933 2775024 2788941 2582605 3167583
41884 3167583 4245463 4474627 3980803 4212282 5281082 5792300 5386028 5150789 5388420
41875 5388420 5233994 4699838 4878153 5793477 6140269 5510268 4923487 4841208 4604103 4181900
41865 4181900 4520836 5669275 6362401 5979075 5267823 4722908 3903851 2818471 2363848
41856 2363848 2864080 3595158 4147386 4829274 5420529 5080771 3930215 3238984 3573078
41847 3573078 4136284 4351760 4641156 5140369 5087827 4153995 3154421 2805595 2821668 2743962
41837 2743962 2654338 2644117 2542930 2494660 2847727 3281102 3060550 2274143 1701944 1417430
41827 1417430 803272 42161 132090 1133296 1850135 1673515 1351415 1468002 1562493 1344049
41817 1344049 1429813 2158974 2861805 3021743 3093142 3511901 3932369 4072561 4294905 4725395
41807 4725395 4792470 4259504 3757146 3706964 3669412 3305362 2991714 2933767 2704498 2252337
41797 2252337 2296038 3066280 3725636 3741668 3748393 4258349 4623267 4218875 3663208 3837920
41787 3837920 4613487 5636547 7509157 10839849 14601615 16696504 16036014 13251965
41779 13251965 9678142 6472421 4407406 3558050 3193945 2581262 1791464 1315122 1236771
41770 1236771 1320571 1539647 1912757 2104406 1773197 1109031 545837 169769 -171315 -444031
41760 -444031 -525418 -463688 -300149 71949 571494 816225 656880 442291 457189 527969
41750 527969 497211 604591 1009004 1380524 1381527 1172226 1076613 1119492 1202186 1329549 1376322
41739 1376322 1071896 504796 188530 355959 650568 734358 672271 520401 160247 -227260
41729 -227260 -209791 112276 110222 -300049 -425309 -7123 237910 -202982 -811438 -980906
41719 -980906 -900324 -830893 -414457 485733 1113892 916407 543460 785975 1238112 1089564
41709 1089564 602671 615318 1059932 1194784 977607 1009978 1314057 1315619 960849 793919
41699 793919 958207 1094298 1197127 1634738 2342220 2908308 3412354 4244359 5188815 5774259
41689 5774259 6543210 8704161 12128921 14802789 14907498 12698529 9792180 7334957
41681 7334957 5524144 4313887 3721704 3563855 3484244 3298039 3035107 2703908 2246663
41672 2246663 1704079 1264297 1108324 1215472 1334304 1239490 1036241 1030439 1259378 1456667
41662 1456667 1593263 2014924 2761683 3233055 3010564 2607269 2802016 3563089 4351187
41653 4351187 5255933 6928980 9282594 11056973 11063931 9407786 7187300 5356466 4162580
41644 4162580 3415655 2925256 2636214 2490503 2319266 2011740 1720536 1621854 1481176 883561
41634 883561 12353 -328179 237743 1092264 1494946 1505906 1549825 1578529 1317813 938104
41624 938104 764928 627187 206909 -226540 -170497 235899 435156 367199 403239 541166
41614 541166 496649 482192 991530 1785144 1983558 1321110 503563 141024 101160 143141
41604 143141 416341 972293 1412007 1398444 1062459 658190 268724 16790 68439 271310
41594 271310 291760 223433 492760 1039583 1238094 842357 362647 221889 176519 -56327
41584 -56327 -185512 173149 836881 1314904 1407896 1209378 817418 352436 -559 -206050
41574 -206050 -398511 -570057 -551360 -384362 -322190 -368984 -258182 19417 163617 157209
41564 157209 353922 794413 1016168 802039 555261 624725 794350 776403 692136 699057
41554 699057 635492 416954 316425 469694 570805 450493 472057 913935 1431424 1612814
41544 1612814 1617681 1736515 1746191 1304338 642238 242250 78208 -217197 -619081 -739958
41534 -739958 -484495 -141045 113322 328089 464798 416986 319060 447769 827469 1237224
41524 1237224 1545890 1764171 1880822 1931917 2087117 2369345 2460083 2114532 1601542 1373164
41514 1373164 1450082 1508553 1436849 1399443 1435551 1392914 1229774 1039859 806867 444035
41504 444035 46216 -170245 -126899 147287 669001 1336197 1765356 1655497 1228216 961386
41494 961386 964024 963294 830401 722232 712912 669976 549468 492053 563973 671799 771560
41483 771560 908122 1025014 990644 842873 772353 847732 989922 1215998 1639253 2185554
41473 2185554 2564974 2605471 2414175 2149009 1832557 1473954 1197332 1130771 1254701 1426340
41463 1426340 1504509 1449157 1363203 1415230 1645855 1870987 1834396 1432943 790634 203636
41453 203636 -4437 231570 527676 381476 -194847 -619629 -478358 -50693 122986 -59798
41443 -59798 -301290 -421276 -464757 -414844 -177577 166179 393467 416088 291609 26348
41433 26348 -365240 -673526 -675163 -485957 -438793 -601006 -697404 -544746 -283548 -110196
41423 -110196 -36861 -23378 -123798 -347301 -513241 -406235 -45834 283085 285699 -51383
41413 -51383 -421567 -489254 -218164 157145 450407 658172 789970 810603 830670 1098058
41403 1098058 1649115 2189172 2472747 2567473 2576345 2384415 1927411 1439193 1125489 829167
41393 829167 357280 -82646 -166691 -1432 41526 -69419 -22681 276601 566406 669281
41383 669281 697668 763060 804120 774859 749443 802395 981784 1337330 1734876 1774915 1246151
41372 1246151 559633 315245 491459 538287 278102 163332 487519 879649 893427 670757
41362 670757 622510 749636 722845 483873 331561 408456 464770 256948 -62089 -143327
41352 -143327 73572 282255 237024 69995 43990 133387 108504 -7007 99828 515340
41342 515340 884649 917992 804526 830930 857557 563118 50742 -196949 79671 680074
41332 680074 1246686 1507684 1316505 798121 399379 452639 731046 759067 485589 274029
41322 274029 290099 334602 292298 315126 490992 713069 940992 1220428 1397927 1226393
41312 1226393 835019 672754 862802 1031554 934579 827268 989916 1273554 1402636 1422998
41302 1422998 1553214 1806214 2006380 2019824 1800237 1387573 992790 878578 1033390 1163978
41292 1163978 1082633 854443 524667 55239 -367318 -370653 59870 471721 632072 919215
41282 919215 1670164 2508452 2839736 2844634 3429328 5089302 7152980 8316703 7830591
41273 7830591 6125577 4348873 3308348 2889314 2516736 1997041 1627263 1582159 1642919
41264 1642919 1634592 1710624 1983702 2224104 2191942 1989266 1823567 1680651 1491298 1364445
41254 1364445 1366685 1298693 985666 586013 326960 146541 -94237 -254048 -117485 207908
41244 207908 461044 659577 991245 1370850 1495300 1314285 1087989 959429 789089 457867
41234 457867 54728 -290541 -517432 -535210 -264702 134751 298783 54324 -341295 -466691
41224 -466691 -175641 298585 635320 760163 859995 1071195 1243350 1135561 796860 546320
41214 546320 544021 597796 477224 206145 -67404 -273459 -345758 -158575 271957 689072
41204 689072 875319 884913 857943 797410 697822 677052 760922 736574 472286 214739 302821
41193 302821 719137 1175837 1512488 1747172 1854443 1778280 1600538 1450307 1297667 1041543
41183 1041543 731965 519785 470988 585708 863464 1186905 1332385 1301439 1421198 1857456
41173 1857456 2261637 2223576 1854748 1545394 1349313 1065565 779515 784638 985467 909972
41163 909972 420248 -42101 -78471 172843 335090 261411 16925 -335848 -715797 -949691
41153 -949691 -888062 -523095 39704 613402 973068 1059536 1103634 1314843 1481707 1175838
41143 1175838 376509 -409938 -733517 -641100 -454255 -372074 -412953 -518492 -567382 -445846
41133 -445846 -211833 -56634 -44011 -29755 124441 410641 764735 1128222 1408474 1545777
41123 1545777 1609544 1654452 1544849 1166895 749085 642187 783189 740491 352937 -48558
41113 -48558 -177904 -182839 -307697 -503101 -619756 -713450 -875079 -962194 -778790 -383274
41103 -383274 13141 320294 537034 615909 613587 820395 1413443 2048257 2153125 1696563
41093 1696563 1361019 1778791 2771616 3539976 3517505 2844999 2032435 1406703 1026909 935101
41083 935101 1173249 1549273 1688549 1458209 1131886 994272 1001004 1003136 1048974 1181700
41073 1181700 1166969 802249 350845 241485 402897 349192 -61529 -417728 -395660 -154058
41063 -154058 89806 447189 1035954 1602073 1794279 1617836 1342979 1125649 962390 873932
41053 873932 887023 929101 943634 1022357 1237643 1420457 1294439 818213 273333 3343
41043 3343 94436 281866 198899 -198585 -526688 -441649 -103758 82661 85303 205832 447128
41032 447128 426507 77628 -70834 351710 934855 1034157 638686 238790 49878 -125679
41022 -125679 -359160 -435589 -294803 -204198 -333445 -465637 -323933 12130 205386 80416
41012 80416 -203746 -379856 -376148 -350394 -439793 -564354 -571281 -503498 -526506 -577766 -340571
41001 -340571 301702 988483 1246329 1008775 619319 430570 541500 809735 963946 795043
40991 795043 369035 -34333 -269916 -452973 -642398 -635885 -285870 181536 424882 426827
40981 426827 418161 482070 511940 480702 461714 413449 219782 -47425 -155761 -37999 121501
40970 121501 166748 147036 168803 248190 379991 607936 935204 1248736 1408585 1386114
40960 1386114 1289700 1266838 1371590 1522200 1613852 1644546 1655591 1596483 1397416 1152813
40950 1152813 1035979 1024485 945532 829055 928463 1285311 1559917 1442771 968761 303816
40940 303816 -428299 -927664 -768344 -17381 580820 485928 113762 207822 737829 1028461
40930 1028461 816199 505652 382474 227984 -135560 -460173 -442056 -72221 518472 1168616
40920 1168616 1549476 1379521 918636 778996 1064948 1197402 830531 400029 381402 512720
40910 512720 288692 -155810 -291577 -119409 -190099 -709398 -1210392 -1251539 -964011 -690841
40900 -690841 -464081 -139553 187870 239669 -32706 -346706 -446180 -389229 -367483 -325581
40890 -325581 44075 827202 1542735 1517337 655230 -371768 -835129 -694213 -469664 -532380
40880 -532380 -788013 -1013877 -1182571 -1324883 -1302667 -942883 -328678 223982 488923 516991
40870 516991 496238 537989 639905 760043 845178 841524 766824 747907 899446 1164134 1346413
40859 1346413 1315099 1115837 887981 738061 689831 683447 627737 520581 473308 505618 388157
40848 388157 -103605 -791365 -1206070 -1165051 -980102 -967469 -1016217 -850317 -494029 -204336
40838 -204336 -80821 -9994 86676 183260 259325 277530 134907 -168685 -416555 -430364 -311869
40827 -311869 -209273 -8995 443330 961629 1214926 1205475 1176121 1121113 819828 337710
40817 337710 32148 7358 25164 54544 405762 1103399 1604742 1481518 1018815 769757
40807 769757 800591 760774 482271 105041 -257486 -578157 -691349 -381274 251699 780365
40797 780365 880614 605357 218560 -63730 -141685 -19619 190429 341940 384160 379849
40787 379849 401757 474900 606718 783356 903050 779812 300846 -389485 -922514 -1021021
40777 -1021021 -785553 -557975 -494126 -452993 -367154 -447488 -806277 -1135836 -1106603 -891784
40767 -891784 -852412 -813466 -214070 944358 1847277 1808378 1042259 236880 -246568 -415727
40757 -415727 -254525 242261 800585 1045781 919102 649891 390805 143594 -24410 22759
40747 22759 258597 466292 486751 387344 378772 613743 1019577 1313664 1293451 1112906 1092191
40736 1092191 1239372 1219751 882081 523556 461266 593062 592771 344676 -3862 -245664
40726 -245664 -226651 36861 240010 66432 -285313 -213547 431378 1000488 887340 356998
40716 356998 122465 386318 754613 873509 686580 243232 -273286 -462078 -115924 377371
40706 377371 471869 188563 -27817 -28471 -22522 -13401 264395 835446 1418317 1890344 2326567
40695 2326567 2572673 2327728 1721311 1263970 1118159 966120 725331 775724 1220106 1515150
40685 1515150 1232657 721531 589190 887793 1221803 1357321 1327051 1189558 1073749 1246448
40675 1246448 1755679 2176693 2068922 1552100 1115507 1000625 1090981 1265217 1487146 1614817
40665 1614817 1487238 1223173 1138997 1310548 1443864 1262693 877991 695885 1008499 1674284
40655 1674284 2176710 2065615 1392761 653023 290520 372771 723697 1150877 1475223 1564494
40645 1564494 1464500 1329070 1149533 777712 295168 59530 209686 404482 282622 -53459
40635 -53459 -248055 -161655 116278 498385 863262 990143 827347 653409 689616 752051
40625 752051 602822 420296 515293 762985 791450 627629 638018 843023 833765 480974
40615 480974 222437 425881 871843 1123521 1078257 888888 632557 362757 270139 471192
40605 471192 765201 873210 814731 796953 839044 804183 758434 966470 1447942 1801034
40595 1801034 1630128 1004460 354132 18026 22927 197377 310338 144158 -331648 -789357
40585 -789357 -745944 -90027 707260 1054207 825250 359126 11811 -63831 201069 806687
40575 806687 1553661 2184831 2733309 3475460 4469479 5432045 6189736 6956935 8031708
40566 8031708 9577314 11936842 15739912 21172330 27221944 32018783 33955011 32436623
40558 32436623 27974282 22018414 16443753 12505289 10120089 8443285 7044930 6115891
40550 6115891 5687304 5336108 4803124 4308352 3994272 3566670 2821623 2092099 1754426
40541 1754426 1593724 1080796 105447 -904360 -1453040 -1301913 -515836 508254 1216202
40532 1216202 1413002 1500522 1946938 2671337 3242608 3520720 3724914 3946261 3982004 3677069
40522 3677069 3121630 2483030 1909861 1603462 1691157 1988946 2157714 2136097 2157108 2306043
40512 2306043 2369961 2214830 2003396 1887729 1769632 1574654 1518331 1820595 2302306 2561392
40502 2561392 2514557 2516227 2902492 3590639 4188610 4376995 4106822 3503932 2706629 1844747
40492 1844747 1110764 709968 652939 668952 455415 11994 -371926 -457108 -279939 -48565
40482 -48565 60962 -9430 -191100 -323026 -283587 -108432 89931 272934 429411 467544
40472 467544 373925 426466 937480 1735375 2223421 2081372 1607262 1210538 918212 646312
40462 646312 607851 1026351 1655736 2038518 2130552 2227749 2347628 2183717 1713624 1355558
40452 1355558 1362731 1486584 1440551 1301775 1192981 928905 328274 -377221 -805169 -924474
40442 -924474 -964871 -967746 -785610 -469077 -310184 -461554 -750960 -904311 -776870 -384790
40432 -384790 100843 405069 375345 153558 -6847 -24543 53268 231643 457756 462995
40422 462995 56205 -482603 -676295 -519794 -465957 -672799 -727083 -336405 131612 162184
40412 162184 -163811 -365144 -306320 -282569 -411837 -405652 -60022 384038 571927 496686
40402 496686 415259 442515 447691 319199 149066 94327 137754 65027 -304756 -893863 -1425894
40391 -1425894 -1738163 -1966743 -2321653 -2712171 -2769567 -2331911 -1761102 -1577212 -1809651 -1941716
40381 -1941716 -1577680 -943867 -542098 -489826 -508194 -476426 -593119 -902152 -1065989 -864029
40371 -864029 -594657 -633342 -826578 -746359 -414579 -305040 -618759 -986951 -985157 -584783
40361 -584783 -5295 523541 742970 490885 24088 -130931 154528 430950 361293 204166
40351 204166 312443 540784 575615 547395 805085 1252572 1412663 1079889 463920 -248270
40341 -248270 -993840 -1509916 -1429045 -834543 -297382 -185058 -284984 -278799 -225373 -320988 -474913
40330 -474913 -444845 -246420 -150161 -318304 -626856 -823076 -747778 -434478 -67213 170852
40320 170852 219076 106658 -93759 -178415 152111 905778 1544225 1460892 715444 -60001
40310 -60001 -515734 -912279 -1449159 -1748938 -1383154 -588302 -6463 131151 134133 232269
40300 232269 267214 107324 24055 407634 1221125 1931223 2022514 1526153 972724 792531
40290 792531 859072 770530 499624 465797 894054 1426975 1590356 1388675 1154305 1007490
40280 1007490 817791 586848 481078 483591 364691 66253 -185489 -242744 -233350 -276670
40270 -276670 -274779 -163164 -128038 -330625 -583398 -581039 -373099 -317549 -547850 -747472 -560513
40259 -560513 -35853 488095 814146 1016151 1190388 1286216 1245999 1160352 1154211 1178238 1035932
40248 1035932 625286 86768 -297713 -328151 -44465 294157 427023 331704 191817 98603
40238 98603 -80118 -423896 -704397 -617275 -181347 328027 766224 1134078 1240007 766005
40228 766005 -175090 -909926 -902989 -349562 179887 459871 665460 886595 978298 887697
40218 887697 819190 989553 1373817 1717932 1724737 1321731 855838 846447 1343425 1723721
40208 1723721 1418555 671485 205799 284617 573034 856696 1288603 1792269 1842859 1214500
40198 1214500 482593 316265 588789 684370 457334 321959 474599 626499 622175 785082
40188 785082 1355509 1963329 2037250 1543021 965528 657685 550159 503346 607403 986144
40178 986144 1518103 1938759 2118465 2097147 1931378 1660845 1364628 1080871 702248 137985
40168 137985 -422567 -630938 -434554 -195802 -224885 -386273 -352452 -81007 201182 369681
40158 369681 474573 495664 334706 81305 -3305 142302 274209 214649 80974 -2822
40148 -2822 -175827 -592963 -1082215 -1307998 -1189795 -933021 -706309 -510898 -340463 -247975
40138 -247975 -228516 -210648 -196055 -261411 -396672 -482365 -456301 -365177 -216086 74763 510366
40127 510366 906880 1052228 902788 559285 122379 -344641 -749459 -946270 -797979 -279161
40117 -279161 438330 1023652 1215516 1059693 853008 814916 885835 887009 776081 644032
40107 644032 526241 360727 152136 54944 192494 419544 378234 -119840 -793264 -1096677
40097 -1096677 -800082 -277139 -103189 -430343 -916869 -1229813 -1373179 -1450574 -1363406 -964478
40087 -964478 -373034 105998 335367 420082 457964 420622 290817 120984 -81981 -345696
40077 -345696 -556532 -490822 -119060 286410 458524 404495 263721 76977 -127132 -165314
40067 -165314 133662 633729 969499 927641 599877 166853 -301765 -796210 -1247127 -1519176
40057 -1519176 -1480130 -1097537 -531593 -74542 107153 122920 156848 215793 232021 303420
40047 303420 581801 959458 1135235 1015466 797584 622837 430144 235496 242258 489132
40037 489132 643754 379364 -219220 -829570 -1292494 -1611003 -1715882 -1518113 -1121613 -742190
40027 -742190 -462801 -258242 -158859 -149359 -3908 466821 1018545 1132745 640946 -50643
40017 -50643 -424913 -322473 99449 598631 889821 689656 -30224 -894879 -1392749 -1289214
40007 -1289214 -737696 -80465 372872 469515 271925 5477 -126804 -103811 -60867 -135272
39997 -135272 -349960 -616433 -831154 -971358 -1071635 -1090772 -869689 -300871 488347 1189703
39987 1189703 1531039 1410351 908978 273878 -188767 -342691 -330165 -373111 -526761 -709145
39977 -709145 -853480 -893630 -735960 -444738 -322060 -539317 -793674 -649979 -156863 256510
39967 256510 486387 898935 1636151 2221700 2143740 1519401 882675 553974 510466 656449
39957 656449 879876 980597 867310 736436 773338 789229 483386 -12391 -229739 -17222
39947 -17222 275877 371201 464698 835739 1298412 1345089 779927 -19485 -509601 -519825
39937 -519825 -330794 -294192 -468239 -647791 -681746 -653982 -726340 -894017 -976909 -829104
39927 -829104 -513439 -282725 -377368 -769291 -1111049 -1058102 -671696 -365315 -397925 -586014
39917 -586014 -620708 -489536 -395714 -381552 -263361 80881 536080 874963 954877 812107
39907 812107 640583 621494 706330 672056 467142 332241 436883 600043 601696 572985 738352
39896 738352 899550 600728 -182617 -923122 -1209428 -1182548 -1174594 -1266091 -1412822 -1687289
39886 -1687289 -2075645 -2240107 -1832368 -978659 -181712 232440 345881 355660 296332 118100
39876 118100 -135318 -336125 -396012 -329660 -229169 -183102 -188029 -154736 -33782 105168 170138
39865 170138 178824 225779 352301 524786 717481 928223 1107805 1153718 1010717 740811
39855 740811 469421 283444 193556 166193 151965 77434 -140690 -504240 -858169 -999898
39845 -999898 -920091 -849757 -972186 -1167621 -1196401 -1090585 -1150726 -1502562 -1855124 -1825429
39835 -1825429 -1367020 -745476 -220489 71492 30061 -349855 -817438 -1010468 -874399 -763549
39825 -763549 -976111 -1321217 -1343602 -902731 -290053 229657 709261 1213401 1477344 1168478
39815 1168478 400173 -311962 -616192 -587718 -409091 -119917 170928 149738 -325365 -897991
39805 -897991 -1079122 -842816 -564497 -441727 -312132 -50740 198678 299557 345206 433734
39795 433734 421797 104508 -445879 -869908 -842153 -377091 143790 291661 34643 -216204
39785 -216204 -158754 -59747 -357547 -891902 -986169 -394976 294912 464366 257517 210068
39775 210068 402639 457223 215185 -59465 -128991 -26773 174625 476587 762563 807847
39765 807847 582226 289110 32322 -284925 -635660 -733416 -392822 194968 723820 1119331
39755 1119331 1439836 1614222 1529338 1292910 1170247 1256792 1374191 1299088 976949 519587
39745 519587 117109 -30157 192363 709483 1265503 1568537 1461101 1016708 503929 197412
39735 197412 155387 192980 102926 -124671 -319522 -316765 -92928 232097 488846 599887
39725 599887 661347 829059 1094123 1253177 1159765 919678 747281 700165 669782 583872
39715 583872 483700 414390 370088 363718 436405 570514 695375 802438 938248 1044973
39705 1044973 952360 634535 362034 434651 785918 994918 730367 112039 -390341 -371815
39695 -371815 180943 895530 1321074 1289050 1014309 839080 891535 1016338 1001216 809723
39685 809723 600703 566396 741711 950150 988228 889164 891090 1066663 1156349 964056 745528
39674 745528 854739 1079475 803642 -50645 -732975 -633611 -140628 -70645 -517717 -820028
39664 -820028 -556144 2356 456430 731218 812676 570382 133316 779 401918 867776
39654 867776 832935 407561 137076 201364 323672 355556 427778 497640 269235 -247211
39644 -247211 -528576 -198884 393333 610372 378932 237365 545866 995797 1046019 610291
39634 610291 78343 -241309 -422436 -625439 -776054 -750572 -706371 -898583 -1181218 -1046820
39624 -1046820 -316837 491232 735413 403748 26005 -37990 96071 202213 276376 406654
39614 406654 559242 650911 704379 797705 913113 920247 708301 332873 30021 925 132785
39603 132785 67451 -331648 -734868 -769069 -538102 -425163 -467348 -312305 167588 613609
39593 613609 693040 541904 469838 490796 426220 293855 297751 509757 798647 1031452 1157228
39582 1157228 1138171 971885 753919 587675 482891 447088 562215 810897 945696 752012
39572 752012 376686 174983 274458 517701 798722 1170860 1577156 1761574 1595940 1293555
39562 1293555 1131008 1096069 967977 635692 175969 -292888 -648051 -702677 -331466 289754
39552 289754 747313 817375 728798 853378 1187857 1335605 1046953 583067 381297 486148
39542 486148 553740 391834 209623 231491 327601 250393 64854 60457 296366 511121 507748
39531 507748 390597 350370 414552 508041 591301 613796 456919 61717 -448778 -866782
39521 -866782 -1065889 -1022372 -770683 -419063 -124683 29019 61358 -37397 -325012 -705461
39511 -705461 -885449 -718072 -456878 -426080 -516306 -299821 338710 979929 1182649 971028
39501 971028 655059 383806 105732 -162253 -285259 -201864 29042 354259 724776 996566
39491 996566 1043108 991161 1145177 1621727 2239202 2814213 3326814 3671985 3522471 2725426
39481 2725426 1701494 1139688 1304466 1872418 2419925 2799363 3026503 3126151 3225491 3525523
39471 3525523 3978339 4201163 3932197 3398331 2985412 2702905 2289606 1754410 1432904
39462 1432904 1478301 1669969 1871133 2339598 3307355 4456540 5143085 5107981 4721413 4504902
39452 4504902 4613199 4847786 5008141 5079121 5108042 5025163 4672813 4012275 3221222 2509300
39442 2509300 1885714 1234286 603129 236717 241811 380932 336106 78436 -156850 -181147
39432 -181147 -6132 239874 414807 446712 442450 636856 1100767 1601821 1923745 2199665
39422 2199665 2680203 3257559 3533867 3358886 2979310 2603611 2164162 1656235 1375236
39413 1375236 1530628 1822734 1721225 1119281 472695 263850 477781 668168 494223
39404 494223 141206 136181 702534 1427041 1732722 1560400 1314919 1228218 1156760 1013394
39394 1013394 950742 982772 864374 571555 489166 831641 1257545 1392084 1367068 1462744
39384 1462744 1573847 1485633 1360263 1434875 1500131 1230250 821517 727175 918278 996305
39374 996305 911106 951191 1109656 1108208 1028052 1267743 1835468 2290817 2428541 2427468 2320454
39363 2320454 1975691 1633167 1750687 2225795 2468447 2341648 2316378 2609495 2929067 3156914
39353 3156914 3475692 3775685 3855442 4230170 5647280 7747197 9475040 10888112 13007765
39344 13007765 15756540 18042826 20306106 24536743 30976680 37965949 46798492 62633609
39336 62633609 86109000 106568712 109796979 93178198 68591489 49223111 37948531
39329 37948531 30322362 23763862 19295192 17059037 15213022 13005608 11436076 10698020
39321 10698020 9652001 8046008 6942551 6620352 6077530 4996964 4345211 4508294 4494049
39312 4494049 3613462 2528342 1974866 1700563 1344776 1259958 1727723 2268229 2412280
39303 2412280 2399624 2524376 2512682 2126290 1721079 1640762 1650863 1507888 1513856 1937386
39293 1937386 2387851 2362317 2039348 1978179 2301745 2644459 2697172 2429791 1962998 1510507
39283 1510507 1276235 1232961 1218311 1303498 1684254 2128404 2060258 1427156 964984 1259208
39273 1259208 1977017 2395626 2301750 1981661 1664830 1393291 1201161 1075091 929624 843513
39263 843513 1028300 1350021 1284690 670622 103411 171428 653279 944842 975380 1145047
39253 1145047 1538926 1786902 1683634 1446268 1277438 1067685 673744 234370 66223
39244 66223 355132 990110 1631846 1973085 1988742 1864658 1672408 1296603 759951 402169
39234 402169 560420 1187725 1903536 2318891 2266198 1870086 1449372 1211101 1061256 887944
39224 887944 881953 1209744 1490310 1143614 288155 -301487 -261258 -27770 62180 358040
39214 358040 1154454 1997376 2303730 2188734 2090137 1999254 1702786 1429758 1560264 1914477
39204 1914477 1993019 1786993 1757443 2123331 2702334 3314600 3810799 3864240 3312756 2584039
39194 2584039 2221459 2123025 1825209 1370353 1213370 1361472 1327011 946569 577769 451939
39184 451939 474055 667728 1123502 1484022 1245556 665302 570821 1105038 1497484 1331558
39174 1331558 1152468 1419109 1732855 1671653 1581752 1830643 1963218 1427210 616340 324595
39164 324595 529126 575377 314859 183704 272621 186880 -127459 -200401 166182 576168
39154 576168 692420 629486 503165 157933 -381131 -680919 -468863 -56265 139292 191094
39144 191094 448769 959619 1434010 1639616 1553622 1247844 880501 701129 811601 983904
39134 983904 935659 720507 609060 637134 565155 318192 157046 254721 354967 118746
39124 118746 -320610 -460014 -85736 469226 838026 1115171 1594681 2194637 2501221 2395583
39114 2395583 2292262 2573720 3027446 3138521 2872892 2859738 3669363 5086843 6287567
39105 6287567 6667143 6306610 5629269 4869932 4061883 3342525 2930602 2798072 2657345
39096 2657345 2349560 1989588 1641384 1154152 496679 -39544 -223878 -222188 -272115 -286283
39086 -286283 -128590 -19704 -192741 -335588 47775 777483 1108111 773561 331709 289322
39076 289322 452486 436979 308301 311873 366225 274438 166860 302105 611853 830411
39066 830411 938314 1121740 1387606 1531378 1418736 1054506 480396 -149452 -512013 -405181
39056 -405181 -27710 226834 148142 -271707 -967606 -1682000 -1935857 -1491634 -748699 -350483
39046 -350483 -462792 -716619 -754491 -513702 -60950 495431 942316 1107467 1054683 904610
39036 904610 577856 21221 -444989 -410839 42430 444716 589196 658608 713489 555955
39026 555955 210396 46960 200354 274056 -97568 -709361 -1084776 -1054859 -768548 -357827
39016 -357827 100134 426594 435171 152769 -207666 -439228 -432191 -218566 -30011 -149833
39006 -149833 -578958 -992064 -1129514 -1060062 -949346 -796793 -587739 -500316 -707631 -1087618
38996 -1087618 -1351180 -1379101 -1247625 -1011662 -661325 -232909 214494 680538 1127559 1378661
38986 1378661 1295414 1010418 792643 684099 438237 -136874 -873179 -1325289 -1150270 -447362
38976 -447362 272587 550573 432684 335080 457689 568794 454720 278871 262318 268420
38966 268420 35928 -356288 -633931 -811836 -1099285 -1363101 -1183453 -558796 -80291 -143585
38956 -143585 -365071 -130085 543524 1078869 1121704 843886 503575 97918 -431488 -922016
38946 -922016 -1097424 -843870 -296642 263444 583991 635362 647022 812693 963097 740005
38936 740005 149102 -313140 -254830 90273 181386 -107589 -361141 -191711 325579 832861
38926 832861 1073459 991962 630075 75651 -555684 -1176352 -1707234 -1976009 -1773567 -1124630
38916 -1124630 -419123 -140854 -453557 -1080870 -1554388 -1571680 -1196910 -751450 -452624 -181948
38906 -181948 268582 761149 871720 470679 -5660 -53821 309627 676837 812750 827401
38896 827401 869168 920347 899997 765858 511463 216275 47594 40412 -34202 -347073 -643799
38885 -643799 -511241 4886 386881 311487 9755 -145428 -97201 14883 143582 275229
38875 275229 303446 204509 172052 340714 517326 436954 183509 98384 323789 676318
38865 676318 946836 1086819 1085691 904698 620996 456999 540365 732997 802323 696920
38855 696920 552437 458675 333831 70035 -263351 -444234 -328632 6949 372094 634370
38845 634370 738609 652006 403709 126590 -64872 -212883 -418251 -636275 -698817 -513710
38835 -513710 -115250 429067 987986 1293982 1137341 649951 183807 -103694 -312252 -450424
38825 -450424 -341149 34575 404375 559116 571955 529789 359862 119438 129456 525852
38815 525852 937652 927736 540138 109955 -218209 -406545 -211762 524071 1366753 1604198
38805 1604198 1116430 496738 242710 253705 240605 200512 262808 397068 523136 674545
38795 674545 840637 855843 652576 446684 470107 657873 774344 721522 561635 360788
38785 360788 180658 126057 236129 392063 459583 458404 485892 550256 587889 579670 551356
38774 551356 511980 461960 397651 258205 -36607 -431648 -718538 -745566 -560859 -302196
38764 -302196 -64507 69743 28714 -106816 -98622 159053 429765 362117 -109415 -690774
38754 -690774 -1023281 -994731 -814411 -820657 -1132549 -1462239 -1391982 -882324 -362093 -246384
38744 -246384 -513517 -826681 -889011 -581921 22697 612278 794064 521276 199559 163517
38734 163517 241958 110253 -134969 -144491 59313 89611 -159768 -349113 -324219 -475661
38724 -475661 -1156128 -2023994 -2339169 -1814865 -886030 -165158 129840 197646 317549 585085
38714 585085 887183 1055487 1039013 924508 800532 666720 509839 407657 495238 835247
38704 835247 1321409 1680091 1620194 1110301 518605 334336 679511 1192325 1435445 1294523
38694 1294523 922734 473479 43405 -238125 -257163 -38818 281508 567460 687379 522758
38684 522758 119702 -248174 -337045 -204620 -72722 4026 126332 265828 261636 125012
38674 125012 80421 214266 322997 236334 67053 -26321 -114793 -310911 -468378 -350775
38664 -350775 -31001 159802 101314 60620 315195 766621 1035694 855684 303081 -302932
38654 -302932 -682318 -800470 -797521 -714365 -392791 250568 946036 1251579 1011982 496846
38644 496846 84021 -55977 23485 161783 184519 29173 -179408 -293217 -366017 -548358
38634 -548358 -778941 -814715 -601663 -366662 -279763 -303548 -466141 -923703 -1526383 -1675504
38624 -1675504 -1005601 -6990 455135 170539 -245380 -189071 290789 738796 847664 652456
38614 652456 414253 425459 759702 1145856 1230170 966942 589805 253032 -54498 -281947
38604 -281947 -315590 -222320 -177975 -123948 146211 500775 504612 103328 -172158 47663 444371
38593 444371 592527 662018 1036426 1524923 1567276 1122368 754186 782495 873696 623374
38583 623374 104736 -369096 -682700 -898046 -1061487 -1229263 -1469769 -1677712 -1595400 -1168380
38573 -1168380 -666102 -302895 19926 410296 682472 633168 433497 429057 641530 767679
38563 767679 644419 442679 373747 430530 483022 461956 375200 252029 129210 38014 -1465
38552 -1465 55949 246993 451422 390605 -58976 -613767 -832392 -601624 -212582 12791
38542 12791 -24705 -291889 -697178 -999303 -893582 -360715 215517 432016 273171 26569
38532 26569 -90613 -87503 -75917 -136301 -258817 -313458 -138486 245786 584227 649078 478348
38521 478348 253723 48690 -157113 -313998 -347836 -321993 -364046 -455498 -479140 -451809 -492778
38510 -492778 -546155 -376463 63501 458110 466366 117697 -252982 -391005 -344582 -343338 -514561
38499 -514561 -714488 -675135 -363588 -82041 -66053 -128447 15213 174274 -129799 -858322
38489 -858322 -1329055 -1121538 -659698 -537652 -662458 -560527 -255352 -240684 -665821 -1117242
38479 -1117242 -1254410 -1166586 -1006917 -745954 -450880 -382475 -591438 -762772 -675145 -498938
38469 -498938 -432087 -373422 -215147 -140850 -302901 -446825 -212788 337458 801803 927523
38459 927523 765199 483203 294799 402778 706636 720056 145389 -573035 -670851 -16803
38449 -16803 741644 1010231 834392 555528 264960 -162104 -715565 -1173975 -1309329 -1074284
38439 -1074284 -669507 -438802 -546624 -746858 -658490 -284903 -17948 -67866 -176359 -58839
38429 -58839 124519 1434 -450311 -845145 -857959 -528287 -88515 307588 598032 694742
38419 694742 512318 116750 -271208 -500611 -656758 -887625 -1104396 -1054258 -743264 -551227
38409 -551227 -757148 -1150258 -1344863 -1299343 -1211094 -1046475 -603697 -28495 187050 -145147
38399 -145147 -627740 -819797 -743269 -662425 -661396 -668404 -637577 -469134 2860 678360 1073963
38388 1073963 843113 256805 -108516 -10595 392625 923163 1476764 1852469 1864542 1617548
38378 1617548 1383715 1226284 999598 674230 393383 254103 293893 604196 1133442 1465038
38368 1465038 1205373 592589 285423 473597 644688 398721 56150 161966 709475
38359 709475 1197497 1266911 984239 616841 367925 249501 54947 -427470 -1051409 -1347292
38349 -1347292 -1083301 -588258 -304922 -223180 -29154 341229 620351 619394 437162 269435
38339 269435 230793 345343 515547 526757 264203 -111542 -361749 -453396 -466458 -358202
38329 -358202 -92314 106930 -28265 -370194 -519276 -373837 -213373 -166761 -10275 346755
38319 346755 577220 423018 161466 230938 572173 703476 382623 -129862 -480875 -627995
38309 -627995 -744820 -897471 -941954 -713398 -266893 112697 205498 133718 202668 455314
38299 455314 598171 465740 320177 483669 859071 1080657 1019013 845248 664275 411526
38289 411526 137007 80073 341403 697306 859524 752660 440475 -38708 -615358 -1094359
38279 -1094359 -1278982 -1151774 -852307 -527227 -250997 -16079 253146 598999 904353
38270 904353 976496 820411 712975 903196 1316458 1646720 1669023 1375669 896267 417844
38260 417844 136356 135085 276802 293775 18606 -485556 -987118 -1237071 -1113812 -707665
38250 -707665 -261365 30637 170027 279832 413371 489540 409117 190641 -20404 -70617
38240 -70617 62625 257583 407710 583251 958995 1554601 2122953 2362892 2209427 1860542
38230 1860542 1538068 1272016 930613 449615 4620 -113000 161927 531814 659915
38221 659915 576520 593152 828730 1046006 1024435 856014 708836 504580 87492 -399517
38211 -399517 -604462 -437618 -196038 -144432 -191940 -125273 557 -83953 -452526 -819813
38201 -819813 -868910 -638101 -457608 -521772 -661007 -605990 -367045 -209535 -299104 -543028
38191 -543028 -797821 -1045891 -1270305 -1310631 -1012041 -465734 32052 250478 174691 -75898
38181 -75898 -373367 -612509 -695352 -555981 -238589 62733 138773 13222 -39598 147702
38171 147702 369648 349316 206099 299023 621043 756429 556337 428848 699133 1068533
38161 1068533 1093246 906293 992985 1407616 1699687 1594353 1319798 1207687 1313955 1502543
38151 1502543 1620559 1539442 1274335 1085653 1213406 1506585 1573595 1290519 885577 549744
38141 549744 298477 222622 489568 996605 1365536 1412543 1329209 1287608 1180336 904427
38131 904427 617451 530193 654826 877142 1066062 1045307 721247 306560 123239 127888
38121 127888 -12580 -303357 -326733 62263 406381 292553 -80659 -308385 -379185 -499214
38111 -499214 -643401 -684749 -712748 -844065 -956004 -958455 -1046348 -1288582 -1279893 -697768 53256
38100 53256 312961 98318 -20042 151093 255198 124646 40162 133435 122632 -128934
38090 -128934 -275032 10334 540108 873337 806038 424622 -84732 -529036 -824086 -1106317
38080 -1106317 -1510677 -1831583 -1736673 -1361396 -1277437 -1706840 -2152254 -2047531 -1454230 -845253
38070 -845253 -473831 -257980 -80867 112028 398141 788243 1114237 1214930 1180833 1236621
38060 1236621 1410905 1465097 1158868 532663 -65074 -266830 -88557 25588 -271593 -736571
38050 -736571 -827283 -453390 -94079 -113680 -328332 -402909 -323544 -237237 -123710 69095
38040 69095 174990 10931 -292929 -434980 -335027 -164877 -57851 16174 135542 331479
38030 331479 548538 611883 355967 -121018 -490509 -582038 -539524 -478027 -265069 136734
38020 136734 389962 185061 -255682 -438056 -261540 -80718 -156006 -380472 -550364 -596389
38010 -596389 -512228 -324082 -172768 -182650 -216854 -10548 407953 682483 590580 304597
38000 304597 103614 62219 151294 415323 851445 1270223 1487431 1556828 1611382 1549910
37990 1549910 1136917 451488 866 216885 938553 1567941 1714822 1516065 1295053
37981 1295053 1120999 865150 541695 337572 321211 347327 284596 136587 -105762 -498213
37971 -498213 -920269 -1042872 -710761 -217484 -7622 -184470 -462980 -528068 -289438 142163
37961 142163 559341 755010 644770 319081 -44541 -277191 -260832 -37608 110011 -85051
37951 -85051 -461407 -532706 -151667 207208 63211 -425990 -738224 -688923 -496484 -315418
37941 -315418 -136547 -76488 -302288 -629199 -629794 -263397 -2493 -153046 -405346 -307115
37931 -307115 112098 488451 676717 814025 941625 907241 656969 351530 124211 -66297
37921 -66297 -255497 -337840 -254137 -166991 -250196 -381266 -289220 -20975 16924 -379780 -859091
37910 -859091 -966373 -759300 -635423 -669559 -553809 -202114 60507 69676 145032 576171
37900 576171 1151311 1510103 1631695 1606613 1249396 428616 -426922 -693992 -366304 -23233
37890 -23233 -12137 -129347 -135231 -107807 -170388 -280560 -432789 -712839 -1016004 -1057112 -803308
37879 -803308 -554128 -433289 -162996 425242 980111 1035489 621571 204054 156072 493333
37869 493333 974522 1250462 1045663 409210 -282464 -712849 -922940 -1113129 -1292461 -1293079
37859 -1293079 -1045978 -691168 -452008 -475346 -723912 -965509 -947212 -622934 -143328 343970
37849 343970 746255 938448 857007 680794 671582 812134 857338 752856 685858 684550 554334
37838 554334 323434 325323 623908 779765 508494 194898 339948 789687 986290 793692
37828 793692 571890 509713 386056 54998 -253590 -273793 -58549 158323 261831 289386
37818 289386 296442 299959 305728 344485 474250 684776 784133 526335 -52903 -573292 -714412
37807 -714412 -550910 -358787 -262098 -246654 -332343 -475170 -436535 -38709 519948 864514
37797 864514 900812 828825 772506 686210 607062 695910 965614 1207274 1270992 1248945 1312344
37786 1312344 1489700 1642019 1575814 1210733 720396 416357 369563 275141 -130671 -661797
37776 -661797 -928650 -868378 -738000 -664122 -532200 -302521 -94193 91870 417942 883133
37766 883133 1221596 1248326 1100985 1032275 1123201 1268190 1298355 1095820 735787 493317
37756 493317 533889 669468 662608 664897 981055 1438377 1465033 907394 311966 173408 304314
37745 304314 239232 -80567 -358673 -397717 -163432 340148 874349 883321 87017 -956387
37735 -956387 -1363005 -984870 -510932 -479952 -675277 -647178 -360823 -16997 405349 1005293
37725 1005293 1545743 1611814 1162289 585841 178344 -140663 -525990 -907483 -1124065 -1117876
37715 -1117876 -836441 -177991 729682 1393086 1425254 1077400 969488 1295211 1627576 1573373
37705 1573373 1267539 1047068 943805 767417 485462 237055 91008 41800 144573 404266
37695 404266 612620 558193 352301 284688 376178 351774 92928 -152281 -118076 119492
37685 119492 262417 146224 -133986 -376448 -466742 -446860 -422279 -397925 -253773 74600
37675 74600 462674 713570 737043 557980 268349 52722 97535 334547 437333 243421
37665 243421 8076 38580 272783 477428 653013 894330 1027950 824678 489908 492363
37655 492363 911712 1377223 1654049 1839588 1947390 1803904 1494535 1426084 1729489 2024833
37645 2024833 2012303 1889482 1920783 1999005 1963263 1985455 2243377 2487773 2352218 1913410
37635 1913410 1561446 1438472 1351728 1158417 925884 746678 626564 520290 340317 47307
37625 47307 -157255 43866 582070 893620 595339 47469 -81334 368221 997617 1452418
37615 1452418 1684660 1709626 1508847 1197927 979293 890082 818282 733838 667617 525705
37605 525705 205056 -142637 -252010 -143783 -105167 -252926 -380387 -285386 -20898 230901
37595 230901 335142 214695 -128759 -551094 -861466 -1006013 -1050518 -1011786 -829954 -464617
37585 -464617 88152 778726 1386447 1589401 1357933 1116281 1247878 1581143 1673938 1480210
37575 1480210 1351947 1432912 1468792 1272206 992271 794877 593235 261324 -122889 -403682
37565 -403682 -542479 -569936 -489225 -313623 -85511 172454 408472 477093 298854 51446
37555 51446 -7917 104296 135089 -34648 -282753 -485520 -622224 -664676 -622641 -670699 -944034
37544 -944034 -1242760 -1269836 -1132966 -1206832 -1472604 -1461224 -988428 -482706 -338033 -342568
37534 -342568 -66368 494080 988506 1196300 1134331 880957 583660 474175 600709 688259
37524 688259 508144 222393 103955 91612 -63273 -336797 -464530 -381297 -299749 -335896
37514 -335896 -347314 -213378 -47146 -28664 -176786 -366529 -468733 -415096 -205187 95957
37504 95957 400959 662862 884045 1071124 1186293 1136742 862568 497448 364278 663698
37494 663698 1202637 1601032 1737450 1782409 1820929 1735882 1513373 1339814 1260881 1049638
37484 1049638 602751 179072 4945 -86096 -315702 -490335 -243809 362934 847152 889174
37474 889174 619167 322047 118988 -27180 -201152 -473191 -812020 -1072978 -1189392 -1292478
37464 -1292478 -1476581 -1553217 -1283852 -811744 -596863 -880299 -1406261 -1711764 -1536007 -938121
37454 -938121 -189768 403270 707375 831121 913231 884823 579304 43635 -430148 -597150
37444 -597150 -447783 -102626 333864 777769 1134011 1317701 1289077 1098716 915028 895604
37434 895604 956343 804740 332377 -160600 -308445 -133774 44487 64761 52309 145233
37424 145233 326602 524415 672837 666488 433698 63130 -287549 -574406 -802531 -853441
37414 -853441 -601385 -176042 113652 126413 -14499 -129762 -91893 199768 680504 991194
37404 991194 790612 214976 -263092 -454137 -609576 -911053 -1171992 -1199983 -1120488 -1112127
37394 -1112127 -1077140 -820779 -374762 73006 414922 609344 608406 504999 581467 965651
37384 965651 1349348 1289219 732036 49853 -392233 -536026 -563515 -698085 -1019073 -1322587
37374 -1322587 -1222511 -539852 444734 1228459 1497068 1219732 528088 -278574 -756807
37365 -756807 -670027 -316407 -248414 -631210 -1094159 -1238213 -1043268 -701177 -303029 129611
37355 129611 464107 519691 287208 -25690 -163865 -14846 300567 496236 374479 65263
37345 65263 -79672 115101 458245 654613 625705 473900 277679 89684 29485 166038
37335 166038 348575 357791 216807 154841 256636 360448 335085 226091 59231 -244992
37325 -244992 -630909 -836988 -757602 -638863 -673051 -635402 -257292 231949 363820 143774
37315 143774 40588 241619 384600 153421 -296949 -705616 -1082672 -1444312 -1533108 -1162232
37305 -1162232 -590870 -205501 -7959 261694 661777 1025682 1247883 1282027 1019699 519716
37295 519716 202819 410989 864660 976879 660182 384756 425048 501870 281166 -169467
37285 -169467 -582158 -822804 -862519 -687745 -389423 -116956 155496 579441 1084245 1378673
37275 1378673 1411906 1516551 1909275 2321030 2339845 1909910 1287216 685995 180585 -175977
37265 -175977 -333018 -290023 -85112 182657 332429 288587 275437 558612 974083 1054320
37255 1054320 720430 486267 791934 1464545 2052761 2361096 2378284 2001633 1217317 360631
37245 360631 -172267 -373486 -503620 -639324 -616277 -326415 189866 874997 1645011 2304681
37235 2304681 2656391 2641008 2278546 1635862 971933 664875 775964 908295 736576 443707
37225 443707 351690 363400 142714 -305295 -609547 -520240 -132754 292162 502193 404580
37215 404580 283586 638600 1497388 2144662 1920436 1049654 251565 -200380 -476966 -500133
37205 -500133 20587 893200 1490160 1590590 1558488 1577485 1368453 882910 635307 993962
37195 993962 1642898 2089428 2258002 2249602 1964683 1365281 739288 306838 -111047 -654911
37185 -654911 -994296 -765311 -171012 294205 508032 691610 915317 1067832 1172655 1313756
37175 1313756 1354585 1127886 801809 658412 605543 337187 -83022 -256273 -72550 147929
37165 147929 198833 235631 357204 364917 155021 -1256 156585 467794 600866 521109
37155 521109 424594 343930 136842 -159746 -259750 -2638 396737 604618 568361 526606
37145 526606 669904 935279 1153106 1253249 1231751 1022240 568383 15984 -312655 -189474
37135 -189474 331187 977791 1435269 1513277 1290637 1060557 969372 765576 147392 -673082
37125 -673082 -1088360 -855907 -399419 -193649 -185437 -66586 189710 392334 494748 532776
37115 532776 366670 -144934 -811797 -1284584 -1469934 -1462807 -1205137 -613816 37825 329759
37105 329759 308841 457442 971793 1483849 1620091 1442266 1180766 921634 761115 888811
37095 888811 1239423 1388468 1114715 794597 882658 1216539 1241806 816566 391544 384552
37085 384552 704537 971294 979493 856102 877535 1160962 1482781 1484456 1137549 832567
37075 832567 839224 895950 638360 253258 262658 703368 1026739 927796 767611 891533 983738
37064 983738 565383 -159402 -525678 -389181 -309149 -642324 -972558 -728147 7796 664911
37054 664911 915346 846102 561073 64554 -448783 -601755 -274374 256999 751372 1281152
37044 1281152 1897107 2314463 2240890 1830498 1471341 1221328 813973 209608 -236229 -269641
37034 -269641 -95805 -49811 -133331 -106611 100296 317138 427322 503928 612040 646102
37024 646102 466116 113640 -219537 -432312 -624822 -900074 -1116190 -984863 -463692 98650
37014 98650 349635 362038 475194 755227 876656 611597 189939 -7362 41672 15148
37004 15148 -281960 -661014 -792230 -571477 -182313 145407 364390 564133 716044 580654
36994 580654 6066 -727142 -1074493 -820537 -335331 -131127 -317304 -625347 -808725 -820542
36984 -820542 -715695 -606609 -649106 -847860 -923144 -607843 -58355 271786 169451 -175206
36974 -175206 -543406 -907842 -1193687 -1159699 -728512 -181239 209675 518135 873597 1058509
36964 1058509 775075 213278 -53760 217690 664741 834901 685417 443338 234562
36955 234562 41221 -151440 -354683 -615285 -917409 -1141169 -1216733 -1198053 -1094083 -795422
36945 -795422 -310121 94619 178527 30092 -113327 -227020 -457479 -819719 -1180424 -1459400
36935 -1459400 -1577925 -1293269 -452808 571064 1103120 974631 761759 983263 1364043
36926 1364043 1238347 506467 -197972 -278755 207125 774274 1091317 1184242 1202305 1175401
36916 1175401 1030678 760685 486455 324126 249839 183896 172136 341939 660301 893741
36906 893741 877905 688105 468759 255967 80022 67299 260995 469572 485044 348353
36896 348353 205757 18165 -334325 -726175 -852226 -639293 -348019 -220768 -248603 -338980
36886 -338980 -480579 -630765 -630885 -380524 13702 360515 549856 529005 262947 -147228
36876 -147228 -407729 -262617 213279 644993 715483 479559 311905 520030 1003615 1361459
36866 1361459 1360318 1171711 1052390 959117 696909 331267 147624 209351 259466 120679
36856 120679 -92196 -249238 -394438 -504278 -360295 78834 411341 233427 -262995 -470809
36846 -470809 -151245 256539 212613 -248020 -598077 -504385 -239617 -314452 -795942 -1196550
36836 -1196550 -1100695 -676347 -352563 -179566 123014 548215 694272 389553 -10514 -188714
36826 -188714 -340530 -746809 -1196911 -1275980 -1028346 -871551 -941343 -981077 -883738 -896457
36816 -896457 -1165664 -1440646 -1418541 -1142544 -876820 -738357 -596589 -261484 286939 797613
36806 797613 919563 601881 255195 326426 770755 1166199 1281171 1229737 1096443 792047
36796 792047 378017 163940 273254 391832 187664 -223930 -461272 -351685 -2920 445947
36786 445947 888024 1150712 1087988 768795 405502 107733 -155156 -375815 -447491 -307480
36776 -307480 -52366 120451 75041 -123486 -233693 -90141 167105 255360 166700 223610
36766 223610 616417 1090493 1277211 1176280 1078668 1109199 1099419 896000 569870 281427
36756 281427 105494 38972 59280 126136 197044 253517 263525 163064 -37852 -175374 -62979
36745 -62979 319925 840925 1346989 1691955 1742006 1525300 1310182 1340821 1523125 1560940
$$ [...]
##END NTUPLES=NMR SPECTRUM
##END=
