##TITLE=31Pdec_LR-760-1-C2
 CCl4, 24 sc
 20.1.2023
##JCAMPDX= 6.0         $$ Bruker NMR JCAMP-DX V2.0
##DATA TYPE= NMR SPECTRUM
##DATA CLASS= NTUPLES
##ORIGIN= UXNMR, Bruker Analytische Messtechnik GmbH
##OWNER= root
$$ XWIN-NMR		Version 3.5
$$ Fri Jan 20 15:36:20 2023 Russian Standard Time (UT+4h)  she@DPX200
##.OBSERVE FREQUENCY= 81.013821
##.OBSERVE NUCLEUS= ^31P
##.ACQUISITION MODE= SIMULTANEOUS
##.ACQUISITION SCHEME= undefined
##.AVERAGES= 24
##.DIGITISER RES= 16
##SPECTROMETER/DATA SYSTEM= spect
##.PULSE SEQUENCE= zgpg30
##.SOLVENT NAME= CDCl3
##.SHIFT REFERENCE= (INTERNAL, CDCl3, 0, 248.564)
##AUDIT TRAIL= $$ (NUMBER, WHEN, WHO, WHERE, WHAT)
$$ ##TITLE= Audit trail, XWIN-NMR		Version 3.5
$$ ##JCAMPDX= 5.01
$$ ##ORIGIN= Bruker BioSpin GmbH
$$ ##OWNER= she
$$ F:/spectra/data/she/nmr/P31/1/pdata/1/auditp.txt
$$ ##AUDIT TRAIL=  $$ (NUMBER, WHEN, WHO, WHERE, WHAT)
(   1,<2023-01-20 15:34:51.23 +0400>,<she>,<DPX200>,
      <created by zg, POWCHK disabled, PULCHK disabled
       configuration hash MD5:
       00 E9 B6 7A A2 85 ED C7 34 08 36 98 17 FE 4E 26
       data hash MD5: 32K
       9B D4 C9 0E 23 F4 62 2C 16 4C BC C6 03 9E 70 5C>)
(   2,<2023-01-20 15:35:29.20 +0400>,<she>,<DPX200>,
      <Start of raw data processing
       efp BC_mod = 2 LB = 1 FT_mod = 6 PKNL = 1 PHC0 = -10989.33 PHC1 = 87.65779 SI = 64K 
       data hash MD5: 64K
       46 5E 61 AE A3 E3 C5 60 4E 5B 2A E6 3B 0F 5E 99>)
(   3,<2023-01-20 15:35:44.92 +0400>,<she>,<DPX200>,
      <pk PHC0 = 28.96025 PHC1 = 0 
       data hash MD5: 64K
       AB 27 45 A3 97 32 FE 47 74 11 44 9B 0D 9C 06 74>)
(   4,<2023-01-20 15:35:48.39 +0400>,<she>,<DPX200>,
      <abs ABSG = 5 
       data hash MD5: 64K
       E1 B8 6E 17 02 09 02 55 FF 11 75 B4 5C 58 34 6B>)
$$ ##END=
$$ 
$$ hash MD5
$$ 2F CC 7B 6E A8 55 5A AB E8 12 41 36 15 50 EE C6
##$RELAX= 
##$RELAX= 
##$RELAX= 
##$RELAX= 
##$RELAX= 
##$RELAX= 
##$RELAX= 
##$RELAX= 
##$RELAX= 
$$ Bruker specific parameters
$$ --------------------------
##$DU= <F:/spectra>
##$EXPNO= 1
##$NAME= <P31>
##$PROCNO= 1
##$TYPE= <nmr>
##$USER= <she>
##$AMP= (0..31)
100 100 100 100 100 100 100 100 100 100 100 100 100 100 100 100 100 100 
100 100 100 100 100 100 100 100 100 100 100 100 100 100 
##$AQSEQ= 0
##$AQ_mod= 1
##$AUNM= <au_zg>
##$AUTOPOS= <>
##$BF1= 81.014009
##$BF2= 200.13
##$BF3= 200.13
##$BF4= 200.13
##$BF5= 200.13
##$BF6= 200.13
##$BF7= 200.13
##$BF8= 200.13
##$BYTORDA= 1
##$CFDGTYP= 0
##$CFRGTYP= 5
##$CHEMSTR= <none>
##$CNST= (0..31)
1 1 145 1 1 1 1 1 1 1 1 1 1 1 1 1 1 1 1 1 1 1 1 1 1 1 1 1 1 1 1 1 
##$CPDPRG= <waltz16>
##$CPDPRG1= <>
##$CPDPRG2= <waltz16>
##$CPDPRG3= <>
##$CPDPRG4= <mlev>
##$CPDPRG5= <mlev>
##$CPDPRG6= <mlev>
##$CPDPRG7= <mlev>
##$CPDPRG8= <mlev>
##$CPDPRGB= <>
##$CPDPRGT= <>
##$D= (0..31)
0 1 0 0 0 0 0 0 0 0 0 0.03 2e-05 3e-06 0 0 0 0 0 0 0 0 0 0 0 0 0 0 0 0 
0 0 
##$DATE= 1674214490
##$DBL= (0..7)
120 120 120 11 120 120 24 19 
##$DBP= (0..7)
150 150 150 150 150 150 150 150 
##$DBP07= 0
##$DBPNAM0= <>
##$DBPNAM1= <>
$$ [...]
##$SUBNAM3= <"">
##$SUBNAM4= <"">
##$SUBNAM5= <"">
##$SUBNAM6= <"">
##$SUBNAM7= <"">
##$SUBNAM8= <"">
##$SUBNAM9= <"">
##$SW= 501.771253377433
##$SWIBOX= (0..15)
0 1 3 0 0 0 0 0 0 0 0 0 0 0 0 0 
##$SW_h= 40650.406504065
##$TD= 32768
##$TD0= 1
##$TE= 0
##$TE2= 300
##$TE3= 300
##$TEG= 300
##$TL= (0..7)
0 120 53 12 22 120 120 120 
##$TP= (0..7)
150 150 150 150 150 150 150 150 
##$TP07= 0
##$TPNAME0= <>
##$TPNAME1= <>
##$TPNAME2= <>
##$TPNAME3= <>
##$TPNAME4= <>
##$TPNAME5= <>
##$TPNAME6= <>
##$TPNAME7= <>
##$TPOAL= (0..7)
0.5 0.5 0.5 0.5 0.5 0.5 0.5 0.5 
##$TPOFFS= (0..7)
0 0 0 0 0 0 0 0 
##$TUNHIN= 0
##$TUNHOUT= 0
##$TUNXOUT= 0
##$USERA1= <user>
##$USERA2= <user>
##$USERA3= <user>
##$USERA4= <user>
##$USERA5= <user>
##$V9= 5
##$VALIST= <valist>
##$VCLIST= <CCCCCCCCCCCCCCC>
##$VD= 0
##$VDLIST= <DDDDDDDDDDDDDDD>
##$VPLIST= <PPPPPPPPPPPPPPP>
##$VTLIST= <TTTTTTTTTTTTTTT>
##$WBST= 1024
##$WBSW= 4
##$XGAIN= (0..3)
0 0 0 0 
##$XL= 0
##$YL= 0
##$YMAX_a= 2956
##$YMIN_a= -2864
##$ZGOPTNS= <>
##$ZL1= 120
##$ZL2= 120
##$ZL3= 120
##$ZL4= 120
##$ABSF1= 248.5645
##$ABSF2= -253.2056
##$ABSG= 5
##$ABSL= 3
##$ALPHA= 0
##$AQORDER= 0
##$ASSFAC= 0
##$ASSFACI= 0
##$ASSFACX= 0
##$ASSWID= 0
##$AUNMP= <proc_1d>
##$AZFE= 0.1
##$AZFW= 0.5
##$BCFW= 0
##$BC_mod= 2
##$BYTORDP= 0
##$COROFFS= 0
##$CY= -3
##$DATMOD= 1
##$DC= 0
##$DFILT= <>
##$DTYPP= 0
##$F1P= 0
##$F2P= 0
##$FCOR= 1
##$FTSIZE= 65536
##$FT_mod= 6
##$GAMMA= 0
##$GB= 0
##$INTBC= 1
##$INTSCL= 6.047779e-11
##$ISEN= 30
##$LB= 1
##$LEV0= 0
##$LPBIN= 0
##$MAXI= 10000
##$MC2= 0
##$MEAN= 0
##$ME_mod= 0
##$MI= 50
##$NCOEF= 0
##$NC_proc= -10
##$NLEV= 6
##$NOISF1= 182.463
##$NOISF2= 159.3651
##$NSP= 0
##$NTH_PI= 0
##$NZP= 0
##$OFFSET= 248.5645
##$PC= 4
##$PHC0= -10960.37
##$PHC1= 87.65779
##$PH_mod= 1
##$PKNL= yes
##$PPARMOD= 0
##$PSCAL= 0
##$PSIGN= 0
##$REVERSE= no
##$SF= 81.0140089999694
##$SI= 65536
##$SIGF1= 159.3651
##$SIGF2= -187.1042
##$SINO= 113.3802
##$SIOLD= 16384
##$SREGLST= <1H.CDCl3>
##$SSB= 0
##$STSI= 65536
##$STSR= 0
##$SW_p= 40650.406504065
##$SYMM= 0
##$S_DEV= 0
##$TDeff= 32768
##$TDoff= 0
##$TI= <>
##$TILT= no
##$TM1= 0
##$TM2= 0
##$TOPLEV= 0
##$USERP1= <user>
##$USERP2= <user>
##$USERP3= <user>
##$USERP4= <user>
##$USERP5= <user>
##$WDW= 1
##$XDIM= 65536
##$YMAX_p= 407564989
##$YMIN_p= -251491581
$$ End of Bruker specific parameters
$$ ---------------------------------
##NTUPLES= NMR SPECTRUM
##VAR_NAME=  FREQUENCY,     SPECTRUM/REAL,   SPECTRUM/IMAG
##SYMBOL=    X,             R,               I
##VAR_TYPE=  INDEPENDENT,   DEPENDENT,       DEPENDENT
##VAR_FORM=  AFFN,          ASDF,            ASDF
##VAR_DIM=   65536,         65536,           65536
##UNITS=     HZ,            ARBITRARY UNITS, ARBITRARY UNITS
##FACTOR=    0.620285442955139, 1,           1
##FIRST=     20137.2065510682, 0,            0
##LAST=      -20513.1999529968, 0,           0
##MIN=       -20513.1999529968, -251491581,  0
##MAX=       20137.2065510682, 407564989,    0
$$ Real data points
##PAGE= N=1
##DATA TABLE= (X++(R..R)), XYDATA
$$ [...]
$$ plain form
40945 12080657 17859884 20709438 13242367 1567930 241234 9654276 14510553 9535422
40937 9535422 9446086 23213462 34465367 23486239 -2046561 -16203545 -9250769 3683234
40929 3683234 6023910 -3220058 -15365269 -21772588 -17500928 -6717705 -3354116 -14479983
40921 -14479983 -25477681 -16767045 5850212 15948353 4577897 -6502321 1125555
40914 1125555 14020070 8277161 -13589030 -26541095 -18466222 -3497414 561238 -7014651
40906 -7014651 -15976352 -20569777 -21774758 -20032492 -12923547 -124889 11925734 12149666
40898 12149666 -5384790 -31927639 -47913106 -41074092 -19118795 -79648 7926685
40891 7926685 11594060 18412774 25672696 26306460 19870245 12701307 9311793 7538748
$$ packed form
40945A2080657N779227K849554p467071j1674437j326696R413042M856277m975131
40937I535422q9336J3767376J1251905j0979128k5532800j4156984O952776J2934003
40929C683234K340676r243968j2145211o407319M271660J0783223L363589j1125867
40921a4479983j0997698Q710636K2617257J0098141j1370456j1080218P627876
40914A125555J2894515n742909k1866191j2952065Q074873J4968808M058652p575889
40906g014651q961701m593425j204981J742266P108945J2798658J2050623K23932
40898A2149666j7534456k6542849j5985467O839014K1955297J9039147Q006333
40891G926685L667375O818714P259922O33764o436215p168938l389514j773045
$$ plain form
40883 7538748 2025250 -9430212 -23027290 -32154148 -34233204 -33753456 -36153302 -39361805
40875 -39361805 -35962807 -25108205 -16658032 -18777828 -25643463 -24501906 -13086350 -1710123
40867 -1710123 2643781 5102474 11576165 17106975 13237154 1527374 -8820089 -13228109
40859 -13228109 -13170282 -9157865 -2864278 -3171851 -16250493 -29657536 -22585338 3607099
40851 3607099 21987929 16025141 2241841 3189788 13544337 13190831 2530885 -450563
40843 -450563 6537183 7162447 -1216531 -394141 13959282 17107332 -7123612 -34551358
40835 -34551358 -30714490 -241648 19772782 10924178 -7460980 -12597257 -7728746 -7336131
40827 -7336131 -11044552 -7978357 1992086 7248289 3309634 143573 6862890 17129373
$$ packed form
40883G538748n513498j1455462j3597078r126858k079056M79748k399846l208503
40875c9361805L398998J0854602Q450173k119796o865635J141557J1415556J1376227
40867a710123M353904K458693O473691N530810l869821j1709780j0347463m408020
40859a3228109N7827M012417O293587l07573j3078642j3407043P072198K6192437
40851C607099J8380830n962788j3783300R47947J0354549l53506j0659946k981448
40843d50563O987746O25264q378978Q22390J4353423L148050k4230944k7427746
40835c4551358L836868L0472842K0014430q848604j8385158n136277M868511L92615
40827g336131l708421L066195R970443N256203l938655l166061O719317J0266483
$$ plain form
40819 17129373 16529054 2066049 -12347538 -12169630 130772 8247599 1447377 -14079280
40811 -14079280 -23582275 -18820654 -3618366 10997326 15088606 7161000 -4501636 -10569660
40803 -10569660 -10741695 -10661547 -10282721 -4076406 6331570 11299322 9676866 13730150
40795 13730150 28487855 37981568 26070482 2607615 -8223765 -1849004 2651759
40788 2651759 -6668637 -17883016 -15705087 -3885216 3234597 1844680 101145 3180818
40780 3180818 6851167 5315490 -1219925 -8089232 -12147402 -14798013 -19088316 -24191343
40772 -24191343 -25183620 -19890966 -12517381 -7578059 -5096820 -6449670 -17717456 -37659811
40764 -37659811 -48752384 -34909187 -6444816 8666425 576110 -11686143 -10433969
$$ packed form
40819A7129373o00319j4463005j4413587J77908J2300402Q116827o800222j5526657
40811a4079280r502995M761621J5202288J4615692M091280p927606j1662636o068024
40803a0569660j72035Q0148L78826O206315J0407976M967752j622456M053284
40795A3730150J4757705R493713j1911086k3462867j0831380O374761M500763
40788B651759r320396j1214379K177929J1819871P119813j389917j743535L079673
40780C180818L670349j535677o535415o869307m058170k650611m290303n103027
40772b4191343r92277N292654P373585M939322K481239j352850j1267786j9942355
40764c7659811j1092573J3843197K8464371J5111241q090315j2262253J252174
$$ plain form
40757 -10433969 -2875864 -3598612 -9148689 -7085573 -753674 -5048129 -19224070 -22574484
40749 -22574484 -2822420 23909317 30073585 7790451 -23747087 -39527911 -32754514
40742 -32754514 -18343933 -15748683 -29659612 -47201308 -52686412 -43340933 -30342349
40735 -30342349 -25945114 -30293722 -30939004 -17087929 4923363 14780345 1138723 -22801263
40727 -22801263 -33793978 -25539388 -12161116 -7049363 -10302242 -17791968 -28545882 -37808220
40719 -37808220 -35910275 -22897959 -13900462 -19974569 -31995923 -33710735 -23026669 -9350200
40711 -9350200 2585826 12533513 13849113 -812333 -22975332 -32530688 -22493381 -8158480
40703 -8158480 -6395220 -14978455 -18887282 -10515158 3832395 14505927 18409572 17516364
$$ packed form
40757a0433969P558105p22748n550077K063116O331899m294455j4175941l350414
40749b2574484J9752064K6731737O164268k2283134l1537538j5780824O773397
40742c2754514J4410581K595250j3910929j7541696n485104R345479J2998584
40735c0342349M397235m348608o45282J3851075K2011292R856982j3641622k3939986
40727b2801263j0992715Q254590J3378272N111753l252879p489726j0753914r262338
40719c7808220J897945J3012316Q997497o074107j2021354j714812J0684066J3676469
40711i350200J1936026R947687J315600j4661446k2162999r555356J0037307J4334901
40703h158480J763260q583235l908827Q372124J4347553J0673532L903645q93208
$$ plain form
40695 17516364 12761248 4103483 -4169580 -4502743 3051204 6062672 -5223128 -20026598
40687 -20026598 -16260615 9581449 34015261 34975268 18082684 5156549 5305201 9143525
40679 9143525 6295598 -3245906 -13126948 -16765322 -11016992 -259353 6405404 7229539
40671 7229539 10796895 20765139 26994064 21647333 14083484 16133321 21678242 17867561
40663 17867561 9294937 10398488 17633172 12856931 -3482502 -6527791 16526479 43733102
40655 43733102 45074736 18442175 -12965660 -28538374 -24270998 -7897894 7970317
40648 7970317 12846019 7783824 4330780 8545050 12470484 8220190 3013893 9811520
40640 9811520 26895050 37848307 32429232 18500187 9323271 5001954 -5925796 -26319699
$$ packed form
40695A7516364m755116q657765q273063l33163P553947L011468j1285800j4803470
40687b0026598L765983K5842064K4433812R60007j6892584j2926135J48652L838324
40679I143525k847927r541504r881042l638374N748330J0757639O664757Q24135
40671G229539L567356R968244O228925n346731p563849K049837N544921l810681
40663A7867561q572624J103551P234684m776241j6339433l045289K3054270K7206623
40655D3733102J341634k6632561l1407835j5572714M267376J6373104J5868211
40648G970317M875702n062195l453044M214270L925434m250294n206297O797627
40640I811520J7083530J0953257n419075j3929045r176916m321317j0927750k0393903
$$ plain form
40632 -26319699 -40398727 -32191534 -9948610 1459736 -5414298 -10888287 -1945978 2439961
40624 2439961 -20009071 -53426460 -58868328 -28748267 1731675 3256401 -13124043
40617 -13124043 -21543586 -18530099 -17139842 -19970368 -18181197 -9972181 -3233280 -2348665
40609 -2348665 -3876339 -3604369 -455503 3744553 3402805 -7228619 -25461142 -40824532
40601 -40824532 -47064548 -46244051 -39667589 -25934484 -11041351 -6667529 -12066540 -11599806
40593 -11599806 826496 8648940 -3892386 -26449113 -34754219 -21066624 -107442
40586 -107442 10491527 5872011 -5469142 -9736766 -1832735 4971786 -6784854 -31107393
40578 -31107393 -40206576 -22014485 1250240 5717692 82785 7156959 24000106 25614535
$$ packed form
40632b6319699j4079028Q207193K2242924J1408346o874034n473989Q942309M385939
40624B439961k2449032l3417389n441868L0120061L0479942J524726j6380444
40617a3124043q419543L013487J390257k830526J789171Q209016O738901Q84615
40609b348665j527674K71970L148866M200056l41748j0631424j8232523j5363390
40601d0824532o240016Q20497O576462J3733105J4893133M373822n399011M66734
40593a1599806J2426302P822444j2541326k2556727q305106J3687595K0959182
40586a07442J0598969m619516j1341153m267624P904031O804521j1756640k4322539
40578c1107393r099183J8192091K3264725M467452n634907P074174J6843147J614429
$$ plain form
40570 25614535 4778294 -15164270 -11324623 10824557 25950203 16344010 -11441766
40563 -11441766 -32211920 -25891588 656236 20739323 19497364 8286509 2983434
40556 2983434 2925613 1306273 936686 5366340 8014485 5665415 9182593 23946340
40548 23946340 34332362 27523985 17695188 22624127 30473561 18426128 -6806020 -19281302
40540 -19281302 -17509836 -23285120 -39412743 -44835235 -34920083 -30452316 -38299065 -38187694
40532 -38187694 -21708372 -11146872 -21219451 -31928534 -22313670 -6393873 -9476650
40525 -9476650 -27081814 -34481454 -25558973 -16604483 -16836119 -17143011 -7836337 8226490
40517 8226490 21531042 25527554 21117615 17054478 22266316 34132239 40548134 36322547
$$ packed form
40570B5614535k0836241j9942564L839647K2149180J5125646r606193k7785776
40563a1441766k0770154O320332K6547824K0083087j241959j1210855n303075
40556B983434n7821j619340l69587M429654K648145k349070L517178J4763747
40548B3946340J0386022o808377r828797M928939P849434j2047433k5232148j2475282
40540a9281302J771466n775284j6127623n422492R915152M467767p846749J11371
40532c8187694J6479322J0561500j0072579j0709083R614864J5919797l082777
40525i476650j7605164p399640Q922481Q954490k31636l06892R306674J6062827
40517H226490J3304552L996512m409939m063137N211838J1865923O415895m225587
$$ plain form
40509 36322547 28816702 24542460 20927589 15049762 8955714 2467763 -6793965 -12798327
40501 -12798327 -5275053 10877344 16515113 4785245 -9818184 -15495812 -17688962 -21060890
40493 -21060890 -17255594 -3145577 7778311 6879769 5691906 14606483 23870060 22534588
40485 22534588 18726289 22025738 22559009 9196820 -6452757 -7447454 102905 172318
40477 172318 -3141878 5666546 23549658 33318835 31347290 26304411 17330293 -311770
40469 -311770 -13894608 -5967106 14654783 22987719 17047001 17160142 26302204 23743459
40461 23743459 3355049 -14020731 -15914838 -15427118 -21025116 -19206817 -3374338 8435444
40453 8435444 4677465 3107123 18728165 32181349 18654197 -9278964 -19070918 -7560186
$$ packed form
40509C6322547p505845m274242l614871n877827o094048o487951r261728o004362
40501a2798327P523274J6152397N637769j1729868j4603429n677628k193150l371928
40493b1060890L805296J4110017J0923888q98542j187863Q914577R263577j335472
40485B2534588l808299L299449N33271j3362189j5649577r94697P550359O9413
40477A72318l314196Q808424J7883112R769177j971545n042879q974118j7642063
40469c11770j3582838P927502K0621889Q332936n940718J13141R142062k558745
40461B3743459k0388410j7375780j894107M87720n597998J818299J5832479J1809782
40453H435444l757979j570342J5621042J3453184j3527152k7933161r791954J1510732
$$ plain form
40445 -7560186 -1187169 -11619797 -22431824 -21945662 -20411866 -26131226 -28472675 -17326845
40437 -17326845 -1842419 3910731 1408940 494683 947607 -4767326 -14783595 -16880709
40429 -16880709 -4779128 13649313 26738319 31806163 34844310 40825657 47377447 47562805
40421 47562805 37260351 18995896 -936748 -17028811 -25059560 -21439043 -7564784
40414 -7564784 5532661 4569369 -9223381 -16558926 -1413540 26957739 43388668 38444415
40406 38444415 28579071 29723151 34144732 26195165 10911255 7577628 17527436 20278304
40398 20278304 6874906 -4547399 901599 8118559 -4459443 -27939621 -34504857
40391 -34504857 -19855521 -6910465 -5711746 1648016 24794599 39995918 23164611
$$ packed form
40445g560186O373017j0432628j0812027M86162J533796n719360k341449J1145830
40437a7326845J5484426N753150k501791r14257M52924n714933j0016269k097114
40429a6880709J2101581J8428441J3089006N067844L038147N981347O551790J85358
40421D7562805j0302454j8264455j9932644j6092063q030749L620517J3874259
40414g564784J3097445r63292j3792750p335545J5145386K8371279J6430929m944253
40406C8444415r865344J144080M421581p949567j5283910l333627R949808K750868
40398B0278304j3403398j1422305N448998P216960j2578002k3480178o565236
40391c4504857J4649336J2945056J198719P359762K3146583J5201319j6831307
$$ plain form
40384 23164611 -9135066 -18726268 492920 15031670 767062 -25410237 -34142631
40377 -34142631 -24142366 -16170337 -18048518 -17012556 -5052370 7643045 9859170 5256715
40369 5256715 2945520 3438568 3713721 6994265 15480492 20052186 11385990 -1928475
40361 -1928475 -1825884 11981414 18705201 5385885 -14588420 -19664777 -5573929 16332399
40353 16332399 35749046 46707338 42262886 20818418 -4074840 -13207708 -3173446
40346 -3173446 10343241 12612528 5814632 2295738 7889381 16547670 19880851 18626805
40338 18626805 22204317 35629325 49614905 49040164 30983013 7978659 -7345242
40331 -7345242 -13305509 -13499202 -9917293 -5802512 -5503655 -5886160 1869650 15253598
$$ packed form
40384B3164611l2299677r591202J9219188J4538750j4264608k6177299q732394
40377c4142631J0000265P972029j878181J035962J1960186J2695415K216125m602455
40369E256715k311195M93048K75153L280544Q486227M571694q666196j3314465
40361a928475J02591J3807298O723787j3319316j9974305n076357J4090848K1906328
40353A6332399J9416647J0958292m444452k1444468k4893258r132868J0034262
40346c173446J3516687K269287o797896l518894N593643Q658289L333181j254046
40338A8626805L577512J3425008J3985580n74741j8057151k3004354j5323901
40331g345242n960267j93693L581909M114781K98857l82505P755810J3383948
$$ plain form
40323 15253598 17518195 2443385 -10158124 544773 24189128 30399417 9136069
40316 9136069 -17849384 -26842387 -17798272 -6350825 -2838833 -5186238 -5232811 1991902
40308 1991902 11881667 13989578 5838764 -1842930 156845 6592317 8762897 10421477
40300 10421477 19407541 29879303 28961350 17625552 8754904 6541303 4122856 27358
40292 27358 -533935 -319444 -7686244 -18605027 -19739463 -11513956 -8656678 -14444060 -15016920
40283 -15016920 -4828242 3539382 3106568 4825018 15112791 21229022 12985444 1191886
40275 1191886 -967334 877536 -3753102 -8868912 -2473928 11965014 21149587 20968936
40267 20968936 15881019 8328772 2641649 9600205 31253054 49012874 42769465 16520120
$$ packed form
40323A5253598K264597j5074810j2601509J0702897K3644355O210289k1263348
40316I136069k6985453q993003R044115J1447447L511992k347405m6573P224713
40308A991902R889765K107911q150814p681694J999775O435472K170580J658580
40300A0421477Q986064J0471762r17953j1335798q870648k213601k418447m095498
40292B7358n61293K14491p366800j0918783j134436Q225507K857278n787382n72860
40283a5016920J0188678Q367624m32814J718450J0287773O116231q243578j1793558
40275A191886k159220J844870m630638n115810O394984J4438942R184573j80651
40267B0968936n087917p552247n687123O958556K1652849J7759820o243409k6249345
$$ plain form
40259 16520120 -8064122 -17099236 -11442292 3075020 18152819 23323759 17832288 15337124
40251 15337124 24518459 34665179 34050088 30294215 34845777 39388854 29473925 12060048
40243 12060048 5533586 9253885 8234594 3139687 8315380 21464970 23544811 11511719
40235 11511719 3880602 8182525 9384656 -875498 -8789910 -3640288 3873325 1808199
40227 1808199 -3687392 -2420205 3182458 7413602 11450774 13697794 6942949 -4237456
40219 -4237456 -1798808 17719238 32650185 27804076 16561011 14851765 14701669 5656084
40211 5656084 1835137 18880348 39362834 34051356 9275750 -592751 14471756 28656796
40203 28656796 24350553 15099007 14974914 14733934 4417906 -4181583 2733873 15471168
$$ packed form
40259A6520120k4584242r035114N656944J4517312J5077799N170940n491471k495164
40251A5337124R181335J0146720o15091l755873M551562M543077r914929j7413877
40243A2060048o526462L720299j019291n094907N175693J3149590K079841j2033092
40235A1511719p631117M301923J202131j0260154p914412N149622P513613k065126
40227A808199n495591J267187N602663M231144M037172K247020o754845j1180405
40219d237456K438648J9518046J4930947m846109j1243065j709246j50096r045585
40211E656084l820947J7045211K0482486n311478k4775606r868501J5064507J4185040
40203B8656796m306243r251546j24093k40980j0316028q599489O915456J2737295
$$ plain form
40195 15471168 14560632 -1204915 -17745487 -27788302 -32958313 -30280517 -14700860 5956355
40187 5956355 14201094 4198828 -10965426 -17077581 -15886512 -19880420 -34583989 -50512812
40179 -50512812 -52292091 -34517246 -8068531 10422629 14965843 13412753 14571318 17022184
40171 17022184 13044279 -382465 -17677906 -29339119 -28909772 -18465258 -8248535
40164 -8248535 -6647112 -9662096 -6272370 4197961 8649502 -520760 -11035002 -5238648
40156 -5238648 15490005 31587950 29984574 18067393 10552992 10671722 10179348 3996305
40148 3996305 -2161477 -599812 5539528 3661459 -11780233 -28520674 -28828306 -11655571
40140 -11655571 5289048 6937060 -3993906 -16096095 -23616472 -25529416 -20163528 -10717529
$$ packed form
40195A5471168r10536j5765547j6540572j0042815n170011K677796J5579657K0657215
40187E956355Q244739j0002266j5164254o112155J191069l993908j4703569j5928823
40179e0512812j779279J7774845K6448715J8491160M543214j553090J158565K450866
40171A7022184l977905j3426744j7295441j1661213M29347J0444514J0216723
40164h248535J601423l014984L389726J0470331M451541r170262j0514242N796354
40156e238648K0728653J6097945j603376j1917181p514401J18730m92374o183043
40148C996305o157782J561665O139340j878069j5441692j6740441l07632J7172735
40140a1655571J6944619J648012j0930966j2102189p520377j912944N365888R445999
$$ plain form
40132 -10717529 -8595014 -19460214 -31139964 -27585565 -10802398 4009800 11388913
40125 11388913 18339687 25836826 25213844 15559583 7688273 5532420 -77210 -11864483
40117 -11864483 -16854537 -7208645 4708454 5348606 1178188 5692491 16172564 20729037
40109 20729037 20354181 24745371 30510910 23571132 3839686 -10527426 -7456141 4937706
40101 4937706 12806806 12447327 7309504 1001587 -1418072 4247479 11680829 5827056
40093 5827056 -18769075 -47760339 -61050884 -52954739 -35006137 -22735271 -21621484
40086 -21621484 -22943543 -14369367 2149694 9122386 -1658222 -11651846 911608 25938683
40078 25938683 32617115 15864958 4957715 17433395 31858627 23905291 5216762
$$ packed form
40132a0717529K122515j0865200j1679750L554399J6783167J4812198P379113
40125A1388913O950774P497139o22982r654261p871310k155853n609630j1787273
40117a1864483m990054R645892J1917099O40152m170418M514303J0480073M556473
40109B0729037l74856M391190N765539o939778j9731446j4367112L071285J2393847
40101D937706P869100l59479n137823o307917k419659N665551P433350n853773
40093E827056k4596131k8991264j3290545Q096145J7948602J2270866J113787
40086b1621484j322059Q574176J6519061O972692j0780608r993624J2563454K5027075
40078B5938683O678432j6752157j0907243J2475680J4425232p953336j8688529
$$ plain form
40071 5216762 1214323 8488710 5002395 -7412480 -4106565 19623955 38405912 36008405
40063 36008405 26772605 26209851 24884264 8985799 -11876352 -18397281 -11585039 -8001118
40055 -8001118 -10827642 -6542459 8942559 19437104 10770595 -8578272 -18447193 -11609806
40047 -11609806 1933198 12164106 20390121 30614807 37452140 30873007 11447058
40040 11447058 -7677241 -16888740 -20807768 -26985816 -30501411 -20202549 1688458 17757700
40032 17757700 16170309 4051665 -4834909 -7861957 -11387735 -16014628 -14037868 -2296011
40024 -2296011 10283507 12577889 5253618 -308199 3253778 10885427 14096016 13138904
40016 13138904 13495161 13222952 4241466 -12136871 -22139386 -17859756 -8743127 -6645304
$$ packed form
40071E216762m002439P274387l486315j2414875L305915K3730520J8781957k397507
40063C6008405r235800n62754j325587j5898465k0862151o520929O812242L583921
40055h001118k826524M285183J5485018J0494545q666509j9348867r868921O837387
40047a1609806J3543004J0230908Q226015J0224686O837333o579133j9425949
40040A1447058j9124299r211499l919028o178048l515595J0298862K1891007J6069242
40032A7757700j587391j2118644q886574l027048l525778m626893J976760J1741857
40024b296011J2579518K294382p324271n561817L561977P631649L210589r57112
40016A3138904L56257k72209q981486j6378337j0002515M279630R116629K097823
$$ plain form
40008 -6645304 -8777260 -6034860 365015 3645688 5530977 10707942 13911219 9854879
40000 9854879 9952312 27581079 49923713 49921627 28006551 14827745 26111891 42962033
39992 42962033 47571839 48174729 51237778 40111905 8249531 -13278661 4058333 38017218
39984 38017218 45053646 24232678 11089359 15927040 13288938 -5539305 -14635767 701832
39976 701832 20284030 27009764 31741412 41215321 37097321 12401116 -3502765 12849730
39968 12849730 38175168 37244421 16542413 7171800 12001057 9747035 627618 5611491
39960 5611491 22456164 23241448 971758 -17629550 -14919990 -5091363 -2470031 1963678
39952 1963678 16459134 28131676 25877285 21339149 26926201 31868113 21643820 5905908
$$ packed form
40008f645304k131956K742400O399875L280673J885289N176965L203277m056340
40000I854879R7433J7628767K2342634k086k1915076j3178806J1284146J6850142
39992D2962033M609806O02890L063049j1125873l1862374k1528192J7336994L3958885
39984C8017218P036428k0820968j3143319M837681k638102j8828243r096462J5337599
39976G01832J9582198O725734M731648R473909m118000k4696205j5903881J6352495
39968A2849730K5325438r30747k0702008r370613M829257k254022r119417M983873
39960E611491J6844673P85284k2269690j8601308K709560R828627K621332M433709
39952A963678J4495456J1672542k254391m538136N587052M941912j0224293j5737912
$$ plain form
39944 5905908 4049111 13373539 14546909 3525487 -3111933 5779617 21628226 29998763
39936 29998763 26181642 14572406 1769064 -7064331 -10257774 -9316695 -5147963 2285487
39928 2285487 9426502 10616793 6463369 2839872 -1077806 -13196580 -32109304 -42416555
39920 -42416555 -34500073 -17894891 -5955968 1283116 8248544 10106693 2462960 -4801670
39912 -4801670 529092 13633131 20032159 16168054 7800048 -5070098 -23989255 -37958209
39904 -37958209 -33339009 -16323072 -6294123 -6648756 -2154748 11960159 19484672 9997306
39896 9997306 -2310684 668267 14258225 18901021 7621982 -6998391 -11079116 -5376359
39888 -5376359 -1625644 -6997600 -14469856 -10672878 6037443 21053237 22332869 17169305
$$ packed form
39944E905908j856797R324428J173370j1021422o637420Q891550J5848609Q370537
39936B9998763l817121j1609236j2803342q833395l193443R41079M168732P433450
39928B285487P141015J190291m153424l623497l917678j2118774j8912724j0307251
39920d2416555P916482J6605182J1938923P239084O965428J858149p643733p264630
39912d801670N330762J3104039O399028l864105q368006j2870146j8919157j3968954
39904c7958209M619200J7015937J0028949l54633M494008J4114907P524513r487366
39896I997306j2307990K978951J3589958M642796j1279039j4620373m080725N702757
39888e376359L750715n371956p472256L796978J6710321J5015794J279632n163564
$$ plain form
39880 17169305 20165306 29511901 29364730 15241373 1974118 2125841 9205591 9521562
39872 9521562 1893335 -2258552 5758100 21655089 31864142 27079438 13969801 9702811
39864 9702811 20318008 31026705 26723833 14900041 14325051 25768784 31502281 23794995
39856 23794995 15831701 19726442 29122628 30304725 18772869 -452465 -18039671 -21993512
39848 -21993512 -6001387 19323574 34519051 33925882 28731697 25673705 18018896 2501909
39840 2501909 -10853843 -14104738 -12768808 -12729664 -7924521 9026142 33185644 52418186
39832 52418186 58569039 49299151 28767068 10021148 5136930 9869858 10804091 8636599
39824 8636599 16513005 32396006 35479133 18634115 2317479 4052200 15053824 21222944
$$ packed form
39880A7169305K996001R346595j47171j4123357j3267255J51723P079750L15971
39872I521562p628227m151887Q016652J5896989J0209053m784704j3109637m266990
39864I702811J0615197J0708697m302872j1823792n74990J1443733N733497p707286
39856B3794995p963294L894741R396186J182097j1531856j9225334j7587206l953841
39848b1993512J5992125K5324961J5195477n93169n194185l057992p654809j5516987
39840B501909j3355752l250895J335930L9144M805143J6950663K4159502J9232542
39832E2418186O150853r269888k0532083j8745920m884218M732928R34233k167492
39824H636599P876406J5883001L083127j6845018j6316636J734721J1001624O169120
$$ plain form
39816 21222944 26021016 34918664 37340087 25295738 12935015 14847352 19210892 6074216
39808 6074216 -19226061 -34269128 -31658763 -20651731 -5902690 12333171 24220723
39801 24220723 19620796 6196796 -1993970 -6956781 -17164313 -24708487 -16844780 -3566495
39793 -3566495 -6682572 -24293771 -32469918 -21844516 -7419015 -993627 2102383 6876151
39785 6876151 12104620 21814716 41027649 58373573 55866099 38387940 30023327 37613042
39777 37613042 42022886 31007975 16724696 12629697 15178797 17718099 22445240 28961168
39769 28961168 28907136 20977959 15426375 17270570 21095501 26258851 38072906 49674816
39761 49674816 44408461 22954523 6649186 6340847 9600859 6394055 3744782 5329989
$$ packed form
39816B1222944M798072Q897648K421423j2044349j2360723J912337M363540j3136676
39808F074216k5300277j5043067K610365J1007032J4749041J8235861J1887552
39801B4220723m599927j3424000q190766m962811j0207532p544174P863707J3278285
39793c566495l116077j7611199q176147J0625402J4425501O425388L096010M773768
39785F876151N228469R710096J9212933J7345924k507474j7478159q364613P589715
39777C7613042M409844j1014911j4283279m094999K549100K539302M727141O515928
39769B8961168n4032p929177n551584J844195L824931N163350J1814055J1601910
39761D9674816n266355k1453938j6305337l08339L260012l206804k649273J585207
$$ plain form
39753 5329989 1627543 -6859561 -1762797 21696743 39377577 33127936 18651576 17182150
39745 17182150 20104573 7088246 -16569123 -27862183 -21688327 -13661809 -12716640 -12353472
39737 -12353472 -6605951 2369278 10977485 16496754 16529117 14477159 17766880 23622853
39729 23622853 19104340 3545204 -5519270 -182596 3221371 -6882645 -13987101 -965463
39721 -965463 17065145 14081259 -5222072 -13288322 -1789866 11193731 12560464 8111156
39713 8111156 6132172 8162508 15307745 25929093 29983109 22055848 13983061 17470870
39705 17470870 23539123 19452415 14537765 23298430 33174606 20596509 -6533046 -16618086
39697 -16618086 -3866284 5226898 -1403786 -4460859 7329162 16222089 9680163 4064752
$$ packed form
39753E329989l702446q487104N096764K3459540J7680834o249641j4476360j469426
39745A7182150K922423j3016327k3657369j1293060O173856Q026518R45169L63168
39737a2353472N747521Q975229Q608207N519269L2363k051958L289721N855973
39729B3622853m518513j5559136r064474N336674L403967j0104016p104456J3021638
39721i65463J8030608k983886j9303331q066250J1498456J2983597J366733m449308
39713H111156j978984K030336P145237J0621348M054016p927261q072787L487809
39705A7470870O068253m086708m914650Q760665R876176j2578097k7129555j0085040
39697a6618086J2751802R093182o630684l057073J1790021Q892927o541926n615411
$$ plain form
39689 4064752 14100751 25387911 19542657 4890775 19528 5335738 11988023 21119993
39681 21119993 32345794 30597752 9168536 -9354630 -2190337 16243624 15925685 1059965
39673 1059965 4006953 30766411 48330996 35233320 12576503 7932623 14646421 10047925
39665 10047925 -4763132 -10873260 -7714849 -14388886 -34256479 -44383978 -29239429
39658 -29239429 -4251398 7619626 6487530 5715508 4348710 -8246766 -26145315 -30454576
39650 -30454576 -21134787 -20312777 -35173879 -41704733 -21695685 4775537 7004280 -10463674
39642 -10463674 -16826584 -3053967 7946024 419618 -12333638 -13721257 -8817126 -10312223
39634 -10312223 -16037710 -15307178 -7302121 82294 3435763 5582056 8650409 13111919
$$ packed form
39689D064752J0035999J1287160n845254j4651882m871247N316210O652285R131970
39681B1119993J1225801j748042k1429216j8523166P164293J8433961l17939j4865720
39673A059965K946988K6759458J7564585j3097676k2656817m643880O713798m598496
39665A0047925j4811057o110128L158411o674037j9867593j0127499J5144549
39658b9239429K4988031J1871024j132096p72022j366798j2595476j7898549m309261
39650c0454576R319789Q22010j4861102o530854K0009048K6471222K228743j7467954
39642a0463674o362910J3772617J0999991p526406j2753256j387619M904131j495097
39634a0312223n725487P30532Q005057P384415L353469K146293L068353M461510
$$ plain form
39626 13111919 19951433 28369943 34994562 38334911 39168705 35600696 25497559 14850324
39618 14850324 13218828 17870121 14214683 -2540746 -17978350 -18479716 -9966891 -7017234
39610 -7017234 -11962054 -15475874 -12136439 -5840284 -3645362 -10839058 -26845399 -40572594
39602 -40572594 -37668707 -19296789 -4629867 -5950918 -11491245 -5153628 6826929 6313211
39594 6313211 -5415258 -7088807 10885831 33122971 43116699 43393242 42176330 34637359
39586 34637359 12795406 -13885842 -25308302 -18080904 -10823246 -16923140 -24553886 -14259927
39578 -14259927 11238691 28549889 23812813 8400453 1309357 7606352 20379665
39571 20379665 32896113 39267407 32531954 14550409 940100 2542494 7821638 -352353
$$ packed form
39626A3111919O839514Q418510O624619L340349Q33794l568009j0103137j0647235
39618A4850324j631496M651293l655438j6755429j5437604n01366Q512825K949657
39610g017234m944820l513820L339435O296155K194922p193696j6006341j3727195
39602d0572594K903887J8371918J4666922j321051n540327O337617J1980557n13718
39594F313211j1728469j673549J7974638K2237140R993728K76543j216912p538971
39586C4637359k1841953k6681248j1422460P227398P257658o099894p630746J0293959
39578a4259927K5498618J7311198m737076j5412360p091096O296995J2773313
39571B0379665J2516448O371294o735453j7981545j3610309J602394N279144q173991
$$ plain form
39563 -352353 -14967736 -11925122 13012860 35948629 39192095 33004300 32664543 33172580
39555 33172580 22746830 7376645 3395871 12937752 22852068 24088105 19353492 14747383
39547 14747383 14227475 18819031 22874815 16679302 1135851 -7802667 410536 14203088
39539 14203088 15887420 6750833 2150594 8029946 17596869 26143743 32631203 30327132
39531 30327132 14033820 -4285189 -5433457 9445558 18242945 8551756 -7032005
39524 -7032005 -11854180 -7255494 -6597921 -17958535 -38079715 -54169048 -49490217 -19341029
39516 -19341029 15649925 26169945 9108812 -8236919 -4702223 9507957 13051534
39509 13051534 3302035 -7474805 -13594198 -17942118 -20091140 -17267613 -12972877 -12563632
$$ packed form
39563c52353j4615383L042614K4937982K2935769L243466o187795l39757N08037
39555C3172580j0425750j5370185l980774R541881R914316J236037m734613m606109
39547A4747383n19908M591556M055784o195513j5543451q938518Q213203J3792552
39539A4203088J684332r136587m600239N879352R566923Q546874O487460k304071
39531C0327132j6293312j8319009j148268J4879015Q797387r691189j5583761
39524g032005m822175M598686O57573j1360614k0121180j6089333M678831L0149188
39516a9341029L4990954J0520020j7061133j7345731L534696J4210180L543577
39509A3051534r749499j0776840o119393m347920k149022K823527M294736M09245
$$ plain form
39501 -12563632 -13865515 -11964824 -7995240 -3284995 7900997 27099816 40216542 33416087
39493 33416087 16341853 11876633 23476845 30683688 19746006 994334 -10433421
39486 -10433421 -14780058 -18960761 -21307500 -17228377 -10555118 -6886653 -2341724 9132354
39478 9132354 22323535 26851823 23721030 23636595 29642415 33226762 29127406 23104712
39470 23104712 21361670 21193233 16787850 7441074 -3915013 -13567204 -14814738 -1608444
39462 -1608444 19000837 26566880 10142219 -13472445 -16771215 4153860 24471697
39455 24471697 21676594 210826 -19447009 -25196353 -19017999 -7594325 1745777 1261588
39447 1261588 -9103869 -16116498 -7040750 11857521 22566686 21644069 24902614 40654659
$$ packed form
39501a2563632j301883J900691L969584M710245J1185992J9198819J3116726o800455
39493C3416087j7074234m465220J1600212P206843j0937682j8751672j1427755
39486a0433421m346637m180703k346739M079123O673259L668465M544929J1474078
39478I132354J3191181M528288l130793q4435O005820L584347m099356o022694
39470B3104712j743042j68437m405383r346776j1356087r652191j247534J3206294
39462a608444K0609281P566043j6424661k3614664l298770K0925075K0317837
39455B4471697k795103k1465768j9657835n749344O178354J1423674R340102m84189
39447A261588j0365457p012629R075748J8898271J0709165r22617L258545J5752045
$$ plain form
39439 40654659 53284224 45427978 25389160 15888875 20770833 21629494 9014929 -1682168
39431 -1682168 5442465 21021928 23483516 10596445 2068878 10960683 26492447 30334632
39423 30334632 19903245 7375457 1104749 -2579973 -9400841 -16990613 -18664369 -12986593
39415 -12986593 -4030996 6637191 21276752 36217616 37766695 17213882 -11699469
39408 -11699469 -21907944 -4441050 18530123 19981316 256079 -16975544 -15501497
39401 -15501497 -822301 13531657 19250197 11684507 -9467986 -31788878 -35550122
39394 -35550122 -16375872 7119436 16234286 12941297 9625388 9811168 11009724 15729424
39386 15729424 24069008 24149482 8261270 -7892800 -3570541 12140599 8443554 -20575255
$$ packed form
39439D0654659J2629565p856246k0038818r500285M881958Q58661j2614565j0697097
39431a682168P124633J5579463K461588j2887071q527567Q891805J5531764L842185
39423C0334632j0431387j2527788o270708l684722o820868p589772j673756N677776
39415a2986593Q955597J0668187J4639561J4940864J549079k0552813k8913351
39408a1699469j0208475J7466894K2971173J451193j9725237j7231623J474047
39401a5501497J4679196J4353958N718540p565690k1152493k2320892l761244
39394c5550122J9174250K3495308R114850l292989l315909J85780J198556M719700
39386A5729424Q339584Q0474j5888212j6154070M322259J5711140l697045k9018809
$$ plain form
39378 -20575255 -42717878 -32163447 -5166774 5433650 -5736934 -18533688 -22005984
39371 -22005984 -24249409 -30856726 -34467430 -29093145 -19424876 -10477427 1064674 19169765
39363 19169765 38887475 49425660 44004347 25727614 6610119 -622303 5787485
39356 5787485 14429698 14095302 6264494 -706934 -4945580 -9968151 -13517232 -8563032
39348 -8563032 4032662 14046635 15843665 15312659 19217198 24921615 25538350 20149004
39340 20149004 14072496 11927045 13969106 17492654 19744822 20708913 23421075 29873539
39332 29873539 37306031 40915730 39044581 33156430 25019129 17383086 14271495 15664537
39324 15664537 15104653 8455242 1406489 903943 3027869 -765829 -8127087 -8508320
$$ packed form
39378b0575255k2142623J0554431K6996673J0600424j1170584j2796754l472296
39371b2005984k243425o607317l610704N374285R668269Q947449J1542101J8105091
39363A9169765J9717710J0538185n421313j8276733j9117495p232422O409788
39356E787485Q642213l34396p830808o971428m238646n022571l549081M954200
39348h563032J2595694J0013973J797030n31006L904539N704417O16735n389346
39340B0149004o076508k145451K042061L523548K252168R64091K712162O452464
39332B9873539P432492L609699j871149n888151q137301p636043l111591J393042
39324A5664537n59884o649411p048753n02546K123926l793698p361258l81233
$$ plain form
39316 -8508320 -804823 4753012 4169250 5663382 13770789 20782948 20989825 21085097 26938572
39307 26938572 30527644 21589720 5080116 -4283540 -101252 12518286 26603398 36368177
39299 36368177 35662670 24323947 12964174 11527256 16293294 17921051 17677578 23037747
39291 23037747 30535337 28425076 16866997 9851705 13263763 15872754 8802393 206147
39283 206147 599708 4630020 -230904 -13866463 -24485595 -24922165 -16824845 -2661094
39275 -2661094 13815645 21323410 10050583 -10701437 -17941459 -4289066 10618406
39268 10618406 7438068 -5360413 -5702669 7274754 11403847 -4267815 -21741496 -19596741
39260 -19596741 -2515766 8141478 4919392 -196507 1750035 4320168 -725755 -9419297
$$ packed form
39316h508320P703497N557835n83762J494132Q107407P012159K06877R5272N853475
39307B6938572L589072q937924j6509604r363656M182288J2619538J4085112R764779
39299C6368177p05507j1338723j1359773j436918M766038J627757k43473N360169
39291B3037747P497590k110261j1558079p015292L412058K608991p070361q596246
39283B06147L93561M030312m860924j3635559j0619132m36570Q097320J4163751
39275b661094J6476739P507765j1272827k0752020p240022J3652393J4907472
39268A0618406l180338j2798481l42256J2977423M129093j5671662j7473681K144755
39260a9596741J7080975J0657244l222086n115899J946542K570133n045923q693542
$$ plain form
39252 -9419297 -11555139 -3379459 11200380 26874016 39791367 47886564 51451533 50772985
39244 50772985 43607481 30357679 20053223 21575200 28566917 25213583 10110448 303424
39236 303424 4810505 9344438 -569060 -14832133 -13619325 2734912 16969548 21377850
39228 21377850 21686815 18856678 8463497 -2148266 1917907 18098089 26400640 20318246
39220 20318246 16645956 25224408 30252672 16852758 -1577342 -1903642 14728228 27332074
39212 27332074 26572317 22785075 25352627 31000844 33165058 29862722 21107424 8559635
39204 8559635 -1987625 -5898534 -6190182 -7696426 -8344476 -4175000 1777263 4776385
39196 4776385 7082765 11231714 11490745 4791659 2815179 16340287 32985793 30917142
$$ packed form
39252i419297k135842Q175680J4579839J5673636J2917351Q095197L564969o78548
39244E0772985p165504j3249802j0304456J521977O991717l353334j5103135r807024
39236C03424M507081M533933r913498j4263073J212808J6354237J4234636M408302
39228B1377850L08965k830137j0393181j0611763M066173J6180182Q302551o082394
39220B0318246l672290Q578452N028264j3399914j8430100l26300J6631870J2603846
39212B7332074p59757l787242K567552N648217K164214l302336q755298j2547789
39204H559635j0547260l910909k91648j506244o48050M169476N952263K999122
39196D776385K306380M148949K59031o699086j976480J3525108J6645506k068651
$$ plain form
39188 30917142 13041789 5017397 16124963 25389334 15566895 -362130 -861424 12360208
39180 12360208 20750831 16480721 8095636 5322262 11070802 23213745 33582515 30685077
39172 30685077 13262193 -4657104 -11526572 -14139999 -25044774 -40950064 -46662177
39165 -46662177 -36722641 -20855611 -9719502 -5476637 -4688319 -1862928 6971949 16502376
39157 16502376 13676487 -3293776 -15047286 -4244162 17168103 20916844 35502
39150 35502 -24862311 -37305233 -42942765 -50218390 -51968668 -37763791 -12015124 11378971
39142 11378971 23759679 22874799 9276422 -8630452 -14775096 -2309453 14984079
39135 14984079 18352613 7066863 -3290427 -1560078 9305475 20445068 25699027
$$ packed form
39188C0917142j7875353q024392J1107566R264371r822439j5929025m99294J3221632
39180A2360208Q390623m270110q385085k773374N748540J2142943J0368770k897438
39172C0685077j7422884j7919297o869468k613427j0904775j5905290n712113
39165d6662177R939536J5867030J1136109M242865P88318K825391Q834877R530427
39157A6502376k825889j6970263j1753510J0803124K1412265L748741k0881342
39150C5502k4897813j2442922n637532p275625j750278J4204877K5748667K3394095
39142A1378971J2380708q84880j3598377j7906874o144644J2465643J7293532
39135A4984079L368534j1285750j0357290J730349J0865553J1139593N253959
$$ plain form
39128 25699027 23267281 16994961 15701074 24332656 35906879 38075839 27348434 11790188
39120 11790188 773404 -2778082 -1498410 -752947 -5637832 -15088544 -19812568 -11624105
39112 -11624105 6018387 22019507 30270417 31827910 27083085 15618747 4441113
39105 4441113 5544679 20544298 35991911 39703470 34672571 30071290 25346513 13553143
39097 13553143 -2460208 -8847318 1431243 17812282 24233142 17402517 7909363 5647478
39089 5647478 9420770 11139910 6226801 -2238449 -8008461 -8152784 -4939443 -2379136
39081 -2379136 -1742557 -398821 5757145 19030222 37578765 54484657 60221188 49935915
39073 49935915 30232077 15947153 16779491 27861625 36142179 35110335 30205798 30714667
$$ packed form
39128B5699027k431746o272320j293887Q631582J1574223K168960j0727405j5558246
39120A1790188j1016784l551486J279672P45463m884885r450712m724024Q188463
39112a1624105J7642492J6001120Q250910J557493m744825j1464338j1177634
39105D441113J103566J4999619J5447613L711559n030899m601281m724777j1793370
39097A3553143j6013351o387110J0278561J6381039O420860o830625r493154k261885
39089E647478L773292J719140m913109q465250n770012j44323L213341K560307
39081b379136O36579J343736O155966J3273077J8548543J6905892N736531j0285273
39073D9935915j9703838j4284924Q32338J1082134Q280554j031844m904537N08869
$$ plain form
39065 30714667 40430106 56020973 69558510 71789569 58966449 39564911 28577028
39058 28577028 30271149 31709472 20184209 2895244 -536376 15365958 33605251
39051 33605251 37037176 29996706 29627930 40898745 50719438 47511231 37249730 34154272
39043 34154272 40505601 44247732 37036864 26467988 25051117 32636584 38362164 37867661
39035 37867661 37883621 41735774 41752745 32845056 23482319 22503937 23071797 14120117 2857674
39026 2857674 7564041 26965812 36806174 25541621 15106652 29711667 56645491
39019 56645491 60527409 33628551 9036413 16829966 45623140 61312649 51991855
39012 51991855 36305458 31408845 32483842 29668565 28532872 39454670 55356860 57762141
$$ packed form
39065C0714667R715439J5590867J3537537K231059j2823120j9401538j0987883
39058B8577028J694121J438323j1525263j7288965l431620J5902334J8239293
39051C3605251L431925p040470l68776J1270815R820693l208207j0261501l095458
39043C4154272O351329L742131p210868j0568876j416871P585467N725580m94503
39035C7867661J5960L852153J6971q907689r362737r78382N67860q951680j1262443
39026B857674M706367J9401771R840362j1264553j0434969J4605015K6933824
39019E6645491L881918k6898858k4592138P793553K8793174J5689509r320794
39012E1991855j5686397m896613J074997k815277j135693J0921798J5902190K405281
$$ plain form
39004 57762141 45005234 37678919 49294706 65302132 63085669 43436293 27088989
38997 27088989 24204924 23900706 15735194 5778572 3912931 7170187 6599081 3863219
38989 3863219 9315504 25162496 40200537 43178566 35189967 25887936 21037792 17610708
38981 17610708 11015805 3968759 4394803 13971679 23464724 23676045 17599577 15492358
38973 15492358 20104086 24826038 26135324 28463448 34037082 36566591 29803107 15725451
38965 15725451 -11808 -13775698 -20441900 -12673309 7997146 25686874 26200040 15948264
38957 15948264 14863610 30361752 47676600 49468004 38151755 32319954 42591507
38950 42591507 57344754 56619128 37737888 19519128 17982273 26238907 27418642 20877984
$$ packed form
39004E7762141j2756907p326315J1615787J6007426k216463j9649376j6347304
38997B7088989k884065l04218q165512r956622j865641L257256n71106k735862
38989C863219N452285J5846992J5038041K978029p988599r302031m850144l427084
38981A7610708o594903p047046M26044R576876R493045K11321o076468k107219
38973A5492358M611728M721952J309286K328124N573634K529509o763484j4077656
38965A5725451j5737259j3763890o666202P768591K0670455J7689728N13166j0251776
38957A5948264j084654J5498142J7314848J791404j1316249n831801J0271553
38950D2591507J4753247p25626j8881240j8218760j536855Q256634J179735o540658
$$ plain form
38942 20877984 20879546 30680106 35254025 24641765 8424951 -1786872 -9613999 -21608551
38934 -21608551 -30323860 -24880462 -10009733 410688 2568201 1672246 -1061227 -4390346
38926 -4390346 3258477 30128074 59466971 62677334 37220190 12653211 13102361 30252736
38918 30252736 41147242 38068187 30968342 30919599 39994713 49970491 46251786 22773028
38910 22773028 -3261859 -4844624 19807104 39924154 30447482 4448597 -6631675
38903 -6631675 5625674 21977110 25839250 20102827 14635547 13100236 15234331 20503874
38895 20503874 26114095 29717569 35051729 46238581 56657752 54438130 41015203 32897140
38887 32897140 40237920 53460078 57293805 49691684 39655956 33514051 31925266 35492067
$$ packed form
38942B0877984J562R800560M573919j0612260j6216814j0211823p827127j1994552
38934b1608551q715309N443398J4870729J0420421K157513q95955k733473l329119
38926d390346P648823K6869597K9338897L210363k5457144k4566979M49150J7150375
38918C0252736J0894506l079055p099845m8743R075114R975778l718705k3478758
38910B2773028k6034887j582765K4651728K0117050r476672k5998885j1080272
38903f631675J2257349J6351436L862140n736423n467280j535311K134095N269543
38895B0503874N610221L603474N334160J1186852J0419171k219622j3422927q118063
38887C2897140P340780J3222158L833727p602121j0035728o141905j588785L566801
$$ plain form
38879 35492067 44222954 53587747 58347388 58432343 55245009 46327901 32073791 23564945
38871 23564945 31505357 47849093 51881428 37974374 24374757 28007189 42698252
38864 42698252 51761079 51314370 48792837 46953885 44059006 44439398 53425405 64725038
38856 64725038 67920618 65958364 68722937 71527853 60432599 40204713 33591679 45809428
38848 45809428 53501331 41401524 26944305 30227059 40202391 35034257 20725324 21130966
38840 21130966 37521321 46799018 38722217 28787653 30872696 39372679 43767740 42544086
38832 42544086 37936060 32689650 34287123 46033904 53718452 40760974 17759149 14064221
38824 14064221 35546587 55208385 53899995 45028119 46168049 51119934 48048811 43109286
$$ packed form
38879C5492067Q730887R364793M759641Q4955l187334q917108j4254110q508846
38871B3564945P940412J6343736M032335j3907054j3599617L632432J4691063
38864D2698252R062827m46709k521533j838952k894879L80392Q986007J1299633
38856F4725038L195580j962254K764573K804916j1095254k0227886o613034J2217749
38848D5809428P691903j2099807j4457219L282754R975332n168134j4308933M05642
38840B1130966J6390355R277697q076801r934564K085043Q499983M395061j223654
38832D2544086m608026n246410J597473J1746781P684548j2957478k3001825l694928
38824A4064221K1482366J9661798j308390q871876J139930M951885l071123m939525
$$ plain form
38816 43109286 44273835 40591778 22549626 8389132 22599535 56911264 79394559
38809 79394559 77357807 65448384 54314004 39335879 23543371 24394615 46927487
38802 46927487 70435331 74365393 62875234 52457040 47992873 43854736 39874708 42884247
38794 42884247 55469292 72473813 87201978 94923306 92067964 77876927 57490324
38787 57490324 40618540 35884324 44957427 60031868 68667714 65499632 59045397 62509078
38779 62509078 77454104 91328911 92694745 84422598 78394214 79598194 80446639 73014125
38771 73014125 63636646 68358739 91113329 114043651 118265517 108889022 106089247 113306278
38763 113306278 112092449 93214200 74373982 75318446 90048734 98398393 93746982 83519144
$$ packed form
38816D3109286J164549l682057j8042152j4160494J4210403L4311729K2483295
38809G9394559k036752j1909423j1134380j4978125j5792508Q51244K2532872
38802D6927487K3507844L930062j1490159j0418194m464167m138137l980028L009539
38794D2884247J2585045J7004521J4728165P721328k855342j4191037k0386603
38787E7490324j6871784m734216R073103J5074441Q635846l168082o454235L463681
38779F2509078J4945026J3874807J365834q272147o028384J203980Q48445p432514
38771G3014125r377479M722093K2754590K2930322M221866r376495k799775P217031
38763A13306278j213829j8878249j8840218R44464J4730288Q349659m651411j0227838
$$ plain form
38755 83519144 72083740 60996827 58980137 72378844 89183274 90709123 77732031
38748 77732031 68647109 73267318 84582888 94574415 101173760 101084313 93468802 89431193
38740 89431193 99073412 110880363 105393438 88137450 83326816 93090485 93060110 76868670
38732 76868670 72998860 99624977 130665362 131068437 105251490 85231743 86757333 102526220
38724 102526220 124877428 147151945 151801823 126582221 90218834 76255627 91006386
38717 91006386 109820111 114926912 113894032 118014281 125056907 129958000 133865629 135755091
38709 135755091 131341847 126058095 132621413 149133988 156221890 144796321 131402672
38702 131402672 134872512 150114084 157289354 148394928 133680990 127529813 136421317 155674614
$$ packed form
38755H3519144j1435404j1086913k016690J3398707J6804430J525849j2977092
38748G7732031r084922M620209J1315570R991527O599345q9447p615511m037609
38740H9431193R642219J1806951n486925j7255988m810634R763669l0375j6191440
38732G6868670l869810K6626117L1040385M03075k5816947k0019747J525590J5768887
38724A02526220K2351208K2274517M649878k5219602l6363387j3963207J4750759
38717I1006386J8813725N106801j032880M120249P042626M901093L907629J889462
38709A35755091m413244n283752O563318J6512575P087902j1425569j3393649
38702A31402672L469840J5241572P175270q894426j4713938o151177Q891504J9253297
$$ plain form
38694 155674614 171612287 172294930 160844112 151796797 151319549 150848445 144792863 141808683
38686 141808683 149122159 156954030 151710121 137712390 132478862 144007084 164476367
38679 164476367 183886353 198239010 204851649 201031425 190443231 183319330 186819081
38672 186819081 198357847 208953427 210808057 203456623 195521190 197848231 211863321
38665 211863321 227932140 237261298 239403109 235343687 223356714 209236993 209517812 230861672
38657 230861672 254043790 255552024 241376925 240136273 262047348 285607565 291343903
38650 291343903 287561313 288616294 285888981 262926100 230577549 221142557 244780047
38643 244780047 273889749 281004748 274607580 280487991 298388410 300116688 272556542
$$ packed form
38694A55674614J5937673O82643j1450818r047315m77248m71104o055582k984180
38686A41808683P313476P831871n243909j3997731n233528J1528222K0469283
38679A64476367J9409986J4352657O612639l820224j0588194p123901L499751
38672A86819081J1538766J0595580J854630p351434p935433K327041J4015090
38665B11863321J6068819R329158K141811m059422j1986973j4119721K80819K1343860
38657B30861672K3182118J508234j4175099j240652K1911075K3560217N736338
38650B91343903l782590J054981k727313k2962881l2348551r434992K3637490
38643B44780047K9109702P114999o397168N880411J7900419J728278k7560146
$$ plain form
38636 272556542 241937442 243016626 276177081 310400616 322972736 319472289 314665759
38629 314665759 311635527 307881705 308544905 320603011 339832068 354224343 357245825 349943375
38621 349943375 334661734 316212768 305807437 313145745 334993973 359578927 380473733
38614 380473733 397634679 407564989 404234360 390642780 379114307 377682205 383804856
38607 383804856 391816519 398047255 398921014 393933333 390618909 395906859 402625516 397068366
38599 397068366 380684181 369803295 371297358 374422203 371388322 368305788 367678108 358885694
38591 358885694 339431962 328754166 343125654 369304793 381911589 377216697 370074610
38584 370074610 365455092 355450537 341127101 334507066 336769378 334012915 319042093
$$ packed form
38636B72556542l0619100J079184L3160455L4223535J2572120l500447m806530
38629C14665759l030232l753822O63200J2058106J9229057J4392275L021482p302450
38621C49943375j5281641j8448966j0405331P338308K1848228K4584954K0894806
38614C80473733J7160946R930310l330629j3591580j1528473j432102O122651
38607C83804856Q011663O230736Q73759m987681l314424N287950O718657n557150
38599C97068366j6384185j0880886J494063L124845l033881l082534o27680q792414
38591C58885694j9453732j0677796J4371488K6179139J2606796m694892p142087
38584C70074610m619518j0004555j4323436o620035K262312k756463j4970822
$$ plain form
38577 319042093 301228962 290646733 287182384 288938838 296019592 300929207 290604104
38570 290604104 265793738 245669076 244729889 255425467 261176479 256908292 248978250 243364673
38562 243364673 241741561 242608707 240290428 229228336 213554336 204808682 206473767 209712299
38554 209712299 207933796 204495865 201238232 192619153 179185264 173512087 181649916 190693001
38546 190693001 187908239 180915147 182633904 185607694 171569242 142514604 121088309
38539 121088309 118592201 122386065 120574064 120284964 129877434 137727542 125882867 98998068
38531 98998068 82646033 90603372 106945672 108126537 94447116 87865206 99913040
38524 99913040 114865223 111735316 93363582 80959251 83720300 89183340 85775475 79560680
$$ packed form
38577C19042093j7813131j0582229l464349J756454P080754M909615j0325103
38570B90604104k4810366k0124662r39187J0695578N751012m268187p930042n613577
38562B43364673j623112Q67146k318279j1062092j5674000q745654J665085L238532
38554B09712299j778503l437931l257633q619079j3433889n673177Q137829R043085
38546A90693001k784762o993092J718757K973790j4038452k9054638k1426295
38539A21088309k496108L793864j812001k89100R592470P850108j1844675k6884799
38531I8998068j6352035P957339J6342300J180865j3679421o581910J2047834
38524I9913040J4952183l129907j8371734j2404331K761049N463040l407865o214795
$$ plain form
38516 79560680 80942796 87542545 91081071 91098129 89362378 79608546 58709885 42546226
38508 42546226 52143202 83408279 107725310 107046636 93338982 86186416 85083837 75886322
38500 75886322 56219407 40836084 42997809 59876733 77335189 83504148 77134551
38493 77134551 66971758 64079599 72249111 84599421 89598877 80228270 58945119 36976101
38485 36976101 28016123 37232720 54525999 63079307 56668119 43802862 33202477 23625193
38477 23625193 14288605 15917974 37138786 62692015 62909993 31575553 214335 2567384
38469 2567384 34130457 61577446 66227185 59524623 55554240 49782674 35132782 21911610
38461 21911610 24870374 39498040 48209791 46044584 44333686 50101375 57165515 59198956
$$ packed form
38516G9560680J382116O599749L538526J7058j735751r753832k0898661j6163659
38508D2546226R596976L1265077K4317031o78674j3707654p152566j102579r197515
38500G5886322j9666915j5383323K161725J6878924J7458456O168959o369597
38493G7134551j0162793k892159Q169512J2350310M999456r370607k1283151k1969018
38485C6976101q959978R216597J7293279Q553308o411188j2865257j0600385r577284
38477B3625193r336588J629369K1220812K5553229K17978l1334440l1361218K353049
38469B567384L1563073K7446989M649739o702562l970383n771566j4649892j3221172
38461B1911610K958764J4627666Q711751k165207j710898N767689P064140K033441
$$ plain form
38453 59198956 57572045 53002552 42520764 29557752 25046637 32156935 40124588 39805795
38445 39805795 35973079 37023712 41175385 41399849 37741760 36396875 40165932 45688562
38437 45688562 47462094 42116574 32936119 30001205 38074167 45100441 34771203 11546150
38429 11546150 -2187898 2124793 8338015 4769948 4537907 21948894 45923631 56590347
38421 56590347 55484448 57823109 64150960 62358536 52224401 45316647 42972849 35865837
38413 35865837 24635694 19937363 21319262 17009555 7215503 6762752 19304274 28087891
38405 28087891 19579241 180492 -16644454 -24498298 -20465474 -4282167 12949469
38398 12949469 16415812 10728396 17437392 41482566 59826113 54971979 40017119 34953888
$$ packed form
38453E9198956j626911m569493j0481788j2963012m511115P110298P967653l18793
38445C9805795l832716J050633M151673K24464l658089j344885L769057N522630
38437D5688562J773532n345520r180455k934914Q072962P026274j0329238k3225053
38429A1546150j3734048M312691O213222l568067k32041J7410987K3974737J0666716
38421E6590347j105899K338661O327851j792424j0134135o907754k343798p107012
38413C5865837j1230143m698331J381899m309707r794052m52751J2541522Q783617
38405B8087891q508650j9398749j6824946p853844M032824J6183307J7231636
38398A2949469L466343n687416O708996K4045174J8343547m854134j4954860n063231
$$ plain form
38390 34953888 36867859 33797210 32255241 45548960 63584537 61135073 35268141 10888440
38382 10888440 5459909 9045557 6858887 3457063 11473622 27501478 34489319 25739116
38374 25739116 14116846 13566900 19100600 13350395 -7844329 -25638379 -20211407 3602444
38366 3602444 23096592 27328014 26532216 30307919 31878115 22532871 9225977 5423094
38358 5423094 12203439 20641277 27119370 33397795 35298914 25608495 8909896 1166959
38350 1166959 10546703 26821260 33614246 25508636 10180323 -1616967 -4672463 -121443
38342 -121443 9384184 23254489 39442079 49089678 42091678 21268541 4002937 3797456
38334 3797456 15453353 24329832 24040111 17403719 6715369 -5695360 -11518703 -4123965
$$ packed form
38390C4953888J913971l070649j541969J3293719J8035577k449464k5866932k4379701
38382A0888440n428531L585648k186670l401824Q016559J6027856O987841q750203
38374B5739116j1622270n49946N533700n750205k1194724j7794050N426972K3813851
38366C602444J9494148M231422p95798L775703J570196r345244j3306894l802883
38358E423094O780345Q437838O478093O278425J901119r690419j6698599p742937
38350A166959R379744J6274557O792986q105610j5328313j1797290l055496M551020
38342a21443R505627J3870305J6187590R647599o998000k0823137j7265604k05481
38334C797456J1655897Q876479k89721o636392j0688350j2410729n823343P394738
$$ plain form
38326 -4123965 8476201 10356499 -1593610 -14653966 -18997882 -17311888 -13440100 -5726647
38318 -5726647 1713691 -4669889 -27962142 -47350904 -40109887 -12482976 6856180 3697074
38310 3697074 -6373812 -2854863 13427246 26601459 27796944 21372891 16145769 19571091
38302 19571091 34596702 52270456 52988616 27670998 -5024101 -15993561 110345
38295 110345 21253714 28855048 26147160 21734692 12707848 -4882501 -22173420 -27134952
38287 -27134952 -19125104 -3551332 17512495 37993035 42892424 25775318 1930998
38280 1930998 -10885357 -14998862 -19892923 -19046215 -2287769 17727915 17752380 -1563111
38272 -1563111 -19532699 -29989848 -42153389 -48561443 -28384811 9998779 26943851
$$ packed form
38326d123965J2600166J880298j1950109j3060356m343916J685994L871788P713453
38318e726647P440338o383580k3292253j9388762P241017K7626911J9339156l159106
38310C697074j0070886L518949J6282109J3174213J195485o424053n227122L425322
38302A9571091J5025611J7673754P18160k5317618l2695099j0969460J6103906
38295A10345K1143369P601334k707888m412468r026844j7590349j7290919m961532
38287b7134952Q009848J5573772K1063827K0480540M899389j7117106k3844320
38280A930998j2816355m113505m894061Q46708J6758446K0015684K4465j9315491
38272a563111j7969588j0457149j2163541o408054K0176632L8383590J6945072
$$ plain form
38265 26943851 8261727 -9862367 5241622 34776176 42786319 32373875 32770859
38258 32770859 47154771 50370825 32321832 10572872 -328715 -4644315 -7950505
38251 -7950505 -6709789 501311 8733539 15973807 22836477 24898130 20320627 20970965
38243 20970965 37682592 57218947 54277060 27078248 1545224 -2597904 8241064
38236 8241064 18821214 23943480 23484101 14702050 -618547 -11450770 -8558910 4669789
38228 4669789 16159560 16166372 4810085 -6915027 -6646623 4211704 11245837 8343023
38220 8343023 6917788 14151312 16693167 2633722 -14258389 -14365608 -4466059 -3687107
38212 -3687107 -6886622 5865653 27910794 30725491 12923318 6472190 23206063 32822950
$$ packed form
38265B6943851j8682124j8124094J5103989K9534554Q010143j0412444L96984
38258C2770859J4383912L216054j8048993k1748960j0901587m315600l306190
38251g950505J240716P211100Q232228P240268O862670K061653m577503O50338
38243B0970965J6711627J9536355k941887k7198812k5533024m143128J0838968
38236H241064J0580150N122266m59379q782051j5320597j0832223K891860J3228699
38228D669789J1489771O812j1356287j1725112K68404J0858327P034133k902814
38220H343023j425235P233524K541855j4059445j6892111j07219R899549P78952
38212c687107l199515J2752275K2045141K814697j7802173o451128J6733873R616887
$$ plain form
38204 32822950 13869297 -7415473 2467151 30635204 37459877 14451357 -9799236
38197 -9799236 -14587162 -8552506 -6122201 -7062509 -5304892 -1630014 -685545 -4034262
38189 -4034262 -9412164 -12028886 -7530782 2084543 8862086 9246561 8799990 12228571
38181 12228571 15443331 12927430 5999487 -2018920 -11603748 -21707217 -25435754 -17416655
38173 -17416655 -308804 19531439 36236697 42840505 35750217 23660272 20889247
38166 20889247 28837848 35981141 37674934 39976420 41254467 30325747 9621829 -1499081
38158 -1499081 3101764 4802772 -8566082 -23137304 -26086898 -26838486 -30548815 -17715990
38150 -17715990 20056497 48155122 31305707 -7965509 -15647897 15958442 40126541
$$ packed form
38204C2822950j8953653k1284770R882624K8168053O824673k3008520k4250593
38197i799236m787926O034656K430305r40308J757617L674878R44469l348717
38189d034262n377902k616722M498104R615325O777543L84475m46571L428581
38181A2228571L214760k515901o927943q018407r584828j0103469l728537Q019099
38173a7416655J7107851J9840243J6705258O603808p090288j2089945k771025
38166B0889247P948601P143293J693793K301486J278047j0928720k0703918j1120910
38158a499081M600845J701008j3368854j4571222k949594p51588l710329J2832825
38150a7715990L7772487K8098625j6849415l9271216p682388L1606339K4168099
$$ plain form
38143 40126541 26849423 -147177 -7805118 2111932 9850996 9065836 3106485 -7422347
38135 -7422347 -17163594 -14908390 -2743266 2753169 -620808 7101110 32818742 50388846
38127 50388846 35684221 2878956 -16243621 -14681227 -9229410 -8096588 -3537970 7576687
38119 7576687 16630046 16763008 9223019 -2472924 -13564191 -16904937 -11279918 -5752871
38111 -5752871 -5716994 -2199705 12886112 29258230 30968318 19680137 9298330 3829322
38103 3829322 -1268172 -1134289 13015275 31090491 29971674 7489337 -9854337 -1492074
38095 -1492074 22586477 41195818 48260733 46575223 31497397 335796 -30411105
38088 -30411105 -37081711 -17223069 8734141 23830631 28984538 30277034 26477541 15247049
$$ packed form
38143D0126541j3277118k6996600p657941R917050P739064p85160n959351j0528832
38135g422347r741247K255204J2165124N496435l373977P721918K5717632J7570104
38127E0388846j4704625l2805265j9122577J562394N451817J132822M558618J1114657
38119G576687R053359J32962p539989j1695943j1091267l340746N625019N527047
38111e752871L5877L517289J5085817J6372118J710088j1288181j0381807n469008
38103C829322n097494J33883J4149564J8075216j118817k2482337j7343674Q362263
38095a492074K4078551J8609341P064915j685510j5077826l1161601l0746901
38088c0411105o670606J9858642K5957210J5096490N153907J292496l799493j1230492
$$ plain form
38080 15247049 1284719 -9125449 -15081098 -16746083 -10733393 2937095 14452523
38073 14452523 13562081 3228769 -4036927 -2665114 1074760 970020 -1203402 -2738557
38065 -2738557 -6221283 -11815304 -9875067 8127905 32291442 38689943 16467149 -15315409
38057 -15315409 -25183534 -2949166 29737402 44355771 36230680 24961174 26273738
38050 26273738 32642464 27250398 9879120 -2806724 -1814065 2732115 168252 -2695449
38042 -2695449 6538950 23389021 30248791 21057048 8611389 5015597 7207465 7325345
38034 7325345 6652685 10455370 16219814 17404966 15537516 18110375 24122695 21495770
38026 21495770 3686707 -17404342 -22544789 -7945782 9911974 14340885 7118970
$$ packed form
38080A5247049j3962330j0410168n955649j664985O012690J3670488J1515428
38073A4452523q90442j0333312p265696J371813L739874j04740k173422j535155
38065b738557l482726n594021J940237J8002972K4163537O398501k2222794l1782558
38057a5315409r868125K2234368L2686568J4618369q125091j1269506J312564
38050B6273738O368726n392066j7371278j2685844R92659M546180k563863k863701
38042b695449R234399J6850071O859770r191743j2445659l595792K191868J17880
38034G325345o72660L802685N764444J185152j867450K572859O012320k626925
38026B1495770j7809063k1091049n140447J4599007J7857756M428911p221915
$$ plain form
38019 7118970 1334518 481117 -4249029 -14918621 -18138806 -3987559 15884146 21871309
38011 21871309 13229114 6918382 10759085 13313640 4561133 -7491724 -9160209 31530
38003 31530 9734998 12733714 8515393 -169052 -6041024 401471 17462839 27305654
37995 27305654 16196202 -4499589 -10702436 2713357 16875665 17230265 12274085 17211775
37987 17211775 30546207 37312675 29399871 13017907 -826482 -5094134 1652229 13911119
37979 13911119 20133285 13324344 2153779 3624364 21446877 39052845 39437898 25417019
37971 25417019 12439980 6784563 2387417 -2604469 -776127 8569134 12236046 2112588
37963 2112588 -9465878 -7204977 1869687 -1869022 -18379823 -25325543 -11620554 5570427
$$ packed form
38019G118970n784452q53401m730146j0669592l220185J4151247J9871705N987163
38011B1871309q642195o310732L840703K554555q752507j2052857j668485R191739
38003C1530R703468K998716m218321q684445n871972O442495J7061368R842815
37995B7305654j1109452k0695791o202847J3415793J4162308L54600m956180M937690
37987A7211775J3334432O766468p912804j6381964j3844389m267652O746363J2258890
37979A3911119O222166o808941j1170565J470585J7822513J7605968L85053j4020879
37971B5417019j2977039n655417m397146m991886J828342R345261L666912j0123458
37963B112588j1578466K260901R074664l738709j6510801o945720J3704989J7190981
$$ plain form
37955 5570427 7298888 161252 2678350 15895070 24706147 22487795 17305210 15011217
37947 15011217 11660122 4647294 -1499837 -3928491 -5625011 -7138937 -3339269 7359057
37939 7359057 18232448 22966923 22845196 21723020 19868302 16346067 12200126 8103232
37931 8103232 3590702 607519 2189143 5836254 4945676 -839999 -4556980 -4707177
37923 -4707177 -10038451 -25043325 -39063241 -39444426 -29960868 -25167600 -29004253 -30540248
37915 -30540248 -21966505 -10130031 -5648158 -8633252 -12036096 -14235257 -19899088 -28980716
37907 -28980716 -33072655 -26754508 -17267058 -16213918 -23505121 -27361663 -21564978 -14226525
37899 -14226525 -14381551 -17620850 -13770086 -3586276 3076952 3243525 2984541 3569554
$$ packed form
37955E570427J728461p137636K517098J3216720Q811077k218352n182585k293993
37947A5011217l351095p012828o147131k428654j696520j513926L799668J0698326
37939G359057J0873391M734475j21727j122176j854718l522235m145941m096894
37931H103232m512530k983183J581624L647111q90578n785675l716981j50197
37923d707177n331274j5004874j4019916l81185R483558M793268l836653j535995
37915c0540248Q573743J1836474M481873k985094l402844k199161n663831r081628
37907b8980716m091939O318147R487450J053140p291203l856542N796685P338453
37899a4226525j55026l239299L850764J0183810O663228J66573k58984N85013
$$ plain form
37891 3569554 -1684899 -13089503 -18952783 -10990546 3231903 9854764 4229830 -7651410
37883 -7651410 -15794376 -10463151 10494640 33088789 36537416 18634935 1284582 2254087
37875 2254087 13052586 15731076 8928731 2009994 -5106757 -16528176 -22808590 -11459730
37867 -11459730 7845673 11403835 -3987353 -16420508 -12557087 -4381689 -5390723 -10734958
37859 -10734958 -11663663 -11611157 -14906556 -14401914 -4312425 6337196 6294785 -1687439 -8688867
37850 -8688867 -13305786 -15835713 -10133949 4546390 13473433 4162364 -12869046 -16720466
37842 -16720466 -4286837 8825919 10888186 3311735 -8086822 -16534477 -13236445 2133352
37834 2133352 13630694 7142516 -7363437 -8160814 7061578 20653007 23305814 22400138
$$ packed form
37891C569554n254453j1404604n863280P962237J4222449O622861n624934j1881240
37883g651410q142966N331225K0957791K2594149L448627j7902481j7350353R69505
37875B254087J0798499K678490o802345o918737p116751j1421419o280414J1348860
37867a1459730J9305403L558162j5391188j2433155L863421Q175398j009034n344235
37859a0734958r28705N2506l295399N04642J0089489J0649621m2411p982224p001428
37850h688867m616919k529927N701764J4680339Q927043r311069j7031410l851420
37842a6720466J2433629J3112756K062267p576451j1398557q447655L298032J5369797
37834B133352J1497342o488178j4505953p97377J5222392J3591429K652807r05676
$$ plain form
37826 22400138 22013499 16734948 8723392 8384393 12087118 2569094 -19289805 -27732041
37818 -27732041 -11601511 3580780 -6016662 -23084294 -15741624 10521244 19335294
37811 19335294 -2432468 -27747624 -30220892 -15274003 -2018648 3608454 5359061
37804 5359061 3540124 -889622 -1107305 4447849 5756826 -2639859 -9345809 -3312813
37796 -3312813 5446864 -1098610 -19719125 -27488615 -13566968 6821184 15001339 11413763
37788 11413763 7709185 7805582 7728366 7179953 9645629 13813309 14670667 12285033 11763729
37779 11763729 15234059 20401756 25212815 26954223 19939126 3820412 -8238784 -2279925
37771 -2279925 15238638 22571135 11646823 -2780267 -8002297 -10935184 -20962078 -30902937
$$ packed form
37826B2400138l86639n278551q011556l38999L702725r518024k1858899q442236
37818b7732041J6130530J5182291r597442j7067632P342670K6262868Q814050
37811A9335294k1767762k5315156k473268J4946889J3255355N627102J750607
37804E359061j818937m429746k17683N555154J308977q396685o705950O032996
37796c312813Q759677o545474j8620515p769490J3921647K0388152Q180155l587576
37788A1413763l704578R6397p7216n48413K465676M167680Q57358k385634n21304
37779A1763729L470330N167697M811059J741408p015097j6118714j2059196N958859
37771b279925J7518563P332497j0924312j4427090n222030k932887j0026894r940859
$$ plain form
37763 -30902937 -29690044 -21643964 -16792770 -12569601 -3226332 2305078 -6389840 -17353024
37755 -17353024 -10628695 6654651 7218225 -12336022 -23652779 -11146130 4540220
37748 4540220 2805535 -3595247 6457580 24831449 28025559 15741101 8570260 13381163
37740 13381163 16203541 8411916 -2296439 -9167157 -15611524 -23061472 -25181030 -19114113
37732 -19114113 -10445108 -3209974 4636960 13224165 18155270 18348511 17902277 18774646
37724 18774646 19408552 20205736 21897670 20155290 11606855 2705806 796821 -764282
37716 -764282 -13260623 -29386657 -28394698 -9019010 2106747 -14031185 -40343383 -45549846
37708 -45549846 -24507519 -416550 8536500 8189993 11935925 18794662 17123537 5157901
$$ packed form
37763c0902937J212893Q046080M851194M223169R343269N531410q694918j0963184
37755a7353024O724329J7283346N63574j9554247j1316757J2506649J5686350
37748D540220j734685o400782J0052827J8373869L194110j2284458p170841M810903
37740A3381163K822378p791625j0708355o870718o444367p449948k119558O066917
37732a9114113Q669005P235134P846934Q587205M931105J93241m46234Q72369
37724A8774646O33906P97184J691934j742380q548435q901049j908985j561103
37716g64282j2496341j6126034R91959J9375688J1125757j6137932k6312198n206463
37708d5549846K1042327K4090969Q953050l46507L745932O858737j671125j1965636
$$ plain form
37700 5157901 -3065578 3347967 14409784 11078630 -6563631 -17370050 -10488824 -2267026
37692 -2267026 -9103025 -19548114 -14762044 -4474345 -13415621 -36466795 -40917255 -18178782
37684 -18178782 1052850 -3340683 -8915993 9187527 34666047 36518321 18375041
37677 18375041 8027265 11071505 9814905 1825044 4403920 19779221 27874532 19015890
37669 19015890 5403966 -6169407 -24190245 -45357729 -46795660 -21436341 3841239
37662 3841239 5229769 -3579751 3986130 25407740 36486431 29145650 16545489 6924057
37654 6924057 -3459808 -13925682 -18490048 -21075617 -30071201 -36583168 -21092912 12461128
37646 12461128 31797993 17022894 -12254886 -24872210 -17575253 -8772058 -4958070
$$ packed form
37700E157901q223479O413545J1061817l331154j7642261j0806419O881226Q221798
37692b267026o835999j0445089M786070J0287699q941276k3051174m450460K2738473
37684a8178782J9231632m393533n575310J8103520K5478520J852274j8143280
37677A8375041j0347776L044240j256600p989861K578876J5375301Q095311q858642
37669A9015890j3611924j1573373j8020838k1167484j437931K5359319K5277580
37662C841239J388530q809520P565881K1421610J1078691p340781j2600161r621432
37654F924057j0383865j0465874m564366k585569q995584o511967J5490256L3554040
37646A2461128J9336865j4775099k9277780j2617324P296957Q803195L813988
$$ plain form
37639 -4958070 3619660 17039517 18815250 1521920 -17978064 -20189126 -9028750 -3746124
37631 -3746124 -11013986 -18713429 -16704634 -10637030 -10388779 -14863691 -16648304 -15807659
37623 -15807659 -18995819 -26457818 -29497059 -22590019 -10415782 -119306 6786634 11652597
37615 11652597 14524254 17119513 23838251 34634452 42477160 43091974 40722859 38046120
37607 38046120 28796691 10506019 -3376830 1303135 16308339 19509521 5772557
37600 5772557 -7518488 -7552415 -613453 5635834 15386106 29938492 36848320 27925867
37592 27925867 14413864 9128784 6075700 -4950508 -15349139 -10705083 1453593
37585 1453593 1076659 -10695884 -12612729 417323 7629329 -3919115 -19071853 -19261162
$$ packed form
37639d958070Q577730J3419857J775733j7293330j9499984k211062J1160376N282626
37631c746124p267862p699443K008795O067604K48251m474912j784613Q40645
37623a5807659l188160p461999l039241O907040J2174237J0296476O905940M865963
37615A1652597K871657K595259O718738J0796201P842708O14814k369115k676739
37607C8046120r249429j8290672j3882849M679965J5005204L201182j3736964
37600E772557j3291045l3927O938962O249287R750272J4552386O909828q922453
37592B7925867j3512003n285080l053084j1026208j0398631M644056J2158676
37585A453593l76934j1772543j916845J3030052P212006j1548444j5152738j89309
$$ plain form
37577 -19261162 -8302728 -838703 -1355078 -7527071 -18864960 -27936093 -18347754 11469737
37569 11469737 36004656 33788771 19550875 22790189 42160034 47344693 25507940
37562 25507940 -224488 -5083189 6643805 16100188 17571515 17473766 16872143 10039640
37554 10039640 -3522126 -16537380 -22508631 -20437646 -12438101 -1637116 8052644 13044628
37546 13044628 11408276 3846272 -5151693 -9776472 -10331021 -14754505 -26696147 -35881411
37538 -35881411 -29238466 -9128274 9779356 19872233 24558880 24088189 13395122 -2821692
37530 -2821692 -9715283 -4267908 -1896866 -11362105 -19021915 -12019927 -2440703 -9382451
37522 -9382451 -27368838 -34329791 -25307419 -15227869 -9743621 1836313 19827805 24713249
$$ packed form
37577a9261162J0958434P464025n16375o171993j1337889r071133R588339K9817491
37569A1469737K4534919k215885j4237896L239314J9369845N184659k1836753
37562B5507940k5732428m858701J1726994R456383J471327r7749o01623o832503
37554A0039640j3561766j3015254n971251K070985P999545J0800985R689760M991984
37546A3044628j636352p562004q997965m624779n54549m423484j1941642r185264
37538c5881411O642945K0110192J8907630J0092877M686647m70691j0693067j6216814
37530b821692o893591N447375K371042r465239p659810P001988R579224o941748
37522i382451j7986387o960953R022372J0079550N484248J1579934J7991492M885444
$$ plain form
37514 24713249 6431537 -16015794 -19391438 -6190373 5884345 11416269 15425244
37507 15425244 14095857 358193 -14805789 -10508661 11641746 25527129 18360769
37500 18360769 9339025 17764267 31887902 28763046 10859671 -1097431 -3962432 -13508692
37492 -13508692 -29654782 -28801179 -1503136 26075571 25910450 6028896 -6003371 -4919581
37484 -4919581 -7821970 -17086234 -11110493 20227684 52582577 54545344 26229188 -4091383
37476 -4091383 -15674346 -13447896 -11298754 -10546325 -2403582 13366635 22029060 10984281
37468 10984281 -10941583 -20980314 -12010602 -4125724 -16880051 -38618597 -40324066
37461 -40324066 -17721324 1205298 -2916514 -12934867 -3568833 17911734 22515553
$$ packed form
37514B4713249j8281712k2447331l375644J3201065J2074718N531924M008975
37507A5425244j329387j3737664j5163982M297128K2150407J3885383p166360
37500A8360769r021744Q425242J4123635l124856j7903375j1957102k865001r546260
37492a3508692j6146090Q53603K7298043K7578707j65121j9881554j2032267J083790
37484d919581k902389r264264N975741L1338177L2354893J962767k8316156l0320571
37476d091383j1582963K226450K149142P52429Q142743J5770217Q662425j1044779
37468A0984281k1925864j0038731Q969712P884878j2754327k1738546j705469
37461d0324066K2602742J8926622m121812j0018353R366034K1480567M603819
$$ plain form
37454 22515553 5212167 -5701746 9486935 31831271 29523583 997597 -24684887
37447 -24684887 -26204854 -12922643 -7134033 -15792008 -27050286 -28254545 -19266745 -9618763
37439 -9618763 -8264207 -15968190 -23749364 -19563369 -1271174 17197662 18437292 1980635
37431 1980635 -13709550 -12891288 -432144 7055249 2722410 -5529711 -8825649 -7367524
37423 -7367524 -6142787 -7718554 -11371829 -14518090 -13713058 -8269245 -2670455 -376942
37415 -376942 3799884 17743405 37792747 49087566 43587410 30009165 20815181 16379212
37407 16379212 9158033 -1640668 -8570845 -7912055 -5272675 -7316295 -12635858 -13558786
37399 -13558786 -5146991 9422010 21911542 26167501 21751479 12024984 1692605 -3714516
$$ packed form
37454B2515553j7303386j0913913J5188681K2344336k307688k8525986k5682484
37447b4684887j519967J3282211N788610q657975j1258278j204259Q987800R647982
37439i618763J354556p703983p781174M185995J8292195J8468836J239630j6456657
37431A980635j5690185Q18262J2459144P487393m332839q252121l295938J458125
37423g367524J224737j575767l653275l146261Q05032N443813N598790K293513
37415c76942M176826J3943521K0049342J1294819n500156j3578245r193984m435969
37407A6379212p221179j0798701o930177O58790K639380k043620n319563r22928
37399a3558786Q411795J4569001J2489532M255959m416022r726495j0332379n407121
$$ plain form
37391 -3714516 -983482 5284245 5607632 -1233236 -4002845 4706944 14430625 10355294
37383 10355294 -3861748 -11427417 -8736185 -9380240 -20025219 -30505711 -33683402 -36561086
37375 -36561086 -42029717 -38100429 -19435140 -2538620 -1141977 -1090015 17647148 44570918
37367 44570918 50262295 29570663 6606451 -3185466 -8611707 -15439050 -11418983 8249059
37359 8249059 23605299 16518333 -1337382 -5941139 4982403 14147794 13250062 10251010
37351 10251010 11424509 13676223 15042842 18025506 20713993 17649463 12406433 17239061
37343 17239061 35105037 51570843 50815880 33429051 13263949 1656223 -689572
37336 -689572 -26002 -1959156 -5493352 -3189473 9681386 25914060 31500431 21464584
$$ packed form
37391c714516K731034O267727L23387o840868k769609Q709789R723681m075331
37383A0355294j4217042p565669K691232o44055j0644979j0480492l177691k877684
37375c6561086n468631L929288J8665289J6896520J396643N1962J8737163K6923770
37367D4570918N691377k0691632k2964212r791917n426241o827343M020067J9668042
37359H249059J5356240p086966j7855715m603757J0923542R165391q97732k999052
37351A0251010J173499K251714J366619K982664K688487l064530n243030M832628
37343A7239061J7865976J6465806p54963j7386829k0165102j1607726k345795
37336f89572O63570j933154l534196K303879J2870859J6232674N586371j0035847
$$ plain form
37328 21464584 5264104 -5238386 -6996983 -2796638 5105214 13391287 16786428 15310268
37320 15310268 16591204 24067303 29074529 23315149 13267485 11162206 16099047 17080245
37312 17080245 12134652 9555450 10294483 5725497 -3563840 -3841984 9212597 19576008
37304 19576008 13309030 -944710 -5636116 2682070 15538316 25966186 27035175 10132484
37296 10132484 -18937222 -34846174 -23737070 -7755026 -14680158 -33367114 -29916311
37289 -29916311 -3549869 9281589 -8529998 -29499443 -26540041 -11650635 -9725965
37282 -9725965 -19897770 -26608666 -28760098 -32995456 -33783850 -24882866 -17981102 -25640416
37274 -25640416 -36259110 -30239331 -11880611 -293504 3354072 12463963 24131552
$$ packed form
37328B1464584j6200480j0502490j758597M200345P901852Q286073L395141j476160
37320A5310268J280936P476099N007226n759380j0047664k105279M936841R81198
37312A7080245m945593k579202P39033m568986r289337k78144J3054581J0363411
37304A9576008o266978j4253740m691406Q318186J2856246J0427870J068989j6902691
37296A0132484k9069706j5908952J1109104J5982044o925132j8686956L450803
37289b9916311K6366442J2831458j7811587k0969445K959402J4889406J924670
37282i725965j0171805o710896k151432m235358p88394Q900984O901764p659314
37274b5640416j0618694O019779J8358720J1587107L647576R109891J1667589
$$ plain form
37267 24131552 20487194 635760 -16154389 -21547819 -25867814 -30424108 -19601718 9772810
37259 9772810 35420035 38480106 25725576 11846861 -792187 -12626529 -17162086
37252 -17162086 -16070436 -25806486 -51178703 -67954626 -52472407 -17221775 4424011
37245 4424011 1522412 -7218858 -4983802 5345278 14735589 20393768 21090824 14967858
37237 14967858 6323905 3272952 5845973 6620490 4146987 4001499 5332781 471385
37229 471385 -8255183 -6787287 7514499 15898166 4326730 -12634191 -11095903 6972984
37221 6972984 17865438 12246140 4651005 4079853 -716981 -15610955 -23512965 -11582486
37213 -11582486 1942916 -6691624 -26431286 -26466885 -6569559 633311 -18873371 -39897673
$$ packed form
37267B4131552l644358j9851434j6790149n393430m319995m556294J0822390K9374528
37259I772810K5647225L060071j2754530j3878715j2639048j1834342m535557
37252a7162086J091650r736050k5372217j6775923J5482219L5250632K1645786
37245D424011k901599q741270K235056J0329080R390311N658179O97056o122966
37237A4967858q643953l050953K573021P74517k473503j45488J331282m861396
37229D71385q726568J467896J4301786Q383667j1571436j6960921J538288J8068887
37221F972984J0892454n619298p595135n71152m796834j4893974p902010J1930479
37213a1582486J3525402q634540j9739662l5599J9897326P202870j9506682k1024302
$$ plain form
37205 -39897673 -39966079 -30244118 -26945265 -21463538 -3751690 9758550 1982815 -10278696
37197 -10278696 -768331 21424404 26635932 14291467 9932742 17001089 11541165 -12086673
37189 -12086673 -29296427 -27959280 -26162186 -34049867 -33207622 -12682902 6458802 5611495
37181 5611495 261549 11393527 27800919 24296949 650297 -23545752 -39004354
37174 -39004354 -47424109 -44902404 -29520448 -15487856 -16168783 -21517131 -14406652 -400457
37166 -400457 1572465 -9849866 -19993301 -23439983 -24536422 -19593059 -3343485 12261108
37158 12261108 11511499 3564877 11245821 33337009 45448140 38472077 27713791 21271640
37150 21271640 9310117 -8467820 -14596307 -4662609 895238 -10002395 -21122675
$$ packed form
37205c9897673o8406R721961L298853N481727J7711848J3510240p775735j2261511
37197a0278696R510365K2192735N211528j2344465m358725P068347n459924k3627838
37189a2086673j7209754J337147J797094p887681Q42245K0524720J9141704q47307
37181E611495n349946J1131978J6407392l503970k3646652k4196049j5458602
37174c9004354q419755K521705J5381956J4032592o80927n348348P110479J4006195
37166d00457J972922j1422331j0143435l446682j096439M943363J6249574J5604593
37158A2261108p49609p946622P680944K2091188J2111131o976063j0758286o442151
37150B1271640j1961523j7777937o128487R933698N557847j0897633j1120280
$$ plain form
37143 -21122675 -17074719 -7996411 -5937148 -207803 18772919 30434510 9138326 -32590068
37135 -32590068 -56138705 -47808238 -29394760 -18413761 -7250603 10785780 21698833
37128 21698833 13078879 -2224948 -3081665 10039213 19475021 18056768 15062682 17027039
37120 17027039 20106032 23641250 33988422 47285254 44464245 17852432 -8286484
37113 -8286484 -3067821 28703011 49782815 39110775 17620310 15967240 33248745
37106 33248745 43525377 33215769 14215573 2782615 815429 163637 -4742801 -11764836
37098 -11764836 -13962745 -8051223 -2162459 -9153445 -27133046 -35281841 -18630313 10259405
37090 10259405 25815528 19604568 3600311 -10596706 -20509993 -24185417 -19487410 -12672669
$$ packed form
37143b1122675M047956R078308K059263N729345J8980722J1661591k1296184m1728394
37135c2590068k3548637Q330467J8413478J0980999J1163158J8036383J0913053
37128B1698833q619954j5303827q56717J3120878R435808j418253k994086J964357
37120A7027039L078993L535218J0347172J3296832k821009k6611813k6138916
37113h286484N218663L1770832K1079804j0672040k1490465j653070J7281505
37106C3248745J0276632j0309608j9000196j1432958j967186o51792m906438p022035
37098a1764836k197909N911522N888764o990986j7979601q148795J6651528K8889718
37090A0259405J5556123o210960j6004257j4197017r913287l675424M698007O814741
$$ plain form
37082 -12672669 -13580581 -20922119 -24301670 -20378059 -14244513 -6258597 7067927 18832278
37074 18832278 15120443 -4281057 -23765939 -33707742 -39006639 -42441980 -36759138 -20258068
37066 -20258068 -4489256 2279370 5589137 10259480 8981494 -4045997 -19545730 -24675912
37058 -24675912 -19961701 -14833293 -12805505 -9782829 -2737360 5861200 9628400 3986914
37050 3986914 -4666519 -251080 21180138 36939164 23921759 -3729768 -8269211 17183594
37042 17183594 36083033 21275508 -7467526 -17067810 -8073079 -3658343 -9089474 -8798401
37034 -8798401 4967067 23230069 35303085 36421444 26912953 16974565 22099139 40271199
37026 40271199 46956413 28345907 4204954 -1119493 6368026 7654658 6086853 15582430
$$ packed form
37082a2672669r07912p341538l379551L923611O133546P985916J3326524J1764351
37074A8832278l711835j9401500j9484882r941803n298897l435341N682842J6501070
37066b0258068J5768812O768626L309767M670343j277986j3027491j5499733n130182
37058b4675912M714211N128408K027788L022676P045469Q598560L767200n641486
37050C986914q653433M415439K1431218J5759026j3017405k7651527m539443K5452805
37042A7183594J8899439j4807525k8743034r600284Q994731M414736n431131K91073
37034h798401J3765468J8263002J2073016J118359r508491r938388N124574J8172060
37026D0271199O685214j8610506k4140953n324447P487519J286632j567805R495577
$$ plain form
37018 15582430 26131846 15553867 -9607244 -19227952 -5787162 6718085 3012135
37011 3012135 -5277837 -7423677 -9549937 -13443546 -6859101 12715174 27468821 24331831
37003 24331831 11270006 -80138 -7679380 -7486838 8053545 29338887 30675815 5677216
36995 5677216 -19220961 -20628810 -7554987 -311523 -382614 1246439 3629101 2312721
36987 2312721 1223070 979047 -9408691 -31641540 -44935889 -33935059 -15258791 -13604514
36979 -13604514 -23526681 -20058700 433210 15914909 13053493 2643970 -1425109 127523
36971 127523 -474532 -5780014 -11423451 -9095100 6575680 27058069 32635631 15880573
36963 15880573 -5347212 -9483066 2896754 16937485 26232097 31659058 27973181 11698975
$$ packed form
37018A5582430J0549416j0577979k5161111r620708J3440790J2505247l705950
37011C012135q289972k145840k126260l893609O584445J9574275J4753647l136990
37003B4331831j3061825j1350144p599242J92542J5540383K1285342J336928k4998599
36995E677216k4898177j407849J3073823P243464p1091J629053K382662j316380
36987B312721j089651k44023j0387738k2232849j3294349J1000830J8676268J654277
36979a3604514r922167L467981K0491910J5481699k861416j0409523m069079J552632
36971A27523o02055n305482n643437K328351J5670780K0482389N577562j6755058
36963A5880573k1227785m135854J2379820J4040731R294612N426961l685877j6274206
$$ plain form
36955 11698975 -3956165 -2274105 12364577 20888232 16273984 6373046 -3871119 -13017103
36947 -13017103 -12032851 4163014 17825292 6033621 -23597624 -39702164 -29812922
36940 -29812922 -10237160 7522710 29932616 54300929 59389972 37442771 10790822
36933 10790822 1652555 6739339 14523524 24038607 31162718 20784986 -7111556 -25348896
36925 -25348896 -16252606 -1000661 -7188714 -24461019 -21804121 2699641 20360122
36918 20360122 15196779 328885 -8257182 -9164789 -5157965 2927405 9362161 8802527
36910 8802527 8570599 17936227 27702686 21767127 7353280 8672699 28199497 41122919
36902 41122919 35523693 30654794 41834622 52641860 42074661 19575636 9262569
$$ packed form
36955A1698975j5655140J682060J4638682Q523655m614248r900938j0244165r145984
36947a3017103R84252J6195865J3662278j1791671k9631245j6104540R889242
36940b9812922J9575762J7759870K2409906K4368313N089043k1947201k6651949
36933A0790822r138267N086784P784185R515083P124111j0377732k7896542j8237340
36925b5348896R096290J5251945o188053j7272305K656898K4503762J7660481
36918B0360122n163343j4867894q586067r07607M006824Q085370O434756n59634
36910H802527k31928R365628R766459n935559j4413847J319419J9526798J2923422
36902D1122919n599226m868899J1179828J0807238j0567199k2499025j0313067
$$ plain form
36895 9262569 12279963 9539881 -4530619 -14537377 -9717558 2997967 13969502 22159274
36887 22159274 27315210 25409450 18226655 16096211 23719422 31645842 29106245 18982686
36879 18982686 12733481 15084816 21500319 28393501 37562146 49071354 55998504 50714490
36871 50714490 34701287 18629099 11797749 13020217 13546070 8666961 3657477 5592830
36863 5592830 11078398 8164811 -6515741 -18357045 -11036760 9045138 15847448 -3178963
36855 -3178963 -26777442 -24359079 3850825 25660515 17403353 -8598340 -23797254
36848 -23797254 -18632192 -6712807 -1203741 -264789 5258365 19811665 39530052 53953273
36840 53953273 52405505 35465703 18351401 15221458 21713943 21554632 8924032 -6036067
$$ packed form
36895I262569L017394k740082j4070500j0006758M819819J2715525J0971535Q189772
36887B2159274N155936j905760p182795k130444P623211P926420k539597j0123559
36879A8982686o249205K351335O415503O893182R168645J1509208O927150n284014
36871E0714490j6013203j6072188o831350J222468N25853m879109n009484J935353
36863E592830N485568k913587j4680552j1841304P320285K0081898O802310j9026411
36855c178963k3598479K418363K8209904K1809690q257162k6001693j5198914
36848b3797254N165062J1919385N509066R38952N523154J4553300J9718387J4423221
36840E3953273j547768j6939802j7114302l129943O492485j59311j2630600j4960099
$$ plain form
36832 -6036067 -13628659 -14398973 -10444451 -463156 9990619 5806567 -18796962 -46386842
36824 -46386842 -53540035 -38261946 -19161995 -9675432 -5334197 2217988 10847448 13717204
36816 13717204 11046626 8103420 6166189 3443026 2217939 6233638 11177226 7289860
36808 7289860 -5491963 -14036450 -9401639 881620 6518054 11654943 24347780 34849071
36800 34849071 24309684 -3514648 -20451766 -12041422 2462053 1830858 -4113316 6225769
36792 6225769 27820711 35804201 24851084 15507032 20219180 27032546 22749697 11931543
36784 11931543 5040732 4379876 9165579 19533680 29027678 27917209 19710568 18664513
36776 18664513 25626687 24722461 11056760 861912 3470368 5117389 -4442103 -11033720
$$ packed form
36832f036067p592592p70314L954522R981295J0453775m184052k4603529k7589880
36824d6386842p153193J5278089J9099951R486563M341235P552185Q629460K869756
36816A3717204k670578k943206j937231k723163j225087M015699M943588l887366
36808G289860j2781823q544487M634811J0283259N636434N136889J2692837J0501291
36800C4849071j0539387k7824332j6937118Q410344J4503475o31195n944174J0339085
36792F225769K1594942P983490j0953117r344052M712148O813366m282849j0818154
36784A1931543o890811o60856M785703J0368101R493998j110469q206641j046055
36776A8664513O962174r04226j3665701j0194848K608456J647021r559492o591617
$$ plain form
36768 -11033720 -1509636 9951836 5183905 -5317339 -1113252 9890707 3566946 -17388140
36760 -17388140 -26320218 -18104689 -17998848 -37594131 -52225248 -36979890 -3211675 16920920
36752 16920920 8217602 -17515539 -38112121 -38747265 -22480599 -8648791 -11654546 -20922168
36744 -20922168 -15573198 2194406 8616927 -4132492 -15412892 -8924464 5534613
36737 5534613 14516147 20924173 25733657 14334969 -15936202 -35550641 -18696832 14918380
36729 14918380 24885254 7813400 -2369599 10481277 22868480 11807225 -12242402
36722 -12242402 -26313968 -27538585 -29037217 -36871981 -45225048 -46924726 -39634693 -27446134
36714 -27446134 -20298453 -23706170 -27744298 -18330737 -861012 4053934 -6802363 -10851676
$$ packed form
36768a1033720R524084J1461472m767931j0501244M204087J1003959o323761k0955086
36760a7388140q932078Q215529J05841j9595283j4631117J5245358L3768215K0132595
36752A6920920q703318k5733141k0596582o35144J6266666J3831808l005755r267622
36744b0922168N348970J7767604O422521j2749419j1280400O488428J4459077
36737E534613Q981534O408026M809484j1398688l0271171j9614439J6853809L3615212
36729A4918380R966874j7071854j0182999J2850876J2387203j1061255k4049627
36722a2242402j4071566j224617j498632p834764q353067j699678P290033J2188559
36714b7446134P147681l407717m038128R413561J7469725M914946j0856297m049313
$$ plain form
36706 -10851676 5031459 20771950 12730564 -8848181 -15404941 -3390500 3922486
36699 3922486 -4731189 -13817302 -9070725 2671861 10157284 14444816 17767255 13127004
36691 13127004 -706793 -8296152 1365900 13632608 6814008 -15118312 -28352442
36684 -28352442 -23990469 -15539443 -11407166 -3421273 9964453 11628964 -7937012 -29297968
36676 -29297968 -28294106 -10856252 -2968679 -11721410 -18675490 -12619365 -6967735 -16562457
36668 -16562457 -34558921 -44654314 -44466244 -43023302 -42138347 -34664103 -19447186 -5361068
36660 -5361068 1817072 7228477 17599287 30550216 38207714 37567210 31834802 23256866
36652 23256866 11030683 -1977989 -6690195 1762381 14000554 15380460 5786980 795541
$$ packed form
36706a0851676J5883135J5740491q041386k1578745o556760J2014441P312986
36699C922486q653675r086113M746577J1742586P485423M287532L322439m640251
36691A3127004j3833797p589359R662052J2266708o818600k1932320j3234130
36684b8352442M361973Q451026M132277P985893J3385726J664511j9565976k1360956
36676b9297968J003862J7437854P887573q752731o954080O056125N651630r594722
36668a6562457j7996464j0095393J88070J442942Q84955P474244J5216917J4086118
36660e361068P178140N411405J0370810J2950929P657498o40504n732408q577936
36652B3256866j2226183j3008672m712206Q452576J2238173J379906r593480m991439
$$ plain form
36644 795541 8597931 16132005 7870864 -9990080 -18200609 -12821021 -8289690 -12053774
36636 -12053774 -13968787 -6434556 1633183 908264 -2257953 1288902 5558579 -534637
36628 -534637 -12409131 -15086273 -6038629 2036823 579476 -6019850 -11478360 -15014710
36620 -15014710 -16132054 -14023674 -14828893 -27332744 -46343137 -51396309 -30048499 4753261
36612 4753261 28307104 30425941 21335387 15024680 14276609 12705651 7041352 3910268
36604 3910268 11970298 26984856 30928135 13300275 -10713921 -15387918 1664047 14705380
36596 14705380 4915877 -13690078 -15540379 -45444 10811552 7449899 4882776 14820324
36588 14820324 23701872 12127581 -14584731 -32358354 -31730687 -27916789 -34054243 -40925348
$$ packed form
36644G95541P802390P534074q261141j7860944q210529N379588M531331l764084
36636a2053774j915013P534231Q067739p24919l166217L546855M269677o093216
36628e34637j1874494k677142R047644Q075452j457347o599326n458510l536350
36620a5014710j117344K108380q05219j2503851j9010393n053172K1347810L4801760
36612D753261K3553843K118837r090554o310707p48071j570958n664299l131084
36604C910268Q060030J5014558L943279j7627860k4014196m673997J7051965J3041333
36596A4705380r789503j8605955j850301J5494935J0856996l361653k567123R937548
36588A4820324Q881548j1574291k6712312j7773623O27667L813898o137454o871105
$$ plain form
36580 -40925348 -34302765 -20174932 -15721900 -20406683 -15751794 3431051 16914636 8556356
36572 8556356 -7425301 -5657688 13959848 26859232 17599958 -3869360 -20174718
36565 -20174718 -24898323 -19758072 -8138146 2480282 3839237 -526322 3236194 18502693
36557 18502693 29994607 24868635 11113524 4045545 4186988 2285199 -708156 4935055
36549 4935055 17787542 21852670 6600339 -19266664 -37234607 -36030178 -18993793
36542 -18993793 -735735 4243983 -4249697 -11222114 -5906663 2936746 811213 -9243483
36534 -9243483 -12091010 -6434454 -6595670 -15633668 -16389928 1474941 22461436 26543727
36526 26543727 16672416 10204714 12764203 16821576 19418376 23569654 24413332 11414064
$$ packed form
36580d0925348O622583J4127833M453032m684783M654889J9182845J3483585q358280
36572H556356j5981657J767613J9617536J2899384r259274k1469318j6305358
36565b0174718m723605N140251J1619926J0618428J358955m365559L762516J5266499
36557A8502693J1491914n125972j3755111p067979J41443j901789k993355N643211
36549D935055J2852487M065128j5252331k5867003j7967943J204429J7036385
36542a8993793J8258058M979718q493680o972417N315451Q843409k125533j0054696
36534i243483k847527N656556j61216r037998p56260J7864869K0986495M082291
36526B6543727r871311o467702K559489M057373K596800M151278Q43678j2999268
$$ plain form
36518 11414064 -12862214 -29753673 -25144528 -4372131 16230334 24981003 20449586
36511 20449586 9194712 124375 -4144704 -9518852 -18652042 -22093948 -11952429 438841
36503 438841 -3248062 -19057205 -22815208 -6491306 6921109 -4027461 -28388726 -40012275
36495 -40012275 -33473284 -25156906 -25762837 -29774068 -29952926 -26415171 -20644666 -13235901
36487 -13235901 -8697696 -11690394 -17511981 -15841024 -4466300 9048135 18074622 20146977
36479 20146977 12330277 -4343075 -17017969 -11721674 6331320 16706786 10981340
36472 10981340 2238676 3088487 9020456 11209084 11768351 15166270 15771709 7073505
36464 7073505 -4320638 -6970097 -2190866 -1359910 -8317434 -14994199 -13140973 -1787651
$$ packed form
36518A1414064k4276278j6891459M609145K0772397K0602465Q750669m531417
36511B0449586j1254874r070337m269079n374148r133190l441906J0141519J2391270
36503D38841l686903j5809143l758003J6323902J3412415j0948570k4361265j1623549
36495d0012275O538991Q316378o05931m011231j78858L537755N770505P408765
36487a3235901M538205k992698n821587J670957J1374724J3514435R026487K072355
36479B0146977p816700j6673352j2674894N296295J8052994J0375466n725446
36472A0981340q742664Q49811N931969K188628N59267L397919O05439q698204
36464G073505j1394143k649459M779231Q30956o957524o676765J853226J1353322
$$ plain form
36456 -1787651 15002384 29538943 32151378 20764398 7679698 7501093 18090642 22318787
36448 22318787 10178880 -8964398 -19206816 -16741613 -11304457 -12316905 -17799499 -17814658
36440 -17814658 -8132632 2150407 800973 -10734072 -18504987 -16535714 -16354944 -28718643
36432 -28718643 -44630002 -46225904 -31337680 -14166905 -3932901 3079465 9469693
36425 9469693 9552463 1951647 -2806215 3432669 12107311 8041570 -9056857 -22549344
36417 -22549344 -19901964 -9237614 -9324696 -24016034 -33581159 -17961657 14555360 33248949
36409 33248949 22694713 2282247 -984438 12109177 19528353 12241919 2832539 1449387
36401 1449387 2995974 2349725 4390891 11276508 15191235 12989701 13891189 21470946
$$ packed form
36456a787651J6790035J4536559K612435j1386980j3084700j78605J0589549M228145
36448B2318787j2139907j9143278j0242418K465203N437156j012448n482594j5159
36440a7814658R682026J0283039j349434j1535045p770915J969273J80770j2363699
36432b8718643j5911359j595902J4888224J7170775J0234004P012366O390228
36425I469693Q2770p600816m757862O238884Q674642m065741j7098427j3492487
36417b2549344K647380J0664350q7082j4691338r565125J5619502L2517017J8693589
36409C3248949j0554236k0412466l266685J3093615P419176p286434r409380j383152
36401A449387J546587o46249K041166O885617L914727k201534R01488P579757
$$ plain form
36393 21470946 21141976 -6187 -30421991 -46638943 -42792627 -32986120 -28238113 -26066470
36385 -26066470 -21972379 -17099998 -12222527 -4921423 4704041 13638815 21861030 30273586
36377 30273586 33020585 22123998 1448750 -14179184 -17400662 -16934306 -23347207 -34324887
36369 -34324887 -39866030 -35971422 -27250426 -20233055 -18977742 -23508361 -28331400 -26209854
36361 -26209854 -17342062 -10833834 -13107970 -19609900 -23232125 -25780395 -32842072 -40176392
36353 -40176392 -35824295 -18115155 -2765000 -5557638 -21838532 -29916539 -15182212
36346 -15182212 13490313 33441321 32054000 17574413 5686369 -407239 -10537731
36339 -10537731 -28300832 -40062391 -30983835 -7402908 8338448 6574004 1961608
$$ packed form
36393B1470946l28970k1148163l0415804j6216952L846316R806507M748007K171643
36385b6066470M094091M872381M877471P301104R625464Q934774Q222215Q412556
36377C0273586K746999j0896587k0675248j5627934l221478M66356o412901j0977680
36369c4324887n541143L894608Q720996P017371J255313m530619m823039K121546
36361b6209854Q867792O508228k274136o501930l622225k548270p061677p334320
36353d0176392M352097J7709140J5350155k792638j6280894q078007J4734327
36346a5182212K8672525J9951008j387321j4479587j1888044o093608j0130492
36339a0537731j7763101j1761559R078556K3580927J5741356j764444m612396
$$ plain form
36332 1961608 10298515 24421969 24687690 6975537 -13512282 -23710181 -23067982 -12398543
36324 -12398543 10084105 35460230 43953951 30216982 15224256 18135902 28328535
36317 28328535 24622328 12929768 19265989 46748744 67110080 62528880 50549958
36310 50549958 52755567 60254548 51484557 29370761 15782139 15706207 11807586 -4758965
36302 -4758965 -20137364 -20298365 -10566533 -4251246 -4185553 -4018574 792153 10062003 20259873
36293 20259873 24838604 20815370 17420266 27423394 45706605 49556417 28557537 1562468
36285 1562468 -7939659 -2098721 910858 -2472939 -143123 9405420 11131899 -2637370
36277 -2637370 -20529079 -30456276 -33252330 -30696885 -17366534 3610052 12602790 -2019481
$$ packed form
36332A961608Q336907J4123454K65721j7712153k0487819j0197899O42199J0669439
36324a2398543K2482648K5376125Q493721j3736969j4992726K911646J0192633
36317B8328535l706207j1692560O336221K7482755K0361336m581200j1978922
36310E0549958K205609P498981q769991k2113796j3588622p5932l898621j6566551
36302d758965j5378399j61001R731832O315287O5693J66979M810727R269850J0197870
36293B0259873M578731m023234l395104J0003128J8283211L849812k0998880k6995069
36285A562468r502127N840938L009579l383797K329816R548543J726479j3769269
36277b637370j7891709r927197k796054K555445J3330351K0976586Q992738j4622271
$$ plain form
36269 -2019481 -23143699 -26991659 -16884774 -14931793 -27359226 -41620837 -53739297
36262 -53739297 -70366781 -81721114 -64213473 -21804325 5410650 -5866617 -26483198
36255 -26483198 -18421502 7880692 13534730 -6010074 -17936584 -8495572 -1759621 -13956663
$$ packed form
36269b019481k1124218l847960J0106885J952981j2427433j4261611j2118460
36262e3739297j6627484j1354333J7507641M2409148K7214975j1277267k0616581
36255b6483198Q061696K6302194N654038j9544804j1926510R441012O735951j2197042
$$ [...]
##END NTUPLES=NMR SPECTRUM
##END=
