##TITLE=31Pdec_LR-760-1-C2-B20
 CCl4, 64 sc
 27.1.2023
##JCAMPDX= 6.0         $$ Bruker NMR JCAMP-DX V2.0
##DATA TYPE= NMR SPECTRUM
##DATA CLASS= NTUPLES
##ORIGIN= UXNMR, Bruker Analytische Messtechnik GmbH
##OWNER= root
$$ XWIN-NMR		Version 3.5
$$ Fri Jan 27 14:22:10 2023 Russian Standard Time (UT+4h)  she@DPX200
##.OBSERVE FREQUENCY= 81.013821
##.OBSERVE NUCLEUS= ^31P
##.ACQUISITION MODE= SIMULTANEOUS
##.ACQUISITION SCHEME= undefined
##.AVERAGES= 64
##.DIGITISER RES= 16
##SPECTROMETER/DATA SYSTEM= spect
##.PULSE SEQUENCE= zgpg30
##.SOLVENT NAME= Acetone
##.SHIFT REFERENCE= (INTERNAL, Acetone, 0, 248.564)
##AUDIT TRAIL= $$ (NUMBER, WHEN, WHO, WHERE, WHAT)
$$ ##TITLE= Audit trail, XWIN-NMR		Version 3.5
$$ ##JCAMPDX= 5.01
$$ ##ORIGIN= Bruker BioSpin GmbH
$$ ##OWNER= she
$$ F:/spectra/data/she/nmr/P31/1/pdata/1/auditp.txt
$$ ##AUDIT TRAIL=  $$ (NUMBER, WHEN, WHO, WHERE, WHAT)
(   1,<2023-01-27 14:20:57.46 +0400>,<she>,<DPX200>,
      <continue with go, POWCHK disabled, PULCHK disabled
       configuration hash MD5:
       00 E9 B6 7A A2 85 ED C7 34 08 36 98 17 FE 4E 26
       data hash MD5: 32K
       36 52 6C 10 CC D9 CC 2E C1 F9 EC 6E 03 12 07 E6>)
(   2,<2023-01-27 14:21:14.10 +0400>,<she>,<DPX200>,
      <Start of raw data processing
       efp BC_mod = 2 LB = 1 FT_mod = 6 PKNL = 1 PHC0 = -11269.6 PHC1 = 646.0112 SI = 64K 
       data hash MD5: 64K
       EF A9 1E BA 10 4C FB E4 F0 11 C6 57 4D D6 61 6F>)
(   3,<2023-01-27 14:21:39.03 +0400>,<she>,<DPX200>,
      <pk PHC0 = 160.2606 PHC1 = -190.2 
       data hash MD5: 64K
       45 9D 71 57 4D 04 EA 7D 65 09 9F AD 27 AF 83 A8>)
(   4,<2023-01-27 14:21:42.18 +0400>,<she>,<DPX200>,
      <abs ABSG = 5 
       data hash MD5: 64K
       0B FE D1 E6 59 1E D9 1D 81 4D 92 38 6B 29 4F C1>)
$$ ##END=
$$ 
$$ hash MD5
$$ 9E C2 06 2F 2C E8 8B 1C 31 1A 96 DB 73 EA 8B BF
##$RELAX= 
##$RELAX= 
##$RELAX= 
##$RELAX= 
##$RELAX= 
##$RELAX= 
##$RELAX= 
##$RELAX= 
##$RELAX= 
$$ Bruker specific parameters
$$ --------------------------
##$DU= <F:/spectra>
##$EXPNO= 1
##$NAME= <P31>
##$PROCNO= 1
##$TYPE= <nmr>
##$USER= <she>
##$AMP= (0..31)
100 100 100 100 100 100 100 100 100 100 100 100 100 100 100 100 100 100 
100 100 100 100 100 100 100 100 100 100 100 100 100 100 
##$AQSEQ= 0
##$AQ_mod= 1
##$AUNM= <au_zg>
##$AUTOPOS= <>
##$BF1= 81.014009
##$BF2= 200.13
##$BF3= 200.13
##$BF4= 200.13
##$BF5= 200.13
##$BF6= 200.13
##$BF7= 200.13
##$BF8= 200.13
##$BYTORDA= 1
##$CFDGTYP= 0
##$CFRGTYP= 5
##$CHEMSTR= <none>
##$CNST= (0..31)
1 1 145 1 1 1 1 1 1 1 1 1 1 1 1 1 1 1 1 1 1 1 1 1 1 1 1 1 1 1 1 1 
##$CPDPRG= <waltz16>
##$CPDPRG1= <>
##$CPDPRG2= <waltz16>
##$CPDPRG3= <>
##$CPDPRG4= <mlev>
##$CPDPRG5= <mlev>
##$CPDPRG6= <mlev>
##$CPDPRG7= <mlev>
##$CPDPRG8= <mlev>
##$CPDPRGB= <>
##$CPDPRGT= <>
##$D= (0..31)
0 1 0 0 0 0 0 0 0 0 0 0.03 2e-05 3e-06 0 0 0 0 0 0 0 0 0 0 0 0 0 0 0 0 
0 0 
##$DATE= 1674814777
##$DBL= (0..7)
120 120 120 11 120 120 24 19 
##$DBP= (0..7)
150 150 150 150 150 150 150 150 
##$DBP07= 0
##$DBPNAM0= <>
$$ [...]
##$SUBNAM3= <"">
##$SUBNAM4= <"">
##$SUBNAM5= <"">
##$SUBNAM6= <"">
##$SUBNAM7= <"">
##$SUBNAM8= <"">
##$SUBNAM9= <"">
##$SW= 501.771253377433
##$SWIBOX= (0..15)
0 1 3 0 0 0 0 0 0 0 0 0 0 0 0 0 
##$SW_h= 40650.406504065
##$TD= 32768
##$TD0= 1
##$TE= 0
##$TE2= 300
##$TE3= 300
##$TEG= 300
##$TL= (0..7)
0 120 53 12 22 120 120 120 
##$TP= (0..7)
150 150 150 150 150 150 150 150 
##$TP07= 0
##$TPNAME0= <>
##$TPNAME1= <>
##$TPNAME2= <>
##$TPNAME3= <>
##$TPNAME4= <>
##$TPNAME5= <>
##$TPNAME6= <>
##$TPNAME7= <>
##$TPOAL= (0..7)
0.5 0.5 0.5 0.5 0.5 0.5 0.5 0.5 
##$TPOFFS= (0..7)
0 0 0 0 0 0 0 0 
##$TUNHIN= 0
##$TUNHOUT= 0
##$TUNXOUT= 0
##$USERA1= <user>
##$USERA2= <user>
##$USERA3= <user>
##$USERA4= <user>
##$USERA5= <user>
##$V9= 5
##$VALIST= <valist>
##$VCLIST= <CCCCCCCCCCCCCCC>
##$VD= 0
##$VDLIST= <DDDDDDDDDDDDDDD>
##$VPLIST= <PPPPPPPPPPPPPPP>
##$VTLIST= <TTTTTTTTTTTTTTT>
##$WBST= 1024
##$WBSW= 4
##$XGAIN= (0..3)
0 0 0 0 
##$XL= 0
##$YL= 0
##$YMAX_a= 4820
##$YMIN_a= -4665
##$ZGOPTNS= <>
##$ZL1= 120
##$ZL2= 120
##$ZL3= 120
##$ZL4= 120
##$ABSF1= 248.5645
##$ABSF2= -253.2056
##$ABSG= 5
##$ABSL= 3
##$ALPHA= 0
##$AQORDER= 0
##$ASSFAC= 0
##$ASSFACI= 0
##$ASSFACX= 0
##$ASSWID= 0
##$AUNMP= <proc_1d>
##$AZFE= 0.1
##$AZFW= 0.5
##$BCFW= 0
##$BC_mod= 2
##$BYTORDP= 0
##$COROFFS= 0
##$CY= -3
##$DATMOD= 1
##$DC= 0
##$DFILT= <>
##$DTYPP= 0
##$F1P= 0
##$F2P= 0
##$FCOR= 1
##$FTSIZE= 65536
##$FT_mod= 6
##$GAMMA= 0
##$GB= 0
##$INTBC= 1
##$INTSCL= 6.047779e-11
##$ISEN= 30
##$LB= 1
##$LEV0= 0
##$LPBIN= 0
##$MAXI= 10000
##$MC2= 0
##$MEAN= 0
##$ME_mod= 0
##$MI= 50
##$NCOEF= 0
##$NC_proc= -10
##$NLEV= 6
##$NOISF1= 182.463
##$NOISF2= 159.3651
##$NSP= 0
##$NTH_PI= 0
##$NZP= 0
##$OFFSET= 248.5645
##$PC= 4
##$PHC0= -11109.34
##$PHC1= 455.8112
##$PH_mod= 1
##$PKNL= yes
##$PPARMOD= 0
##$PSCAL= 0
##$PSIGN= 0
##$REVERSE= no
##$SF= 81.0140089999694
##$SI= 65536
##$SIGF1= 159.3651
##$SIGF2= -187.1042
##$SINO= 113.3802
##$SIOLD= 16384
##$SREGLST= <1H.CDCl3>
##$SSB= 0
##$STSI= 65536
##$STSR= 0
##$SW_p= 40650.406504065
##$SYMM= 0
##$S_DEV= 0
##$TDeff= 32768
##$TDoff= 0
##$TI= <>
##$TILT= no
##$TM1= 0
##$TM2= 0
##$TOPLEV= 0
##$USERP1= <user>
##$USERP2= <user>
##$USERP3= <user>
##$USERP4= <user>
##$USERP5= <user>
##$WDW= 1
##$XDIM= 65536
##$YMAX_p= 460932335
##$YMIN_p= -333708776
$$ End of Bruker specific parameters
$$ ---------------------------------
##NTUPLES= NMR SPECTRUM
##VAR_NAME=  FREQUENCY,     SPECTRUM/REAL,   SPECTRUM/IMAG
##SYMBOL=    X,             R,               I
##VAR_TYPE=  INDEPENDENT,   DEPENDENT,       DEPENDENT
##VAR_FORM=  AFFN,          ASDF,            ASDF
##VAR_DIM=   65536,         65536,           65536
##UNITS=     HZ,            ARBITRARY UNITS, ARBITRARY UNITS
##FACTOR=    0.620285442955139, 1,           1
##FIRST=     20137.2065510682, 0,            0
##LAST=      -20513.1999529968, 0,           0
##MIN=       -20513.1999529968, -333708776,  0
##MAX=       20137.2065510682, 460932335,    0
$$ Real data points
##PAGE= N=1
##DATA TABLE= (X++(R..R)), XYDATA
$$ [...]
14008 37203717 46429214 39440390 12650409 -5281612 3997941 19928574 20019579 14515716
14000 14515716 15524150 5558847 -24788236 -40065484 -8783031 36577734 41490977
13993 41490977 12090471 -902383 12343650 12868454 -13121407 -34414886 -35211583 -37417074
13985 -37417074 -49897371 -48395403 -22373532 5839943 24555552 48745260 76823056
13978 76823056 80810806 60527204 57784755 88860495 110207853 85516772 43307273
13971 43307273 26984515 25373180 1377506 -36547835 -43479693 -8204559 30655122
13964 30655122 39015388 23909097 11370085 11983139 15300813 6891288 -12044618 -21939125
13956 -21939125 -10209248 4469620 -5574319 -31286804 -34779872 -9679988 3961847
13949 3961847 -17982621 -44855412 -40848071 -17883364 -6082324 -3501245 5913900 11212378
13941 11212378 -5533899 -28365588 -30469845 -21978563 -29768221 -42429455 -24038729
13934 -24038729 22546510 54182953 50111350 31417509 14909560 -7012364 -32107995
13927 -32107995 -38328370 -23134524 -14137728 -23688744 -28034736 -9591836 13505647 20091392
13919 20091392 16828038 14497959 3554621 -20756190 -35475889 -21729178 1184687
13912 1184687 3361633 -10706518 -15267370 -8294852 -10223698 -23750939 -27821961 -14317815
13904 -14317815 -2577253 -8374421 -19153667 -12291402 13856084 37951806 40370376
13897 40370376 23952707 9955140 12787619 20282186 7322930 -28164529 -55305403
13890 -55305403 -46227714 -11442676 14470458 15166193 4774192 1757263 7244740 10882955
13882 10882955 5532603 -6615547 -14676145 -7236559 11670779 19597729 1510092 -25456385
13874 -25456385 -29626550 -6239021 17234146 19691391 10151547 5401467 4042007 -3156793
13866 -3156793 -12863640 -16623348 -18081298 -25312703 -33873620 -35296119 -35784727 -45951301
13858 -45951301 -55454923 -41667626 -7044983 15110203 2046588 -29972316 -50945924
13851 -50945924 -54490308 -53971775 -53915322 -44947789 -22962028 2671412 19489084 20807326
13843 20807326 8387003 -4569750 -554714 20563360 36259369 32143126 25599920
13836 25599920 36521171 46582256 21931570 -25582283 -40923618 -2642448 41804017
13829 41804017 42933263 18021813 16225151 38540666 39149053 534872 -38454548 -39388660
13821 -39388660 -13586818 1444946 -10927866 -39442070 -64383667 -67608228 -40420891
13814 -40420891 1378128 23927142 12936930 -7299825 -7879317 6060762 11085239
13807 11085239 7025514 14410178 33604690 36950996 10194955 -23074464 -33454923
13800 -33454923 -24075010 -18788475 -24970760 -29807226 -28083414 -30629786 -42258180 -51721790
13792 -51721790 -52332788 -55123202 -67512270 -72735517 -50569220 -12092617 8899451 938783
13784 938783 -10596660 -2781249 11044921 3548375 -24046318 -43359664 -38645798 -24739444
13776 -24739444 -22783321 -34827582 -48591965 -54216352 -48264803 -31123659 -9787780
13769 -9787780 2892126 522090 -8122608 -8963884 1148629 13291529 19351868 20367560
13761 20367560 21827629 24754709 23884303 14905085 2478127 -2143706 6221319 19865923
13753 19865923 28502687 32497221 38019664 41545334 30675120 3071797 -25579947 -37948896
13745 -37948896 -31977654 -16805181 -100220 13627946 19143995 13839746 1719146
13738 1719146 -12092035 -26550166 -38565330 -37816741 -16886406 16689069 46756232
13731 46756232 63762067 65816176 50292226 17614848 -17953475 -35491531 -28588114
13724 -28588114 -8819384 12769502 33753708 47159028 38831159 9441447 -16496726
13717 -16496726 -20192828 -15261119 -24606619 -39676343 -29621489 9017876 40378020
13710 40378020 36586767 11842715 -6019893 -14867697 -26818004 -36015390 -27073044 -6215914
13702 -6215914 6075408 10277623 25733476 52130165 63872803 49977028 30278947
13695 30278947 21566839 17126638 13803506 27384063 59443125 79782312 70977260 62305893
13687 62305893 83088182 107107949 89240543 40898838 16233823 28371028 35035273
13680 35035273 13416557 -7865133 -9901516 -20547733 -57042098 -79444787 -46887552
13673 -46887552 13287524 41464601 28402217 12635724 9907256 -1844543 -27995742
13666 -27995742 -37685610 -11269459 30104758 56686282 62394897 53094758 31813041
13659 31813041 10851042 12469602 38896224 62414906 63605067 60192569 76367590
13652 76367590 99093779 91766694 46528911 -1289697 -15412110 618387 12482424
13645 12482424 -3154498 -33656063 -46956406 -29200013 -645888 9088967 -4063268
13638 -4063268 -17760951 -14707312 -1695573 6318374 8777520 16731640 32985695 43885469
13630 43885469 32599577 -192159 -30043511 -29458229 710343 29100989 31780653
13623 31780653 20802866 18941437 19129240 -1997516 -35027112 -40031695 -7798156 18184196
13615 18184196 3385637 -25449968 -21137061 14618701 41268832 44737308 49532164
13608 49532164 67246669 76013396 62737504 49130014 55382758 65820467 55449413
13601 55449413 31007404 18409032 20619059 15474624 -7207240 -30588390 -36260626
13594 -36260626 -25172252 -6828719 15237298 36465458 43077367 26749143 2564762
13587 2564762 -3087618 15592687 35788433 34193772 12619149 -11801090 -31560238
13580 -31560238 -49869146 -61713685 -52491442 -20723383 12930221 29322337 32518507
13573 32518507 36285229 38654375 26303933 219652 -20675878 -23933091 -17184471 -12511564
13565 -12511564 -9665862 -2436674 7388986 11677796 8064051 4756490 14445565 42865840
13557 42865840 77599624 90231909 62161386 11841979 -17364290 -5449945 19831732
13550 19831732 19150623 -7695116 -24579413 -8965128 19760832 26736568 2899484
13543 2899484 -28757780 -41324465 -30235322 -12508503 -4494536 -4010112 2252116 16059516
13535 16059516 23144591 15951779 8173248 14972874 30046291 38996261 45112238 58434986
13527 58434986 66332444 46352546 9469551 -5727780 6673152 4066437 -36290146
13520 -36290146 -70298625 -47613242 8278748 30194163 3252867 -23923545 -22619059
13513 -22619059 -20037817 -36432830 -42590955 -13981046 16868962 7069373 -26473935
13506 -26473935 -31982389 -2281645 19207647 8762203 -6990126 902184 23396167
13499 23396167 37275682 39844325 39914923 35350507 21627351 10358974 17493526 36389270
13491 36389270 40799932 19168347 -5600874 -534132 35764654 67433976 64126127
13484 64126127 39167654 28769646 38983203 39227301 13242163 -13856047 -16266043
13477 -16266043 -6292093 -5512469 -2609831 23106955 53887650 53063935 24909095 9860989
13469 9860989 19838131 24337253 8281741 -3304057 5476239 12658941 3507163 3362062
13461 3362062 33115267 65905473 65788568 43879633 36594645 46538414 45219691 23342416
13453 23342416 -636984 -17229403 -34462102 -48782124 -41012111 -9619063 16772319
13446 16772319 10306655 -26847923 -67532471 -82407082 -60534841 -20975946 175054
13439 175054 -11915018 -32073571 -29547439 -10666204 -5867715 -22548391 -36796314 -29486007
13431 -29486007 -5032473 26357129 59165623 80108186 69959976 30176176 -8338776
13424 -8338776 -15268544 8184284 34227507 37519354 16472123 -8888940 -19312803
13417 -19312803 -17303553 -18701574 -23134832 -11556731 17408782 32525802 12630156
13410 12630156 -17064273 -20775419 -7125263 -12081399 -37782695 -49930771 -35274581
13403 -35274581 -20633238 -27240438 -42646823 -49335026 -49086363 -46471630 -37699676 -28668857
13395 -28668857 -35640520 -54233623 -55436288 -27860927 2027727 8104443 -1358259 -4489840
13387 -4489840 1946118 7612456 5356975 -10628834 -41263022 -65632629 -54613436 -15277655
13379 -15277655 9104556 1162383 -3588771 22402170 47904433 31651013 -8057367
13372 -8057367 -20573314 -1802270 5580096 -14333623 -27306522 -7495249 22819660
13365 22819660 29202189 10704113 -8617618 -12928650 -3079331 13647718 28182059
13358 28182059 32366930 26288629 18492777 16292630 20745759 28701579 31699307 18051585
13350 18051585 -10589341 -28056108 -6393715 46940762 89218501 86925804 50759681
13343 50759681 19334644 14859179 24136851 22740525 7979496 -2382121 -2015504 -8797257
13335 -8797257 -33661833 -52886998 -36157738 5506273 30471705 24918144 16220710
13328 16220710 21219182 20054538 -118506 -13219375 4628183 32957714 40035649
13321 40035649 32342691 33568345 36471809 18844473 -7506694 -9593074 11525911 22276298
13313 22276298 11430766 798466 -211700 -7140114 -20660742 -17227534 6530735
13306 6530735 19023985 2155961 -19137399 -17244959 -2568976 18222 -8579253 -10634991
13298 -10634991 -3684181 848708 301232 1392216 5013694 6246838 4302358 1189443
13290 1189443 -3508440 -7981894 -5670397 4694722 13345026 10458174 -2397459 -14846077
13282 -14846077 -15744958 748688 27889777 46203464 41350408 20689823 1847303
13275 1847303 -9569103 -17205794 -17909586 -8999623 -4321038 -17970917 -36810128 -37244809
13267 -37244809 -25751351 -29702137 -48368912 -51635240 -33457168 -24645083 -38407262
13260 -38407262 -46134056 -30054434 -17946003 -33085943 -47808761 -29512055 -3385735
13253 -3385735 -18261799 -65286254 -83237931 -44722158 9014119 28165996 10824407
13246 10824407 -14646392 -31336580 -37697532 -32300680 -17400033 -6781600 -11742382
13239 -11742382 -23790450 -24521798 -10365019 3734506 5678432 804113 -110852 962082
13231 962082 -5065140 -13226203 -6386295 14893493 23631598 5341282 -10952619 10852632
13223 10852632 55215347 68422376 33428665 -5671508 -6867174 16355902 25780759
13216 25780759 13294855 -1885302 -8540002 -7294527 4684612 24781433 32787943
13209 32787943 14417675 -12405998 -19719691 -8828645 -1698396 -1349511 9741951 33225079
13201 33225079 44621428 24897324 -16773868 -55016326 -67868808 -45622765 1850365
13194 1850365 44490787 53947115 29813977 -4203429 -27055432 -33679028 -28638661 -20283787
13186 -20283787 -16469197 -14143041 -404590 23823575 32709681 6414094 -36204771
13179 -36204771 -57037540 -45102853 -22464857 -8761696 -3316039 -2265961 -10299237
13172 -10299237 -28674594 -46459128 -49702026 -32844935 -3712028 16394255 7642048
13165 7642048 -21779518 -36427466 -16431430 14049912 20744053 7372295 4706107
13158 4706107 22865132 43072208 50191016 45408253 31599441 13617148 7718670 22051897
13150 22051897 33984536 18434004 -7902448 -7732622 15426807 20197938 -5214768
13143 -5214768 -24635402 -15082092 -1511487 -10151567 -27238086 -29810369 -23043681 -18905107
13135 -18905107 -8108260 16256806 33256206 24517095 8959134 14382514 30859457
13128 30859457 25402211 -7880686 -42756790 -58094655 -52093077 -26114909 16553300
13121 16553300 56717520 69709903 53767817 30712060 17773896 14180239 14119819 15790121
13113 15790121 15433522 6203083 -12607153 -31848849 -38588371 -23560512 10582366 43437708
13105 43437708 49231328 24447410 -4211611 -7734668 16174749 47340728 65892964
13098 65892964 64332076 48705038 34938180 32094317 25231869 -6892879 -51420662
13091 -51420662 -64877324 -32359298 3604690 -1606522 -32381660 -37327996 -1854124
13084 -1854124 37698695 47283976 31251690 13945866 10169623 17128197 18019172 -4895658
13076 -4895658 -44918919 -66182251 -44661210 -5004834 8813658 -8296893 -23709487
13069 -23709487 -21164260 -17698227 -24061532 -26197259 -18004704 -17350847 -30491237 -31697861
13061 -31697861 -4038255 24123783 14339902 -25017220 -48360266 -32950489 185187
13054 185187 25303586 42807523 61361379 73146566 66457682 51031046 48992552 61134949
13046 61134949 61649952 34573100 213157 -9984069 4305697 15317613 10014618
13039 10014618 5805902 16534235 26709741 16510739 -5725220 -17866233 -18658217
13032 -18658217 -23908213 -34803138 -35565424 -22646626 -12934013 -17858013 -27740260 -28219644
13024 -28219644 -18317448 -7086051 -2919376 -7913883 -13284561 -3546526 21896489 37260966
13016 37260966 19521617 -14518596 -23462226 5224612 40650892 51445721 38853566
13009 38853566 19858831 3027764 -6075284 906195 17921387 20298773 -3638442
13002 -3638442 -31727482 -36689255 -22039501 -10555586 -9268579 -7307269 -483623 4102319
12994 4102319 5566696 12391967 27173118 42439751 52514413 58282693 60206792 56148531
12986 56148531 45833413 30841744 13328342 358058 2000939 16351458 25129253
12979 25129253 16225049 2464189 3126527 14015649 14641119 1803985 -5148491 4826022
12971 4826022 18273854 18915083 7863926 -7840033 -29912645 -55567743 -62153099 -29086877
12963 -29086877 24966628 49930486 20826664 -28860211 -46839847 -25731906 -5612937
12956 -5612937 -14639364 -33929552 -33622593 -19519002 -18474460 -31369272 -32414043 -13518975
12948 -13518975 1972131 -2970860 -15800260 -21453226 -26281410 -36116216 -33727504 -4366547
12940 -4366547 31289868 38182115 14107762 -9748123 -12230427 -1530003 8614514
12933 8614514 17028010 23813529 22189999 10660252 -2275749 -12934464 -27217293 -43413735
12925 -43413735 -46464352 -30881852 -15263852 -18022826 -27846275 -17429572 15050208
12918 15050208 37584790 24987237 -6677323 -20849779 -8520600 3791683 -3247411
12911 -3247411 -12244104 2366238 31994195 45082106 34257020 22910366 21866310
12904 21866310 11458648 -19378425 -46331945 -46152081 -36233903 -47166294 -71115298
12897 -71115298 -70948110 -34316846 12073928 39897623 43204110 26851851 -907094
12890 -907094 -23428933 -29199633 -30122932 -40483598 -42509497 -7891484 46807806 68428865
12882 68428865 40368130 4998274 -3410949 -4447837 -24410393 -45653873 -40178651
12875 -40178651 -19414751 -7051695 10790477 58850573 113052535 119919619 72045819
12868 72045819 17435311 -8776104 -19229571 -35220405 -53696634 -65345891 -70916114
12861 -70916114 -66427522 -42584628 -10746878 444779 -13538691 -25037285 -19451787
12854 -19451787 -15165807 -22284637 -18556737 7488821 23820441 1773553 -29242106
12847 -29242106 -15663498 43725047 94178365 94408059 56965975 20374043 10462801
12840 10462801 30391704 61703633 71535301 41992998 -4400585 -28734859 -24215802
12833 -24215802 -16938756 -19592227 -15358339 4612056 18724241 7063700 -17338056
12826 -17338056 -29295827 -27183764 -28455163 -40590615 -53999433 -57128655 -45725686
12819 -45725686 -23663468 -4476563 -3780398 -20918268 -37469214 -42083798 -43951143 -51284335
12811 -51284335 -52413280 -35034229 -10855600 -478658 -3218631 -4057713 -3712922 -16336970
12803 -16336970 -37745548 -41164067 -11828178 32417525 62251378 64384525 43770104
12796 43770104 14414162 -5577124 -4994457 5771204 3249090 -18219433 -36255255
12789 -36255255 -29574228 -5744555 10217616 5516742 -12414472 -29924044 -38822844
12782 -38822844 -38755336 -35760219 -35299587 -33602901 -22498569 -4568059 7205578 7946483
12774 7946483 5549748 2452898 -9394010 -25898787 -23461931 8216366 42776781 48636142
12766 48636142 30839334 17014961 12248760 -2370699 -30158755 -49084369 -45370056
12759 -45370056 -29306089 -11665940 8804416 26203195 23638719 1822414 -14147535
12752 -14147535 -12259040 -12258129 -27493741 -35125035 -12998317 15939266 12451347 -18532457
12744 -18532457 -35187878 -22446753 -8891498 -15551074 -26209035 -22320205 -13391665
12737 -13391665 -11788001 -5521719 17483290 38880454 33237142 9328949 -1169317
12730 -1169317 9933994 20458108 16397219 10187589 15039736 24082613 24563355 15310951
12722 15310951 544615 -19085694 -40050640 -53321229 -56398522 -55416791 -48906691 -26888536
12714 -26888536 3254257 11276840 -14497304 -37296358 -13241767 44414153 74642526
12707 74642526 45143243 -10975639 -45037342 -50182445 -49736141 -51936148 -44597827 -24525526
12699 -24525526 -5165978 4196762 6327587 2581238 -9855996 -24756714 -28439960 -20281702
12691 -20281702 -16892762 -28610920 -44417884 -48793515 -43030288 -39902207 -45006968 -53573308
12683 -53573308 -59936300 -59672943 -46753683 -20949713 2845757 6402948 -5855905 -5132720
12675 -5132720 25710010 61767741 59221393 10668830 -40920869 -53914100 -36349199
12668 -36349199 -23014191 -19125012 -358177 32509219 39897086 2394532 -41131997
12661 -41131997 -44259237 -16096124 2192859 4216643 18015666 48242499 66343234
12654 66343234 61482433 56308504 61858132 59811690 45367082 45085753 68551452 81659397
12646 81659397 57902183 21605518 6508979 2943158 -15545358 -40996690 -49323656
12639 -49323656 -46337404 -49100215 -41249172 341631 47037161 44788571 -2005916 -29986134
12631 -29986134 -7576911 28691528 42438854 47065472 62876597 74391925 63871050
12624 63871050 47801742 44272888 36191412 3323485 -35417162 -48186190 -38145624
12617 -38145624 -30951445 -31821801 -27978962 -18884395 -12338510 -3320244 14008344 26948718
12609 26948718 25771012 28355427 50996910 71365198 59083555 30030562 26039195
12602 26039195 46562602 47622740 11977857 -25418175 -33312287 -23996550 -20041011 -17471767
12594 -17471767 -4591128 10422127 13429282 5181468 -9519491 -32774125 -56626954
12587 -56626954 -57051700 -26115469 7338107 11038693 -9985410 -26459258 -27057677 -26359812
12579 -26359812 -37840434 -58214682 -75420500 -77743805 -58846930 -26092816 268386
12572 268386 6874408 1607503 -356646 2699327 2565225 -2363139 -6478778 -7656946
12564 -7656946 -6983548 -1912859 9430523 20029398 19904709 9111109 -1895432 -3105984
12556 -3105984 7922792 25701814 39516952 40699837 29639850 11396839 -13012134
12549 -13012134 -40769368 -56398629 -44884141 -17427794 -3576198 -11953690 -21045999
12542 -21045999 -17568909 -17423855 -32138016 -41438389 -24914722 597754 6250315 -1389607
12534 -1389607 8181511 38797830 62260184 61408333 46942175 29531497 5448172 -22917610
12526 -22917610 -37776039 -27727094 -2501329 18874982 21478814 141603 -29136753
12519 -29136753 -30263214 13750018 67234367 79754641 56270410 50589187 82431120
12512 82431120 105183437 76931727 23929436 1393140 19691953 44546502 51230196
12505 51230196 43257102 28085545 7290706 -11444768 -17380233 -11357130 -1193731
12498 -1193731 11792026 26951887 34980756 31178367 27473721 34243415 42469321 41949200
12490 41949200 41955583 51871049 57784948 45572955 31883978 39597113 54667226 44868509
12482 44868509 14794113 1940048 18183752 35342260 33855866 26021324 21061965
12475 21061965 6155238 -22326486 -43827031 -47363101 -48118792 -53327918 -45299147 -18445617
12467 -18445617 1783277 1902068 7188505 34529821 52945128 31117250 -4550840
12460 -4550840 -6414055 20412344 31406319 17735771 13812425 31448053 40843419 27119632
12452 27119632 15579933 21700323 20650037 -6111054 -30391137 -17021171 20654531
12445 20654531 38717098 21217347 -9186703 -29427034 -36709233 -34729267 -24108110
12438 -24108110 -9309753 1583277 6535959 8222862 4970816 -4960576 -11754498 -208109
12430 -208109 29463781 56323518 58710198 35641992 6348334 -9482900 -9855898 -7774509
12422 -7774509 -9917347 -4904305 17776954 42890495 41972197 13695257 -8737844 -1908024
12414 -1908024 14979391 10842910 -7810791 -5681566 25271054 47406052 27369005
12407 27369005 -15320723 -30220021 -251666 36264840 33583855 -5698314 -36475795
12400 -36475795 -27580099 4392179 22082490 12369449 -8658804 -24548215 -32801237
12393 -32801237 -33121922 -21473243 -848888 16810303 24964327 26812647 22536223 7042336
12385 7042336 -14872467 -26964265 -22271780 -10621782 1030529 18215206 39920209
12378 39920209 49548458 38675194 21583317 10180472 -6210743 -34834257 -51807060
12371 -51807060 -29665856 17379007 45793166 37496219 15597571 6206999 10996550
12364 10996550 20759214 30943708 35592420 25628770 2368770 -20607956 -33452515
12357 -33452515 -35844636 -27918250 -11750870 -88271 -3154167 -6916119 12003438 47354898
12349 47354898 65602969 53706497 36120952 32277729 27345892 6334344 -9934381
12342 -9934381 6371516 42518615 60231037 50899102 42267538 48822352 48531300 22518423
12334 22518423 -7332826 -3566630 34400512 65677237 57376270 21480135 -6289085
12327 -6289085 -11600177 -9058265 -9266282 -1145375 22913584 43216226 34842376 4745471
12319 4745471 -15781778 -13742508 -7490917 -14768343 -29391936 -37123062 -35978981 -30918271
12311 -30918271 -23488767 -16197926 -14159547 -15173714 -11814068 -8355750 -17780927 -35560087
12303 -35560087 -38528133 -20954676 -7798849 -15698252 -25647292 -17875334 -10314314 -30074112
12295 -30074112 -63298273 -71261111 -49335952 -31424562 -34684523 -37893884 -24606295
12288 -24606295 -12981414 -23689240 -44170060 -47578936 -30780400 -12373075 -3629721
12281 -3629721 -387938 2542728 5213230 7748724 9919340 9007867 7540358 16927006
12273 16927006 41336646 63262553 60343880 35640461 15696019 15218758 18987266 8060135
12265 8060135 -8407620 -3466127 28696452 59857790 58757001 24993522 -14209624
12258 -14209624 -33525287 -28904660 -14361973 -8656156 -20829782 -39603399 -40830607
12251 -40830607 -15936798 10627570 5848867 -30471343 -63377158 -64229473 -39936438
12244 -39936438 -16161816 -6878793 -10007821 -20496105 -34566020 -46739136 -52142628
12237 -52142628 -48646945 -33341322 -4731889 27334733 43555586 33503580 5626679
12230 5626679 -23037552 -37964814 -29636511 -1905587 20403468 13320216 -11227188
12223 -11227188 -15800530 8566307 27078825 15059264 -4462406 -2404196 7520478
12216 7520478 -1727798 -15592395 1892479 43697732 62623367 39950806 9399968
12209 9399968 4652651 19638266 32871305 39365763 43167228 42941827 38920058 35313500
12201 35313500 28120764 10332438 -6892141 -2297119 21884527 40991030 47286340
12194 47286340 57348399 72282155 66408468 32386816 3379541 6455042 23277707
12187 23277707 23948710 13094864 10584394 8776558 -13243680 -44699271 -49966204 -19547841
12179 -19547841 15791499 25472089 11032448 -6450337 -12727192 -8613851 -3582415 -5766116
12171 -5766116 -14128823 -21843903 -27813556 -35669007 -40294778 -31414975 -15424876 -12891216
12163 -12891216 -24132564 -20858534 10633796 40620252 33913812 -1249464 -27511014
12156 -27511014 -26624854 -8167745 14869500 31132801 25415896 -529861 -12972272
12149 -12972272 14053615 52590626 51618666 9701549 -23423901 -19435860 -3276273
12142 -3276273 -2406142 -5507628 7902364 30009402 41541367 41221250 34491842 13802533
12134 13802533 -24265330 -57633751 -60771133 -39831664 -22835144 -19579238 -13355434
12127 -13355434 6331464 22135864 9592813 -28864824 -61231312 -59920012 -32993918
12120 -32993918 -12428191 -11311805 -8179251 16464364 45552297 48905448 29389614
12113 29389614 16961361 20688222 18601637 -406622 -15989145 -9051706 11853046
12106 11853046 30401796 44324888 52769671 45864921 24280635 7332256 3397388
12099 3397388 -5862478 -31199909 -48124802 -30350088 5983482 20683655 2254643
12092 2254643 -23811948 -32164739 -19444944 4277075 23546522 22936887 4778808 -5771613
12084 -5771613 7126823 23502348 15922693 -7850870 -18551929 -11176873 -4023824 1075682
12076 1075682 19297893 43200629 43162690 17562286 4943649 28409432 59713950 61064566
12068 61064566 37230241 21169375 26160804 37023138 37563523 25415205 6468225
12061 6468225 -9389206 -13050239 -8191444 -10459272 -25685744 -40325523 -42923178 -40522526
12053 -40522526 -41187845 -35622851 -13325199 14814025 27956450 20621250 851711 -26634537
12045 -26634537 -57286367 -75583274 -68196268 -45371981 -31625246 -36530652 -48389373
12038 -48389373 -52848198 -44111853 -23447819 -1770765 2495927 -15085076 -31848003
12031 -31848003 -24786471 -3727760 4112249 -3046824 -1584035 14591013 21178407 2274426
12023 2274426 -24557757 -35577232 -30769059 -20564063 -3330009 22433677 38052318
12016 38052318 22518577 -12978228 -29826151 -5527657 40375253 68382368 59249630
12009 59249630 28410486 4999176 1292903 4723131 -1030366 -13724059 -17891445 -7599417
12001 -7599417 7447500 17679619 23154739 25262498 21142179 10673461 -1245909 -12927720
11993 -12927720 -26064370 -35532820 -32122880 -19140244 -11916383 -15731718 -19945782 -20190467
11985 -20190467 -27057641 -41384038 -41228471 -12343308 23724501 34029576 16937644
11978 16937644 -1261927 -5351411 -3638378 -3656050 1643170 18543135 39523014 51649089
11970 51649089 49504790 39227560 36453053 54555415 84311183 93098201 59728114
11963 59728114 3909573 -36072270 -48801537 -52513957 -58237813 -57004759 -45383876
11956 -45383876 -36010714 -33878733 -26427325 -9049177 2074797 -2164760 -3810211 14401711
11948 14401711 37634793 39084801 21744557 14448839 27641738 37228608 20300867
11941 20300867 -10211493 -19997924 4124339 38303612 49532620 31324212 5376001
11934 5376001 -8156671 -10589130 -11993686 -12618684 -9776991 -12538816 -29057355 -43014771
11926 -43014771 -27395758 13137834 37939099 21683703 -9889553 -13541272 17009879
11919 17009879 50820497 63730183 59490213 50363224 39765670 29043779 24025336
11912 24025336 25922604 25790065 15675102 -464477 -12088125 -13994928 -8573400 1419929
11904 1419929 17965670 43193420 69009127 75436210 47752279 -2551392 -42579640
11897 -42579640 -50051907 -34722873 -22462266 -25442870 -36171447 -43653823 -43310182 -34149582
11889 -34149582 -18743147 -6573067 -6733467 -14893350 -16172833 -4204481 9890709 11933220
11881 11933220 3079572 -1524689 8852958 27706256 39043464 36654505 30771298 31863689
11873 31863689 33049427 18622086 -10745438 -34058136 -35795428 -23999828 -15427334
11866 -15427334 -13890704 -13583982 -14140121 -19299886 -26596845 -30150291 -28457725 -19520003
11858 -19520003 2747981 33762199 50618246 39162472 21111723 29331972 58631669
11851 58631669 69346148 43738684 9104284 -5880466 -7221204 -9092003 -1480821
11844 -1480821 24008923 37981682 4970926 -54863031 -78561268 -42530686 5912801
11837 5912801 15157580 -7123344 -22884973 -26927833 -42715332 -69580017 -77488490 -57601565
11829 -57601565 -40466612 -49923262 -68430399 -67376762 -48271017 -30236667 -14389813
11822 -14389813 11149392 40137705 51488345 43104063 36181520 41010414 41888662 25356566
11814 25356566 3529639 -3709499 5160679 18858607 33239274 50196059 63928659
11807 63928659 64175663 51403570 36176872 23264508 7605930 -11044484 -19246998
11800 -19246998 -3635994 29407402 56258103 61638003 55178694 53565736 50684510 23669964
11792 23669964 -25242341 -54375536 -30953575 19520370 39816142 12618984 -23656697
11785 -23656697 -32745934 -22577025 -18179957 -22231947 -23034127 -20441796 -21363731 -23488109
11777 -23488109 -22655804 -24131566 -29937145 -28651380 -14387808 -496977 3198515 8009852
11769 8009852 19156295 12637417 -28446812 -71336741 -67527092 -22456125 9733236
11762 9733236 1601110 -18353144 -18633775 -5323547 6351687 22851158 49486299 66197762
11754 66197762 55192917 32444014 23737697 24996222 14656941 -5647977 -12568974
11747 -12568974 280379 12145539 6471715 -9223016 -20311864 -24282294 -25242453 -22876466
11739 -22876466 -17043932 -15319652 -25297038 -41415549 -47985594 -37737521 -21819915 -16080412
11731 -16080412 -21021249 -25009993 -27193883 -41281607 -66920055 -74371424 -39923364 12464815
11723 12464815 33074116 9983384 -18852235 -23655158 -20414938 -32742679 -46531291
11716 -46531291 -33056093 1440211 23091697 19108670 7455313 736870 -7915433
11709 -7915433 -19030994 -17032724 2016489 16878463 10857574 -2384241 1046809 21621840
11701 21621840 38567350 37624974 22528358 4243838 -7902717 -6486948 11121206
11694 11121206 37991676 60560722 66661821 51002973 19436140 -9719780 -18129556
11687 -18129556 -7787000 -474840 -9272029 -19851669 -10743595 16263907 39412813
11680 39412813 44546718 35130156 19995554 7423243 7731973 22901031 34392963 21774885
11672 21774885 -4427340 -10730991 12517803 35907413 33255230 15166128 3956024
11665 3956024 -1415099 -11338809 -15662065 1521281 27502671 32975880 15662872 2988555
11657 2988555 10075734 22016813 21985297 11894616 -1094215 -15446051 -25315912 -21638107
11649 -21638107 -11532321 -15983494 -38986660 -58427378 -56930169 -42472780 -28198995
11642 -28198995 -11002341 16833625 49357600 71153691 69399687 40039053 -1988389
11635 -1988389 -21628999 1248203 36318493 35185099 1397950 -13686842 5980667
11628 5980667 13685771 -19956933 -52633792 -38140126 -3386019 -2925590 -28785047 -26461317
11620 -26461317 16913180 59604365 72818757 67210074 55104446 37227750 27375898
11613 27375898 42074421 63063740 55483201 25659554 15078227 33955071 48397489
11606 48397489 39438086 26432493 22561346 15451994 4964670 13596509 43996765 69442628
11598 69442628 79165301 87895841 90138981 58424630 2916808 -25474009 -14721831
11591 -14721831 -13563622 -42813418 -49616488 3913493 66523291 70838558 31220535
11584 31220535 4783130 -3401432 -25214047 -51164451 -43590563 -11980205 -2247432
11577 -2247432 -17392655 -17203174 4334767 9066440 -11396478 -16784402 11635104 40636330
11569 40636330 45081995 45451516 61107507 73780230 66069664 55259404 58418286 59504251
11561 59504251 43344787 31142977 45937817 65855046 50306492 849751 -39502838
11554 -39502838 -45166860 -36547324 -44594949 -68385839 -79677859 -61035722 -28440890
11547 -28440890 -12720643 -22316382 -33963708 -24880787 -2952631 7485144 682706
11540 682706 -7695792 -8080251 -7303779 -11398041 -16871608 -21918286 -30456677 -42432886
11532 -42432886 -53270021 -61949514 -65602163 -51407372 -14489658 19668282 16804774
11525 16804774 -19172382 -46613906 -40491867 -21039026 -17035546 -25444910 -26191149 -18792457
11517 -18792457 -21244196 -39507037 -57251663 -56747334 -38960758 -20371768 -14657971 -20439273
11509 -20439273 -27559512 -31522738 -33085907 -25011724 2770478 37387660 44827174 15581261
11501 15581261 -13279864 -8455140 7392626 -9246375 -49987460 -63605561 -34910783
11494 -34910783 -4518960 -1070164 -3221085 11018250 22820151 10150596 -10544750
11487 -10544750 -14657340 -11631468 -20394830 -26857402 -6172646 27740089 34926381 5836140
11479 5836140 -29145404 -44267600 -42499771 -35955206 -30486983 -31730960 -40991625 -41249966
11471 -41249966 -10737710 42682523 80340687 75093600 41346312 15447316 16094156
11464 16094156 29849429 29185826 1631206 -35690737 -52671204 -40564874 -21785808
11457 -21785808 -18445533 -22988250 -14174210 8460276 26219586 31325930 32493576 31126934
11449 31126934 16041292 -12097277 -32801844 -33179415 -26041798 -28131798 -35569121 -36613156
11441 -36613156 -35950857 -45090283 -54334480 -38763814 2393315 33162138 22318877 -14363475
11433 -14363475 -31239357 -8490933 26902528 38263998 20579789 -3216792 -12578190
11426 -12578190 -2506768 22841894 52043192 66354783 55565884 34037892 25109756
11419 25109756 28610954 21445412 -5188056 -28275306 -23967464 -1102423 11744050
11412 11744050 3906923 -9043470 -11786012 -8703885 -12898996 -25585831 -33914870 -26968852
11404 -26968852 -7779202 12778941 29051554 40640202 42756015 30121798 13144949
11397 13144949 12348893 25973027 22611717 -13862341 -50397343 -46201885 -15502613 -9409619
11389 -9409619 -38012344 -56523606 -39540485 -21262415 -35352625 -56956652 -44905588
11382 -44905588 -11843978 -4493227 -29209331 -45992411 -34809741 -22063735 -30358533
11375 -30358533 -39795316 -19630024 25526739 61677484 64890695 40240498 9847830
11368 9847830 -7157455 -7671129 -4170068 -9378656 -22415195 -34819395 -44184293 -50784143
11360 -50784143 -46651217 -24602717 3395106 14538336 4302554 -8293215 -7279161
11353 -7279161 4101956 17362861 31788361 46157388 52510296 47506693 38022119 27111922
11345 27111922 6848003 -24411006 -48618956 -45283494 -16948775 12748591 23170721
11338 23170721 12308931 -6328998 -15555505 -8134052 5344803 7237771 -4115205
11331 -4115205 -10353253 1410017 19287386 24296552 19062412 22705694 39197833 47743087
11323 47743087 30290916 -2864362 -23523632 -16793472 4787798 17190680 10760686
11316 10760686 -1675930 -2618588 7090379 9489236 -4746934 -21351065 -21628225 -8624515
11308 -8624515 -274054 -105998 7335718 28407013 45567397 41439399 24660279 17911901
11300 17911901 28277562 43349856 51287615 50454618 42114376 27902359 14580378 9304068
11292 9304068 10195242 11995930 17872209 31819951 42965091 36243201 18655935 13542377
11284 13542377 25111044 31992647 23409089 15482803 17758834 11446076 -15398544 -35453621
11276 -35453621 -17551816 21246334 35497838 15890829 -3956954 -4923136 -6272744
11269 -6272744 -21029252 -25657800 607226 32164297 24563533 -23866032 -65598512
11262 -65598512 -61257140 -24232033 478611 -8243389 -26679975 -23537589 -5487094
11255 -5487094 -6879450 -34565339 -49990622 -23377373 17821232 24327917 -6204180
11248 -6204180 -31949556 -30762441 -19728902 -9634891 14232047 51415383 69514780
11241 69514780 52977124 32699118 37262375 46313039 28095874 -2842379 -7952591
11234 -7952591 11293313 16556210 -4460467 -20469348 -7870782 16042336 24141994
11227 24141994 17426884 16259985 29811691 47266027 51250200 34118920 7186412
11220 7186412 -6745841 1601754 14740840 11967151 -257550 882079 16989550 23299476
11212 23299476 3793588 -28519810 -52548245 -62192565 -59992100 -45059931 -21043885
11205 -21043885 -3997782 -6029633 -16211099 -12705753 6352594 17866310 5186118
11198 5186118 -16240330 -16743405 7617021 28429086 23221189 4657050 -2369994 257427
11190 257427 -9312781 -32693005 -46154726 -39844134 -33289274 -39207983 -38887065 -14263723
11182 -14263723 17255726 26082848 14405887 10000327 23504006 36465610 29422421
11175 29422421 2246553 -31153616 -52410841 -47967142 -24580401 -8953443 -15796292
11168 -15796292 -25349028 -11729029 16253914 26182807 7180794 -21135185 -41217235
11161 -41217235 -53777453 -61895730 -62480640 -55035112 -39951516 -11295149 28516092 54802664
11153 54802664 48282383 29211340 31080547 45772091 35454117 -267911 -16819667
11146 -16819667 3454035 21228562 7343588 -6067813 19947378 62000966 67274387
11139 67274387 33287338 6030989 9315305 22675383 27266071 29357593 32524152 26453391
11131 26453391 14756562 18814972 39700277 48869430 34348214 24080652 38885562
11124 38885562 52041413 30222481 -7057521 -11877797 16608447 27255516 -5514089
11117 -5514089 -42422002 -38818750 -8567045 3259986 -11981185 -24110308 -18611810
11110 -18611810 -13625452 -19845668 -19816054 -809258 20335060 24522995 21156497 28842246
11102 28842246 39473027 26874569 -12265881 -47228533 -47038187 -13863671 20374235
11095 20374235 24923181 -1853305 -31540026 -35224614 -15428171 -1620633 -12484511
11088 -12484511 -34908681 -46412559 -44335580 -40928090 -40366672 -35158969 -20026785 1597959
11080 1597959 20471806 24502762 7741583 -16679118 -24772542 -11857127 -241654
11073 -241654 -5668927 -13657960 -6462969 3768101 -6824001 -33909626 -50012282 -44515855
11065 -44515855 -33685924 -31725151 -33963821 -30556218 -19384852 -4408284 5557455 359893
11057 359893 -15616983 -19692947 -566991 18716229 10554573 -13372193 -16120031 10649840
11049 10649840 36562505 37666372 23370107 13406610 13935362 23535557 38991171 46084075
11041 46084075 25275962 -23505292 -76670621 -112092066 -123570929 -111139072 -78328138
11034 -78328138 -41531076 -20040281 -12079937 -537496 15797476 20029025 8383834
11027 8383834 -3520472 -11340055 -29076464 -53891558 -54291534 -14227417 34326806 47585738
11019 47585738 24277603 418629 -1559124 4491003 -3264959 -21606874 -26806477 -7162160
11011 -7162160 18854656 24186697 8574583 -2825465 1443522 2976447 -11895864 -25694210
11003 -25694210 -19677749 -7253965 -8186405 -9931680 9080417 34233708 34180249 13196717
10995 13196717 -149956 -5831982 -23657530 -39424424 -18204756 27168141 42653174
10988 42653174 17905149 1652077 15669114 20023637 -7994436 -27244203 -6655136
10981 -6655136 14855242 -4971223 -35468901 -22904865 21292417 42968797 29011041
10974 29011041 10321304 215911 -14403550 -31746092 -34963270 -26683164 -22047984
10967 -22047984 -15854946 4672245 24807153 19087803 -5363124 -18324825 -10552505
10960 -10552505 3891779 16237632 20971542 1987132 -42541976 -78640536 -78934083
10953 -78934083 -67666496 -79291782 -91933318 -56807966 16566450 63310867 52963458
10946 52963458 22636193 12757129 18561442 18452109 9022341 -3143403 -12869652 -10928397
10938 -10928397 4894883 12855434 -7931120 -40380296 -52857596 -51455690 -64320483
10931 -64320483 -80989151 -63205318 -18919847 -4323419 -36558250 -64008825 -49305300
10924 -49305300 -25211834 -30803817 -41839298 -14006884 38070287 57634221 26581186
10917 26581186 -14862846 -25315526 -5818893 14557486 13512551 -6888341 -25349051
10910 -25349051 -24497963 -11636235 -7179652 -12454389 -7681109 13327232 28755804 19929732
10902 19929732 -2308464 -14508761 -8346269 7889943 20412359 16171009 -5339956
10895 -5339956 -22433393 -13107118 10362664 12553728 -15014330 -42229520 -45812773 -36377975
10887 -36377975 -29184744 -19483356 -3761984 3711690 -4154634 -11146996 -6398842 -4323531
10879 -4323531 -14955924 -19316888 773938 29276720 38038577 25721048 11601287
10872 11601287 6491335 11662300 30211828 56518820 68987560 55187913 30509719
10865 30509719 12927006 -2632234 -23074770 -31477515 -12011406 15490637 17756469
10858 17756469 -5613930 -28301082 -40143658 -51371091 -60112131 -50885260 -27232406
10851 -27232406 -13576839 -17746412 -19869423 -8081480 755006 -9751051 -26926046
10844 -26926046 -28193895 -14933399 -6932733 -9072048 -4307256 16113257 32708716 22347830
10836 22347830 -5034674 -14036626 8549404 33848067 31513469 11433991 2769516
10829 2769516 6630853 1536231 -10804675 -3251449 28597094 53485510 52780938 46883266
10821 46883266 54860588 60628305 44249396 18442385 4970632 -1629020 -15623581
10814 -15623581 -25233215 -9887347 21168050 39595585 37264586 25301740 4724273
10807 4724273 -29321007 -60553495 -62146278 -34281982 -3952983 11336823 14380084
10800 14380084 7481895 -9479990 -22056553 -14175935 -1005770 -17164735 -64228480
10793 -64228480 -99549292 -89717696 -49850184 -15783884 -319576 5490667 6583346
10786 6583346 1175665 -5603867 -4487866 3409494 7469750 3827902 3294436 19656510
10778 19656510 50039279 69035748 50162422 -1343330 -45034921 -44961076 -8196267
10771 -8196267 25695360 26983413 -3625794 -46751161 -77945488 -75460811 -37896778
10764 -37896778 3178534 8054364 -27545710 -68180015 -80932973 -66047571 -42498670
10757 -42498670 -22574394 -10207176 -8398918 -14991832 -19928291 -16557797 -9118366 -3278760
10749 -3278760 1937422 7183810 8089921 4741922 5578693 13184878 16475042 8037289
10741 8037289 -490312 4652901 13830722 4847845 -20329210 -30402129 -5999045 30455112
10733 30455112 42524358 26697041 10080824 5117130 -6455065 -35962506 -59883858
10726 -59883858 -50404288 -17214846 6284419 8733865 5613730 3218491 -11307271 -39657493
10718 -39657493 -60379910 -57380296 -37983608 -14213926 10137821 24544373 11894359
10711 11894359 -19749242 -31787856 -4196017 31218532 31883203 2129982 -16700540
10704 -16700540 -2204276 28566148 47412914 41960135 19517110 873821 3178833
10697 3178833 16380477 10336355 -20821868 -41975474 -25923072 2857291 3148903 -21742299
10689 -21742299 -32590007 -13575720 12206486 21568533 13280236 -5351060 -24023206
10682 -24023206 -25440949 -4829877 12193678 1350781 -19010682 -13414288 12022366
10675 12022366 18296463 -1743906 -13392015 50320 12921065 3864179 -16464579
10668 -16464579 -39166888 -76018346 -124104479 -149993891 -133718012 -97696775 -71518671
10661 -71518671 -58772799 -56618306 -72162934 -96384094 -97781772 -68934818 -44826290
10654 -44826290 -46623960 -44867849 -13619639 17342481 10451963 -12098746 -3693762 25764301
10646 25764301 24121639 -16484892 -46029504 -32653033 146064 21539537 30514971
10639 30514971 30321410 9796612 -27884152 -52464425 -45326274 -23934475 -9154103
10632 -9154103 4164732 23809305 35146908 25341441 10692585 12270285 21410986 17483978
10624 17483978 5561546 5231007 11159651 -936250 -29726843 -43260189 -26376807
10617 -26376807 -3996152 -3682151 -19631587 -31131875 -35247316 -38705817 -34210459 -12670478
10609 -12670478 10170261 9189801 -9885526 -15562216 198418 8519413 -9434577 -32071685
10601 -32071685 -33515659 -23982609 -27601322 -40311970 -41089885 -30959269 -26479409 -22737543
10593 -22737543 -563567 29902036 32143604 -796024 -28888194 -20080690 7667507
10586 7667507 20067443 15952130 16436248 22775315 14703883 -15459537 -51022005 -72731857
10578 -72731857 -75754953 -65510189 -50497829 -40229533 -39548287 -42076433 -34965148 -13030123
10570 -13030123 12147199 18192886 -7939770 -51908378 -81056886 -78791585 -60690217
10563 -60690217 -46642087 -32373748 -7980070 11911896 7613206 -6752163 -1659204
10556 -1659204 15661727 11684543 -8984502 -1053069 44858462 75372077 52363000
10549 52363000 11525494 6227404 31643678 46265677 37205897 20369069 1226112
10542 1226112 -20469138 -27505256 -9326049 8921167 1698995 -12744237 -5403355 9322652
10534 9322652 1342459 -14752386 -3650571 22027204 19292214 -6908442 -8489825 21915513
10526 21915513 38189044 20675537 3230124 3905634 -6672630 -42128389 -65842164
10519 -65842164 -52810618 -33370593 -39096627 -51690006 -43081538 -24544461 -18667521
10512 -18667521 -21138163 -25714702 -46723671 -79273391 -80138090 -32670566 10357711 -1109314
10504 -1109314 -37811962 -42342064 -20808614 -18752904 -34431558 -28630760 -3782767 1138271
10496 1138271 -13335100 -11077899 2095394 -15672967 -53765743 -55765897 -36311847
10489 -36311847 -91915028 -239496618 -333708776 -236239921 -13104159 138191278 134665160
10482 134665160 78419488 78499148 108661302 89328822 28902557 3962185 35282372
10475 35282372 63271936 45268806 11181622 2920546 10064163 727540 -17306130
10468 -17306130 -9662632 24571226 47847346 39598308 20767936 15345167 19878883 25215970
10460 25215970 38635737 62793072 76898740 65548063 48848226 55155160 75785835
10453 75785835 76952023 50290474 21107158 7392061 351778 -9366064 -12606781 821970
10445 821970 24219939 42566719 46391262 34317610 15399689 8304651 22051487 39903720
10437 39903720 41018906 32778114 36055339 42899213 23880872 -18146591 -40044226 -18534361
10429 -18534361 17473209 34931064 42159291 58481509 70420205 55736034 28935913
10422 28935913 21951295 32547543 32639313 21065636 25819356 51372575 64313325 44045060
10414 44045060 14707575 8237730 20244148 23571565 9472813 -6585179 -13658437
10407 -13658437 -21044525 -41539053 -67782889 -73731340 -44743803 -3202310 9361096
10400 9361096 -17805900 -47493372 -41083245 -8036615 11751490 3319879 -13202380
10393 -13202380 -22505776 -32339208 -47226384 -53075054 -39814009 -17905576 -1466680
10386 -1466680 7055534 7899605 -191193 -7161335 3640996 27981077 39976873 29556375
10378 29556375 16382414 13136103 3125907 -24129880 -42138999 -22827393 16293989
10371 16293989 33678816 20963436 6009134 5456426 7026035 -864908 -11221392 -15339281
10363 -15339281 -15446740 -16302240 -20915874 -33511332 -49694302 -49598674 -23088020 4376511
10355 4376511 -1047396 -30880608 -41845430 -16577427 15450694 25313380 20569751 20059308
10347 20059308 22204252 17441063 9460842 5462790 3573147 4574851 16079725 30683455
10339 30683455 22956461 -13543651 -48287137 -52871563 -36324308 -19872261 -1361587
10332 -1361587 25707927 40063005 17895534 -21777400 -35632764 -15875678 3822134
10325 3822134 1396268 -9385204 -11652617 -9492766 -10327816 -10986524 -11367859 -18211087
10317 -18211087 -26673296 -21409059 -4173223 4328982 293139 8031856 39263919 65421879
10309 65421879 53315796 12177937 -18501937 -18830666 -4234511 4631037 6644455 10059427
10301 10059427 11429843 -3488959 -36849367 -64445170 -56756702 -18057425 10145206
10294 10145206 -2401132 -36368144 -51961451 -42423697 -30718942 -24003768 -9373354
10287 -9373354 7178165 1267767 -21470776 -21556146 11615108 35775699 20557961 -4169180
10279 -4169180 1219269 23870153 28366175 18252475 19852947 27743353 18288851 2443133
10271 2443133 10846429 33544474 29653871 -2628091 -20812515 -10408487 -7492012 -32492721
10263 -32492721 -53602571 -42424910 -21128170 -21663833 -34057280 -30195556 -11665550
10256 -11665550 12083 338521 -740723 -510575 3144040 20512593 46347048 48919457
10248 48919457 12985721 -26156021 -26190193 116999 4076432 -27271345 -58149590 -60774127
10240 -60774127 -47003231 -37542804 -32804105 -26015816 -19885582 -17322283 -13536813 -7237156
10232 -7237156 -5361358 -9755420 -11533152 -3071690 15127783 39788845 64719780 77455290
10224 77455290 71355531 59299916 58606504 64256553 56268474 32830543 14138463 10606599
10216 10606599 9767682 1331401 -5681175 -568796 11066699 16280052 8535425 -12605794
10208 -12605794 -40724723 -58265226 -51108199 -31341079 -24910058 -32001243 -25011935 5002594
10200 5002594 28903085 23825124 9136210 12565794 23267504 10748239 -23492469
10193 -23492469 -46918176 -42740023 -24806011 -7720342 7349768 14253519 -290459
10186 -290459 -29993157 -45413796 -31678630 -10149202 -6162156 -11352959 1258972 33253034
10178 33253034 54193558 41236517 8849620 -9763158 -2911800 8098812 -2235158
10171 -2235158 -30953127 -48743712 -33247257 6024423 38530320 43820904 27601743
10164 27601743 9649931 1368408 -3134186 -15414036 -34782834 -46616135 -41535556
10157 -41535556 -30102451 -29010309 -36606502 -36432977 -25341770 -20507286 -32237859 -47207301
10149 -47207301 -49326841 -40907291 -29851512 -13496661 5833365 6311582 -25303738 -61904166
10141 -61904166 -63553741 -33083617 -11860062 -18368991 -25951980 -12004378 5779794
10134 5779794 4002156 -3944286 10220676 42177276 60302711 51462284 34015990 26042615
10126 26042615 24314543 18492688 7324305 -5157514 -15945830 -20833251 -16915875 -10709532
10118 -10709532 -13478729 -25248488 -32963808 -27743857 -15087155 -4730092 922062 4274289
10110 4274289 6391156 8137798 11273505 14383304 13740757 12251886 20837169 44238241
10102 44238241 69601065 76993149 61165887 36875290 20532815 11396394 -3183447
10095 -3183447 -24650665 -34578183 -17266702 14195535 28644677 15895478 -125467
10088 -125467 4103546 18820958 18048659 -1773066 -21101770 -29647036 -35640147 -42233899
10080 -42233899 -39582188 -27611896 -22845417 -29734509 -27222764 -2499294 20571518 11587742
10072 11587742 -19477129 -33120621 -14111296 13063734 25160211 29531850 41106758
10065 41106758 51740845 41428855 10118618 -18362351 -21993614 -623227 27002161
10058 27002161 39160531 27731217 6240919 -1047435 15483552 38194780 40607325
10051 40607325 16631250 -14222615 -29363669 -24533175 -12608664 -7863721 -15258467
10044 -15258467 -31346304 -49408668 -62079963 -63081484 -51215917 -32652360 -15682605
10037 -15682605 -2857701 8125999 16697725 19925350 22255370 34379839 55168557
10030 55168557 63838071 42218895 872280 -28620845 -26405088 -731480 25263244
10023 25263244 33314777 20402059 1288684 -2071861 14494556 27837726 18047559
10016 18047559 2396492 16014629 59124979 89828717 76901492 35443380 -1441411
10009 -1441411 -22864744 -35641744 -40488716 -34395534 -23612943 -14896468 -3746869 13122364
10001 13122364 25837614 27780287 29473732 37079409 32537233 191230 -38641562 -47331782
9993 -47331782 -25561144 -9833772 -20677571 -36650811 -29176250 -1709465 18381751
9986 18381751 15074259 -94061 -4389046 7179810 12762561 -7812498 -37666930 -37147300
9978 -37147300 -216517 31359867 28018461 15781203 29102753 49543494 36284695
9971 36284695 -1537859 -16366558 239060 6410366 -18737363 -44923650 -45183070 -32856517
9963 -32856517 -25790478 -17056001 -3240467 -2804518 -22688342 -41244662 -45452404 -49621262
9955 -49621262 -57040463 -43706894 -5922604 18115577 6488301 -8127126 3483511
9948 3483511 11965403 -19180787 -62046118 -61292392 -19721853 10774096 8935270 -2428235
9940 -2428235 -13167025 -35609210 -56810927 -40636140 9180163 39780033 22828326
9933 22828326 -6643025 -8931819 1194264 -14465414 -53231626 -72648259 -47573072
9926 -47573072 -983890 24200934 11831195 -13551905 -18618015 -3085463 1366146
9919 1366146 -22927153 -53086673 -58395621 -40341166 -18710193 4334460 36684525
9912 36684525 64654531 63277228 36466333 16741513 22233056 38302172 43886464 34561864
9904 34561864 17901876 4158537 1436959 6022803 2485196 -14701356 -31113464 -35582344
9896 -35582344 -34282650 -28111473 -4424786 29176413 39602720 24316760 26806283 57598412
9888 57598412 59649410 17562899 36494801 204756592 415857981 460932335 302219659
9881 302219659 122941666 73718384 99193970 78270092 15257490 -7360471 19498951
9874 19498951 38659094 36904204 47007024 66662879 62595725 39345555 29867535 31278350
9866 31278350 15908792 -8228375 -11035981 257223 -3111819 -11330465 4890641 28619246
9858 28619246 17354431 -18137272 -24199650 6642985 24166712 5001260 -14981466
9851 -14981466 -6368440 13265778 21913195 25506607 29093489 19774611 -3594436 -20779258
9843 -20779258 -22662233 -19016207 -9379530 14271180 33494069 18207474 -18781389 -30998479
9835 -30998479 -10439601 1724772 -11298222 -15003507 8008795 20374439 -5631378
9828 -5631378 -36542609 -31447826 -6264027 -922471 -14928309 -19558400 -10226229 -5370974
9820 -5370974 -10362667 -18043168 -30159910 -47582192 -55463938 -46852048 -42069313 -53991867
9812 -53991867 -55151734 -17283686 32546032 38823952 -4777411 -46194020 -46376005 -22297821
9804 -22297821 -8307317 -7016234 1636645 21879559 34275833 21791669 -9299659
9797 -9299659 -35670156 -38696033 -18134472 12835332 39462226 49344845 34954199 5431458
9789 5431458 -10791340 6089904 38447085 50376702 35099811 19420980 19163346 19553978
9781 19553978 8628776 -1409655 -3085522 -14280760 -46004662 -73775984 -69068280
9774 -69068280 -41801455 -24154075 -25775043 -31443145 -31440455 -27544783 -17835082 -1580070
9766 -1580070 7482219 -2445063 -17034577 -12162357 9844753 24039814 20467789 14875195
9758 14875195 21492390 34998801 40975175 29411338 668864 -27524178 -26243252 13051882
9750 13051882 59873285 77264844 65284673 50111212 39717390 20397476 -6624817
9743 -6624817 -19320354 -11172065 -3174161 -9387720 -16018347 -6451168 14542872 32622105
9735 32622105 40459750 33708382 11327402 -10706305 -8926226 12179366 18016257 -6688455
9727 -6688455 -30218833 -17783595 17906161 38402892 37581586 45094169 75057717 102062614
9719 102062614 95860141 59334732 22721320 12057514 28492090 49571476 48807949
9712 48807949 21968027 -6836941 -13003618 -141817 11006536 15431247 26501068
9705 26501068 47555157 62605004 59859755 44938111 24462788 -3324665 -32437126
9698 -32437126 -44769500 -36376235 -29523237 -41011924 -55498575 -51176351 -36055001 -32050409
9690 -32050409 -34479938 -19247854 12826253 31298148 20583482 725014 -4866037
9683 -4866037 2495830 10566155 14366983 9663249 -8267976 -26426087 -18537796 15494034
9675 15494034 36997419 15877251 -28290963 -53830323 -48472932 -30798935 -16436574
9668 -16436574 -8667278 -11054788 -23538383 -32767605 -27225313 -14111839 -4562217 3132256
9660 3132256 6588319 -12669395 -56272086 -86311749 -72557280 -43449619 -46022787 -70366041
9652 -70366041 -67093817 -32835182 -16955773 -35660127 -41959676 -5057566 35160659
9645 35160659 28320579 -12881457 -36803063 -21465042 13619774 40640709 41148753 12572219
9637 12572219 -20134645 -22334947 2825970 13663582 -6563734 -24030012 -15876847
9630 -15876847 -11609622 -35884194 -55174778 -32691230 993476 -6675385 -40532055
9623 -40532055 -39792434 3836338 36919669 30761052 13767788 11844814 15542743 17878521
9615 17878521 30003313 44213164 32984653 2430666 -3360277 27846104 51289171
9608 51289171 34717590 4702747 -6968359 -15535860 -41913741 -60789611 -39137899
9601 -39137899 2732390 19290377 9852395 11103344 30796221 37840588 17718693 -5473161
9593 -5473161 -8651819 3518567 19502152 39051226 60731504 73944710 71735767 55679978
9585 55679978 28022287 -2356382 -11199439 16031693 50760783 46084573 2687322
9578 2687322 -24053717 564138 39945932 37111501 -8376473 -47110729 -48659837 -28151965
9570 -28151965 -8423531 8772667 25793845 32239354 21283465 5346104 28221
9563 28221 3628482 5411883 4569139 7477468 12782143 13037560 8737592 8980337 17591514
9554 17591514 26374193 23056716 2454242 -27502534 -47803942 -42679904 -17348951 5304425
9546 5304425 11676849 11875977 19157166 27199984 22273736 7890998 -832857 -290956
9538 -290956 3474699 12938852 32107729 45450454 30967663 -3985094 -26462885 -21705989
9530 -21705989 -6688603 4287082 15920269 24232621 8368355 -29158358 -45890894
9523 -45890894 -12335823 41067364 59607381 30767381 -11861176 -36181703 -36080109
9516 -36080109 -20909397 -6768224 -8521044 -19308931 -12048508 18218885 34948405
9509 34948405 10670149 -26519731 -33068672 -15096767 -10083394 -21312309 -21599650 -11491470
9501 -11491470 -16757362 -29363945 -10879853 36267577 59996774 38666250 13339406
9494 13339406 15661183 19521229 -1221505 -19391825 -4028338 20203161 15283939 -1098893
9486 -1098893 15548560 59810421 84114056 72491982 54719435 50481095 47976554 40599313
9478 40599313 40071622 45072852 36551235 15328052 8470420 24449351 35013227 19632924
9470 19632924 -998678 1339358 17159972 13952402 -15533157 -44424552 -49256307 -37508588
9462 -37508588 -33008575 -44796329 -58278053 -54839760 -32902431 -5014982 20314920
9455 20314920 42360204 55251405 49455547 33525649 35071926 63980544 90376160
9448 90376160 80252613 41650298 12240320 9799406 20707417 31189312 39754253
9441 39754253 38485337 13508008 -27332712 -53476101 -49450961 -32568821 -24115300 -24996982
9433 -24996982 -29656998 -40035982 -51322827 -46107529 -20434198 2938518 4873659 -4336835
9425 -4336835 -7608761 -10466896 -25015336 -40961030 -39218118 -23343408 -11623706 -7264264
9417 -7264264 -2378060 -1568441 -11365839 -14350325 10282838 42766690 39553510 92024
9409 92024 -24636903 -5348844 24498897 25220250 9975469 11513819 20850894 5277909
9401 5277909 -29496727 -43821459 -26432810 -6716885 -1134113 8665701 32564975 48051479
9393 48051479 39602226 26617750 26797234 22288287 -6522893 -37570753 -33776557 768809
9385 768809 26818642 25126167 11784536 1364610 -10246601 -21323143 -15530628 9244513
9377 9244513 28786041 24839743 10151634 6140252 12204684 13593049 6457993 -2448707
9369 -2448707 -11778403 -23654250 -30546040 -20123428 7355834 38163822 60965442 73680386
9361 73680386 75480706 62702089 35845113 4438873 -18348556 -25065920 -20127491 -18344009
9353 -18344009 -31781489 -53407636 -60411438 -41569083 -14365367 -2492507 -1436494
9346 -1436494 14867591 50743724 73640375 55991599 15671128 -6932392 -3103736
9339 -3103736 -141818 -11954855 -16982318 1011172 19473272 11403357 -7368896 -912954
9331 -912954 26403324 32996741 6387524 -15236563 -3224364 17899895 13118896 -8167469
9323 -8167469 -13726359 -1956841 4407350 3168011 10729059 22687216 18526760 6450608
9315 6450608 20670952 62975096 86494301 58650104 9420204 -8910351 11390640
9308 11390640 33332325 28210401 3099260 -19294575 -26607367 -20601338 -8078733 7223662
9300 7223662 25993774 46059569 56626189 47818352 24758383 2219593 -13040767
9293 -13040767 -23017303 -25821787 -19584804 -16376035 -30928552 -55026834 -66123831 -62834860
9285 -62834860 -64737728 -72629599 -61574903 -25888760 1866292 -3013313 -21250171 -23441716
9277 -23441716 -13715331 -12010054 -16066806 -12491006 -7429645 -13579457 -20720956 -11831231
9269 -11831231 2837674 912030 -11591724 -8382281 14461103 37304144 54001193
9262 54001193 74899586 93291600 85103144 48154843 10003730 -10792815 -22232134
9255 -22232134 -31193981 -28925620 -14613096 -4712841 -5871805 -4308728 5312949 6735220
9247 6735220 -7195351 -16202805 -3514519 16666400 21792769 11827944 -1358305 -16390635
9239 -16390635 -32974240 -36972743 -18611772 6391623 16071405 12410604 11024027 10942413
9231 10942413 -751685 -19318037 -21863389 1950112 36261780 57456371 54076874
9224 54076874 31959812 12441514 18972110 49889636 71853476 58850377 29465398
9217 29465398 21182130 33759518 30012831 -4069161 -34620577 -30429140 -8374022 -3929968
9209 -3929968 -17088030 -17155534 8198655 37407215 48111503 41963318 31600276 22025996
9201 22025996 13559000 10024294 14061744 21047598 24548193 23825885 22472255 23569250
9193 23569250 27751278 31515727 27235025 10679887 -11408998 -27560859 -34357174 -35107337
9185 -35107337 -28357705 -10691739 8655969 12631086 2002103 -285238 18518890 39076613
9177 39076613 35839153 12869030 -5044690 -8726947 -9964315 -13372717 -6975230 13481096
9169 13481096 30928425 28959214 14519608 7291224 13996917 22633855 18325205 -1092995
9161 -1092995 -22946523 -31040061 -21963759 -9021926 -5616546 -9438834 -11636599 -14826152
9153 -14826152 -26145396 -35568149 -21988584 14586414 46175587 50975734 38401393
9146 38401393 30422463 33079285 37959955 38304310 31055516 15209843 1065941 8513010
9138 8513010 40535478 69417651 67355599 42868105 27618573 32249364 36384611 22553347
9130 22553347 -777156 -16603565 -23373742 -30321618 -37975957 -35677809 -17909041 4736229
9122 4736229 14719953 5847827 -11312064 -23030945 -26650371 -27414078 -26991809 -23800513
9114 -23800513 -20880593 -22178851 -22711627 -14880558 -3900793 -2867604 -11747477 -16479504
9106 -16479504 -10772646 -2767824 1607009 3365451 -3300649 -26463146 -52830889 -54767579
9098 -54767579 -30945454 -12888116 -17450761 -22391909 -8531887 5538917 -397192 -6462537
9090 -6462537 14487413 43099278 36732660 -2801076 -27884636 -11630222 22224580
9083 22224580 40750319 39699461 31804964 25377776 24404679 28912140 29366973 18884686
9075 18884686 10794444 22113695 40865286 36287364 3945045 -26019265 -30659678 -18737558
9067 -18737558 -7399998 273788 5653866 5131969 -135686 -3555025 -7654726 -20106912
9059 -20106912 -32906344 -28989292 -12968210 -8923224 -22060468 -31001818 -26235163 -25031809
9051 -25031809 -35083307 -35826116 -16478195 -2766091 -17767816 -38950151 -27024726
9044 -27024726 14446603 40017178 21344414 -19520547 -40492180 -27503833 -5186957
9037 -5186957 -4651058 -25366281 -35118855 -13481805 14842739 9016421 -29724112 -54868745
9029 -54868745 -35020316 8198567 34606426 35107322 30131196 35421984 47310557 52579264
9021 52579264 40652397 13412524 -11256650 -15465228 -2031636 14339693 32599614
9014 32599614 59217748 79957804 70869794 41637663 30689196 46230952 52521649
9007 52521649 32553788 19931395 38833142 55779107 34137882 1216400 8449940
9000 8449940 48055331 65714672 44738058 20875220 14239482 2545925 -25881348
8993 -25881348 -42370795 -24837238 2164697 1656763 -24814221 -44635096 -37817203 -13699811
8985 -13699811 6936412 11789233 3931512 -2532498 3451426 18168968 29556151 31830889
8977 31830889 25849495 11152038 -9621102 -23800121 -21429130 -11070487 -7408587 -7884944
8969 -7884944 5573 11890578 8701495 -13132273 -33792271 -36287493 -23897286 -8861713
8961 -8861713 -157369 -4748721 -23661135 -42939407 -44524197 -30018593 -18726458 -19723914
8953 -19723914 -22469423 -18133786 -11919292 -8435904 -2824936 5294239 5736538 -3692375
8945 -3692375 -6766520 10184603 36686189 50269804 44924161 36640075 41764982 56679204
8937 56679204 60920295 40486234 7597048 -8268854 6583436 33016818 43088419
8930 43088419 33292871 21554790 17963127 15352939 6876778 -4194270 -13900622 -22125725
8922 -22125725 -25220199 -17259659 -1626043 9937152 12153105 10558529 10830967 13305164
8914 13305164 16949282 19528337 17106968 12622589 17434776 31617240 33132579 5754645
8906 5754645 -31023248 -43337259 -27964586 -10045293 -946166 10140953 22274316
8899 22274316 15555438 -12977866 -38073527 -44033473 -44682370 -50672449 -46212158 -19017554
8891 -19017554 11682622 20487926 9371281 -5687239 -21818086 -39493206 -44394732
8884 -44394732 -26550781 -4102506 -484702 -7754489 357676 25892730 43868359 38401921
8876 38401921 17027327 -8683906 -32686319 -45205004 -37983092 -21982908 -19096053
8869 -19096053 -32290691 -42464562 -38019548 -28449875 -24038587 -21396480 -16638444 -15280709
8861 -15280709 -19175611 -18525342 -8120993 384503 -5946639 -22423536 -34255765 -35728418
8853 -35728418 -30977942 -21137604 -2771016 21516641 40210434 43303397 32016751 17592364
8845 17592364 11887679 17275728 24165682 21496299 11395962 8080098 17321636 22681048
8837 22681048 2810398 -36943850 -61726542 -44205742 1716143 34799386 31722454
8830 31722454 5889686 -19704377 -40433688 -59382639 -65001222 -42757114 -4362169
8823 -4362169 19631077 19931387 17213800 22661978 16946929 -12107084 -35126905 -16199770
8815 -16199770 30032183 52168849 31981087 4491351 -380202 290125 -19075472 -42708630
8807 -42708630 -37310763 -9740686 -1109752 -23698100 -40816424 -21357451 16105939
8800 16105939 33684480 25845147 15534829 13402803 9785211 2461495 3757449 15441499
8792 15441499 20204085 7663704 -9170853 -13707757 -6908493 1780159 10212741 18073193
8784 18073193 18445355 8453940 -2202008 -5721408 -7075323 -7128890 8610721 43140704
8776 43140704 65220282 44356554 1782573 -8538433 27008184 62347208 57002638
8769 57002638 27404819 11690723 11437890 -202569 -28056314 -46572247 -39496417 -19427678
8761 -19427678 -2694038 12716270 33412043 49584222 41862487 6320448 -35297018
8754 -35297018 -52748355 -35057292 -972142 20808377 21384905 15730669 17235633 20177561
8746 20177561 14345801 5276102 6552230 18180892 26738102 25022913 19191916 16703307
8738 16703307 18220604 22062416 26771953 28155623 22419771 13031362 6628063 2613771
8730 2613771 -4355621 -12391398 -13704883 -8951163 -9144905 -20321398 -36249998 -49394500
8722 -49394500 -58774990 -63361879 -59085814 -48140944 -40214354 -37444060 -29389721 -11533861
8714 -11533861 3670453 6641630 9175969 24994599 41045119 32498155 4937401 -5205287
8706 -5205287 19062816 48116428 45063858 15157788 -4525397 4823929 24732788 27618313
8698 27618313 6741092 -21776390 -33707338 -15893456 15820861 22423741 -16611673
8691 -16611673 -70366549 -86746814 -56176321 -20373787 -13138342 -21955317 -22498787 -20846490
8683 -20846490 -33891248 -48918529 -37177739 159872 31068483 36724886 29194723
8676 29194723 23353919 17401856 8034678 2599440 6061980 11864947 13683281 13042513
8668 13042513 10337527 2043220 -9049598 -14562384 -14043930 -12949762 -6501414 15449163
8660 15449163 44960058 58979332 51073763 37868466 27797122 9882233 -15653067
8653 -15653067 -25083217 -8249925 9499157 7013104 3980802 26823679 58014753 56687272
8645 56687272 19371810 -16844605 -27954532 -24360867 -18319346 -6277241 8167158
8638 8167158 6229378 -16161108 -34229320 -24837814 6172908 36782937 51174661 41804352
8630 41804352 10372602 -21908565 -25017095 4942118 37701543 47218124 40431335 36254196
8622 36254196 37218883 38668132 45072412 55297830 50045161 19987940 -8236451 -3454750
8614 -3454750 22520936 30274271 11161841 -2757680 9988811 30404557 30471115 9590189
8606 9590189 -12147753 -17644016 -338453 32937467 57543913 48686908 13595242 -12289392
8598 -12289392 -10088065 2883195 8218484 14087306 29296436 36561160 19677066 -2912894
8590 -2912894 -3792718 8714332 6000791 -10406993 -11714601 7433267 19982422 13424029
8582 13424029 8485673 18886160 26572169 15433401 1063419 4659171 18987219 22411311
8574 22411311 9912693 -9491728 -29887720 -43259015 -33596004 1015075 33564973
8567 33564973 38953970 29036966 32554164 48972327 50285330 26639909 2257428 -272393
8559 -272393 10567713 12219553 -319535 -12667512 -14985817 -16295823 -30339201 -50593371
8551 -50593371 -50950772 -21078862 9572115 4895686 -25092863 -35043557 -12107760 4183327
8543 4183327 -13603591 -35775851 -25453276 1639444 9032815 3122056 14224913 32347278
8535 32347278 18962405 -22402185 -44591436 -31281267 -19185108 -33402145 -51764391
8528 -51764391 -52696526 -50286148 -55606505 -46782936 -10504003 22144291 17278093 -10523346
8520 -10523346 -22009527 -7245349 14759671 31368861 41146406 38948674 24601618
8513 24601618 14333338 19531174 26810991 20491488 9167256 7530020 9067850 2371572
8505 2371572 -1434788 14263630 39174738 48010421 35711582 17026272 1386794 -8512364
8497 -8512364 -4805082 14109343 30584822 29573171 22012259 23777625 26330340 14601306
8489 14601306 -1609116 -4265658 -557014 -6873004 -13157261 -131426 19006314 14491678
8481 14491678 -9049442 -18987855 -8663928 -2504692 -7773658 -5740689 5359288 4656359
8473 4656359 -5414216 5592286 40101269 57780264 37881929 13254075 16333419
8466 16333419 31489728 31532739 24166449 26231383 24650723 3931647 -13959126 -1084580
8458 -1084580 25181700 27754473 11753676 12219222 28104550 21562947 -13014689 -32174552
8450 -32174552 -12857960 8880740 -2165824 -20387066 730539 53299236 84477789
8443 84477789 71832553 45214592 30619378 15675567 -11137296 -24860597 -1368312
8436 -1368312 32707744 28433224 -13947291 -43156524 -31682578 -11540735 -16972832 -29290562
8428 -29290562 -12886966 19545565 21539264 -16042936 -51298978 -52869494 -36766782
8421 -36766782 -28199208 -20345612 4602272 35239239 40471146 12535718 -21433568 -31558872
8413 -31558872 -15281272 6780446 16298220 14344855 14210568 19303612 14570986 -13260641
8405 -13260641 -51806407 -71596644 -59115068 -30734794 -12145027 -13205267 -24447682
8398 -24447682 -30114734 -24328836 -20355673 -37890136 -71151892 -80575033 -36765638 33584861
8390 33584861 71575780 55944956 22047303 7173314 7439922 1800562 -10058481 -15868916
8382 -15868916 -16642928 -20356224 -21667400 -9336108 12542333 27170667 24672621 8728508
8374 8728508 -9653803 -17781996 -11158626 -3916326 -14762625 -35909825 -36391507 -7631740
8366 -7631740 18437506 15463083 2419977 10341163 30683434 32400406 17064829 15761476
8358 15761476 33040449 35705019 7815791 -19075121 -9850129 26438401 54955788
8351 54955788 62282665 60668879 55896877 37425889 2908818 -26819219 -27818010 -1159272
8343 -1159272 27375090 34538439 20697510 2569826 -8284444 -12780061 -14345004 -13431226
8335 -13431226 -13519230 -20687614 -32286970 -37150047 -32786144 -29626901 -30552743 -21991036
8327 -21991036 1355816 18692117 9503231 -14512730 -27053546 -27746990 -37711811 -58170367
8319 -58170367 -64092170 -44299633 -19434335 -8533769 -2593241 12638856 28637287
8312 28637287 29726311 22775337 28784274 49837801 62591826 45015079 -475452 -48201596
8304 -48201596 -66706927 -42466720 3733039 31187488 21852095 2309213 10312159
8297 10312159 45932522 73240344 68086115 44396980 28661251 26462599 24979577 16078931
8289 16078931 3496215 -6994263 -12500884 -9541917 5128080 28536039 50784302
8282 50784302 61580143 57247713 44196664 35903327 40552651 49441745 45333538 26317179
8274 26317179 10790307 9992639 7712866 -15480651 -45360164 -45439601 -7965897 30076082
8266 30076082 33282750 11231578 -429567 11737568 28401804 26959693 3673994
8259 3673994 -28479433 -47809126 -35420355 2829528 29892739 13732482 -30813631
8252 -30813631 -57409492 -45803655 -19885772 -4856668 3814085 14955096 14687577 -8847880
8244 -8847880 -33397884 -26993781 3644005 19411482 3140932 -19690439 -19381528 3061103
8236 3061103 28046703 42900319 42714621 24007353 -5921291 -26084273 -25770237 -22601067
8228 -22601067 -38531647 -63984286 -67188260 -39570472 -10112659 -6488927 -20267639
8221 -20267639 -24775419 -14361349 -6972640 -12438953 -17428698 -6039978 17912056 36081182
8213 36081182 35729357 19595254 720908 -9087348 -9321750 -10323976 -19046648 -27931578
8205 -27931578 -25795767 -16471265 -13616265 -17430580 -13293291 1672133 8373964 -7436833
8197 -7436833 -32944883 -45808825 -41893124 -32528693 -26107206 -26980021 -40764883 -63227220
8189 -63227220 -73596699 -57620215 -29531194 -13214544 -10921259 -11209352 -17202102 -39430838
8181 -39430838 -65983167 -70080674 -48652883 -25547311 -13730895 -2840235 10944816
8174 10944816 13587167 2152905 -4534193 903925 -2288053 -28075828 -56226365 -61095198
8166 -61095198 -47393010 -34634915 -23712369 -4241990 17546410 24458391 15794882
8159 15794882 6990069 5263624 4422506 1446650 1488431 7133958 15850564 26758078
8151 26758078 39146549 46914060 44663468 37161556 34545047 40139206 47956764 48762267
8143 48762267 37224600 20139136 15899674 32262870 46453807 28972632 -10017311
8136 -10017311 -25669910 -26851 32007242 37050859 31731566 46384834 67815899
8129 67815899 60509573 29685760 16086546 28959188 29565165 -6678547 -49597144 -56716993
8121 -56716993 -29787628 -5438658 -6041083 -22804536 -39323518 -50223342 -55352119 -51109314
8113 -51109314 -35198607 -13869943 2889496 12598122 20259519 25406279 18162634 -3887314
8105 -3887314 -23817534 -24608475 -13707816 -9262546 -6878266 13044687 43382820 48028859
8097 48028859 13515339 -27392220 -41337696 -34990132 -28541517 -18033016 6288850
8090 6288850 28929487 31351306 26935933 38266340 54279873 46880792 18884734 -2499768
8082 -2499768 -11854899 -26303103 -44750026 -46049493 -28074307 -11382340 -2488869 9625642
8074 9625642 18396606 1029820 -37566722 -61134052 -54422787 -43184054 -47579183 -50910896
8066 -50910896 -34510965 -13387473 -13373027 -33570261 -51236945 -48711338 -23220752 13827337
8058 13827337 39783360 41520733 36075795 46469535 57773765 33585272 -17891970
8051 -17891970 -39239900 -4697304 38509885 39976516 16544838 11977445 20430639 3493604
8043 3493604 -34394232 -44682016 -10077437 27713333 28143302 1288060 -20508447 -29757286
8035 -29757286 -39286370 -50834916 -53916641 -47523295 -40168044 -29339386 -1969568 37311206
8027 37311206 56593898 33291003 -8578459 -21435168 3893762 24737631 6151553
8020 6151553 -31976072 -48647941 -39346864 -29019472 -25092706 -16486939 -10582421 -27301066
8012 -27301066 -54941498 -55868133 -25870553 -5805077 -18154044 -31760532 -11747038
8005 -11747038 30584948 62379307 72234689 63392092 35222372 648755 -6748706 24050959
7997 24050959 54726524 45694445 8068632 -23754712 -44096485 -60452971 -51759938
7990 -51759938 4509493 74463655 92307706 47329723 -626364 -3383795 19299576
7983 19299576 21985746 -3425513 -29685452 -34999102 -19358970 5463012 24176422
7976 24176422 24418756 7353718 -12676109 -24502460 -30446318 -38035879 -48087553 -52620479
7968 -52620479 -40858358 -10980536 19989862 27900766 12091259 2086133 19931280
7961 19931280 48934285 58688966 48336733 39955500 38663571 30446628 17383154 21176026
7953 21176026 43803734 55102330 35489848 8344044 10119043 42015964 70794660
7946 70794660 72118107 56835653 51973827 64828435 73547175 55623004 19853379 -2497956
7938 -2497956 55039 3657700 -13203535 -35040255 -33251270 -10970289 2797802 -3079241
7930 -3079241 -12755796 -16409118 -22002021 -29138230 -20825075 6717077 31287728 37303630
7922 37303630 39430990 54101479 64743364 41005310 -12895782 -53004948 -45357904
7915 -45357904 -7339767 11632288 -11605131 -45073335 -39264669 10138098 52703457
7908 52703457 43258791 -4530321 -40638288 -41977153 -29231611 -25778728 -28244611 -23854297
7900 -23854297 -12643416 -320203 12594355 21047898 9911412 -25850005 -64418432
7893 -64418432 -75701227 -53516113 -19047861 4938963 14461429 19943332 28667154 34169400
7885 34169400 22665502 -9706545 -48205845 -71242227 -69009313 -48154998 -23759921
7878 -23759921 -12030322 -22174213 -43684601 -48010230 -18498197 23475701 38363627
7871 38363627 14980861 -18836157 -34295194 -32542525 -30102134 -29890657 -21274148 -1975263
7863 -1975263 13790432 11311164 -5466355 -14874233 -1492778 21441922 23651907 -2723708
7855 -2723708 -29018368 -29054059 -18170521 -29468464 -59439378 -69067939 -42159725 -9988299
7847 -9988299 -4177355 -13895436 -12213647 -2770637 -10898409 -39476384 -63496866 -67325718
7839 -67325718 -61092417 -54989504 -40739910 -11357401 17262561 22258217 4522786 -12949653
7831 -12949653 -16285073 -14544861 -18597897 -22464619 -17423316 -11610167 -16550038 -21433351
7823 -21433351 -6038841 19179799 15111185 -29645215 -70343067 -59003453 -8307978
7816 -8307978 27443184 25529288 14894883 22815233 36901656 34190272 20250072 16420063
7808 16420063 23286885 20553578 -701605 -24678058 -32929955 -27349714 -24081755 -30124768
7800 -30124768 -34966630 -27863908 -16028072 -15812954 -27485306 -31786091 -15873385 10065164
7792 10065164 29529572 39790807 44377498 39035915 21183216 3310813 -674324 4593949
7784 4593949 6251562 5494970 10778420 16332633 9743782 -3184912 -4267426 7685560
7776 7685560 16276889 16823086 22585590 37929417 48133269 43466931 34074160 32357926
7768 32357926 36440247 38687996 36953146 31385895 22722015 17973524 25220871 39429646
7760 39429646 45710298 38940017 28354588 22229217 20460549 21713124 24975462 25279984
7752 25279984 19892252 14784820 13054589 5596179 -11572557 -22958645 -16845206 -9411309
7744 -9411309 -20490136 -39286506 -44386828 -42972053 -52467880 -56615258 -26760949 19417039
7736 19417039 32519749 6375772 -14987599 -11768485 -12310648 -28067951 -25082905 12586768
7728 12586768 46445498 44529095 28727010 24512526 13269015 -20534196 -40476816
7721 -40476816 -10197694 40706744 57355567 38851398 24144695 23333871 18191286 11733769
7713 11733769 20091436 27103680 3024280 -37497208 -49140628 -25425085 -4377778
7706 -4377778 -5039334 -8357476 -5354904 -14364187 -38013148 -46156579 -18568258 27263343
7698 27263343 62752348 75194042 63001182 33974437 13165067 22160587 45082503
7691 45082503 43221222 6056409 -40325490 -73371688 -88902256 -78876710 -36357356
7684 -36357356 12616224 25017703 -99252 -17776807 -3673341 16675406 19307174
7677 19307174 18215410 27788338 31258439 17210542 11074996 34114456 59787943 49881143
7669 49881143 13910830 -5931186 3614844 16309674 10991711 -5423889 -18388094
7662 -18388094 -23045921 -20163496 -14796824 -18454748 -35223274 -47886084 -35227814 -1990048
7654 -1990048 24810397 29484290 22509998 20293527 23607546 20512232 2439309 -25505368
7646 -25505368 -45602896 -40358595 -10817081 19506599 26543415 11490299 -2212007
7639 -2212007 1709772 14089644 16030662 5967303 435172 8120833 16534986 13027758
7631 13027758 6759811 12547050 20976898 9923565 -14523528 -19145255 5291577 26400185
7623 26400185 22175109 17966195 41962065 72168857 67092560 30156625 1265371 -3552731
7615 -3552731 -1262186 441475 9364421 17602320 10767264 6130446 31274256 64022493
7607 64022493 51178209 -3442848 -32148418 -6104852 18373605 -8032851 -48450512
7600 -48450512 -42971795 -3003571 17013867 8403104 6188564 18772386 21401123 11298282
7592 11298282 12021267 22895462 16501525 -6847786 -10007912 21510082 50521834 37533953
7584 37533953 -9167454 -49327982 -55112227 -26879491 16556419 50705957 60846847
7577 60846847 53092627 43206398 36226852 27885195 19260978 13093588 2330329 -17044028
7569 -17044028 -27949294 -11364672 19909648 32885319 19154750 1298638 -5932507
7562 -5932507 -11086934 -18103788 -14803945 -938029 1772173 -15086624 -26103352 -7292394
7554 -7292394 27522195 46696518 41891172 28236637 16108633 5545547 1340623 11106938
7546 11106938 29612647 43331821 51222883 65210943 87751362 103220842 97358993
7539 97358993 75544614 55400563 46808036 44417032 37153788 21505923 5759519 1337986
7531 1337986 9044946 16238701 11737411 1764022 3673142 21508366 35843481 25944872
7523 25944872 -2218570 -20985966 -14300222 5830415 20291508 26875588 32847151 35692669
7515 35692669 28966650 21185655 28346061 47734891 59388353 56521398 52984556 53611088
7507 53611088 40823953 5677276 -28014902 -31446974 -9597690 8604140 9309234 1779311
7499 1779311 -5418944 -12491008 -13460938 4133522 38003535 65370816 67056112 48653549
7491 48653549 31363061 26467659 23997478 8090686 -16386716 -19825043 17095532 67938923
7483 67938923 82497921 50523673 17692508 22097753 41687310 32782394 -1004201
7476 -1004201 -16798837 762531 21997652 22543671 12528301 6310391 -1901594 -16238371
7468 -16238371 -21690104 -8007912 10407791 17252902 18814916 26605944 30816289 12733634
7460 12733634 -24292658 -55158182 -61798920 -48812432 -32019974 -20808904 -12007262
7453 -12007262 1923958 17560467 17718825 -6359910 -34356779 -35507095 -8715745 15039404
7445 15039404 14453174 776934 -9269173 -20173274 -41098771 -61817658 -65956805 -56007970
7437 -56007970 -45446878 -35633393 -20669063 -7994223 -11723516 -25720053 -23066994 11196607
7429 11196607 57959550 80805670 61399166 17619984 -11946756 -5315227 19606414
7422 19606414 25940464 3231124 -20299840 -15986006 9594421 28040597 25376900 10781418
7414 10781418 -1347351 -3493917 3864423 10431601 2176748 -19768153 -35773586 -34750815
7406 -34750815 -30813526 -36410657 -34687507 -4796124 35016320 41526430 4902706 -35383336
7398 -35383336 -39572962 -9235656 26853097 45839480 41008207 20458575 7124690
7391 7124690 21349798 51554209 60337552 32783254 134051 -1357298 21865678 35177240
7383 35177240 25038282 8898585 1580396 -2773357 -11918555 -18880025 -13114640 2652726
7375 2652726 14388044 11128010 -4941598 -19523473 -18622051 -3702016 8963532 7851767
7367 7851767 -1759213 -11055483 -22253008 -37720319 -44419986 -27902738 1736468 17009168
7359 17009168 6614226 -15657047 -35807243 -52286498 -59374075 -42114912 -1854395
7352 -1854395 31873525 33104495 11093311 -6359140 -10266894 -12605189 -19662002 -24926074
7344 -24926074 -26426325 -31036495 -39052413 -40923753 -33238579 -24408969 -20609042 -17996419
7336 -17996419 -12432878 -5845383 291467 7216939 11977694 8804830 -747262 -10104548
7328 -10104548 -20274485 -35800530 -47770506 -40506733 -20705821 -18124457 -44974685
7321 -44974685 -74345925 -75398928 -52364941 -28947161 -10852115 10339304 28351991
7314 28351991 28391133 18029515 20432526 34136508 30104782 -2836382 -38725090 -53909647
7306 -53909647 -57608537 -62995036 -53940960 -11428583 42331647 61566026 36784632 6224417
7298 6224417 3137741 19670510 33253607 42271634 55828392 66658485 59525721 39337513
7290 39337513 27341770 29331399 28136264 12406220 -5236696 -8342065 -1515570 -3274432
7282 -3274432 -22147277 -50165936 -73279043 -78575985 -59315193 -25834550 -4754420
7275 -4754420 -10614054 -21404272 -1805458 47001066 81327209 67927180 24979024
7268 24979024 -4567458 -6928499 -5161657 -19082115 -38864892 -42830684 -26415433 -4663280
7260 -4663280 6437462 2769325 -10519687 -26416089 -38824504 -43272907 -40963192 -41355590
7252 -41355590 -52975841 -68319474 -66568741 -39330273 -5940988 8269802 2188545
7245 2188545 -6660108 -10103963 -11280700 -4186869 20705470 48410062 48175084 20052933
7237 20052933 1380959 11168466 20830163 4059404 -17164042 -11375133 5152172 -5000121
7229 -5000121 -33451821 -36154254 -6667452 10949929 -8544887 -33718293 -26211697 5892826
7221 5892826 26080889 17137553 -7616032 -23547841 -11980303 26843440 69340442
7214 69340442 90035227 88210079 76887687 53403833 11511736 -21798649 -4306723
7207 -4306723 57066664 100737858 86208223 38858456 2285504 -13818303 -15249099
7200 -15249099 4803016 41728465 63105098 53349408 43396476 58252456 68160498 37464562
7192 37464562 -8364349 -18990230 1473 2428058 -16009283 -14881390 13041090
7185 13041090 25707085 4924287 -13466169 -2796574 12652342 4718923 -13977257
7178 -13977257 -20679222 -19712008 -19518452 -6269968 27280582 53851871 44989401 11433322
7170 11433322 -18533614 -40155395 -61315925 -69986010 -48415939 -10409354 8874828
7163 8874828 -1485771 -19095275 -23918756 -19610659 -17689876 -21022486 -28580490 -42374856
7155 -42374856 -62513258 -81157714 -85642338 -69580084 -44201888 -32984829 -42516957
7148 -42516957 -44289715 -8062291 46830719 63942701 23507003 -27785852 -38949566
7141 -38949566 -15740340 5644857 15406265 25097944 29430207 15688127 -1755753 1504609
7133 1504609 15432244 9524513 -12565791 -16127345 4544551 13706612 -8291893 -36893415
7125 -36893415 -47688308 -49383139 -53329934 -48571161 -32955675 -34115771 -66625232 -95773091
7117 -95773091 -80388782 -32723999 22321 392911 -7849833 -3730568 9662150 23751639
7109 23751639 32763247 24985789 -4700796 -33953141 -33964958 -12380382 -4708170 -19440759
7101 -19440759 -25595388 -5714674 13059637 2179352 -21840349 -23011187 -833358
7094 -833358 11507520 -1875061 -19068876 -15190650 3856663 13038865 1511619 -17244593
7086 -17244593 -24441160 -15381781 1627429 17783160 27509320 23744591 3078348 -21132833
7078 -21132833 -26503657 -12713176 -8407528 -29709770 -48712773 -30746767 9732334
7071 9732334 27416021 15395404 11385376 27925864 26123890 -17523038 -64015668 -68446747
7063 -68446747 -46871214 -42212262 -52173329 -42413111 -12903346 4182360 5238113 18531272
7055 18531272 45145298 50963918 28433169 15078020 31351269 46164097 30075574
7048 30075574 3454533 1370605 21331795 36601909 37974661 34157078 29180996 23504846
7040 23504846 21794141 21694221 12912265 898506 6727036 28847744 35593198 15166796
7032 15166796 -747514 11703591 29151581 24201806 12168955 16393451 21478711 6747495
7024 6747495 -5230892 13625936 37163640 21564658 -18601615 -33233079 -20078782
7017 -20078782 -17907747 -26572024 -9025066 26221613 24415733 -19488244 -43130098 -20316153
7009 -20316153 -4243981 -29620644 -47822685 -13855488 28605117 16953654 -26335164
7002 -26335164 -33704778 -1956889 13949136 -3000944 -15678365 -7899212 -8758328 -34259517
6994 -34259517 -59228252 -60371455 -45563092 -29719115 -16320750 -10275027 -18047314 -29915092
6986 -29915092 -29415880 -20524311 -18004740 -15848507 1701981 22528608 18319465 -6576143
6978 -6576143 -18195895 -8903112 -8809263 -31106260 -46432628 -29675336 1199235 13430326
6970 13430326 640773 -21270256 -35823153 -29210155 3589040 40293156 42296586
6963 42296586 1615860 -42465702 -49127890 -20729621 10764954 22448348 11604554
6956 11604554 -12871093 -34414517 -38463092 -29786286 -26356765 -30030533 -23553532 -4008110
6948 -4008110 5899367 -6936569 -23440584 -21305509 -5383404 7480657 14148396 18571908
6940 18571908 17188970 6978843 -6978836 -22026504 -37167710 -36999201 -6514321 29395914
6932 29395914 21472293 -29166786 -55859464 -18049981 35516686 40137578 12085106
6925 12085106 13037557 45977623 56847901 29691983 7670632 11964512 7758262 -26601899
6917 -26601899 -54937502 -40835898 -5542967 7746114 -4792591 -15963031 -12724785
6910 -12724785 -1829988 10700926 17785860 4787855 -29472492 -58281673 -56966074
6903 -56966074 -36218642 -25083451 -32111258 -43457129 -48227726 -44436018 -28863047 -2520038
6895 -2520038 19457496 22359051 11885051 3483325 -1935731 -14177800 -31072972 -38466208
6887 -38466208 -31371495 -19010064 -9493164 -3742540 -3557928 -11209318 -20019973 -18053856
6879 -18053856 -3692708 11616557 17349587 13311751 5650152 672102 1933415 7436491
6871 7436491 10696344 8180754 2129881 -6345676 -19188558 -32133555 -33626470 -20034981
6863 -20034981 -1703940 13702363 31010676 50071886 53209206 26573010 -17166649
6856 -17166649 -54377285 -77327682 -87051039 -74024671 -34038606 5224587 7081681
6849 7081681 -23117920 -41049375 -23620484 4535519 15801069 19577799 36731674
6842 36731674 58574405 59018165 35548178 13321553 12723355 30603704 49932845 53577905
6834 53577905 33077153 -2439681 -30005642 -37363531 -37765274 -47285904 -55537794 -38240921
6826 -38240921 3920419 40368759 48933650 40837265 38623220 43649363 38734514 16239345
6818 16239345 -9055266 -15584728 2098145 26608962 33273216 15563718 -5034420
6811 -5034420 -1309146 25649184 44356080 31715098 4021440 -4594014 10528750 18342594
6803 18342594 -2595098 -32782422 -41157711 -31374263 -34483917 -58689695 -73407018 -53078707
6795 -53078707 -14984676 4401103 -3389622 -16324383 -19139080 -19663188 -26067386 -28503039
6787 -28503039 -13666731 13936843 36263055 43225771 42180582 45057170 49637702 39988323
6779 39988323 11698167 -9757221 5308206 43693363 53836223 14326021 -28170241
6772 -28170241 -20256595 19696087 28378552 -6161719 -28392617 -4386205 26266576
6765 26266576 14192469 -27813552 -52757462 -46894473 -30348289 -15137964 -2670274
6758 -2670274 -4005017 -21897393 -28092436 -1186113 25328525 568625 -62934754 -95761629
6750 -95761629 -63651260 -6006679 27559515 32744065 26067167 10460603 -7906490
6743 -7906490 -5944125 21850605 43781613 35383943 17239653 18062307 26105358 14064027
6735 14064027 -8362151 -9177268 9603080 13609984 -6538712 -19446820 -2504366 25854923
6727 25854923 36301425 25528493 9414575 -492047 -9193 12065668 27990661 32807645
6719 32807645 23443189 15341641 19395810 23512492 11319779 -8716379 -10752423 11717497
6711 11717497 33234519 28662725 6714111 -2759383 9240078 19362281 7539376
6704 7539376 -14041631 -22779724 -21957939 -31115402 -47483258 -47272261 -27484441 -13984508
6696 -13984508 -17327916 -14100872 7906045 19238334 -4911914 -35152548 -25747597 15004441
6688 15004441 37738397 27699950 18706744 28161179 28034072 -1335797 -31063037 -25433971
6680 -25433971 6118882 27584010 25296549 11252524 -5079762 -20745856 -26271434
6673 -26271434 -13466576 9840018 30714471 47719130 60228147 54699828 24035291
6666 24035291 -9324272 -14432557 8324406 30006037 31761246 19498470 3649975
6659 3649975 -12691852 -25435377 -30515132 -34645262 -46275281 -56596337 -50083709 -32434046
6651 -32434046 -23667705 -23548039 -13412574 3008865 -4024774 -37553813 -52883331 -17640985
6643 -17640985 34811418 48692748 24408581 11538102 30007089 44122610 24055302
6636 24055302 -8589817 -19232997 -13355889 -21131987 -47581490 -69437439 -73852703 -70968838
6628 -70968838 -67908682 -56246631 -32215235 -9384970 -1316260 -5362993 -12311428 -20188182
6620 -20188182 -29537025 -34944370 -30474920 -16419788 5142840 31569914 50245766 42029899
6612 42029899 6678038 -26974118 -32111370 -16247119 -5517417 -6059007 -3533982 4685052
6604 4685052 5406730 664194 13164394 47593897 71504605 54831516 11276166 -20513635
6596 -20513635 -23933551 -11054208 6466547 26767954 41804015 38933319 23447938
6589 23447938 17662094 28956556 36592835 21475143 -5134131 -16301399 -4167758
6582 -4167758 13471623 17421633 5956141 -10516007 -23697257 -31903720 -35164822 -32051363
6574 -32051363 -23185709 -14485840 -11575589 -11090181 -4862698 4226239 -59782 -25438070
6566 -25438070 -54938357 -64824296 -53196792 -36554874 -22700373 -6315591 8886069
6559 8886069 7109794 -11979231 -23864592 -11675914 8828990 13325094 2908052 -5660463
6551 -5660463 -9940276 -16512427 -14989162 10488468 42760978 38510362 -12818560 -64853884
6543 -64853884 -70370125 -41191617 -26365974 -43776484 -63568769 -57020839 -32064881
6536 -32064881 -11767435 -1330119 7655221 14778022 10431888 -7730072 -31614669 -53477761
6528 -53477761 -69230453 -73153903 -60606667 -37501406 -18542310 -13028861 -17240059 -21459052
6520 -21459052 -19168546 -9282471 3991132 12120842 9786246 3661726 6721207 20337854
6512 20337854 29615818 22860144 9179327 6921428 17209300 20456682 2619977 -23952341
6504 -23952341 -33399018 -16072968 12915491 34271766 43530507 44016342 30760173 -2894603
6496 -2894603 -42639785 -55585962 -27361250 15136479 34570924 29329690 28617572 44516879
6488 44516879 54960604 41814258 20401425 13950971 18858941 18508408 16989951 30446821
6480 30446821 51026363 50204788 21948125 -4529102 -5319437 6916714 5888939 -11362078
6472 -11362078 -26331932 -26448371 -15478504 -3257354 3131189 2658153 2723849 12314922
6464 12314922 27731761 34834377 30859454 30207836 39837714 45352981 35653105 24794008
6456 24794008 29270299 38051395 31214956 18405629 27293475 55721531 68866204 51545655
6448 51545655 32347347 40431439 63895352 71098529 54199485 29969140 11551708
6441 11551708 1585891 3570876 17918623 31937785 33246830 28827708 32032558 35760197
6433 35760197 21108637 -8495367 -26735391 -23066066 -17895832 -28108969 -39131250
6426 -39131250 -28916559 -3916264 10419795 6846959 2340387 8636653 16952536 16315324
6418 16315324 10496302 8206275 8051678 3229008 -5911312 -13508015 -18290118 -23535868
6410 -23535868 -29156671 -31455897 -30084223 -28987883 -30944151 -36497666 -46483155 -58564888
6402 -58564888 -63064276 -52032412 -32911702 -21524379 -18229022 -4904346 25691124
6395 25691124 51291204 46238779 17216141 -5705954 -8983884 -5514485 -5146808 155443
6387 155443 13987385 22077131 16591552 14127170 28613817 41667835 26353250 -7896017
6379 -7896017 -24031844 -11709866 -2795271 -22102023 -48552053 -44525410 -6932405 32865843
6371 32865843 51278861 52996030 51203470 47356553 36808181 22063556 12301601 14271895
6363 14271895 26598253 38802869 35801009 10662721 -24497494 -47094783 -47615567 -39030112
6355 -39030112 -38196308 -44118710 -42768986 -29658974 -16336197 -12798777 -14306214 -11949850
6347 -11949850 -7312834 -6172401 -3468382 11291808 34000256 46279895 40705560 31997592
6339 31997592 34330061 39666615 31298645 9856611 -8935173 -16415360 -15474287 -7626772
6331 -7626772 6689423 17006489 12036530 2109278 11641307 42596289 65816837 59934118
6323 59934118 40199049 33276419 39690128 41146439 33347908 28056681 27018609 17074934
6315 17074934 -5758815 -25817058 -28287614 -18194764 -12851765 -23551503 -48510468
6308 -48510468 -76305268 -92051893 -85599607 -58350396 -22471401 5128272 9838155
6301 9838155 -9153606 -29108157 -18408866 25871085 65097965 61087339 23885990
6294 23885990 -3031621 -961557 6197825 -5054641 -24529301 -30297170 -20729035 -6448819
6286 -6448819 12164301 37646063 56975432 54383839 39044996 37531408 56085189 70204658
6278 70204658 59985165 39902271 39048251 59447181 71055052 51119959 14637330
6271 14637330 -6131203 -5635613 -10652313 -38186692 -66546226 -63678397 -31349964 630114
6263 630114 17321282 29176513 39392397 31559411 2105137 -22160672 -19030709 -2515379
6255 -2515379 2980604 1198129 9110307 18969552 10148411 -7642664 -1077276 32639102
6247 32639102 54435099 38770915 8154403 -6425902 -10505773 -25069453 -42888484
6240 -42888484 -39402637 -16681338 -3338657 -11546590 -23355916 -24112833 -22833314 -29750718
6232 -29750718 -36817033 -34927448 -32109861 -36887224 -36903625 -14639689 21861445 44017514
6224 44017514 38693450 22710018 17693898 23780308 25351533 14624950 1578389 2140268
6216 2140268 19722646 38906769 40195682 23083013 8014755 9166892 14213981 4554731
6208 4554731 -11813970 -9080994 14670469 29550576 17480797 710111 9059069 36534160
6200 36534160 53240628 49008703 40202042 38136580 35870450 28215122 23391908 29043646
6192 29043646 42306373 57546850 69581503 67516054 42412465 5430798 -18059905
6185 -18059905 -18426976 -11141884 -11249560 -14938530 -14024410 -12549949 -18197739 -29415253
6177 -29415253 -40322210 -47425124 -44727603 -25497433 3433987 22825528 23870163 15195940
6169 15195940 1652757 -22284463 -47297140 -43915336 -4509217 31545247 24328697
6162 24328697 -9657495 -20236787 4118653 23320853 9030660 -13727653 -5484646
6155 -5484646 30693123 54920032 44748146 21840973 19145145 34812576 34455050 675012
6147 675012 -37424361 -40899776 -14820171 2758392 1711833 11123492 39404169 46928481
6139 46928481 7922965 -37568230 -36154118 786803 20034181 9795427 5474280
6132 5474280 18907960 19724997 -5087149 -26000976 -21678100 -9144124 -4628653 2589426
6124 2589426 15462725 10578295 -18038158 -34939667 -15535888 10931963 6169348 -17750716
6116 -17750716 -21826500 -868184 17481027 18117457 7245158 -10054727 -27142529 -24922290
6108 -24922290 1651922 20230836 1713560 -28804320 -24449090 8494041 16260414
6101 16260414 -20396675 -58724743 -60616304 -41996674 -34571244 -36267372 -28534353 -15622306
6093 -15622306 -14565038 -21040226 -14471074 7880795 24602774 19179430 1095298 -5923758
6085 -5923758 8737114 29612455 31630535 10889733 -9271912 -10913438 -7782283 -20935358
6077 -20935358 -39494027 -34837364 -10517832 -1959376 -17956673 -19899902 18871321 64636444
6069 64636444 66102826 24667564 -13615087 -24315706 -24800653 -29825578 -25830726 -2305088
6061 -2305088 21376877 21617176 5075344 -3826301 479975 1374289 -10516229 -23898938
6053 -23898938 -25153712 -14735299 -383121 12928724 19351226 10925441 -9190333 -22206105
6045 -22206105 -16187335 -5537805 -11040783 -25168440 -18943177 14571284 46381285 50039916
6037 50039916 33352213 18475653 9863002 793177 -4125054 3377641 14392178 13493213
6029 13493213 5736852 10610641 30480406 45442826 39750649 16018464 -14265384 -35514585
6021 -35514585 -28108388 11531930 51384628 50869627 11044440 -28241144 -45242349 -58930272
6013 -58930272 -83557240 -94685716 -65237739 -10972611 29257490 43967916 51672072
6006 51672072 62088609 63004325 45402148 18892989 -2053541 -11988007 -11918342 -5293047
5998 -5293047 1069797 1925321 1446885 8487320 22779798 32207468 25825976 6792354
5990 6792354 -8570997 -5598905 12304356 24989103 18986999 4333477 -2761812 -7003082
5982 -7003082 -24016356 -45922808 -44124560 -14059138 10097160 1556199 -21178201 -22827949
5974 -22827949 860574 25981711 35829873 30423379 13846210 -3657738 -1586197 27634641
5966 27634641 58909423 62017717 41997685 27630114 26790131 21584100 5422188 -4447241
5958 -4447241 4430464 22624133 35455402 37269478 26922548 8071853 -5549972 -4436366
5950 -4436366 -1434137 -14942305 -37795898 -47485411 -42928075 -40805072 -37742111 -12954085
5942 -12954085 27359860 48293125 40465185 35727379 50741071 55815602 26980878 -8947609
5934 -8947609 -16841440 -8749958 -15398039 -28089689 -17608854 4511743 -3315186 -41944275
5926 -41944275 -61353675 -32561697 11576148 25488990 8592582 -7711697 -7911265
5919 -7911265 -4691832 -14867435 -39036652 -60078092 -56700149 -27237060 191265 -3253181
5911 -3253181 -27356025 -32799724 -5123826 25439345 28638438 13931177 7059886 7939012
5903 7939012 -2107187 -22760149 -32312662 -21965497 -9657368 -14040588 -29704223 -35379855
5895 -35379855 -19470501 6022548 13953832 -12214133 -55571626 -75581883 -51486223
5888 -51486223 -10153588 3836758 -17333713 -38168363 -29491182 -4000871 8693879
5881 8693879 5193508 6660911 21346135 30958407 18661733 -6627973 -24639297 -31246078
5873 -31246078 -37320906 -45147402 -42630828 -24452966 -5221889 -2499680 -14778482 -25346403
5865 -25346403 -22313455 -6702816 12484641 21353216 7729860 -20419390 -30748371
5858 -30748371 -1937828 39508143 43877001 3579342 -34991847 -36649024 -23583802
5851 -23583802 -33487725 -59573061 -66938833 -50058777 -33182926 -22239933 -206349
5844 -206349 28660253 35123728 16760337 10136772 30786346 41438973 10575363 -31280060
5836 -31280060 -32687159 4566157 33823264 31792832 16976651 7063307 -575914 -4815464
5828 -4815464 4382013 19418946 15494944 -13019390 -43457044 -58829556 -63867848 -61282298
5820 -61282298 -42197316 -9889924 16610370 33596796 56388256 79763607 71541939
5813 71541939 27644344 -2762373 19577949 63379245 67195503 21745743 -26020385
5806 -26020385 -38817504 -21999837 2195766 17863460 14758192 -4348934 -15284499
5799 -15284499 2429825 34011157 47224645 36042130 20242029 10114200 3340153
5792 3340153 8567559 33198134 51316385 27682184 -22474155 -42717803 -14665349
5785 -14665349 17018150 14326808 -5502041 -14047944 -18387368 -30508954 -30650603 -3060422
5777 -3060422 22490564 10332435 -21000024 -22855464 12864742 48843471 59437556
5770 59437556 53937315 48082762 47325643 54583211 64125094 54875481 19854801 -9610363
5762 -9610363 -3772070 15901496 9540370 -12456130 -7118062 21227566 22027983 -13403701
5754 -13403701 -31738599 -7641118 11958476 -9417185 -32027022 -9307476 27696188
5747 27696188 20622107 -16431381 -19846253 17995617 39501845 17779136 -7721080
5740 -7721080 -5219881 2797277 -6772744 -11434612 12207440 37751093 25522994 -15100281
5732 -15100281 -40014796 -32624387 -16316468 -13137267 -22433359 -38330637 -59930881 -80341804
5724 -80341804 -86328646 -73787913 -50839283 -26303412 -7085945 -1653572 -9667423 -12095331
5716 -12095331 9617736 45267152 64693485 54968048 30738614 7653863 -12508345
5709 -12508345 -25937865 -20487035 1780092 15226340 1272914 -24126885 -30517681
5702 -30517681 -11930998 10147418 17305580 12400245 8871803 14287270 25603442 33332471
5694 33332471 29759216 15794794 -2616899 -23480975 -45053579 -54890669 -40148673
5687 -40148673 -13132284 -5065299 -23518027 -39141327 -31335079 -21055307 -31656769
5680 -31656769 -42340238 -19661111 21065811 32125790 5796609 -16881331 -12003346
5673 -12003346 671729 5961319 17842696 37939623 38977977 15985812 6459874 26279536
5665 26279536 33134278 -2576850 -35963025 -13734515 35449942 45447413 21634450
5658 21634450 26230275 63584363 66342491 10994217 -34273518 -12720567 38230221
5651 38230221 55197833 44461877 51308750 72951860 66966412 29230973 3640973
5644 3640973 15003315 39900280 49742512 44314214 34302516 22532981 13406088 15763971
5636 15763971 25232840 23620886 6300032 -6484633 3231291 25335748 35182493 26268805
5628 26268805 17909435 29434638 53434131 61501108 38152442 608851 -24676310
5621 -24676310 -36896715 -53276304 -70348924 -61526690 -21927373 13964879 18985162
5614 18985162 12335566 25523014 49936039 51659577 26270279 2647616 -5061571 -14483201
5606 -14483201 -38359735 -60329198 -59102708 -36778059 -12406689 -885372 -4349218
$$ [...]
##END NTUPLES=NMR SPECTRUM
##END=
