##TITLE=31Pdec_LR-760-1-C2-B2
 D2O, 24 sc
 20.1.2023
##JCAMPDX= 6.0         $$ Bruker NMR JCAMP-DX V2.0
##DATA TYPE= NMR SPECTRUM
##DATA CLASS= NTUPLES
##ORIGIN= UXNMR, Bruker Analytische Messtechnik GmbH
##OWNER= root
$$ XWIN-NMR		Version 3.5
$$ Fri Jan 20 14:54:38 2023 Russian Standard Time (UT+4h)  she@DPX200
##.OBSERVE FREQUENCY= 81.013821
##.OBSERVE NUCLEUS= ^31P
##.ACQUISITION MODE= SIMULTANEOUS
##.ACQUISITION SCHEME= undefined
##.AVERAGES= 24
##.DIGITISER RES= 16
##SPECTROMETER/DATA SYSTEM= spect
##.PULSE SEQUENCE= zgpg30
##.SOLVENT NAME= CDCl3
##.SHIFT REFERENCE= (INTERNAL, CDCl3, 0, 248.564)
##AUDIT TRAIL= $$ (NUMBER, WHEN, WHO, WHERE, WHAT)
$$ ##TITLE= Audit trail, XWIN-NMR		Version 3.5
$$ ##JCAMPDX= 5.01
$$ ##ORIGIN= Bruker BioSpin GmbH
$$ ##OWNER= she
$$ F:/spectra/data/she/nmr/P31/1/pdata/1/auditp.txt
$$ ##AUDIT TRAIL=  $$ (NUMBER, WHEN, WHO, WHERE, WHAT)
(   1,<2023-01-20 14:53:35.42 +0400>,<she>,<DPX200>,
      <created by zg, POWCHK disabled, PULCHK disabled
       configuration hash MD5:
       00 E9 B6 7A A2 85 ED C7 34 08 36 98 17 FE 4E 26
       data hash MD5: 32K
       E5 CB 22 07 A9 5C 5E 84 67 31 2F DF 1D 0F 26 95>)
(   2,<2023-01-20 14:53:38.29 +0400>,<she>,<DPX200>,
      <Start of raw data processing
       efp BC_mod = 2 LB = 1 FT_mod = 6 PKNL = 1 PHC0 = -10957.95 PHC1 = 67.05779 SI = 64K 
       data hash MD5: 64K
       7C 34 C3 88 F2 73 37 EF 27 7B 1C D5 44 99 97 40>)
(   3,<2023-01-20 14:53:50.89 +0400>,<she>,<DPX200>,
      <pk PHC0 = -26.31215 PHC1 = 0 
       data hash MD5: 64K
       BE B7 40 8B 8B 37 CD A7 49 D7 3A 08 F0 12 92 B3>)
(   4,<2023-01-20 14:53:56.28 +0400>,<she>,<DPX200>,
      <abs ABSG = 5 
       data hash MD5: 64K
       A4 3F 4F F0 7B 43 C5 BB F9 7C 19 0E 32 FB 77 82>)
$$ ##END=
$$ 
$$ hash MD5
$$ 52 97 AD BA DD A4 27 54 D7 57 F0 0D AF D0 88 D7
##$RELAX= 
##$RELAX= 
##$RELAX= 
##$RELAX= 
##$RELAX= 
##$RELAX= 
##$RELAX= 
##$RELAX= 
##$RELAX= 
$$ Bruker specific parameters
$$ --------------------------
##$DU= <F:/spectra>
##$EXPNO= 1
##$NAME= <P31>
##$PROCNO= 1
##$TYPE= <nmr>
##$USER= <she>
##$AMP= (0..31)
100 100 100 100 100 100 100 100 100 100 100 100 100 100 100 100 100 100 
100 100 100 100 100 100 100 100 100 100 100 100 100 100 
##$AQSEQ= 0
##$AQ_mod= 1
##$AUNM= <au_zg>
##$AUTOPOS= <>
##$BF1= 81.014009
##$BF2= 200.13
##$BF3= 200.13
##$BF4= 200.13
##$BF5= 200.13
##$BF6= 200.13
##$BF7= 200.13
##$BF8= 200.13
##$BYTORDA= 1
##$CFDGTYP= 0
##$CFRGTYP= 5
##$CHEMSTR= <none>
##$CNST= (0..31)
1 1 145 1 1 1 1 1 1 1 1 1 1 1 1 1 1 1 1 1 1 1 1 1 1 1 1 1 1 1 1 1 
##$CPDPRG= <waltz16>
##$CPDPRG1= <>
##$CPDPRG2= <waltz16>
##$CPDPRG3= <>
##$CPDPRG4= <mlev>
##$CPDPRG5= <mlev>
##$CPDPRG6= <mlev>
##$CPDPRG7= <mlev>
##$CPDPRG8= <mlev>
##$CPDPRGB= <>
##$CPDPRGT= <>
##$D= (0..31)
0 1 0 0 0 0 0 0 0 0 0 0.03 2e-05 3e-06 0 0 0 0 0 0 0 0 0 0 0 0 0 0 0 0 
0 0 
##$DATE= 1674212014
##$DBL= (0..7)
120 120 120 11 120 120 24 19 
##$DBP= (0..7)
150 150 150 150 150 150 150 150 
##$DBP07= 0
##$DBPNAM0= <>
##$DBPNAM1= <>
$$ [...]
##$SUBNAM3= <"">
##$SUBNAM4= <"">
##$SUBNAM5= <"">
##$SUBNAM6= <"">
##$SUBNAM7= <"">
##$SUBNAM8= <"">
##$SUBNAM9= <"">
##$SW= 501.771253377433
##$SWIBOX= (0..15)
0 1 3 0 0 0 0 0 0 0 0 0 0 0 0 0 
##$SW_h= 40650.406504065
##$TD= 32768
##$TD0= 1
##$TE= 0
##$TE2= 300
##$TE3= 300
##$TEG= 300
##$TL= (0..7)
0 120 53 12 22 120 120 120 
##$TP= (0..7)
150 150 150 150 150 150 150 150 
##$TP07= 0
##$TPNAME0= <>
##$TPNAME1= <>
##$TPNAME2= <>
##$TPNAME3= <>
##$TPNAME4= <>
##$TPNAME5= <>
##$TPNAME6= <>
##$TPNAME7= <>
##$TPOAL= (0..7)
0.5 0.5 0.5 0.5 0.5 0.5 0.5 0.5 
##$TPOFFS= (0..7)
0 0 0 0 0 0 0 0 
##$TUNHIN= 0
##$TUNHOUT= 0
##$TUNXOUT= 0
##$USERA1= <user>
##$USERA2= <user>
##$USERA3= <user>
##$USERA4= <user>
##$USERA5= <user>
##$V9= 5
##$VALIST= <valist>
##$VCLIST= <CCCCCCCCCCCCCCC>
##$VD= 0
##$VDLIST= <DDDDDDDDDDDDDDD>
##$VPLIST= <PPPPPPPPPPPPPPP>
##$VTLIST= <TTTTTTTTTTTTTTT>
##$WBST= 1024
##$WBSW= 4
##$XGAIN= (0..3)
0 0 0 0 
##$XL= 0
##$YL= 0
##$YMAX_a= 2777
##$YMIN_a= -3865
##$ZGOPTNS= <>
##$ZL1= 120
##$ZL2= 120
##$ZL3= 120
##$ZL4= 120
##$ABSF1= 248.5645
##$ABSF2= -253.2056
##$ABSG= 5
##$ABSL= 3
##$ALPHA= 0
##$AQORDER= 0
##$ASSFAC= 0
##$ASSFACI= 0
##$ASSFACX= 0
##$ASSWID= 0
##$AUNMP= <proc_1d>
##$AZFE= 0.1
##$AZFW= 0.5
##$BCFW= 0
##$BC_mod= 2
##$BYTORDP= 0
##$COROFFS= 0
##$CY= -3
##$DATMOD= 1
##$DC= 0
##$DFILT= <>
##$DTYPP= 0
##$F1P= 0
##$F2P= 0
##$FCOR= 1
##$FTSIZE= 65536
##$FT_mod= 6
##$GAMMA= 0
##$GB= 0
##$INTBC= 1
##$INTSCL= 6.047779e-11
##$ISEN= 30
##$LB= 1
##$LEV0= 0
##$LPBIN= 0
##$MAXI= 10000
##$MC2= 0
##$MEAN= 0
##$ME_mod= 0
##$MI= 50
##$NCOEF= 0
##$NC_proc= -7
##$NLEV= 6
##$NOISF1= 182.463
##$NOISF2= 159.3651
##$NSP= 0
##$NTH_PI= 0
##$NZP= 0
##$OFFSET= 248.5645
##$PC= 4
##$PHC0= -10984.26
##$PHC1= 67.05779
##$PH_mod= 1
##$PKNL= yes
##$PPARMOD= 0
##$PSCAL= 0
##$PSIGN= 0
##$REVERSE= no
##$SF= 81.0140089999694
##$SI= 65536
##$SIGF1= 159.3651
##$SIGF2= -187.1042
##$SINO= 113.3802
##$SIOLD= 16384
##$SREGLST= <1H.CDCl3>
##$SSB= 0
##$STSI= 65536
##$STSR= 0
##$SW_p= 40650.406504065
##$SYMM= 0
##$S_DEV= 0
##$TDeff= 32768
##$TDoff= 0
##$TI= <>
##$TILT= no
##$TM1= 0
##$TM2= 0
##$TOPLEV= 0
##$USERP1= <user>
##$USERP2= <user>
##$USERP3= <user>
##$USERP4= <user>
##$USERP5= <user>
##$WDW= 1
##$XDIM= 65536
##$YMAX_p= 471447899
##$YMIN_p= -29378473
$$ End of Bruker specific parameters
$$ ---------------------------------
##NTUPLES= NMR SPECTRUM
##VAR_NAME=  FREQUENCY,     SPECTRUM/REAL,   SPECTRUM/IMAG
##SYMBOL=    X,             R,               I
##VAR_TYPE=  INDEPENDENT,   DEPENDENT,       DEPENDENT
##VAR_FORM=  AFFN,          ASDF,            ASDF
##VAR_DIM=   65536,         65536,           65536
##UNITS=     HZ,            ARBITRARY UNITS, ARBITRARY UNITS
##FACTOR=    0.620285442955139, 1,           1
##FIRST=     20137.2065510682, 0,            0
##LAST=      -20513.1999529968, 0,           0
##MIN=       -20513.1999529968, -29378473,   0
##MAX=       20137.2065510682, 471447899,    0
$$ Real data points
##PAGE= N=1
##DATA TABLE= (X++(R..R)), XYDATA
$$ [...]
40299c971774M91826l2776q38792n27317M56233N66680j15781J9153J348085K380329
$$ -3971774 -3479948 -3512724 -4351516 -4878833 -4422600 -3855920 -3971701 -3952548 -2604463 -224134
40289b24134K142048J257746K59178j144459k429245k038358M8505J531862J039205
$$ -224134 1917914 3175660 3434838 2290379 -138866 -2177224 -2128719 -596857 442348
40280D42348K09657O99494J079295o70394l072024k848942j28066J518257N26028
$$ 442348 652005 1351499 2430794 1760400 -1311624 -4160566 -4288632 -2770375 -2244347
40271b244347n66886L69776J608760P39331j102488r57613J265333K658432J628377
$$ -2244347 -2811233 -2441457 -832697 -93366 -1195854 -2153467 -888134 1770298 3398675
40262C398675j76230q05958q16698j757478l015706k130441J429200M406612L266826
$$ 3398675 3222445 2416487 1599789 -157689 -3173395 -5303836 -3874636 531976 3798802
40253C798802r39273l319711j361788J787252J923494l77738j357948j44073N29347
$$ 3798802 2859529 -460182 -1821970 -34718 1888776 1511038 153090 9017 538364
40244E38364n52574j294994m96506J10467l45928Q1149J959300K180469q07655
$$ 538364 -14210 -1309204 -1805710 -1695243 -2041171 -1960022 -722 2179747 1372092
40235A372092l055532p99928K821055K128375j914783l049035K31894K497623
$$ 1372092 -1683440 -2483368 337687 2466062 551279 -2497756 -2265862 231761
40227B31761M35533k118744r48094K016184K717558J429659Q65925Q42015n39770
$$ 231761 667294 -1451450 -2399544 -383360 2334198 3763857 4629782 5471797 4932027
40218D932027k245600j492715J160035K102598J03890k138593k304381j131900
$$ 4932027 2686427 1193712 2353747 4456345 4560235 2421642 117261 -1014639
40210a014639o8052Q78346J753823J512595k09774j785639j509661J60218J319142
$$ -1014639 -1082691 -204345 1549478 3062073 2852299 1066660 -443001 -282783 1036359
40201A036359Q28531q25992k073195j246128J843727M744387M081453m94006n083974
$$ 1036359 1864890 1038898 -1034297 -2280425 -436698 4307689 8389142 7895136 2811162
40192B811162n577398k256150J012636J728353J117319J300804K016484J539039
$$ 2811162 -2766236 -5022386 -4009750 -2281397 -1164078 136726 2153210 3692249
40184C692249k54012j625032j602471j044825p02843n0456R78618R04811r00398
$$ 3692249 3438237 1813205 210734 -834091 -1536934 -1587390 -608772 296039 -604359
40175f04359k200314o76997K185433K850539J003895k12095M22808L34266j873290
$$ -604359 -2804673 -3481670 -1296237 1554302 2558197 2346102 2768910 3103176 1229886
40166A229886l294884j287626J884988K411700O46611l49326k03834q52810j866866
$$ 1229886 -2064998 -3352624 -1467636 944064 1590675 1241349 1037515 184705 -1682161
40157a682161r52507J049566O62874j962096k338652J011453L438044J351650
$$ -1682161 -2634668 -1585102 -922228 -2884324 -5222976 -4211523 -773479 578171
40149E78171j881654j313903J778223K363097k50592k019375j020353L58599L52424
$$ 578171 -1303483 -2617386 -839163 1523934 1273342 -746033 -1766386 -1407787 -1055363
40140a055363L35110J264555J587427M27094m12393L53118J012729j73230j773135
$$ -1055363 -720253 544302 2131729 2558823 2146430 2499548 3512277 3339047 1565912
40131A565912j445398K21260P25602m20784j249533n22108P34433J057402L73408
$$ 1565912 120514 341774 1067376 646592 -602941 -1125049 -390616 666786 1040194
40122A040194l82055n20786j83829p8667n47187q01277K03288J891145K259964
$$ 1040194 658139 137353 -46476 -125143 -672330 -1473607 -1270319 620826 2880790
40113B880790O47038j033860r59808L1766J34724l70265R0711J221156R72270
$$ 2880790 3527828 2493968 1534160 1565926 1700650 1330385 1421096 2642252 3614522
40104C614522j048731k548623j665755N43152J617146O08067j194994j779487
$$ 3614522 2565791 17168 -1648587 -1105435 511711 1119778 -75216 -1854703
40096a854703m12716J359736J152941j024202k064884M7313K638974J778472j475759
$$ -1854703 -2267419 -907683 245258 -778944 -2843828 -2796515 -157541 1620931 145172
40087A45172k139713J029979L334015J384620j708486j575894N82734O92159j177768
$$ 145172 -1994541 -964562 2369453 3754073 2045587 469693 1052427 1744586 566818
40078E66818j462088L72702J023495q10133k444462k037333j223957j355162q23453
$$ 566818 -895270 -522568 500927 -309206 -2753668 -4791001 -6014958 -7370120 -8193573
40069h193573J646481M010589L702361J295639q29495j675593j507924l66404
$$ -8193573 -6547092 -2536503 1165858 2461497 1632002 -43591 -1551515 -1917919
40061a917919J184880J452529m0532j051248K95691K301895K079055j5927j135999
$$ -1917919 -733039 719490 678958 -372290 -76599 2225296 4304351 4288424 3152425
40052C152425m58722J2669q43385j531097n67596J263165K124892J216906p85345
$$ 3152425 2693703 2706372 1862987 331890 -235706 1027459 3152351 4369257 3583912
40043C583912k248313j594551Q80639K496714J133441j639461k399429o44512
$$ 3583912 1335599 -258952 621687 3118401 4251842 2612381 212952 -431560
40035d31560P51544J36102o83502P2490J059328J91263j713606k003657m3458
$$ -431560 319984 456086 -227416 -154926 904402 1095665 -617941 -2621598 -2665056
40026b665056K035793K189875N94129j043202j334802m05067L28042j36916q75298
$$ -2665056 -629263 1560612 2154741 1111539 -223263 -628330 -300288 -437204 -1312502
40017a312502k27172J382975J496562p03085k623020j771775N21340J128612j15457
$$ -1312502 -1539674 -156699 1339863 636778 -1986242 -3758017 -3236677 -2108065 -2223522
40008b223522l78247J467941K812536J115626k140713l113220n82387K345759
$$ -2223522 -2601769 -1133828 1678708 2794334 653621 -2459599 -3041986 -696227
40000f96227J946643j567617m134243k577812J623088M183887L108543M92802
$$ -696227 1250416 -317201 -4451444 -7029256 -5406168 -1222281 1886262 2379064
39992B379064q27389o38609m24285o14325l93592M56473J068503P19445m03695
$$ 2379064 1551675 913066 488781 -125544 -519136 -62663 1005840 1725285 1321590
39983A321590j488965j594945l78051J217126J784665J315390J003025R03162
$$ 1321590 -167375 -1762320 -2140371 -923245 861420 2176810 3179835 4082997
39975D082997k02282j829556j404899J359802K627290j21029l488398k918364
$$ 4082997 3880715 2051159 646260 2006062 4633352 4512323 1023925 -1894439
39967a894439J81108R53737p64920o96331J737445K011466j331171l450735j089710
$$ -1894439 -1713331 -759594 -1524514 -2220845 -483400 1528066 196895 -3253840 -4343550
39958d343550J985064J431224o49206k7452K210664K061276k71075j294867n62655
$$ -4343550 -2358486 -927262 -1576468 -1603920 606744 2668020 2396945 1102078 539423
39949E39423n64252j317032n00131J390939J355030m43120n20005J637119K261810
$$ 539423 -24829 -1341861 -1841992 -451053 903977 460857 -59148 1577971 3839781
39940C839781k14383k260082j109882Q03498K34491j619806j655094o6895M83408
$$ 3839781 3625398 1365316 255434 1058932 1293423 -326383 -1981477 -2048372 -1564964
39931a564964o23415j410719n46117J211382K374570J946861r1712k259633k359693
$$ -1564964 -2188379 -3599098 -4145215 -2933833 -559263 1387598 1295886 -963747 -3323440
39922c323440L0461K620383K898407Q00898j688663k628071j443708O20828J226986
$$ -3323440 -3292979 -672596 2225811 3026709 1338046 -1290025 -2733733 -2112905 -885919
39913h85919m39362j980352p65541J822359K135757J34608m95377J191961J569999
$$ -885919 -1325281 -3305633 -4071174 -2248815 -113058 21550 -473827 718134 2288133
39904B288133r24030k280190M65801L579281K276840j554537k717511j089254
$$ 2288133 1364103 -916087 -450286 3128995 5405835 3851298 1133787 44533
39896D4533o14321j601797n75607K476093L207981L43824j886441p06656J002826
$$ 44533 -569788 -2171585 -2747192 -271099 2936882 3280706 1394265 687609 1690435
39887A690435J07763j654918j223073N95322R92365j42924o65591J67419J142062
$$ 1690435 1798198 143280 -1079793 -484471 507894 364970 -300621 -133202 1008860
39878A008860J221325L52775r21711j455909l86345J140726R46246p26719j177610
$$ 1008860 2230185 2582960 1661249 205340 -181005 959721 1905967 1179248 1638
39869A638K97355R48196o84445j873818k81183J662224O20451j825898j608203
$$ 1638 298993 1247189 562744 -1311074 -1592257 69967 690418 -1135480 -2743683
39860b743683J025692J859786m42443k429292j515237N58862J365575J362156
$$ -2743683 -1717991 141795 -300648 -2729940 -4245177 -3686315 -2320740 -958584
39852i58584J788012J824806L58253j305181j022050Q62712J916796Q92784j085889
$$ -958584 829428 2654234 3012487 1707306 685256 1547968 3464764 4357548 3271659
39843C271659k354148k303277j235238J53801R67909O53673l80637j123057r76037
$$ 3271659 917511 -1385766 -2621004 -2467203 -1499294 -845621 -1226258 -2349315 -3325352
39834c325352j13368R73107J809538J979891J401125N87950J68261P6693k75143
$$ -3325352 -3438720 -2465613 -656075 1323816 2724941 3312891 3481152 3557845 3282702
39825C282702q98153r34944M5288J000304N49065j008757j883726j245534k91473
$$ 3282702 2384549 1449605 1494893 2495197 3044262 2035505 151779 -1093755 -1385228
39816a385228j79913j83960P08337J427607K32801j858811j686595J316370L523770
$$ -1385228 -1565141 -1749101 -1040764 386843 619644 -1239167 -2925762 -1609392 1914378
39807A914378J851540j921978l711649k507646o50027L22420J087007J867043
$$ 1914378 3765918 1843940 -1867709 -4375355 -5025382 -4702962 -3615955 -1748912
39799a748912J463437q5627n69016J022311K322950R03846j843427k646857j221170
$$ -1748912 -285475 -371102 -940118 82193 2405143 3308989 1465562 -1181295 -2402465
39790b402465l49771j230448j721519j58024J702396J375864m97541j171190L39987
$$ -2402465 -2752236 -3982684 -5704203 -5862227 -4159831 -2783967 -3281508 -4452698 -4112711
39781d112711K468862L534834K970358O52823k688113m586153k923184P49012
$$ -4112711 -1643849 1890985 4861343 5514166 2826053 -1760100 -4683284 -3934272
39773c934272K488696J163598l33933N0164O84355K1272k25733J373157K310734
$$ -3934272 -1445576 -281978 -615911 -565747 118608 139880 -85853 1287304 3598038
39764C598038L5353k828962j923792J615375K669275L61557r87420K59237L17732
$$ 3598038 3633391 804429 -1119363 496012 3165287 3526844 2539424 2798661 3116393
39755C116393k738330m741313k066214K254980L390156J847705J027273Q22918
$$ 3116393 378063 -4363250 -6429464 -4174484 -784328 1063377 2090650 2913568
39747B913568r69775l064427k229379O05189J355736k92755m11310K113912L361089
$$ 2913568 1943793 -1120634 -3350013 -2744824 -1389088 -1681843 -2093153 20759 3381848
39738C381848Q92825k183389k181514j45173O79274j05696m84377L03131J161852
$$ 3381848 4274673 2091284 -90230 -235403 443871 338175 -146202 156929 1318781
39729A318781J153263K01973j295183k229252j293377J048116K332471J010715
$$ 1318781 2472044 2674017 1378834 -850418 -2143795 -1095679 1236792 2247507
39721B247507j604976l266219l236359j849750O11668L175342L923175K208140
$$ 2247507 642531 -2623688 -5860047 -7709797 -7098129 -3922787 388 2208528
39713B208528o7353r36494r17900j482775k260935j789342k13338Q26100O79530
$$ 2208528 2141175 1204681 286781 -1195994 -3456929 -5246271 -5459609 -4633509 -3953979
39704c953979L18484N79925J176439J422888R35204j89638j114522p13487Q83885
$$ -3953979 -3635495 -3055570 -1879131 -456243 478961 289323 -825199 -1538686 -654801
39695f54801J893003R67201j011710k153579j756173l79870J201773K000506R57594
$$ -654801 1238202 2205403 1193693 -959886 -2716059 -3095929 -1894156 106350 1063944
39686A063944j461312k893684j871828O0956O76044K72691M74594R64585J24826
$$ 1063944 -397368 -3291052 -5162880 -5101924 -4425880 -4153189 -3678595 -2714010 -2589184
39677b589184j563899j617098O73920K915908K652199L5678k789473l529731j202315
$$ -2589184 -4153083 -5770181 -5096261 -2180353 471846 507524 -2281949 -5811680 -7013995
39668g013995K592909M347963K480199k77311n98748M94450k78230k398723k083453
$$ -7013995 -4421086 -73123 2407076 2129765 1531017 2025467 1747237 -651486 -2734939
39659b734939J011759K642676Q66145r22978j45918O93534p62065j879278Q6478
$$ -2734939 -1723180 919496 1785641 862663 716745 1410279 648214 -1231064 -1144586
39650a144586K196051L46453l309617l447367k22638J461347M91263P49692L360214
$$ -1144586 1051465 1397918 -1911699 -5359066 -5581704 -4120357 -3629094 -2879402 480812
39641D80812M244260J250321k024955k183763q78109p09922o92267O96485J703477
$$ 480812 4725072 5975393 3950438 1766675 888566 178644 -513623 182862 1886339
39632A886339M45096j132312m06283J197263O28050j500205k044501m62483R99165
$$ 1886339 2331435 1199123 792840 1990103 2618153 1117948 -926553 -1389036 -389871
39623c89871J322886J309171Q61709p20159k136219j301864Q82616J309510o27307
$$ -389871 933015 2242186 3103895 2383736 247517 -1054347 -171731 1137779 510472
39614E10472k251756j818984m49055N62540J328148J644991O59839r09421j031116
$$ 510472 -1741284 -3560268 -4009323 -3446783 -2118635 -473644 186195 -723226 -1754342
39605a754342K75194O66010m66162p77147P13619J335683q39091l095065j734382
$$ -1754342 -1479148 -813138 -1279300 -2056447 -1342828 -7145 -846236 -3941301 -5675683
39596e675683K100311L688024J269327j754589j615728J150201K958817J821181
$$ -5675683 -3575372 112652 1381979 -372610 -1988338 -838137 2120680 3941861
39588C941861o56480j807302j259950p04446p36514N5634J956701K387194k84700
$$ 3941861 3285381 1478079 218129 -486317 -1222831 -1167197 789504 3176698 2891998
39579B891998l025309j840009J744496K347639r48702k981438p98887J598319
$$ 2891998 -133311 -1973320 -228824 2118815 1170113 -1811325 -2610212 -1011893
39571a011893R7924k510557j228191K616272L326708j3977k251394l86083K222315
$$ -1011893 -913969 -3424526 -4652717 -2036445 1290263 1276286 -975108 -1361191 861124
39562H61124J630011j004481k184454j468873r37295j000314k6900K153134L200676
$$ 861124 2491135 1486654 -697800 -2166673 -3103968 -4104282 -4131182 -1978048 1222628
39553A222628J624203o86171q48984R86351J923404O06541r69181r40504n91889
$$ 1222628 2846831 2160660 1311676 2298027 4221431 4827972 3858791 2918287 2326398
39544B326398j675795k648672r70021J947928K270512M9805p25154Q26181O60482
$$ 2326398 650603 -1998069 -2968090 -1020162 1250350 1300155 575001 1401182 2061664
39535B061664k813037m937482k091696K025200K213299j25445l28396J291047
$$ 2061664 -751373 -5688855 -7780551 -5755351 -3542052 -3667497 -3995893 -2704846
39527b704846R30891j102479j061916R68182J214968n24736m58718J817290K201468
$$ -2704846 -1773955 -2876434 -3938350 -2970168 -1755200 -2279936 -2738654 -921364 1280104
39518A280104l07562j463246O23006K040053J33263j927348j186949m0483j181049
$$ 1280104 972542 -490704 132302 2172355 2305618 378270 -808679 -849162 -2030211
39509b030211k335123o93030J647022J544544L87868P57988J021254j160842k940770
$$ -2030211 -4365334 -5058364 -3411342 -1866798 -1478930 -720942 300312 -860530 -3801300
39500c801300k32220M419315M590147j06821l411017k106132j5280o92806j843363
$$ -3801300 -4033520 385795 4975942 4869121 1458104 -648028 -663308 -1356114 -3199477
39491c199477m0063L221426L845980J165457j556661j657325J27822J160589M5052
$$ -3199477 -3239540 -18114 3827866 4993323 3436662 1779337 1907159 3067748 3112800
39482C112800j793338j759534L82556J719812K10199j907662j133363J834518
$$ 3112800 1319462 -440072 -57516 1662296 1872495 -35167 -1168530 665988
39474F65988K831220L34010k482919k559634p99857K34200j7602m21221l01177
$$ 665988 3497208 3831218 1348299 -1211335 -2011192 -1776992 -1794594 -2215815 -2516992
39465b516992K72853J066634J437563P16958m31040m97110L71589J88367j588332
$$ -2516992 -2244139 -1177505 260058 977016 545976 48866 420455 608822 -979510
39456i79510k602097r97541J457529J702391k54283j478836k52959J852379K283756
$$ -979510 -3581607 -4579148 -3121619 -1419228 -1673511 -3152347 -3405306 -1552927 730829
39447G30829N58101j481385j820781l42799J151685J051597j08932m51014N36988
$$ 730829 1288930 -192455 -2013236 -2356035 -1204350 -152753 -261685 -712699 -175711
39438a75711J227916K82412j330738j732957o89317M58347Q79854R22542Q18123
$$ -175711 1052205 1334617 3879 -1729078 -2418395 -1960048 -1080194 -157652 660471
39429F60471J15000j162143j847261r54211Q31894J815987J358148N37629N35083
$$ 660471 775471 -386672 -2233933 -3188144 -2356250 -540263 817885 1355514 1890597
39420A890597J017160P53545n04670j612380j581148p58132q8234J55937L47680
$$ 1890597 2907757 3661302 3156632 1544252 -36896 -795028 -883262 -727325 -379645
39411c79645O43617P75195N35736J4848n61346r31145q68056l54270M21385J217810
$$ -379645 263972 1039167 1574903 1589751 1028405 97260 -770796 -1125066 -703681 514129
39401E14129J664897J294307K10896n67439l06492K02309k18426j043274p90585
$$ 514129 2179026 3473333 3684229 3116790 2810298 3012607 2794181 1750907 960322
39392I60322J82167j29181j810553k182365Q8436K413207J913109l20561j108257
$$ 960322 1142489 1013308 -797245 -2979610 -2891174 -477967 1435142 1114581 6324
39383F324J21908J224919R59216J5944r59561j775479j546596L16104K253535
$$ 6324 128232 1353151 2312367 2328311 1368750 -406729 -1953325 -1637221 616314
39374F16314K172497O41823l4387M15108K32412p70539q36455J78061J79221j351031
$$ 616314 2788811 3430634 3396247 3811355 4043767 3273228 2436773 2614834 2794055 1443024
39364A443024k094515p80470N63022r4044j711626k143746j046088P62478K739969
$$ 1443024 -651491 -1431961 -868939 -962983 -2674609 -4818355 -5864443 -5101965 -2361996
39355b361996L847246K520066p78268l013103k438619r52842o52541l82981J589059
$$ -2361996 1485250 4005316 3227048 213945 -2224674 -3177516 -3830057 -4213038 -2623979
39346b623979L520399K313698j278589l085543j224246J517816J618289j011540
$$ -2623979 896420 3210118 1931529 -1154014 -2378260 -860444 757845 -253695
39338b53695l561984l584270j093334J711852K570280J475171N39539J132434
$$ -253695 -3815679 -7399949 -8493283 -6781431 -4211151 -2735980 -2196441 -1064007
39330a064007K146502K001616J102589P69292P48299k47712j993138k704161j617819
$$ -1064007 1082495 3084111 4186700 4955992 5704291 5456579 3463441 759280 -858539
39321h58539o5482L58587l09924o39141N00129K417484K894646Q31165j641691
$$ -858539 -924021 -565434 -875358 -1514499 -1014370 1403114 4297760 5128925 3487234
39312C487234j485671O92811J110263j240649k478986N2578K967136J840670j651780
$$ 3487234 2001563 2694374 3804637 2563988 85002 137580 3104716 4945386 3293606
39303C293606k365549J70312J579961J53589j030937k36677J13677j384248k057156
$$ 3293606 928057 1098369 2678330 2831919 1800982 1564305 1677982 293734 -1763422
39294a763422l3223K029489J387719j47584L26944J655982R89044r25666j121489
$$ -1763422 -1796645 232844 1620563 1472979 1799923 3455905 4444949 3519283 2397794
39285B397794K86562M80223r79695j554348k85899Q22005N82029L66882J030465
$$ 2397794 2684356 3164579 2184884 630536 344637 1166642 1748671 2115553 3146018
39276C146018J091975n26080k316945k343928q27176P81535J794064K118887J491200
$$ 3146018 4237993 3711913 1394968 -948960 -1776136 -994601 799463 2918350 4409550
39267D409550J33127r20041j177986j289138j470904p87391Q99893J790715N34501
$$ 4409550 4542677 3622636 2444650 1155512 -315392 -1102783 -202890 1587825 2122326
39258B122326j458324j867089o87063K69296L36873L50288M60210p1886q04401
$$ 2122326 664002 -1203087 -1890150 -1620854 -1283981 -933693 -473483 -545369 -1349770
39249a349770j81345J707088K582349J237319n62994p96515j10479k93657j171768
$$ -1349770 -1531115 175973 2758322 3995641 3432647 2636132 2525653 2231996 1060228
39240A060228j159489j75112K17135n31924j136868n95153N18440J266145J460638
$$ 1060228 -99261 -274373 -57238 -589162 -1726030 -2321183 -1802743 -536598 924040
39231I24040J209158O40487L49177P61394R09145m99953k536046k646806m98929
$$ 924040 2133198 2773685 3122862 3884256 4793401 4293448 1757402 -889404 -1388333
39222a388333J066424J50622j474556j538596p97046q60265o87857J311369L208625
$$ -1388333 -321909 -171287 -1645843 -3184439 -3981485 -4841750 -5529607 -4218238 -1009613
39213a009613J751908j843550k711674M64633L323300K333557n39398j833915
$$ -1009613 742295 -1101255 -3812929 -3348296 -24996 2308561 1769163 -64752
39205f4752j578196j371346o78422J316364K555389Q48059j794206j668750P47454
$$ -64752 -1642948 -3014294 -3692716 -2376352 179037 1027096 -767110 -2435860 -1688406
39196a688406J657579K34253m33069R44378J728691K98837j075272m51078L48930
$$ -1688406 -30827 203426 -229643 714735 2443426 2742263 1666991 1215913 1564843
39187A564843p60727k253198j753165k23943K873n36226J88761J482724J017793
$$ 1564843 804116 -1449082 -3202247 -3426190 -3423317 -3959543 -3770782 -2288058 -1270265
39178a270265n48291j63729K251086L088911P58509j593357q84043J459594K172830
$$ -1270265 -1818556 -1982285 268801 3357712 4116221 2522864 1638821 3098415 5271245
39169E271245Q62364n36124j218825j684565j592905k17282J435246J436592k02906
$$ 5271245 6133609 5597485 4378660 2694095 1101190 883908 2319154 3755746 3552840
39160C552840j602771j901117j965216k097689j303708N16920J737816J414449
$$ 3552840 1950069 48952 -1916264 -4013953 -5317661 -4800741 -3062925 -1648476
39152a648476P71786J035202J305323J45921j829215k627861j486708O38575K599405
$$ -1648476 -876690 158512 1463835 1609756 -219459 -2847320 -4334028 -3695453 -1096048
39143a096048L624784K957410O36201j608166j942982q50935k93040o09459l62594
$$ -1096048 2528736 5486146 6122347 4514181 2571199 1720264 1427224 817765 455171
39134D55171N74290L95800j195622j641874M64121K407444J128827j775958k189400
$$ 455171 1029461 1425261 229639 -1412235 -948114 1459330 2588157 812199 -1377201
39125a377201L04488K009720R26649p58966q59056k99747m19097l57547N93428
$$ -1377201 -1072713 937007 1863656 1104690 245634 -54113 -473210 -830757 -237329
39116b37329Q17738p23726j814918l84325J449842M79723j953682j823955O97167
$$ -237329 580409 -143317 -1958235 -2342560 -892718 -412995 -2366677 -4190632 -3493465
39107c493465J136828j803298l591461q55309L175997L489789M97843j350864
$$ -3493465 -2356637 -4159935 -7751396 -8606705 -5430708 -1940919 -1443076 -2793940
39099b793940k63468J467493J874125J482587J017397R7393j097023j328320l55426
$$ -2793940 -3057408 -1589915 284210 1766797 2784194 2881587 1784564 456244 100818
39090A00818M17684J29042l78328l21540k56510o43861o58592L11045J170797
$$ 100818 518502 647544 269216 -52324 -308834 -952695 -1611287 -1300242 -129445
39081a29445O06381o89009q33782M64842J447455Q03332o72952j489016j421517
$$ -129445 476936 -212073 -1045855 -581013 866442 1669774 996822 -492194 -1913711
39072a913711j116187n30373P84402K052939J649071l13486j392250j23272J421484
$$ -1913711 -3029898 -3560271 -2775869 -722930 926141 612655 -779595 -902867 518617
39063E18617L68502k441189l188193m55734K669336K830625N62532j217678j110520
$$ 518617 887119 -1554070 -4742263 -5197997 -2528661 301964 864496 -353182 -1463702
39054a463702J13736J436351K258020J950427M98105q65560j063629p12151r88563
$$ -1463702 -1349966 86385 2344405 4294832 4792937 3927377 2863748 2151597 1163034
39045A163034j615606j386834j99010Q15853Q41458l8820j308594k112508j627982
$$ 1163034 -452572 -1839406 -2038416 -1222563 -381105 -419925 -1728519 -3841027 -5469009
39036e469009k61022N42605N17736J002027K024651J315877j709918l530932j280002
$$ -5469009 -5730031 -5187426 -4669690 -3667663 -1643012 -327135 -2037053 -5567985 -6847987
39027f847987K220773K255348m98571j260337R99142K333858Q39679n76289O0167
$$ -6847987 -4627214 -2371866 -2870437 -4130774 -3131632 -797774 41905 -534384 -474217
39018d74217N17271p45826j270324N35528J528365j098694m318940l414077P84189
$$ -474217 43054 -702772 -1973096 -1437568 90797 -1007897 -5326837 -8740914 -7956725
39009g956725L380609K583304R65249M76353M50367L99053R94910J904451J685470
$$ -7956725 -4576116 -1992812 -1027563 -551210 -100843 298210 1293120 3197571 4883041
39000D883041K49415r93311j495109j823449j791771p14283O87897R83698M12074
$$ 4883041 5132456 4139145 2644036 820587 -971184 -1685467 -997570 -13872 398202
38991C98202L07109N54555L3442q54284o83044L48889Q87056J033503J674039
$$ 398202 705311 1259866 1293308 439024 -244020 104869 991925 2025428 3699467
38982C699467J857275J62191j869911j504572K68704m4075k176011k068246R60112
$$ 3699467 5556742 5718933 3849022 2344450 2613154 2569079 393068 -1675178 -715066
38973g15066K488327M74093j141702M91078J970593J01920j557022J338970N372695
$$ -715066 1773261 2247354 1105652 1596730 3567323 3669243 2112221 3451191 8823886
38964H823886M030459j450292l756407j247008J94160j992104k725542J009019
$$ 8823886 12854345 11404053 7647646 6400638 6594798 4602694 1877152 2886171
38956B886171L829072O33364m422648m264210m3716J388152j194675k356909M2749
$$ 2886171 6715243 7348607 2925959 -1338251 -1381967 6185 -1188490 -3545399 -3502650
38947c502650J499005p51614k706075m38298L257031L497315R08913k29891Q74355
$$ -3502650 -2003645 -2755259 -5461334 -5899632 -2642601 854714 1763627 1533736 2408091
38938B408091J196845k71368j040715K78058J831594J889748J160503N76046n15610
$$ 2408091 3604936 3333568 2292853 2570911 4402505 6292253 7452756 8028802 7513192
38929G513192k493604l946498l531052j771149J73034J953451L129952K558931
$$ 7513192 5019588 1073090 -2457962 -4229111 -4056077 -2102626 1027326 3586257
38921C586257K28471j703949j411492Q7666N38830l11524q30733k71060M04521
$$ 3586257 3814728 2110779 699287 786953 1325783 1014259 183526 -87534 316987
38912C16987L98549J79790L54315N86464K24871n71783q81211j96500O84581M23362
$$ 316987 715536 895326 1249641 1836105 2060976 1489193 607982 411482 1096063 1519425
38902A519425r50418j676768p32265K46997o89946k149819q13376L132540N087150
$$ 1519425 569007 -1107761 -1840026 -1593029 -2282975 -4432794 -5246170 -2113630 2973520
38893B973520K127101k670723m284165k068946N54227J166995L07204o64037r31307
$$ 2973520 5100621 2429898 -1854267 -3923213 -3368986 -2201991 -1894787 -2558824 -3490131
38884c490131K5223J708598K146592L23451j640438j093441J109423J848670M61975
$$ -3490131 -3464908 -1756310 390282 713733 -926705 -2020146 -910723 937947 1399922
38875A399922p49280n65819k84370p46162q79017K5943J097701J683564K070890
$$ 1399922 650642 84823 -199547 -945709 -1824726 -1798783 -701082 982482 3053372
38866C053372J888517K65323j795101j826625M10270K175200J664152J47357q32661
$$ 3053372 4941889 5207212 3412111 1585486 1995756 4170956 5835108 5982465 5149804
38857E149804j624785k413913j819925M88331K245869J843426R39717J496747
$$ 5149804 3525019 1111106 -708819 -220488 2025381 3868807 4808524 6305271
38849F305271K241034P93981k180636l785702k981392j371220m51870k32187k17823
$$ 6305271 8546305 9340286 7159650 3373948 392556 -978664 -1430534 -1662721 -1880544
38840a880544j2882O78522J370186R39323l83419n90697R90664J945353L42776
$$ -1880544 -1893426 -1214904 155282 1094605 711186 120489 1111153 3056506 3399282
38831C399282j698979j003390J421752J732445o38135k057919m28164J739834
$$ 3399282 1700303 696913 2118665 3851110 3212975 1155056 726892 2466726
38823B466726J409782o96124j813317j091246J34151O78908L69041n39221j325202
$$ 2466726 3876508 3180384 1367067 275821 409972 1088880 1457921 918700 -406502
38814d06502q70789R53957K504699K136942L78288p76344m82132J98832J98543
$$ -406502 -1277291 -323334 2181365 4318307 4696595 3920251 3438119 3636951 3835494
38805C835494r5424R4130K77320o87298k431233k934668j324856L69475j88919
$$ 3835494 3740070 3834200 4111520 3424222 992989 -1941679 -3266535 -2897060 -3085979
38796c085979k000307j866658P60972K648341J541926m66512l63468J108296J057341
$$ -3085979 -5086286 -6952944 -6191972 -3543631 -2001705 -2468217 -2831685 -1723389 -666048
38787f66048n79354j021391O60762K126236J621826L56978p0066q5412m86716
$$ -666048 -1245402 -2266793 -1606031 520205 2142031 2499009 2428943 2343531 1856815
38778A856815n14958N75691J594983R98984o50944j574168j313689p46683k61648
$$ 1856815 1341857 1917548 3512531 4511515 3860571 2286403 972714 226031 -35617
38769c5617L45947O40254k584q76596n86122P42835J501163J031825M13159M44119
$$ -35617 310330 950584 948000 71404 -514718 228117 1729280 2761105 3174264 3618383
38759C618383N07487Q4458k43935k12956o10399j356454o58672J978962L548117
$$ 3618383 4125870 4210328 3966393 3753437 3143038 1786584 1127912 3106874 6654991
38750F654991J138593l202400m561451j986292M72641K99911J7600K015448L761327
$$ 6654991 7793584 4591184 29733 -1956559 -1483918 -1184007 -1166407 849041 4610368
38741D610368J865471j833750k749750n86918Q38865K18894J79680J597840J551146
$$ 4610368 6475839 4642089 1892339 1305421 2144286 2363180 2542860 4140700 5691846
38732E691846j232400l344629j871407R54273J395629k95787j271568p22552J47643
$$ 5691846 4459446 1114817 -756590 197683 1593312 1297525 25957 -696595 -548952
38723e48952R63377J741800J170244j373790l400323k326136J84574N13923j145288
$$ -548952 414425 2156225 3326469 1952679 -1447644 -3773780 -3589206 -3075283 -4220571
38714d220571j330090P12090J918851Q51999j9548J045541J959143N93379j370340
$$ -4220571 -5550661 -4838571 -2919720 -2067721 -2087269 -1041728 917415 1510794 140454
38705A40454j109275Q93492J809972O77014p81538r96378k78749K01387j08864
$$ 140454 -968821 -75329 1734643 2411657 1630119 633741 354992 556379 447515
38696D47515p29335o58639M21094J350230P43326q52942j329742O1200J600311
$$ 447515 -281820 -940459 -519365 830865 1574191 721249 -608493 -547293 1053018
38687A053018J625811P25832L80587O61270N37973l62946j453417k054054j739606
$$ 1053018 2678829 3404661 3785248 4446518 4984491 4621545 3168128 1114074 -625532
38678f25532m65888R41288J189635J41798p45567l14828P84785J207665O59229
$$ -625532 -1091420 -150132 1039503 1181301 435734 120906 905691 2113356 2772585
38669B772585k38368r30046r64797n506J293029J436280J88908n54228O26384
$$ 2772585 2534217 1604171 639374 633868 1926897 3363177 3552085 2997857 3624241
38660C624241K185466J531030j112761k771019j742553K66718O59042p73311j984237
$$ 3624241 5809707 7340737 6227976 3456957 1714404 1981122 2640164 1866853 -117384
38651a17384j341385O23634J870784R49734j325702k413183q41650J714417K227286
$$ -117384 -1458769 -835135 1035649 1985383 659681 -1753502 -2595152 -880735 1346551
38642A346551K99743j121590J26452K105775J482611j320989k426115l32376J563276
$$ 1346551 1646294 524704 651156 2756931 4239542 2918553 492438 160062 1723338
38633A723338J99599j986381n74497L484455M482817M79851l270703j797444K351237
$$ 1723338 1922937 -63444 -637941 2846514 7329331 7809182 4538479 2741035 5092272
38624E092272L063616m97221l426755k603221k76915L56581o20944j387627j206183
$$ 5092272 8155888 7658667 4231912 1628691 1351776 1708357 1087413 -300214 -1506397
38615a506397j48059J709784L303107K767160R1803k141765k079924r46056o05823
$$ -1506397 -1654456 55328 3358435 6125595 6217398 4075633 1995709 1049653 443830
38606D43830n92078M66981J859304J575149m89408k160228j789635J4151J492335
$$ 443830 -148248 318733 2178037 3753186 3263778 1103550 -686085 -671934 820401
38597H20401J529536L66393p68348q71708l32897l19798q07583m19605J134459
$$ 820401 2349937 2716330 1947982 1076274 743377 423579 -384004 -803609 330850
38588C30850J949808N75979j443253j462013M98216J754515O57872j390234j988348
$$ 330850 2280658 2856637 1413384 -48629 449587 2204102 2861974 1471740 -516608
38579e16608n49902J525288K689120K559696J680823N96850m92344j309346j385270
$$ -516608 -1066510 458778 3147898 5707594 7388417 7985267 7492923 6183577 4798307
38570D798307p76531k71839j95254K16345J143578R42998j418385l476855j796870
$$ 4798307 4021776 3749937 3554683 3771028 4914606 5857604 4439219 962364 -834506
38561h34506K490214M120331R23388k787365k342068Q08171J989300L70472q71726
$$ -834506 1655708 5776039 6699427 3912062 1569994 2378165 4367465 4737937 3866211
38552C866211k58920L76960k6935o8237Q22785Q84035n75425j164114J042206
$$ 3866211 3607291 3984251 3957316 3889079 4711864 5595899 5020474 3856360 4898566
38543D898566M032162M337743J694461j092078k177723k250128k255223j890908
$$ 4898566 8930728 13268471 14962932 13870854 11693131 9443003 7187780 5296872
38535E296872r81080m14490n88046m40084N16667N84971j554611l634714k162176
$$ 5296872 4315792 3901302 3313256 2873172 3389839 3974810 2420199 -1214515 -3376691
38526c376691J971085L758909J249311j241985K24262K827705J549392k396130
$$ -3376691 -1405606 2353303 3602614 2360629 2584891 5412596 6961988 4565858
38518D565858l280664q2855K105880N31008j391192o14036Q28802N84766K53693
$$ 4565858 1285194 1202339 3308219 3839227 2448035 1833999 2662801 3247567 3501260
38509C501260J185846P94372k445340m573803j921578K286824K777495O10076
$$ 3501260 4687106 5481478 3036138 -1537665 -3459243 -1172419 1605076 2215152
38501B215152M49790J915911P31239k747355l562878q11238Q84858l90239r56214
$$ 2215152 2664942 4580853 5312092 2564737 -998141 -1809379 -924521 -1314760 -2270974
38492b270974J223120K840253J508280n1527O56626J500025K23534j200647n49632
$$ -2270974 -1047854 1792399 3300679 3249152 3905778 5405803 5629337 4428690 3879058
38483C879058L75389n30729j285508N58242K886750K073461j139851k980347k179216
$$ 3879058 4254447 3723718 2438210 2996452 5883202 7956663 6816812 3836465 1657249
38474A657249m21479J186771K515007K619483R35848q81403j212470j087299j748564
$$ 1657249 1235770 2422541 4937548 7557031 8492879 7611476 6399006 5311707 3563143
38465C563143j654286O57914K785328J675350r85370j148370R13108J207039j047825
$$ 3563143 1908857 2566771 5352099 7027449 6042079 4893709 5806817 7013856 5966031
38456E966031k208646n52074J034219K26898j124514p01997M81845N01882L9318
$$ 5966031 3757385 3205311 4239530 4466428 3341914 2639917 3121762 3623644 3662962
38447C662962Q01990K212577K194969L52891j605299k220493j711528j166016
$$ 3662962 4464952 6677529 8872498 9225389 7620090 5399597 3688069 2522053
38439B522053j070708p95830L78760J748438J635477n8798j172628m39768L49184
$$ 2522053 1451345 655515 1034275 2782713 4418190 4359392 3186764 2746996 3096180
38430C096180n84379j512522J58746L019408L264022P35167q02257K12124J018275
$$ 3096180 2511801 999279 1158025 4177433 7441455 8176622 7374365 7586489 8604764
38421H604764k76578j587527r43740P3926m03469j056262j52155Q91998j4310
$$ 8604764 8328186 6740659 5796919 5870845 5467376 4411114 4258959 5150957 5136647
38412E136647j713773j716254m13150K4058k59468O27074K249607J952220o92907
$$ 5136647 3422874 1706620 1293470 1317528 1058060 1685134 3934741 5886961 5194054
38403E194054k655262j568084J218538K699478J679666o63991k448476k591256
$$ 5194054 2538792 970708 2189246 4888724 6568390 5904399 3455923 864667
38395H64667j434719k82047P5770J51319O12395J065574Q88159M90125N44122
$$ 864667 -570052 -852099 -776329 -625010 -12615 1052959 1941118 2431243 2975365
38386B975365O37181J3031r27713j203235p61744j56889N30206J091017N46510
$$ 2975365 3612546 3625577 2697864 1494629 732885 575996 1106202 2197219 2743729
38377B743729j161297j959105l41561J741765J413579m96573o30348J322562J989546
$$ 2743729 1582432 -376673 -718234 1023531 2437110 1940537 1310189 2632751 4622297
38368D622297p0086j931724j116771O01604N63336m70408k54582Q29535P46368
$$ 4622297 4552211 2620487 1503716 2105320 2668656 2198248 1943666 2773201 3519569
38359C519569m24223p15581L70235J346453J251692N20909k88138p65874k70493
$$ 3519569 3095346 2379765 2750000 4096453 5348145 5869054 5580916 4815042 4544549
38350D544549Q57053O85700j436548k628750j60750L605326L978896J459200J628027
$$ 4544549 5401602 6087302 4650754 2022004 1861254 5466580 9445476 10904676 12532703
38341A2532703O184442R116270N094328k365621n742962l928236k464026m296825
$$ 12532703 18717145 27833415 32927743 30562122 24819160 20890924 18426898 14130073
38333A4130073n870609l553912P22039K717452J589520l79814j607140k042754
$$ 14130073 8259464 4705552 5427591 8145043 9734563 9354749 7747609 5704855
38325E704855j576385k41455O64720q0239j500082j552124j18471R71229P62025
$$ 5704855 4128470 3887015 4551735 4471496 2971414 1419290 1300819 2272048 3034073
38316C034073J61825R204l6279k73405k28438K72283N86392L28627j28954m88735
$$ 3034073 3195898 3205102 3168823 2895418 2666980 2939263 3525655 3854282 3725328 3236593
38306C236593o86756k20050J100157J734130n7034k863383k983720K18849K670717
$$ 3236593 2549837 2329787 3429944 5164074 5107040 2243657 -740063 -521214 2149503
38297B149503J303740j334835j119105J308951K015371J78433j188590m54180
$$ 2149503 3453243 2118408 999303 2308254 4323625 4502058 3313468 2859288
38289B859288Q75898J787140K953639L611882J566666k240633l450274p48135
$$ 2859288 3735186 5522326 8475965 12087847 13654513 11413880 7963606 7215471
38281G215471J487596j47962k745002k146295K36999M35427j009055n48410J382185
$$ 7215471 8703067 8555105 5810103 3663808 3900807 4336234 3327179 2778769 4160954
38272D160954Q97562k013104k655076P24067L813291K860877j32082j408895p29345
$$ 4160954 5058516 3045412 390336 1114403 4927694 7788571 7656489 6247594 5518249
38263E518249K65630J548472L229195L297499M06523k971017l506794j682858
$$ 5518249 5783879 7332351 10561546 13859045 14265568 11294551 7787757 6104899
38255F104899m10236m08888k84573q9522j137807k674433k344093k38754Q35207
$$ 6104899 5694663 5285775 5001202 4911680 3773873 1099440 -1244653 -1483407 -648200
38246f48200k00018j073435q8904J177456P56404m82137n48141M00228P89335
$$ -648200 -848218 -1921653 -2010557 -833101 -76697 -558834 -1106975 -706747 82588
38237H2588O24818J343121K832919K885061M23503k336576k403582K5949J750096
$$ 82588 707406 2050527 4883446 7768507 8192010 5855434 3451852 3477801 5227897
38228E227897Q33444r44471r27415M82622O53453j045376k214219j111405Q54744
$$ 5227897 6061341 5116870 4189455 4672077 5325530 4280154 2065935 954530 1809274
38219A809274J522735J002326O51201N08796k43073j204460j228249n16077l28413
$$ 1809274 3332009 4334335 4985536 5494332 5251259 4046799 2818550 2302473 1974060
38210A974060p71052o16784O04126J823236J921526Q90086m79842j153946m55266
$$ 1974060 1203008 586224 1190350 3013586 4935112 5825198 5345356 4191410 3736144
38201C736144Q91796R18358j131032l159386k570157K74058K582608K661929J197394
$$ 3736144 4627940 5546298 4415266 1255880 -1314277 -1040219 1542389 4204318 5401712
38192E401712n05327j612439j411922L9449R96539j85291k318665k526151k34315
$$ 5401712 4896385 3283946 1872024 1911473 2908012 2722721 404056 -2122095 -2356410
38183b356410K103071K527582J683927J015971R38201J287118J658756R77722
$$ -2356410 -253339 2274243 3958170 4974141 5912342 7199460 8858216 9835938
38175I835938j245613l121658k294516J67171P45901j090629j850926K50388K089346
$$ 9835938 8590325 5468667 3174151 3341322 4087223 2996594 1145668 1396056 3485402
38166C485402N24294k571407l248845j208703P50798J477820K148513K852357
$$ 3485402 4009696 1438289 -1810556 -3019259 -2268461 -790641 1357872 4210229
38158D210229J890496j069346l617450l288954l29828K698118L353791J426747
$$ 4210229 6100725 5031379 1413929 -1875025 -2204853 493265 3847056 5273803
38150E273803q24331r69082O53763J249991n87168k742542k459841r5839J569589
$$ 5273803 4449472 3480390 4134153 5384144 4796976 2054434 -405407 -501246 1068343
38141A068343R83088p31804j576821p78258P13201J240543L27288m69590M13986
$$ 1068343 2051431 1319627 -257194 -1035452 -322251 918292 1245580 775990 1189976
38132A189976J950944J790552N9610o67019L30430O82785q23595j996852j118581
$$ 1189976 3140920 4931472 4991082 4324063 4654493 5337278 4513683 2516831 1398250
38123A398250J06071n2703r1124J495200K590762Q36812j709749j476276P96597
$$ 1398250 1504321 1451618 1360494 2855694 5446456 6283268 4573519 3097243 3893840
38114C893840J478163O0778p52566k44731l57105j289884r77675N52396N88174
$$ 3893840 5372003 5432781 4680215 4435484 4078379 2788495 1810820 2363216 2951390
38105B951390j500347k748944j172718J455763K719559K499618J598546K46778
$$ 2951390 1451043 -1297901 -2470619 -1014856 1704703 4204321 5802867 6049645
38097F049645p66064j17343J575397J696588o67514l092423l037478q46672J337711
$$ 6049645 5283581 5166238 6741635 8438223 7770709 4678286 1640808 794136 2131847
38088B131847J914417N64627j540836k101021k24798J615381O26334j754175j582637
$$ 2131847 4046264 4610891 3070055 969034 744236 2359617 2985951 1231776 -350861
38079c50861J454022L474042K479345R04826Q81802J020811j50504j224229p94504
$$ -350861 1103161 4577203 7056548 7961374 8843176 9863987 9713483 8489254 7694750
38070G694750k09843r40041j789102j127420L46091J216446J593655J800633R69341
$$ 7694750 7484907 6544866 4755764 3628344 3974435 5190881 6784536 8585169 9554510
38061I554510j127361k797551k663243j365080L1448J102772Q72233j411179l510786
$$ 9554510 8427149 5629598 2966355 1601275 1632723 2735495 3607728 2196549 -1314237
38052a314237j999608J975830L146030J66682j810402N13988L018573J273586
$$ -1314237 -3313845 -1338015 1808015 1974697 164295 678283 3696856 4970442
38044D970442j738113p67925K601920K570668j390686m178179l260647j289811
$$ 4970442 3232329 2464404 5066324 7636992 6246306 2068127 -1192520 -2482331
38036b482331n81753k21900Q30383J982272K779739L087201J810411j295888l453728
$$ -2482331 -3064084 -3285984 -2455601 -473329 2306410 5393611 7204022 5908134 2454406
38027B454406k107907P80014J597277Q21770J293425K128981N122l904636m317966
$$ 2454406 346499 1126513 2723790 3545560 4838985 6967966 6973088 3068452 -1249514
38018a249514r380L933565L553139R18185j49094R80840K761183L702051K266163
$$ -1249514 -1258894 2674671 6227810 7145995 6996901 7977741 10738924 14440975 16707138
38009A6707138j841328n344776m281064l5817J847595j49125j436531R72316L805928
$$ 16707138 14865810 9521034 5239970 5204153 7051748 6902623 5466092 6438408 10244336
38000A0244336L176415K74163j640985k028549j833245r91481j4016o91105k622967
$$ 10244336 13420751 13694914 12053929 10025380 8192135 7200654 7186638 6495533 3872566
37991C872566k611919n1331J140271j042026k735509n69184K316193J457080j367977
$$ 3872566 1260647 1209316 2349587 1307561 -1427948 -1997132 319061 1776141 408164
37982D08164j340607J274538K097973K09915r63976J60600J366800R91238o5649
$$ 408164 -932443 342095 2440068 2649983 1686007 1846607 3213407 4204645 4138996
37973D138996r31789j705677j748871l54026J085925P79147j01864Q50251K814483
$$ 4138996 3207207 1501530 -247341 -601367 484558 1263705 1161841 2012092 4826575
37964D826575K769431N52050j122655j523995k473202l753228k555419J254244
$$ 4826575 7596006 8148056 7025401 5501406 3028204 -725024 -3280443 -2026199
37956b026199L595522J920308r90588j249685R05202K397942J685071k79325j855495
$$ -2026199 1569323 3489631 2499043 1249358 2154560 4552502 6237573 5958248 4102753
37947D102753j818823j6930J849276J531284p55816k290776j642722m89596n35711
$$ 4102753 2283930 2267000 4116276 5647560 4891744 2600968 958246 468650 -67061
37938f7061q30733J11307J392702J105515m99165j306806l58010J054614J235845
$$ -67061 -897794 -786487 606215 1711730 1212565 -94241 -452251 602363 1838208
37929A838208P903j234061r98506N52978J478623M38821j178775r74658Q49943
$$ 1838208 1846111 612050 -386456 166522 1645145 2083966 905191 -69467 780476
37920G80476J681251N55792m62485M6768M24649r58387k409528j362004J327219
$$ 780476 2461727 3017519 2555034 2601802 3026451 2068064 -341464 -1703468 -376249
37911c76249K431024J082204l42423m2192J095133J643205J534144R69482m09822
$$ -376249 2054775 3136979 2794556 2752364 3847497 5490702 7024846 7994328 7584506
37902G584506j997746j758766R21697L284812K258022j194181l030637j427575
$$ 7584506 5586760 3827994 4749691 8034503 10292525 9098344 6067707 4640132
37894D640132J095405J441665k23253j638927j795373j344204o82264M10861J516640
$$ 4640132 5735537 7177202 6953949 5315022 3519649 2175445 1493181 1904042 3420682
37885C420682J644052O43206o14524j364202j274707j60688J385590J760529L45230
$$ 3420682 5064734 5707940 5093416 3729214 2454507 2293819 3679409 5439938 5785168
37876E785168r83549k57842J446692J641043M12404j09289M31264Q54138J867621
$$ 5785168 4801619 4543777 5990469 7631512 8043916 7934627 8365891 9220029 11087650
37867A1087650M780111P152998N685033M122822J0527970K3122303K6963010J1905925
$$ 11087650 15867761 23020759 28705792 32828614 43356584 66478887 93441897 105347822
37859A05347822j1901803k5136295k2239218j4013618r676796p311473l257848
$$ 105347822 93446019 68309724 46070506 32056888 22380092 15068619 11810771
37852A1810771k05922j072452k597658r09565J727184J140090j649538k620333
$$ 11810771 11604849 10532397 7934739 7025174 8752358 9892448 8242910 5622577
37844E622577j202706R0939M18924Q43421J249518N81261q17892j793622k235257
$$ 5622577 4419871 4510810 4929734 5773155 7022673 7603934 6786042 4992420 2757163
37835B757163k288567j288961N31214J147382l27138j752900j143262L33227P65187
$$ 2757163 468596 -820365 -289151 858231 531093 -1221807 -2365069 -2031842 -1266655
37826a266655O97201J378831J952878J212779L37174J003599K291624K164675
$$ -1266655 -569454 809377 2762255 3975034 4312208 5315807 7607431 9772106
37818I772106P26671l28783j52740J221504L416859M757120L534553J868230M312596
$$ 9772106 10498777 10169994 10017254 11238758 14655617 19412737 22947290 24815520 29128116
37809B9128116J0197255J2776131J0485859J2745342K6222609L9570686L3153285
$$ 29128116 39325371 52101502 62587361 75332703 101555312 141125998 174279283
37802A74279283M551532k5785389l7584907l1117864k0390052j4115707j0723125
$$ 174279283 178830815 153045426 115460519 84342655 63952603 49836896 39113771
37795C9113771p273197m604661l785008l453415k234717p34081j75148q05770
$$ 39113771 31840574 27235913 23450905 19997490 17762773 17028692 16853544 16047774
37787A6047774j953032k536044j777439k74401K83582p35618j926433j826154
$$ 16047774 14094742 11558698 9781259 9506858 9790440 9054822 7128389 5302235
37779E302235q45283k86643m03183m58415p0226L29009N8756r93475j758823p01472
$$ 5302235 4456952 4170309 3767126 3308711 3238485 3567494 3626250 2632775 873952 172480
37769A72480J912850L327961J564760j432550k212806p55282q4878j156904j587433
$$ 172480 2085330 5413291 6978051 5545501 3332695 2577413 2492535 1335631 -251802
37760b51802q8801J379695J239628P63232J091499Q61532q82007k117324r09192
$$ -251802 -340603 1039092 2278720 3041952 4133451 4994983 4112976 1995652 1086460
37751A086460J102408J160704k46284l88514J315078K595895J653358q67191k959513
$$ 1086460 2188868 3349572 3103288 2714774 4029852 6625747 8279105 7411914 4452401
37742D452401k913231m62507K557282L556841K198419Q17698Q65963P89940r48287
$$ 4452401 1539170 1076663 3633945 7190786 9389205 10206903 11072866 11862806 10914519
37733A0914519k748559k183081K0229J031232J71770n21835K80373J613469K218885
$$ 10914519 8165960 5982879 6003108 7034340 7206110 6684275 6964648 8578117 10797002
37724A0797002K183856K133209K104048J652663M66599j053730j554939J69243
$$ 10797002 12980858 15114067 17218115 18870778 19337377 18283647 16728708 16897951
37716A6897951L407119N924373O592130O162878M892508J562957l745638q032383
$$ 16897951 20305070 26229443 32821573 38984451 43876959 45439916 41694278 33661895
37708C3661895q597024o384160m163023k814078j470044J3918R76450J373173
$$ 33661895 25064871 18680711 14517688 11703610 10233566 10247484 11223934 12597107
37700A2597107J403634P54761k21053j06334J105885J110309j026560k533734
$$ 12597107 14000741 14755502 14534449 14428115 15534000 16644309 15617749 13084015
37692A3084015j011117J413011J358930l46514l56940J558134K716575K396671
$$ 13084015 12072898 13485909 14844839 14498325 14141385 15699519 18416094 20812765
37684B0812765K382419L207415L718596L864053M316874M267668L327935M037254
$$ 20812765 23195184 26402599 30121195 33985248 38302122 42569790 45897725 49934979
37676D9934979P984297J1517862J1136662J1011217J7588451K8394202L6069420
$$ 49934979 57919276 69437138 80573800 91585017 109173468 137567670 173637090
37669A73637090M3189430N9587379P9982041P8303121L6748838k6906062p3969454
$$ 173637090 216826520 276413899 356395940 434699061 471447899 444541837 370572383
37662C70572383q3950881o8471033m9307630l6037956k7228786k1040102j7068988
$$ 370572383 286621502 218150469 168842839 132804883 105576097 84535995 67467007
37655F7467007j3761680j0216974p808637o939181n488373k842361j637425k943483
$$ 67467007 53705327 43488353 35679716 28740535 23252162 20409801 18772376 15828893
37647A5828893l622523j449991Q52627J38646j897024j808903r4198K92298p98617
$$ 15828893 12206370 10756379 11609006 11747652 9850628 8041725 7947527 8239825 7441208
37638G441208r97787K39276J316621J680354J871333J182483j224318l448368
$$ 7441208 6443421 6682697 7999318 9679672 11551005 12733488 11509170 8060802
37630H060802k796372l85556N9077j761019k045937O63651K603488O61447k424934
$$ 8060802 5264430 4878874 4937951 3176932 1130995 1794646 4398134 5059581 2634647
37621B634647k063437J352223L290060J708956o68098p76730R57377K044923J284046
$$ 2634647 571210 1923433 5213493 6922449 6254351 5477621 6434998 8479921 9763967
37612I763967l70639j343389j083844m13538k98010l15365Q12848K795987L288056
$$ 9763967 9393328 8049939 6966095 6552557 6254547 5939182 6752030 9548017 12836073
37603A2836073R77978k191846l532305l036702k234808j006117J461932L391383
$$ 12836073 13814051 11622205 8089900 5053198 2818390 1812273 3274205 6665588
37595F665588J916331j849670l166555l37340K661120K142252k18672r69575l40023
$$ 6665588 8581919 6732249 3565694 3228354 5889474 8031726 7813054 6843479 6503456
37586F503456n78882j312530o67873N22468j04073j821331j590870O36485J495744
$$ 6503456 5924574 4612044 3944171 4466639 4362566 2541235 950365 1586850 3082594
37577C082594l73314k292039j950567m21851N16644R49525J246537P87248j77559
$$ 3082594 2709280 417241 -1533326 -1955177 -1438533 -489008 757529 1544777 1367218
37568A367218p8737J003648O98055j588955k899276j266869Q56654N83761o23541
$$ 1367218 1288481 2292129 2990184 1401229 -1498047 -2764916 -1908262 -1324501 -1948042
37559a948042K84219K368834K025959r81195k881870j452204J257361K396932
$$ -1948042 -1663823 705011 2730970 1749775 -1132095 -2584299 -1326938 1069994
37551A069994J632591J53931j154720j569074o09239P58600P33960o99437j463909
$$ 1069994 2702585 2856516 1701796 132722 -476517 282083 1016043 316606 -1147303
37542a147303m99502O08174K42898o51237j70014J465583K170301R66448p63715
$$ -1147303 -1646805 -1038631 -795733 -1446970 -1616984 -151401 2018900 2985348 2221633
37533B221633j141743K9108J285578J256956N3995j097498j418220j347272j534077
$$ 2221633 1079890 1108998 2394576 3651532 3705527 2608029 1189809 -157463 -1691540
37524a691540j633497q37197P05848J906649K107313J545356M82229j029694k261674
$$ -1691540 -3325037 -4162234 -3456386 -1549737 557576 2102932 2585161 1555467 -706207
37515g06207j914796J01775J881422J561156k87662j382523p37281J84881k57784
$$ -706207 -2621003 -2519228 -637806 923350 635688 -746835 -1484116 -1299235 -1557019
37506a557019j403740j101694J200491L267658K543509p17608l502730l189505
$$ -1557019 -2960759 -4062453 -2861962 405696 2949205 2231597 -1271133 -4460638
37498d460638j72266K713869L059703J075753r15780j096308o7686K12614q20393
$$ -4460638 -4632904 -1919035 1140668 2216421 1300641 204333 136647 349261 -471132
37489d71132j662569j079590J61713P82297R68297J465865J752291R26908l02884
$$ -471132 -2133701 -3213291 -3051578 -2269281 -1300984 164881 1917172 2844080 2541196
37480B541196n56606j87558n25307j103356k68501J480357J708271N1503j060468
$$ 2541196 1984590 1797032 1271725 168369 -100132 1380225 3088496 3139999 2079531
37471B079531n38718k27380j019697q93128R99578J720937q26383l557542k377560
$$ 2079531 1540813 1313433 293736 -599392 400186 2121123 1294740 -2262802 -4640362
37462d640362J333435K665871N14113j359565m42701J399698J623450M37757o63226
$$ -4640362 -3306927 -641056 -126943 -1486508 -1929209 -529511 1093939 1531696 868470
37453H68470j212957j319772p63636L28486J133026J113662M90941l00817p47237
$$ 868470 -344487 -1664259 -2427895 -2099409 -966383 147279 638220 337403 -409834
37444d09834l12124N98989O20391l51272k97218J706942L088119J306847j685227
$$ -409834 -721958 -122969 497422 146150 -151068 1555874 4643993 5950840 4265613
37435D265613j998119J30145Q29890j050985k382805j222819L07716J21504n01831
$$ 4265613 2267494 2397639 3227529 2176544 -206261 -1429080 -1121364 -999860 -1501691
37426a501691K83627J662422J854286Q22498m76755j605685k053189j166986J99321
$$ -1501691 -1218064 444358 2298644 3121142 2644387 1038702 -1014487 -2181473 -1982152
37417a982152K26739o84558K1121K574921L619007J333612j343427j255873Q9414
$$ -1982152 -1755413 -2439971 -2418850 156071 3775078 5108690 3765263 2509390 2598804
37408B598804n06936k348912k103889N39140K311061J345532m96509q03290L13820
$$ 2598804 2091868 -257044 -2360933 -1821793 489268 1834800 1338291 535001 848821
37399H48821J130892P28501k49452n30919L29336J214261O50961j072271k072018
$$ 848821 1979713 2708214 2458762 1927843 2257179 3471440 4122401 3050130 978112
37390I78112j535940p37299o59650l44535J144099K684914K594172R84900p81380
$$ 978112 -557828 -1295127 -1954777 -2299312 -1155213 1529701 4123873 5108773 4327393
37381D327393j938577k360865j870539p06951L20123J000886J784029K112700
$$ 4327393 2388816 27951 -1842588 -2549539 -2229416 -1228530 555499 2668199
37373B668199O55712j953247k983177j519849o580k54264o52177N12919J785543
$$ 2668199 3323911 1370664 -1612513 -3132362 -3138942 -3393206 -4045383 -3532464 -1746921
37364a746921J331698L69113O46125R43756l33448j369935J25165K108264R85825
$$ -1746921 -415223 -46110 600015 1543771 1210323 -159612 -34447 2073817 3059642
37355C059642k078156k610004J3785J945713J441011Q38918J182928J34235k860600
$$ 3059642 981486 -1628518 -1614733 330980 1771991 2610909 3793837 3928072 1067472
37346A067472m107800j242360K452778K529998m52478k324672j061785J569220
$$ 1067472 -3040328 -4282688 -1829910 700088 247610 -2077062 -3138847 -1569627
37338a569627K933042J953431n07104k228471j576215K27691L07879j559190k091070
$$ -1569627 1363415 3316846 2809742 581271 -994944 -767253 -459374 -2018564 -4109634
37329d109634N27319L236237K203822j406921k910324o87339J847115J367425
$$ -4109634 -3582315 -346078 1857744 450823 -2459501 -3146840 -1299725 67700
37321F7700q87641j276844J090308L311906K686812J02460j514029j165479n46515
$$ 67700 -819941 -2096785 -1006477 2305429 4992241 5094701 3580672 2415193 1868678
37312A868678r03045j127566K0670J520323J597034M43072m19193n86077o64836
$$ 1868678 965633 -161933 -141263 1379060 2976094 3419166 2999973 2413896 1749060
37303A749060n33697K03851P23298J35805n48261J31O54380n05194k357521j947920
$$ 1749060 1215363 1419214 2142512 2278317 1730056 1730187 2384567 1879373 -478148 -2426068
37293b426068N87588J951656R20632j46671J16856n578j300208j476326O53788
$$ -2426068 -1838480 113176 1033808 887137 1003993 998415 -301793 -1778119 -1124331
37284a124331K390904J358854n53866n42309N34812L29955n62630j48890P30103
$$ -1124331 1266573 2625427 2071561 1529252 2064064 2394019 1831389 1682499 2412602
37275B412602k09759k047660j567838J296619K881665J363834n73164r3204J537057
$$ 2412602 2202843 155183 -1412655 -116036 2765629 4129463 3556299 3463095 5000152
37266E000152J129707j602822l611028k584454J37660J336297k9896j542196n77222
$$ 5000152 6129859 4527037 916009 -1668445 -1530785 -194488 -224384 -1766580 -2343802
37257b343802K003638K865023P51790j812691k011488j91786J275769J172560
$$ -2343802 -340164 2524859 3276649 1463958 -547530 -739316 536453 1709013
37249A709013J27758q16933j053869n24884J19699J65544K42M70325R59394L0597
$$ 1709013 1836771 1019838 -34031 -558915 -439216 -273672 -273430 196895 1156289 1186886
37239A186886j646513j565335M81862J433340k70087j944272r59610J139355J639211
$$ 1186886 -459627 -2024962 -1543100 -109760 -379847 -2324119 -3283729 -2144374 -505163
37230e05163R86914P55951O762k205788l095668R6538M254060L887645k08446
$$ -505163 481751 1237702 1244464 -961324 -4056992 -3960454 293606 4181251 3972805
37221C972805j784392J006664K806011p7709l865093l628311o21705Q16676J77348
$$ 3972805 2188413 3195077 6001088 5923379 2058286 -1570025 -2191730 -1375054 -1197706
37212a197706J29527J171974J308206R6444p22261m46164k87015q54668j079197
$$ -1197706 -1068179 103795 1412001 1508445 786184 340020 53005 -801663 -1880860
37203a880860o5800J507099K194298J210351p93991j944293q36909J557920K753761
$$ -1880860 -1946660 -439561 1754737 2965088 2171097 226804 -610105 947815 3701576
37194C701576J885225M54120m99950j724363l175584k783358J16793K515435J706388
$$ 3701576 5586801 6040921 5540971 3816608 641024 -2142334 -2025541 489894 2196282
37185B196282m06907l05292J338296Q25929k177717l752955j855669O85727R09460
$$ 2196282 1789375 1484083 2822379 3648308 1470591 -2282364 -4138033 -3452306 -2542846
37176b542846N975M87187J728491J324372n76881j295494L29134K288744K169718
$$ -2542846 -2536871 -2049684 -321193 1003179 426298 -869196 -540062 1748682 3918400
37167C918400O442k136919k533572j335782j49274k11555r85762r33506L36128
$$ 3918400 3924842 1787923 -745649 -2081431 -2230705 -2442260 -3428022 -4361528 -4025400
37158d025400J536748J581269R10895L55418j68561q55330j009114j73200N94675
$$ -4025400 -2488652 -907383 3512 358930 190369 -664961 -1674075 -1847275 -1252600
37149a252600J00078r33071q01449N67150J600371J453944P23360l7706p08801
$$ -1252600 -1152522 -2085593 -2887042 -2319892 -719521 734423 1457783 1420077 711276
37140G11276o76767L82762Q74824r48048l294155k166814K393576M960182K085784
$$ 711276 34509 417271 1292095 344047 -2950108 -5116922 -2723346 2236836 4322620
37131D322620k254561k255180J235531K552829K01888j414308M14390K680163
$$ 4322620 2068059 -187121 1048410 3601239 3803127 2388819 2803209 5483372
37123E483372K086476K3322o84483m71577j178109k123962j517613N405N63777
$$ 5483372 7569848 7593170 6908687 6437110 5259001 3135039 1617426 1622831 2186608
37114B186608L75753P30492Q75600n85522k114532r57820J790633J952815j283799
$$ 2186608 2562361 3292853 4168453 3582931 1468399 510579 2301212 4254027 2970228
37105B970228l702142k308305M74584J122704K52904M66115J415711P67017j173539
$$ 2970228 -731914 -3040219 -2565635 -1442931 -1190027 -723912 691799 1458816 285277
37096B85277j601186J19488J319976K20196j612378k118619j602966j178674m17961
$$ 285277 -1315909 -1196421 123555 343751 -1268627 -3387246 -4990212 -6168886 -6586847
37087f586847J376647K936285K403326L73210o26884L54446J675501J818350J199134
$$ -6586847 -5210200 -2273915 129411 502621 -124263 230183 1905684 3724034 4923168
37078D923168O69635N6713p75957j011976l49846k4664q37466j401002k34882
$$ 4923168 5592803 5649516 4873559 3861583 3511737 3487073 2649607 1248605 1013723
37069A013723J371089Q84001j518878k953606j903177M4020J022290J189829J287210
$$ 1013723 2384812 3268813 1749935 -1203671 -3106848 -3062828 -2040538 -850709 436501
37060D36501R82285K1990n73166M1479J026248J086050K50615o43030j229033
$$ 436501 1418786 1440776 867610 909089 1935337 3021387 3272002 2628972 1399939
37051A399939j340195n53051Q55390J525300P42516m32083q44940r26864j441788
$$ 1399939 59744 -493307 362083 1887383 2629899 2197816 1352876 426012 -1015776
37042a015776j739759q08891Q18690J749486J640212J094126L76234m81496j028268
$$ -1015776 -2755535 -3564426 -2745736 -996250 643962 1738088 2114322 1632826 604558
37033F04558j040731j040311j195741q42254n7128r8067j000078p42987J376950
$$ 604558 -436173 -1476484 -2672225 -3514479 -3571607 -3669674 -4669752 -5412739 -4035789
37024d035789K744836J242283j097137j273886o8480J05321J16440K148006M128586
$$ -4035789 -1290953 -48670 -1145807 -2419693 -2488173 -2382852 -2266412 -118406 4010180
37015D010180J881370l123520m326321J8762L458927R23683l637286l630837L39639
$$ 4010180 5891550 2768030 -1558291 -1539529 1919398 2843081 -794205 -4425042 -4085403
37006d085403K502761J233170L32427J634595K111769l22355k750490j665111
$$ -4085403 -1582642 -349472 -17045 1617550 3729319 3406964 656474 -1008637
36998a008637J477196K244382n08069l299354k951913l77132J588874K182618
$$ -1008637 468559 2712941 2204872 -1094482 -4046395 -4423527 -2834653 -652035
36990f52035K478539K229970k2819l237755l530320L62755L949406K550304j795398
$$ -652035 1826504 4056474 4033655 795900 -2734420 -2371665 1577741 4128045 2332647
36981B332647l015520J79474K739494J105477j949713k289793m55777K02193j035721
$$ 2332647 -682873 -503399 2236095 3341572 1391859 -897934 -1353711 -1151518 -2187239
36972b187239j778479l52197K191388L396454J618712k186586m446117k434463
$$ -2187239 -3965718 -4317915 -2126527 1269927 2888639 702053 -3744064 -6178527
36964f178527J806581L361052R43364j410974m10544K025844K459986R24593n55121
$$ -6178527 -4371946 -1010894 -67530 -1478504 -1889048 136796 2596782 3521375 2966254
36955B966254j642081k664891k276069L14133K577063J733640q15864j598723
$$ 2966254 1324173 -1340718 -3616787 -3302654 -725591 1008049 192185 -1406538
36947a406538l23872N17595J65111l3084Q2843m01999o61391P45724K372689J511318
$$ -1406538 -1730410 -1212815 -1047704 -1080788 -997945 -1399944 -2061335 -1315611 1057078 2568396
36937B568396q84198j161278R43578J700688k92324j798283o10256Q40944K6053
$$ 2568396 1684198 522920 1466498 3167186 2874862 1076579 466323 1307267 1333320
36928A333320j327585n11705J482029J880076O10128l54036o09423j198591j864049
$$ 1333320 5735 -505970 976059 2856135 3466263 3112227 2502804 1304213 -559836
36919e59836j335337R9023Q18581M88446K81842N44758K72366q35787j580911
$$ -559836 -1895173 -1796150 -977569 -489123 -207281 337477 609843 -225944 -1806855
36910a806855j110743k35052j47240o61502n15947Q34130K322617K395868Q91083
$$ -1806855 -2917598 -3152650 -3299890 -3961392 -4477339 -3643209 -1320592 1075276 1966359
36901A966359o08222n78248O56398J508843J197176L94093q5112k98039o92031
$$ 1966359 1358137 779889 1436287 2945130 4142306 4536399 4451287 4153248 3461217
36892C461217j332535j811016j499480j27869J360948J217015p83799k190768
$$ 3461217 2128682 317666 -1181814 -1309683 51265 1268280 484481 -1706287
36884a706287p82444J882787K103290o67370k733175j322482J565768K222675
$$ -1706287 -2488731 -605944 1497346 829976 -1903199 -3225681 -1659913 562762
36876E62762L15535j305810q87902M22510Q78833L09923m21135q07655q97536
$$ 562762 878297 -427513 -1315415 -892905 -14072 295851 -125284 -932939 -1830475
36867a830475q04067n86732l80595l34832m35441m50840j02913O28776J428216
$$ -1830475 -2634542 -3221274 -3601869 -3936701 -4372142 -4822982 -4925895 -4297119 -2868903
36858b868903J935381J927864J160327m47435k111733k369211p64841J134561
$$ -2868903 -933522 994342 2154669 1707234 -404499 -2773710 -3538551 -2403990
36850b403990J411199K02059o20597n2878Q79756P56999l39313r54787O9088K123953
$$ -2403990 -992791 -790732 -1411329 -1464207 -584451 172548 -166765 -1121552 -1052464 1071489
36840A071489L016997J230120j827112k976802j273435O88481O00421k66293M00666
$$ 1071489 4088486 5318606 3491494 514692 -758743 -70262 530159 263866 664532
36831F64532J816927J413694o77429j736630q55571J2059l07773o69314l80387
$$ 664532 2481459 3895153 3217724 1481094 625523 637582 329809 -339505 -719892
36822g19892m37747r42025k37208J925093L076797J649450m60525q50051p1625
$$ -719892 -1157639 -2099664 -2336872 -411779 2665018 4314468 3853943 3003892 2932267
36813B932267j01425j063428j597235j243840n21174M69785J815155K763279K250168
$$ 2932267 2830842 1767414 170179 -1073661 -1594835 -1125050 690105 3453384 5703552
36804E703552J87664k266436l264718j468599J985394L392403O42871l063854
$$ 5703552 5891216 3624780 360062 -1108537 876857 4269260 4912131 1848277
36796A848277k824824Q53144K628784N58314j174225L50514J838786k58422l353706
$$ 1848277 -976547 -123403 2505381 3063695 1889470 2239984 4078770 3820348 466642
36787D66642k982237j08680R49760l83294j068892k10435K58829j72098j65528
$$ 466642 -2515595 -2624275 -1674515 -2057809 -3126701 -3337136 -3078307 -3250405 -3415933
36778c415933K17123k7999J02914J903467L182146R18251k878978l111829N50313
$$ -3415933 -3198810 -3226809 -3123895 -1220428 1961718 2879969 991 -3110838 -2560525
36769b560525L046762J823818l578K34226P75960k02540j038148k68932K41846
$$ -2560525 486237 2310055 2306477 2540703 3316663 3114123 2075975 1807043 2048889
36760B048889r76563j698467K28768K755074K681861M72323j257192j970965k635820
$$ 2048889 1072326 -626141 -397373 2357701 5039562 5511885 4254693 2283728 -352092
36751c52092k658952q93741J323952J419173m99531j633529l40739K067155L306972
$$ -352092 -3011044 -3904785 -2580833 -1161660 -1661191 -3294720 -3635459 -1568304 1738668
36742A738668K343276j53769k348126k609073j201676O4806L66154O63505J342523
$$ 1738668 4081944 3928175 1580049 -1029024 -2230700 -2165894 -1799740 -1136235 206288
36733B06288J097204n03821j483901m65233O93712l00695k250440k111250L43438
$$ 206288 1303492 799671 -684230 -1149463 -455751 -756446 -3006886 -5118136 -4774698
36724d774698K290321J963338M80660m75495o11276l13750K74705R83873J485237
$$ -4774698 -2484377 -521039 -40379 -515874 -1127150 -1440900 -1166195 -182322 1302915
36715A302915J591201J045349m70432k294775k649068p94413J483184J945840
$$ 1302915 2894116 3939465 3469033 1174258 -1474810 -2269223 -786039 1159801
36707A159801P40021k66655k38891R5006M0456m76300j362518k013814j299312
$$ 1159801 1899822 1633167 1394276 1489282 1529738 1053438 -309080 -2322894 -3622206
36698c622206O15103J451716k78963k530689k158754N72831K427407J794619K17724
$$ -3622206 -3007103 -1555387 -1834350 -4365039 -6523793 -5950962 -3523555 -1728936 -1511212
36689a511212o92532j125461j294424l93054J530872K685067J823770j6928j154347
$$ -1511212 -2203744 -3329205 -4623629 -5016683 -3485811 -800744 1023026 1006098 -148249
36680a48249j363060j320405j061831j39695J259566K202087J839914K22123j382463
$$ -148249 -1511309 -2831714 -3893545 -4033240 -2773674 -571587 1268327 1490450 107987
36671A07987j327741M45808J777523Q28541j203247j537266K54661J744032J299169
$$ 107987 -1219754 -773946 1003577 1832118 628871 -908395 -653734 1090298 2389467
36662B389467J37307r0880J37353n39197j836692k131539q34759P67370J121776
$$ 2389467 2526774 2435894 2573247 2034050 197358 -1934181 -2768940 -2001570 -879794
36653h79794K46973l03455O26426K084306J989759J14822j145726m2918J726039
$$ -879794 -632821 -936276 -309850 1774456 3764215 3879037 2733311 2690393 4416432
36644D416432J263563j321431l106300k416585n27089O72414O50981k15147j120139
$$ 4416432 5679995 4358564 1252264 -1164321 -1691410 -1018996 -368015 -583162 -1703301
36635a703301q46616P41189J502366l13237k584578j601745K135893M044726K115138
$$ -1703301 -2549917 -1808728 -306362 -619599 -3204177 -4805922 -2670029 1374697 3489835
36626C489835m38773o49692P7515l59573p92341K59152R09081q93316k949623
$$ 3489835 3051062 2401370 2478885 2119312 1326971 1586123 2495204 1601888 -1347735
36617a347735j844344J306185K481218J069260J15134O33187J93002k190171l819353
$$ -1347735 -3192079 -1885894 595324 1664584 1779718 2412905 2605907 415736 -3403617
36608c403617k427806N63471K448356K501986J498586Q1219j018044q72314K23898
$$ -3403617 -5831423 -5267952 -2819596 -317610 1180976 1262195 244151 -628163 -404265
36599d04265N97488m88764j580581j030402P81686K064864J715529K48498q38714
$$ -404265 193223 -295541 -1876122 -2906524 -2124838 -59974 1655555 1904053 1065339
36590A065339m97160O38414Q65579j58953o90242K61245Q97148m71615j998706
$$ 1065339 568179 1206593 2072172 1913219 1222977 1484222 2381370 1909755 -88951
36581h8951q49520J762289J870243r56898k674359r90915J413151J572667N08624
$$ -88951 -938471 823818 2694061 1737163 -937196 -1928111 -514960 1057707 1566331
36572A566331M80161J080731Q47098K95005M95085O23981k70605q56206K63182
$$ 1566331 2046492 3127223 3974321 4269326 4764411 5388392 5117787 4261581 4524763
36563D524763J507423N36745j776397k709911k000226j526472j418320j8641K351257
$$ 4524763 6032186 6568931 4792534 2082623 82397 -1444075 -2862395 -2881036 -529779
36554e29779L103695J490320p4283K27946J206364J182997N36221K71245K1077
$$ -529779 2573916 4064236 3989953 4217899 5424263 6607260 7143481 7414726 7435803
36545G435803q85283j792632j727036j033305o69765o63457m54800j19215r6859
$$ 7435803 6550520 4757888 3030852 1997547 1327782 664325 209525 90310 -6549
36536f549j44705L67517J260165J501468M79141j159185k092130j610200k56001
$$ -6549 -151254 216263 1476428 2977896 3457037 2297852 205722 -1404478 -1660479
36527a660479Q47158J215005J209248J027743K52076j102718j841988q19694J426887
$$ -1660479 -813321 401684 1610932 2638675 2890751 1788033 -53955 -873649 553238
36518E53238L057073K728702N74991k024019l142088j743308P66461J552561k9696
$$ 553238 3610311 6339013 6914004 4889985 1747897 4589 771050 2323611 2293915
36509B293915j254450J2200J891919J462741m27763p71842P1844j166025m277574
$$ 2293915 1039465 1051665 2943584 4406325 3978562 3206720 3278564 2112539 -2165035
36500b165035m409187N63180N594973M893431m2399k835904j087772J449523J266867
$$ -2165035 -6574222 -6011042 -416069 4477362 4434963 1599059 511287 1960810 3227677
36491C227677m39718q81668j07090j46089j354214j865043m76833J518182K013901
$$ 3227677 2787959 1906291 1799201 1653112 298898 -1566145 -2042978 -524796 1489105
36482A489105Q61584m4448M44105J018757O5064j399482r87154R78771J281977
$$ 1489105 2350689 2306241 2750346 3769103 3834167 2434685 1447531 2426302 3708279
36473C708279j234107l123405r78046L246451M476144J287081k538968l281760
$$ 3708279 2474172 -649233 -1627279 1619172 6095316 7382397 4843429 1561669
36465A561669j408349K72027L40773n23552j076257o03707O08808J233557K04893
$$ 1561669 153320 425347 766120 242568 -833689 -1437396 -828588 404969 609862
36456F09862j552591j854865j89096J416655J190313p7789n86747j12748L85441
$$ 609862 -942729 -2797594 -2986690 -1570035 -379722 -457511 -1044258 -1157006 -771565
36447g71565P13037J192976J121294l81367k013345j166583K013200L702032J293717
$$ -771565 -58528 1134448 2255742 1874375 -138970 -1305553 707647 4409679 5703396
36438E703396k531669l184334o20177Q18135q43240k278118m31997K303270J830495
$$ 5703396 3171727 -12607 -632784 185351 -657889 -2936007 -3368004 -1064734 765761
36429G65761q93045j214237J633828K996008M6910l608704l215004L20280K263671
$$ 765761 -127284 -1341521 292307 3288315 3335225 -273479 -3488483 -3168203 -904532
36420i04532Q89778j089405j262729l08611L42544Q62921J840394K460283J336191
$$ -904532 -14754 -1104159 -2366888 -2675499 -2332955 -1470034 370360 2830643 4166834
36411D166834j326765l315447k485095O50065K831001J538308j581791k438790
$$ 4166834 2840069 -475378 -2960473 -2310408 520593 2058901 477110 -1961680
36403a961680J5416K276436J423115p56641r73712M69369Q65841j65797o65210
$$ -1961680 -1946264 330172 1753287 996646 22934 492303 1358144 1192347 527137
36394E27137k61851n27947j553696j591393l32996O36490Q78360J359690J522013
$$ 527137 265286 -262661 -1816357 -3407750 -3740746 -3104256 -2225896 -866206 655807
36385F55807k07648k498019j890299J352904K615350R8705j948513j86777K022377
$$ 655807 448159 -2049860 -3940159 -2587255 28095 126800 -1821713 -2008490 13887
36376A3887J28935l713394l574978J212849N183081M458441Q47695j976108k552534
$$ 13887 142822 -3570572 -7145550 -5932701 -749620 3708821 4556516 2580408 27874
36367B7874j360434L45411Q32319m78595j592249n05676J349198J114302p59975
$$ 27874 -1332560 -987149 -154830 -633425 -2225674 -2731350 -1382152 -267850 -1027825
36358a027825j407881p12842j196414k518677j132427L096465N049694J984301
$$ -1027825 -2435706 -3148548 -4344962 -6863639 -7996066 -4899601 150093 2134394
36350B134394j595541o72828K454334K081976j682788l325053p66566J809451
$$ 2134394 538853 -133975 2320359 4402335 2719547 -605506 -1372072 437379
36342D37379Q63428j599159k104663r38041m49356o54963K34127K041957K478458
$$ 437379 1300807 -298352 -2403015 -3341056 -3790412 -4445375 -4211248 -2169291 309167
36333C09167Q32576o81877j91694J013370N00753j394249j792243K89239J876121
$$ 309167 1141743 459866 268172 1281542 1782295 388046 -1404197 -1114958 761163
36324G61163J42703k893637k650182J230244L775357J757746j377180o18586K907177
$$ 761163 903866 -1989771 -4639953 -3409709 365648 2123394 746214 127628 3034805
36315C034805L533782l42961l802558k613018J044548K413803Q05714o94515m75748
$$ 3034805 6568587 6225626 2423068 -189950 854598 3268401 4074115 3379600 2903852
36306B903852l1105p08628j668290j613565o43758K93620N59236R250r68720j363330
$$ 2903852 2872747 2164119 495829 -1117736 -1761494 -1467874 -908638 -899388 -1868108 -3231438
36296c231438m20720J201386K004457J428817K43693o90988j041139o09116L66807
$$ -3231438 -3652158 -2450772 -446315 982502 1226195 535207 -505932 -1115048 -748241
36287g48241O77605m87444j622559l53865K731490L988812J631532j484026j887648
$$ -748241 -70636 -558080 -2180639 -2534504 196986 4185798 5817330 4333304 2445656
36278B445656l51153n9831j284535j245323Q94645K346094J040437j183182j536726
$$ 2445656 2094503 2034672 750137 -495186 399459 2745553 3785990 2602808 1066082
36269A066082l70012p7254j121337j531455j68650J522520J591528J54942r45385
$$ 1066082 696070 618816 -502521 -2033976 -2202626 -680106 911422 1066364 120979
36260A20979n68843M03620M03895n10416m69002J555727L656421K939768n15990
$$ 120979 -447864 -44244 359651 -150765 -619767 935960 4592381 7532149 7016159
36251G016159l326913l027942j028447k15697j026656j584628q21702M83291J439515
$$ 7016159 3689246 661304 -367143 -582840 -1609496 -3194124 -4015826 -3532535 -2093020
36242b093020J937690J775592O59436o02322n79588N25788O99927r24335k411873
$$ -2093020 -155330 1620262 2279698 1677376 1097788 1623576 2323503 1399168 -1012705
36233a012705j635733O13911J795139J229203O55311J166261J494115J88438j898634
$$ -1012705 -2648438 -2034527 -239388 989815 1645126 2811387 4305502 4493940 2595306
36224B595306k646547j496420J41958J083750J501292J589920O35440j520656
$$ 2595306 -51241 -1547661 -1405703 -321953 1179339 2769259 3404699 1884043
36216A884043l147776k326682L22436K114252J631235K20034k07494M80629J181682
$$ 1884043 -1263733 -3590415 -3267979 -1153727 477508 697542 490048 970677 2152359
36207B152359J236376O04017o40902j884151j877435l05190J209929R92690l14397
$$ 2152359 3388735 3992752 3351850 1467699 -409736 -714926 495003 1487693 1173296
36198A173296p20535J36210O52697p1336r21067o14949N21605J329483J327278
$$ 1173296 452761 588971 1241668 1170332 249265 -365684 155921 1485404 2812682
36189B812682P83697R7176l28187k68485j31608n07793j025119o00541P90383
$$ 2812682 3596379 3693555 3365368 3096883 2965275 2457482 1432363 831822 1622205
36180A622205J643715Q37393r02608k075607k062564j095513M17506J723539J857109
$$ 1622205 3265920 4103313 3200705 1125098 -937466 -2032979 -1615473 108066 1965175
36171A965175R05201K47350N45079N32848q94791k471071k238834o85052j6175
$$ 1965175 2870376 3117726 3662805 4195653 3300862 829791 -1409043 -2094095 -2110270
36162b110270o00470n88708O02221J031809m02393j725460r27858N90968J58911
$$ -2110270 -2710740 -3299448 -2697227 -1665418 -2067811 -3793271 -4721129 -4130161 -3971250
36153c971250j653394j607860J114222L294444K206235n35140j380035M01368
$$ -3971250 -5624644 -7232504 -6118282 -2823838 -617603 -1152743 -2532778 -2131410
36145b131410K349386K428955J061165l05448r41580q70455m52689l21299p77948
$$ -2131410 217976 2646931 3708096 3402648 2461068 1590613 1137924 816625 38677
36136C8677j081500l22229R55748J258272M28672q0240L18887L13388r16292j959901
$$ 38677 -1042823 -1365052 -409304 848968 1277640 1197400 1516287 1829675 913383 -1046518
36126a046518j321987J00428N25704J86816N85877J552083J429256L2839r74591
$$ -1046518 -2368505 -2268077 -1742373 -1555557 -969680 582403 2011659 2044498 1069907
36117A069907r25484j006885j606149j137943J168500L229811K602106j79846
$$ 1069907 144423 -862462 -2468611 -3606554 -2438054 791757 3393863 3214017
36109C214017k367971k305378o11656J191263J892975J025081o33466j422091
$$ 3214017 846046 -1459332 -2070988 -879725 1013250 2038331 1404865 -17226
36101a7226p56660j03880p90431j622165m51076K243322L422938J552576j241184
$$ -17226 -773886 -877766 -1668197 -3290362 -3741438 -1498116 1924822 3477398 2236214
36092B236214k027145p07697M64940J28628r01725j351116j095889o49280k2556
$$ 2236214 209069 -498628 -33688 94940 -806785 -2157901 -3253790 -3903070 -3925626
36083c925626J055040K122983K071255M97411j484304k192423j038573R29618
$$ -3925626 -2870586 -747603 1323652 1821063 336759 -1855664 -2894237 -1964619
36075a964619J998257J210497q63334k539605k489557j049768K23760M62154L60755
$$ -1964619 33638 1244135 380801 -2158804 -4648361 -5698129 -5474369 -5012215 -4651460
36066d651460Q05726J443448J429073R33722Q13220J149915J218030O76097j95361
$$ -4651460 -3845734 -2402286 -973213 -39491 773729 1923644 3141674 3817771 3622410
36057C622410j143879j835389j578722l65487L96262l18026j224238m54644J332016
$$ 3622410 2478531 643142 -935580 -1301067 -904805 -1222831 -2447069 -2901713 -1569697
36048a569697J824355P19986j08115p3588n05491j385918p37279J643206L025887
$$ -1569697 254658 974644 866529 792941 287450 -1098468 -1835747 -192541 2833346
36039B833346J843783o0096q85426j349612j812469n73217K256603K880157n70136
$$ 2833346 4677129 4617033 3731607 2381995 569526 -3691 2252912 5133069 4562933
36030D562933l921538k784371N36789R98157r06990p78040J475698J694294o44929
$$ 4562933 641395 -2142976 -1606187 -608030 -1515020 -2293060 -817362 876932 232003
36021B32003j365007P64808J832735j957j280733J65607J195755o14899k137072
$$ 232003 -1133004 -368196 1464539 1462582 181849 347456 1543211 928312 -1208760
36012a208760j52931K638048J869224j405382k670260q30084J248259J529873
$$ -1208760 -1361691 1276357 3145581 1740199 -930061 -1760145 -511886 1017987
36004A017987L46792j490531k779112j649405J619973L307203J073851j952484
$$ 1017987 1364779 -125752 -2904864 -4554269 -2934296 372907 1446758 -505726
35996e05726j648137P11916J007465o23536n26154J610874K359901J106052J241977
$$ -505726 -2153863 -1441947 -434482 -1058018 -1584172 26702 2386603 3492655 4734632
35987D734632L637745M324640Q80829l475778m823034l678202k422201j125596
$$ 4734632 8372377 12697017 13577846 10102068 5279034 1600832 -821369 -1946965
35979a946965Q11221J781767L62478j431111p52858J601789K563227J563710P29664
$$ -1946965 -1135744 646023 1008501 -422610 -1175468 426321 2989548 4553258 5282922
35970E282922R11426P21312m39027j284545j094259q16148r89643o99172M28171
$$ 5282922 6194348 6915660 6476633 5192088 4097829 3281681 2292038 1592866 2021037
35961B021037J058976K57717p77070n97397Q2454k88125j141727m83679J430810
$$ 2021037 3080013 3337730 2560660 1963263 2045717 1757592 615865 132186 1562996
35952A562996J679426r01063l161743j730542J939740L550467K163343Q71047
$$ 1562996 3242422 2341359 -820384 -2550926 -611186 2939281 5102624 5973671
35944E973671J146667O53415j769775l074326r80442J495086N93493j753068r56527
$$ 5973671 7120338 7773753 6003978 2929652 1949210 3444296 4037789 2284721 1328194
35935A328194K495862L922287K367388J589075K721555K448816K63307P79244
$$ 1328194 3824056 7746343 10113731 11702806 14424361 16873177 17136484 17915728
35927A7915728N405493Q502507P273819Q989589J9757361L0162390K3265984k216274
$$ 17915728 23321221 31823728 39097547 48087136 67844497 98006887 121272871 119056597
35919A19056597k6753172l2164114k1300074j0128720o747692o377431l775576
$$ 119056597 92303425 60139311 38839237 28710517 21962825 15585394 11809818
35912A1809818r89127j313740k932823k504515p40812l79922j230810j070312
$$ 11809818 10820691 9506951 6574128 4069613 3328801 2948879 1718069 647757
35904F47757Q1123K52514o28606o32838N21134R92500L65687M01953J344320Q39649
$$ 647757 728880 981394 352788 -280050 241084 1233584 1599271 2001224 3345544 4185193
35894D185193j725002l025170o05337K723827K609858n42398k586363j761769
$$ 4185193 2460191 -564979 -1170316 1553511 4163369 3620971 1034608 -727161
35886g27161l2747J071111J958135K254058O04444k017773k580877p68515J59802
$$ -727161 -759908 311203 2269338 4523396 5127840 3110067 529190 -239325 -79523
35877g9523j177908j752812O33211L138881K154868r76006k198279q55060J88419
$$ -79523 -1257431 -3010243 -2377032 761849 2916717 1940711 -257568 -1112628 -924209
35868i24209m86602j305942q73083K52966J052746J119655L36106p28661o05204
$$ -924209 -1410811 -2716753 -3589836 -3336870 -2284124 -1164469 -828363 -1557024 -2162228
35859b162228J088118K243644Q93925j607329k308279q06916P29140J018997O18301
$$ -2162228 -1074110 1169534 2063459 456130 -1852149 -2659065 -1929925 -910928 -292627
35850b92627j6258p86624p51098O57850J709909N31179j378466j071402Q43661
$$ -292627 -308885 -1095509 -1846607 -1188757 521152 1052331 -326135 -1397537 -553876
35841e53876J011100q16948j178913R14178J873616l12669k208613l87512K812605
$$ -553876 457224 -359724 -1538637 -624459 1249157 936488 -1272125 -1659637 1152968
35832A152968K881670p270j837581r68948M45946O37946K11067p4290m34747n76970
$$ 1152968 4034638 4027368 2189787 1220839 1666785 2304731 2515798 2441508 2006761 1429791
35822A429791L70137J869807K060303M65213j175384j431084r34972q35662q78488
$$ 1429791 1799928 3669735 5730038 6195251 5019867 3588783 2653811 1818149 939661
35813I39661j13267J251594J764198M66374j776005k922271j846118L60662J589045
$$ 939661 826394 2077988 3842186 4308560 2532555 -389716 -2235834 -1875172 -286127
35804b86127J129745J72766j03983J29265K29702R5153k52606r13260j337944
$$ -286127 843618 1016384 912401 1041666 1271368 1366521 1113915 200655 -1137289
35795a137289o57178N43019M35959j079895j610916K5264J494014O13659p70726
$$ -1137289 -1794467 -1251448 -815489 -1895384 -3506300 -3481036 -1987022 -1373363 -2144089
35786b144089K24358K268159J642272j266271j904799J219965L719591J810879
$$ -2144089 -1919731 348428 1990700 724429 -1180370 39595 3759186 5570065
35778E570065k137205l503256j968655o41032n76253j10707J101366J234468j70459
$$ 5570065 3432860 -70396 -2039051 -2680083 -3256336 -3367043 -2265677 -1031209 -1201668
35769a201668j053183j79622R85313R72032O04098J052750J495174O38731p70499
$$ -1201668 -2254851 -2434473 -1449160 -477128 126970 1179720 2674894 3313625 2543126
35760B543126j061923m32319m69633j267686j245941j1833P69096Q5445p64411
$$ 2543126 1481203 1048884 579251 -688435 -1934376 -1946209 -1177113 -1091668 -1856079
35751a856079l88958M43791K96106m50499m21639K40826K08481n08690m43376
$$ -1856079 -2245037 -1801246 -1505140 -1955639 -2377278 -2136452 -1927971 -2436661 -2880037
35742b880037P15266J374246O06576k74760J48890J038080N43335j299716k420705
$$ -2880037 -2164771 -790525 -183949 -458709 -309819 728261 1271596 -28120 -2448825
35733b448825j433100N64001J267450j53141j980216j742104Q24320L117446K655204
$$ -2448825 -3881925 -3317924 -2050474 -2203615 -4183831 -5925935 -5101615 -1984169 671035
35724F71035K25107j167749k76665J130148J266491O63325N06677L71793p54617
$$ 671035 896142 -271607 -548272 581876 1848367 2511692 3018369 3390162 2635545
35715B635545k305092k729523j697186k48366P80586J173695P34740k84699o19163
$$ 2635545 330453 -2399070 -4096256 -4344622 -3564036 -2390341 -1655601 -1940300 -2559463
35706b559463N83129K057205J783937n2449j195517n60988M39442L66586j85271
$$ -2559463 -1976334 80871 1864808 1812359 616842 55854 495296 861882 676611
35697F76611p5184K01768o18457k123854k290432k59679K142343K478134P08366
$$ 676611 601427 803195 184738 -1939116 -4229548 -4489227 -2346884 131250 839616
35688H39616r27773r95335n37643r80616j655968r97187N83340J164586N14244
$$ 839616 -88157 -1083492 -1621135 -2601751 -4257719 -5254906 -4671566 -3506980 -2992736
35679b992736L87451J215682J170955l72900j204390P4349J372333N54572q11286
$$ -2992736 -2605285 -1389603 -218648 -591548 -1795938 -1721589 -349256 205316 -605970
35670f05970k50365J078694L50387j807743k263156p35418O4488m84475j23045
$$ -605970 -856335 222359 572746 -1234997 -3498153 -4233571 -4169083 -4653558 -4776603
35661d776603J501014J762351j5341r31533L86000J246974j48855j238988L33597
$$ -4776603 -3275589 -1513238 -1528579 -2460112 -2074112 -827138 -975993 -2214981 -1881384
35652a881384K237107J233273j405084k236408j218522q41765j308920p38960
$$ -1881384 355723 1588996 183912 -2052496 -3271018 -4112783 -5421703 -6160663
35644f160663P80190J302071O76741M98295Q38133N18672J64198J252686K438610
$$ -6160663 -5380473 -4078402 -3401661 -2903366 -2065233 -1546561 -1382363 -129677 2308933
35635B308933R20792k342986l119325m33736J734481Q18307n76083L39438J754221
$$ 2308933 3229725 886739 -2232586 -2666322 -931841 -113534 -689617 -350179 1404042
35626A404042Q26775j074410o93498J476136J961814q7868j802578j125256P00070
$$ 1404042 2230817 1156407 462909 1939045 3900859 3812991 2010413 885157 1585227
35617A585227J706693J694257J299010N94835l59937r92772j147982j532805k481089
$$ 1585227 3291920 4986177 6285187 6880022 6520085 5527313 4379331 2846526 365437
35608C65437l058358k116001J78613K306033K680634R59285j518972k636210j369702
$$ 365437 -2692921 -4808922 -4630309 -2324276 356358 1315643 -203329 -2839539 -4209241
35599d209241J138772K721823K323673O92740p46584j125371m44950N98279J029613
$$ -4209241 -3070469 -348646 1975027 2667767 1921183 795812 350862 949141 1978754
35590A978754M03401o59288j086971n27083L95310Q81712O75755R1507l30816
$$ 1978754 2382155 1722867 635896 108813 504123 1385835 2061590 2153097 1822281
35581A822281l19923k77174q79567j930749k082577l98828K074630L150222J981220
$$ 1822281 1502358 1225184 345617 -1585132 -3667709 -4066537 -1991907 1158315 3139535
35572C139535K0625p22892J08843J075574P72875m92210j064611p3276J213285
$$ 3139535 3160160 2437268 2546111 3621685 4394560 3902350 2837739 2764463 3977748
35563C977748R11062p55213j538028m36566O30681l10850k034023j700058R05779
$$ 3977748 4888810 4133597 2595569 2159003 2789684 2478834 444811 -1255247 -349468
35554c49468K997718K729916J266759K78636m50681j598628k266277j260502N33718
$$ -349468 2648250 5378166 6644925 6923561 6472880 4874252 2607975 1347473 1881191
35545A881191R52002n15570k059774j877465j11042J626323J911371O57644q93163
$$ 1881191 2833193 2317623 257849 -1619616 -1730658 -104335 1807036 2464680 1571517
35536A571517j401909q69099l88793l38250J51403J364751J939230P70109j141279
$$ 1571517 169608 -699491 -1088284 -1426534 -1275131 89620 2028850 2798959 1657680
35527A657680k136033k135808j810649o95639J609833L293428K249410j85051
$$ 1657680 -478353 -2614161 -4424810 -5120449 -3510616 -217188 2032222 1847171
35519A847171n92931J200467J684212m95859k054559n21295J433665M09086j879134
$$ 1847171 1254240 2454707 4138919 3643060 1588501 1067206 2500871 2909957 1030823
35510A030823j394658J336952J912729p92182k900412j793195K38099M44112r803
$$ 1030823 -363835 973117 2885846 2093664 -806748 -2599943 -2361844 -1917732 -1927535
35501a927535J084903K473090J254873k088975l814064k000963J065763K196834
$$ -1927535 -842632 1630458 2885331 796356 -3017708 -5018671 -3952908 -1756074
35493a756074J097414j40751k20258K9548m97873j084026p2534K174055K820403
$$ -1756074 -658660 -799411 -1019669 -990121 -1487994 -2572020 -2644554 -470499 2349904
35484B349904L30984k626002k337407N27923J661010m15477k087630m51841J986974
$$ 2349904 2680888 54886 -2282521 -1754598 -93588 -509065 -2596695 -3048536 -1061562
35475a061562J384023j190054j491489J068824K532609N69405k195622k315079
$$ -1061562 322461 -867593 -2359082 -1290258 1242351 1811756 -383866 -2698945
35467b698945j30655J509857J237695J05414l51242L55268J410487J260769p73047
$$ -2698945 -2829600 -1319743 -82048 23366 -327876 27392 1437879 2698648 1925601
35458A925601l073080l102941o79363J536378J499283J92734m34046l43811o24155
$$ 1925601 -1147479 -4250420 -4929783 -3393405 -1894122 -1701388 -2135434 -2479245 -3103400
35449c103400j017713k70567J454342K406891J702139M64978K316m9485q80902
$$ -3103400 -4121113 -4391680 -2937338 -530447 1171692 1636670 1638986 1589501 708599
35440G08599k337583k654233p66072J740633K097115M23j530399r2887K468498
$$ 708599 -1628984 -4283217 -5049289 -3308656 -1211541 -1211118 -2741517 -2834404 -365906
35431c65906K435266l39429k119696q48844R92037O31311o91983l05338J117074
$$ -365906 2069360 1729931 -389765 -1238609 -246572 384739 -307244 -612582 504492
35422E04492P98226j110497j496400M95546J766569J21112k095799j429731J480323
$$ 504492 1302718 192221 -1304179 -808633 957936 1079048 -1016751 -2446482 -966159
35413i66159K750282O91386k011272k060809K21852J688384O78654j033678j063967
$$ -966159 1784123 2475509 464237 -1596572 -1374720 313664 992318 -41360 -1105327
35404a105327K05337O16370r7807J2524J420465J778873k01922k022260j070025
$$ -1105327 -899990 -283620 -381427 -368903 1051562 2830435 2628513 606253 -463772
35395d63772R69023O89948j387340j680602M59655J886953J123641K75123L80033
$$ -463772 505251 1195199 -192141 -1872743 -1413088 473865 1597506 1872629 2252662
35386B252662n80041k973431l353992j33834K677517J418380j098617k38475K589662
$$ 2252662 1672621 -1300810 -4654802 -4788636 -2111119 -692739 -1791356 -2029831 559831
35377E59831K466037m75979j423733O19723J309331j074566k511877m93966J350183
$$ 559831 3025868 2549889 1126156 1745879 3055210 1980644 -531233 -1025199 324984
35368C24984n09303l323343k523835J048812L007155K186835J016120O11246q8559
$$ 324984 -184319 -3507662 -6031497 -4982685 -1975530 211305 1227425 1838671 1750112
35359A750112r89341p11874L25374K69179o35747k25899J586605K278254Q14988
$$ 1750112 760771 48897 374271 643450 7703 -218196 1368409 3646663 4461651
35350D461651q06670j067708j040185j692228j829380n01433Q47051P05231J43994
$$ 4461651 3654981 2587273 1547088 -145140 -1974520 -2475953 -1628902 -923671 -779677
35341g79677Q95977K183101J898000J34868r40109n28807j32924o94366j023395
$$ -779677 116300 2299401 4197401 4332269 3392160 2863353 2730429 2036063 1012668
35332A012668j13642P73163n071j568051j501331M58795J751217O34668j246902
$$ 1012668 899026 1672189 1667118 99067 -1402264 -943469 807748 1442416 195514
35323A95514j286753L57860J306794N90874l52721l49705p9100l92965q42058
$$ 195514 -1091239 -733379 573415 1164289 811568 461863 382763 -10202 -852260
35314h52260p58307l19490K84803J248389J933076J024499j094704k089454j088239
$$ -852260 -1610567 -1930057 -1645254 -396865 1536211 2560710 1466006 -623448 -1711687
35305a711687j95570r02517j402327J09977J849754J359245j9682N38304K072475
$$ -1711687 -1907257 -2809774 -4212101 -4102124 -2252370 -893125 -912807 -374503 1697972
35296A697972J353704j138889j682475J69226O68855j460824k548314k82369K158484
$$ 1697972 3051676 1912787 230312 399538 1068393 -392431 -2940745 -3223114 -1064630
35287a064630J302237j163947j640493k53516M33618L096j75445j31411o52203
$$ -1064630 237607 -926340 -2566833 -2820349 -2386731 -2383635 -2559080 -2690491 -3342694
35278c342694q32003M48675J736702Q98769j127165j605104k96554O17998M01862
$$ -3342694 -4174697 -3726022 -1989320 -1090551 -2217716 -3822820 -4119374 -3501376 -3099514
35269c099514M41077J222866J577154J094112P13989O93729L06105l05075k09442
$$ -3099514 -2658437 -1435571 141583 1235695 1949684 2643413 2949518 2644443 2435001
35260B435001K79362j07942j136455j125907K54709J371645J167964L56394k75393
$$ 2435001 2714363 2606421 1469966 344059 598768 1970413 3138377 3494771 3219378
35251C219378q52111j310161j092667l76430n1093k24481k35441j63050o47677
$$ 3219378 2367267 1057106 -35561 -411991 -463084 -687565 -923006 -1086056 -1733733
35242a733733j213721o16710R58222J816292J137507j25496q61362q34851j95006
$$ -1733733 -2947454 -3564164 -2605942 -789650 347857 222361 -639001 -1473852 -1668858
35233a668858N56971M38267n91960p67057R80925K604285J612337p31393j113989
$$ -1668858 -1111887 -673620 -1265580 -2032637 -1051712 1552573 3164910 2433517 1319528
35224A319528M96187J037689j45896l05474J361657J815159m92853k474476j274119
$$ 1319528 1815715 2853404 2707508 2402034 3763691 5578850 5085997 2611521 1337402
35215A337402J146235J400059j02416o88135j35088m17187j931417l017384k622537
$$ 1337402 2483637 3883696 3781280 3093145 2958057 2540870 609453 -2407931 -5030468
35206e030468j112662R23760K715528K943791J203892q64454j464171q50177l66669
$$ -5030468 -6143130 -5219370 -2503842 439949 1643841 779387 -684784 -1534961 -1901630
35197a901630m02954o18198r27449r71704m0363J272090J141922m22144q25296
$$ -1901630 -2304584 -2922782 -3850231 -4821935 -4862298 -3590208 -2448286 -2870430 -3695726
35188c695726J066920K622869J509181m30093k68879J276430J572662O05066J34421
$$ -3695726 -2628806 -5937 1503244 1073151 804272 2080702 3653364 4258430 4392851
35179D392851o3966j185319j943975m12176J601440O15867k420759k911487J65547
$$ 4392851 4328885 3143566 1199591 787415 2388855 3004722 583963 -2327524 -2161977
35170b161977K669589J967911M02426L00411J25329j666486k900183j309398J044992
$$ -2161977 507612 2475523 2877949 3178360 3303689 1637203 -1262980 -2572378 -1527386
35161a527386P51060j446366j803104O73485K933682K292521l86387k289890j830053
$$ -1527386 -776326 -2222692 -4025796 -3352311 -418629 1873892 1487505 -802385 -2632438
35152b632438J08601J233596J95414j745594k026816o1684J942195J993810P07527
$$ -2632438 -2523837 -1290241 -1094827 -2840421 -4867237 -4928921 -2986726 -992916 -285389
35143b85389k25256m35031m38425j42680O29237J081932M64240n58768q75616
$$ -285389 -510645 -945676 -1384101 -1526781 -897544 184388 648628 89860 -785756
35134g85756n35199j40786M67635J490448J995213J127143j71702m00065O2148
$$ -785756 -1320955 -1461741 -994106 496342 2491555 3618698 3446996 3046931 3109079
35125C109079l62698j622273j952984p55430M86083P01067P28388J322777J346023
$$ 3109079 2746381 1124108 -828876 -1584306 -1098223 -397156 331232 1654009 3000032
35116C000032m95242l082616l761950j625783J346950K572629J408719p09422
$$ 3000032 2504790 -577826 -4339776 -5965559 -4618609 -2045980 -637261 -1346683
35108a346683j878055j205407O40288J953836J516444p1522j015443n25068L32793
$$ -1346683 -3224738 -4430145 -3789857 -1836021 -319577 -391099 -1406542 -1931610 -1598817
35099a598817M87235N75880J581651K521826J451169j208848k532848j136950
$$ -1598817 -1111582 -535702 1045949 3567775 5018944 3810096 1277248 140298
35091A40298O83635L95180r75764p32005R83713J368518n33135k281922j741913
$$ 140298 823933 1219113 243349 -488656 495057 1863575 1330440 -951482 -2693395
35082b693395k4025N83345m4811k24373P50027J722778J383211j95077j792399
$$ -2693395 -2717420 -2134075 -2178886 -2403259 -1653232 69546 1452757 1257680 -534719
35073e34719k265142j470407k16274O55154J016129J160751J163962J007569R53743
$$ -534719 -2799861 -4270268 -4486542 -3831388 -2815259 -1654508 -490546 517023 1470766
35064A470766J132406J117683O29443J60349J3169o02118k185110l315884k290414
$$ 1470766 2603172 3720855 4350298 4510647 4523816 3921698 1736588 -1579296 -3869710
35055c869710j38914K45213j599473k600302n12198K606359L128811Q59948q43601
$$ -3869710 -4008624 -3763411 -5362884 -7963186 -8475384 -5869025 -2740214 -1880266 -2723867
35046b723867K43011K295791K006872r10329l084674j671978J814849L207754
$$ -2723867 -2480856 -185065 1821807 911478 -2173196 -3845174 -2030325 1177429
35038A177429J034823j728833j994210m88446M09672O88770J665944K374231P56119
$$ 1177429 2212252 483419 -1510791 -1999237 -1589565 -900795 765149 3139380 3895499
35029C895499j920221j932098R29088K281123l03381l315758k400674J404016
$$ 3895499 1975278 43180 972268 3253391 2950010 -365748 -2766422 -1362406
35021a362406L464339J737413j578978l363339k263221Q94995L483561K912893
$$ -1362406 2101933 3839346 2260368 -1102971 -3366192 -2471197 1012364 3925257
35013C925257k82430k446261j364877Q30195J056364l41101r12114j26755O00865
$$ 3925257 3642827 1196566 -168311 661884 1718248 1377147 465033 338278 939143
35004I39143P37679Q64061R22902N58923L55013O43579K68351j262196j929740
$$ 939143 1676822 2540883 3463785 4022708 4377721 5021300 5289651 4027455 2097715
34995B097715k36206J509570L07685k379695k498466J98818J809067M87034j119163
$$ 2097715 1861509 3371079 3678764 1299069 -1199397 -1000579 808488 1295522 176359
$$ [...]
##END NTUPLES=NMR SPECTRUM
##END=
