##TITLE=31Pdec_LR-760-1-C1-B
 D2O, 24 sc
 20.1.2023
##JCAMPDX= 6.0         $$ Bruker NMR JCAMP-DX V2.0
##DATA TYPE= NMR SPECTRUM
##DATA CLASS= NTUPLES
##ORIGIN= UXNMR, Bruker Analytische Messtechnik GmbH
##OWNER= root
$$ XWIN-NMR		Version 3.5
$$ Fri Jan 20 15:28:53 2023 Russian Standard Time (UT+4h)  she@DPX200
##.OBSERVE FREQUENCY= 81.013821
##.OBSERVE NUCLEUS= ^31P
##.ACQUISITION MODE= SIMULTANEOUS
##.ACQUISITION SCHEME= undefined
##.AVERAGES= 24
##.DIGITISER RES= 16
##SPECTROMETER/DATA SYSTEM= spect
##.PULSE SEQUENCE= zgpg30
##.SOLVENT NAME= CDCl3
##.SHIFT REFERENCE= (INTERNAL, CDCl3, 0, 248.564)
##AUDIT TRAIL= $$ (NUMBER, WHEN, WHO, WHERE, WHAT)
$$ ##TITLE= Audit trail, XWIN-NMR		Version 3.5
$$ ##JCAMPDX= 5.01
$$ ##ORIGIN= Bruker BioSpin GmbH
$$ ##OWNER= she
$$ F:/spectra/data/she/nmr/P31/1/pdata/1/auditp.txt
$$ ##AUDIT TRAIL=  $$ (NUMBER, WHEN, WHO, WHERE, WHAT)
(   1,<2023-01-20 15:25:24.54 +0400>,<she>,<DPX200>,
      <created by zg, POWCHK disabled, PULCHK disabled
       configuration hash MD5:
       00 E9 B6 7A A2 85 ED C7 34 08 36 98 17 FE 4E 26
       data hash MD5: 32K
       35 F9 82 E7 32 CE 37 57 C4 C9 09 A0 CE B7 65 B1>)
(   2,<2023-01-20 15:27:52.01 +0400>,<she>,<DPX200>,
      <Start of raw data processing
       efp BC_mod = 2 LB = 1 FT_mod = 6 PKNL = 1 PHC0 = -10984.26 PHC1 = 67.05779 SI = 64K 
       data hash MD5: 64K
       E5 78 D4 76 EB 5B 4F D4 FE 34 EC 2D 05 BF 02 23>)
(   3,<2023-01-20 15:28:10.10 +0400>,<she>,<DPX200>,
      <pk PHC0 = -5.070256 PHC1 = 20.6 
       data hash MD5: 64K
       BA E5 32 97 2E 27 B3 2F B2 43 91 CA 07 76 44 2B>)
$$ ##END=
$$ 
$$ hash MD5
$$ 59 1F 35 4E 0D FD 5E 29 FA 1E 95 91 EF 70 C8 EC
##$RELAX= 
##$RELAX= 
##$RELAX= 
##$RELAX= 
##$RELAX= 
##$RELAX= 
##$RELAX= 
##$RELAX= 
##$RELAX= 
$$ Bruker specific parameters
$$ --------------------------
##$DU= <F:/spectra>
##$EXPNO= 1
##$NAME= <P31>
##$PROCNO= 1
##$TYPE= <nmr>
##$USER= <she>
##$AMP= (0..31)
100 100 100 100 100 100 100 100 100 100 100 100 100 100 100 100 100 100 
100 100 100 100 100 100 100 100 100 100 100 100 100 100 
##$AQSEQ= 0
##$AQ_mod= 1
##$AUNM= <au_zg>
##$AUTOPOS= <>
##$BF1= 81.014009
##$BF2= 200.13
##$BF3= 200.13
##$BF4= 200.13
##$BF5= 200.13
##$BF6= 200.13
##$BF7= 200.13
##$BF8= 200.13
##$BYTORDA= 1
##$CFDGTYP= 0
##$CFRGTYP= 5
##$CHEMSTR= <none>
##$CNST= (0..31)
1 1 145 1 1 1 1 1 1 1 1 1 1 1 1 1 1 1 1 1 1 1 1 1 1 1 1 1 1 1 1 1 
##$CPDPRG= <waltz16>
##$CPDPRG1= <>
##$CPDPRG2= <waltz16>
##$CPDPRG3= <>
##$CPDPRG4= <mlev>
##$CPDPRG5= <mlev>
##$CPDPRG6= <mlev>
##$CPDPRG7= <mlev>
##$CPDPRG8= <mlev>
##$CPDPRGB= <>
##$CPDPRGT= <>
##$D= (0..31)
0 1 0 0 0 0 0 0 0 0 0 0.03 2e-05 3e-06 0 0 0 0 0 0 0 0 0 0 0 0 0 0 0 0 
0 0 
##$DATE= 1674213923
##$DBL= (0..7)
120 120 120 11 120 120 24 19 
##$DBP= (0..7)
150 150 150 150 150 150 150 150 
##$DBP07= 0
##$DBPNAM0= <>
##$DBPNAM1= <>
##$DBPNAM2= <>
##$DBPNAM3= <>
##$DBPNAM4= <>
##$DBPNAM5= <>
##$DBPNAM6= <>
##$DBPNAM7= <>
##$DBPOAL= (0..7)
0.5 0.5 0.5 0.5 0.5 0.5 0.5 0.5 
##$DBPOFFS= (0..7)
$$ [...]
##$SUBNAM2= <"">
##$SUBNAM3= <"">
##$SUBNAM4= <"">
##$SUBNAM5= <"">
##$SUBNAM6= <"">
##$SUBNAM7= <"">
##$SUBNAM8= <"">
##$SUBNAM9= <"">
##$SW= 501.771253377433
##$SWIBOX= (0..15)
0 1 3 0 0 0 0 0 0 0 0 0 0 0 0 0 
##$SW_h= 40650.406504065
##$TD= 32768
##$TD0= 1
##$TE= 0
##$TE2= 300
##$TE3= 300
##$TEG= 300
##$TL= (0..7)
0 120 53 12 22 120 120 120 
##$TP= (0..7)
150 150 150 150 150 150 150 150 
##$TP07= 0
##$TPNAME0= <>
##$TPNAME1= <>
##$TPNAME2= <>
##$TPNAME3= <>
##$TPNAME4= <>
##$TPNAME5= <>
##$TPNAME6= <>
##$TPNAME7= <>
##$TPOAL= (0..7)
0.5 0.5 0.5 0.5 0.5 0.5 0.5 0.5 
##$TPOFFS= (0..7)
0 0 0 0 0 0 0 0 
##$TUNHIN= 0
##$TUNHOUT= 0
##$TUNXOUT= 0
##$USERA1= <user>
##$USERA2= <user>
##$USERA3= <user>
##$USERA4= <user>
##$USERA5= <user>
##$V9= 5
##$VALIST= <valist>
##$VCLIST= <CCCCCCCCCCCCCCC>
##$VD= 0
##$VDLIST= <DDDDDDDDDDDDDDD>
##$VPLIST= <PPPPPPPPPPPPPPP>
##$VTLIST= <TTTTTTTTTTTTTTT>
##$WBST= 1024
##$WBSW= 4
##$XGAIN= (0..3)
0 0 0 0 
##$XL= 0
##$YL= 0
##$YMAX_a= 5309
##$YMIN_a= -6814
##$ZGOPTNS= <>
##$ZL1= 120
##$ZL2= 120
##$ZL3= 120
##$ZL4= 120
##$ABSF1= 0
##$ABSF2= 0
##$ABSG= 0
##$ABSL= 0
##$ALPHA= 0
##$AQORDER= 0
##$ASSFAC= 0
##$ASSFACI= 0
##$ASSFACX= 0
##$ASSWID= 0
##$AUNMP= <proc_1d>
##$AZFE= 0.1
##$AZFW= 0.5
##$BCFW= 0
##$BC_mod= 2
##$BYTORDP= 0
##$COROFFS= 0
##$CY= -3
##$DATMOD= 1
##$DC= 0
##$DFILT= <>
##$DTYPP= 0
##$F1P= 0
##$F2P= 0
##$FCOR= 1
##$FTSIZE= 65536
##$FT_mod= 6
##$GAMMA= 0
##$GB= 0
##$INTBC= 1
##$INTSCL= 6.047779e-11
##$ISEN= 30
##$LB= 1
##$LEV0= 0
##$LPBIN= 0
##$MAXI= 10000
##$MC2= 0
##$MEAN= 0
##$ME_mod= 0
##$MI= 50
##$NCOEF= 0
##$NC_proc= -6
##$NLEV= 6
##$NOISF1= 182.463
##$NOISF2= 159.3651
##$NSP= 0
##$NTH_PI= 0
##$NZP= 0
##$OFFSET= 248.5645
##$PC= 4
##$PHC0= -10989.33
##$PHC1= 87.65779
##$PH_mod= 1
##$PKNL= yes
##$PPARMOD= 0
##$PSCAL= 0
##$PSIGN= 0
##$REVERSE= no
##$SF= 81.0140089999694
##$SI= 65536
##$SIGF1= 159.3651
##$SIGF2= -187.1042
##$SINO= 113.3802
##$SIOLD= 16384
##$SREGLST= <1H.CDCl3>
##$SSB= 0
##$STSI= 65536
##$STSR= 0
##$SW_p= 40650.406504065
##$SYMM= 0
##$S_DEV= 0
##$TDeff= 32768
##$TDoff= 0
##$TI= <>
##$TILT= no
##$TM1= 0
##$TM2= 0
##$TOPLEV= 0
##$USERP1= <user>
##$USERP2= <user>
##$USERP3= <user>
##$USERP4= <user>
##$USERP5= <user>
##$WDW= 1
##$XDIM= 65536
##$YMAX_p= 446215214
##$YMIN_p= -5547216
$$ End of Bruker specific parameters
$$ ---------------------------------
##NTUPLES= NMR SPECTRUM
##VAR_NAME=  FREQUENCY,     SPECTRUM/REAL,   SPECTRUM/IMAG
##SYMBOL=    X,             R,               I
##VAR_TYPE=  INDEPENDENT,   DEPENDENT,       DEPENDENT
##VAR_FORM=  AFFN,          ASDF,            ASDF
##VAR_DIM=   65536,         65536,           65536
##UNITS=     HZ,            ARBITRARY UNITS, ARBITRARY UNITS
##FACTOR=    0.620285442955139, 1,           1
##FIRST=     20137.2065510682, 0,            0
##LAST=      -20513.1999529968, 0,           0
##MIN=       -20513.1999529968, -5547216,    0
##MAX=       20137.2065510682, 446215214,    0
$$ Real data points
##PAGE= N=1
##DATA TABLE= (X++(R..R)), XYDATA
$$ [...]
40996b070826j20371P15832N64749L36951M92055P7293j112822j468968j05216
40987b691323J267556Q22148m16501k16418J203811J555250J71560j055559o88137
40978d7613L83391O98900J73335m88574r59547j053945m15998P41790J406672
40969D38411R60582k6858o65963p49998n22881j62962J09661O8988n7936J80167
40959d28789N81158M37192k33629n31225q0427L57153J21187m06642n95620m34875
40949a214517j21053L36472O11623J49486o64624n18027Q55519J811758R59832
40940B206469p59848j398777o48979J94435L94563M27612O48994O90443L52316
40931B107228J7229p8676j80230m36741o50871p00484o34689l52716K31121P40393
$$ y = [-2070826, -2191197, -1475365, -910616, -573665, -81610, -4317, -1117139, -2586107, -2691323, -1423767, -601619, -1018120, -1234538, -30727, 1524523, 1696083, 640524, -47613, 335778, 1034678, 1208013, 719439, -240108, -1294053, -1710051, -968261, 438411, 1398993, 1372135, 706172, -43826, -566707, -729669, -620008, -551020, -608956, -428789, 152369, 589561, 355932, -175293, -255720, 101433, 222620, -184022, -779642, -1214517, -1335570, -999098, -387475, -237989, -902613, -1420640, -565121, 1246637, 2206469, 1446621, 47844, -601135, -406700, -12137, 415475, 1064469, 1754912, 2107228, 2124457, 2045781, 1865551, 1428810, 777939, 77455, -557234, -909950, -678829, 61564]
40921F1564O45779R323n85836p67659n79910j68835K17367K02793j60307j75654
40911a301375M72134R41215M01068m58204k83558P92043J215912L08944q63585
40902A224594j229507j010282p60228l41967L74770Q24611O33737L66761N21888
40893F04377N58482j02728q09216n75947J95510J80001p91641j363646o25838
40884b730646N90561R25848K79546k91333j08182L80561M39073J36568J97457
40875a80547Q27716J180721M19766r22185j347806l21073R10643Q96407j66402
40866A297240q39383l65135N93143J029394O43555k79638j315138j908001j517713
40857b661676k63672Q33602P44343m16204j411165j170606P3195J086161J042723
$$ y = [61564, 707343, 716666, 130830, -636829, -1216739, -1385574, -1168207, -965414, -1125721, -1301375, -829241, 111974, 513042, 54838, -228720, 563323, 1779235, 2088179, 1224594, -4913, -1015195, -1775423, -2117390, -1742620, -918009, -284272, 82489, 604377, 1162859, 1060131, 250915, -325032, -129522, 50479, -741162, -2104808, -2730646, -2140085, -1214237, -934691, -1226024, -1334206, -953645, -514572, -378004, -180547, 647169, 1827890, 2247656, 1325471, -22335, -343408, 567235, 1463642, 1297240, 457857, 92722, 685865, 1715259, 2358814, 2079176, 764038, -1143963, -2661676, -2925348, -2091746, -1347403, -1763607, -3174772, -4345378, -4272183, -3186022, -2143299]
40848b143299L87485Q7695L03467L61316J1790q8964M63771R51836N67444k37690
40838F64851m01049O8476J63330m09295p61991l55465J19097l9810l66293m9342
40828a367491P10905R88855M04310n61110j221166j120903j82943J015885J475851
40819A42193Q63735K3473j52473R4446J0646l63280m09052j15920o4449l77208
40809c47889o01168n27877k73423K58066J034755J293017M54552n71697m30383
40800B87953M30375K71279r98510j419035j98446Q14517J90346n75988M03957
40791g93552J976018J548506p38300k092974j155352M59553R88815O52937L00069
40782A145720j19407p52241j034153o69336k51182j36350J56797P60308R29105
$$ y = [-2143299, -1755814, -1668119, -1364652, -1003336, -991546, -1080510, -616739, 335097, 902541, 664851, 263802, 332278, 495608, 86313, -675678, -1031143, -912046, -951856, -1318149, -1367491, -656586, 332269, 736579, 175469, -1045697, -2166600, -2349543, -1333658, 142193, 1005928, 1029401, 876928, 971374, 982020, 618740, 209688, 93768, 29319, -347889, -949057, -1476934, -1750357, -1492291, -457536, 835481, 1290033, 718336, 287953, 718328, 989607, -8903, -1427938, -1626384, -811867, -621521, -1197509, -793552, 1182466, 2730972, 1992672, -100302, -1255654, -796101, 192714, 845651, 1145720, 1026313, 274072, -760081, -1429417, -1680599, -1816949, -1660152, -899844, 29261]
40773B9261M42221J95102N16957L22506r13529j752270q59563P10313J017474
40764b91528J01276m81836k61162k3549J30032P69299J321043M84740j264046
40755D84269j733299k46049J146421O61743p20239r98603R643R57989J068934
40746F30809N72896k13252r79766j132059n02015J20821R8653j4691M79287J038114
40736I8797P49212J073j00125L77823L41161l96289p53475j12630Q23667J163527
40726B192741P88269j080q28226j108368n56754Q2183j58095r11741r32265j44474
40716a577810K03634k97474n22179J34620O46401K29606k17181K29761Q14542
40707c56080N27299L1499M40863J105028N75341p43089r50923L79612J497071
$$ y = [29261, 471482, 666584, 1183541, 1506047, 592518, -1159752, -2019315, -1309002, -291528, -190252, -672088, -933250, -956799, -826767, -57468, 1263575, 1748315, 484269, -1249030, -1495079, -348658, 313085, -407154, -1405757, -1396114, -438125, 630809, 1203705, 990453, 10687, -1121372, -1623387, -1502566, -1403913, -1418604, -939317, 98797, 848009, 849082, 748957, 1126780, 1467941, 1071652, 318177, 205547, 1029214, 2192741, 2981010, 2979930, 2151704, 1043336, 486582, 568765, 410670, -501071, -1433336, -1577810, -1374176, -1671650, -2193829, -2059209, -1412808, -1183202, -1400383, -1170622, -356080, 171219, 202718, 643581, 1748609, 2323950, 1580861, 629938, 1009550, 2506621]
40698B506621J054772k21637r84253j024154q95927q05585o00710k54312J37011
40689a088174M51528M99057K90550K24340M71781N16611L4934k89239J15964L70525
40679A597877n72471j737003j159220Q98070J917987P97387o19803n93451L0966
40670E60339k04743p73737l94951M91900N04230k65050n33154l6788L18205K34563
40660i9186K95770N48889L30120l96379q10661n11213L0507L75872N40189M87439
40650G91347R3508l72946n02226l79521k75840j7599N17892P07559J4709q55336
40640b78453p83272O6641N77194M41389K84909K28442k17607q49289q56177l43584
40630a729807k85150p25104n54770N17069J285041R23466J41305k01570k87585
$$ y = [2506621, 3561393, 3339756, 2355503, 1331349, 435422, -370163, -970873, -1225185, -1088174, -636646, -137589, 152961, 377301, 849082, 1365693, 1400627, 1111388, 1227352, 1597877, 1025406, -711597, -1870817, -972747, 945240, 1742627, 1122824, 529373, 560339, 355596, -418141, -813092, -321192, 183038, -82012, -615166, -651954, -333749, -99186, 196584, 745473, 1075593, 679214, -131447, -642660, -612153, -236281, 303908, 791347, 884855, 511909, 9683, -369838, -645678, -663277, -145385, 562174, 576883, -278453, -1061725, -995084, -417890, 23499, 308408, 536850, 319243, -530046, -1386223, -1729807, -2014957, -2740061, -3294831, -2777762, -1492721, -569255, -427950, -629520, -917105]
40621i17105m03829j28191O43420J024284M40023m20444q04646r42902j021898
40612b531288l99961R75706J623004N04494j058915j114476R6887Q31906O94714
40603c77929P45400J100232O88938m23313p36381K3786J23672j186571j952760
40594a994926n12460J443844J108171j090177j966157l15222J427823J011061
40586h88043m42227n41472P66779J623469J277364O20663J28313o66286j525011
40577C53549j302223R314P23650j28873j229410r04642M91876J344091J067091
40568D24423M03837K8438m430J68768K76821j8133m12183n8585Q96219R78506
40558B683681l42670j342789n47527P19225L56902r85907r56471N18648J157204
$$ y = [-917105, -1320934, -1449125, -805705, 218579, 658602, 238158, -566488, -1509390, -2531288, -2931249, -1955543, -332539, 171955, -886960, -2001436, -1904549, -1072643, -377929, 367471, 1467703, 2156641, 1733328, 996947, 1020733, 1144405, -42166, -1994926, -2507386, -1063542, 44629, -1045548, -3011705, -3326927, -1899104, -888043, -1330270, -1871742, -1104963, 518506, 1795870, 2416533, 2544846, 1878560, 353549, -948674, -939360, -215710, -344583, -1573993, -2478635, -1986759, -642668, 424423, 828260, 856698, 852268, 1021036, 1297857, 1279724, 867541, 808956, 1705175, 2683681, 2341011, 998222, 450695, 1169920, 1526822, 540915, -415556, 103092, 1260296]
40549A260296K22818m42905J39069M70754m74113j259702n06549P01687O57671
40540G69026l66702j013106r68124o65619p5373P53150J010811L09230m53972
40531g00679m82862j84811M9587O74143J504902J163283n70880j654259p48857
40522i50433N19674K80919m71746K4955Q40252L3226j464342j066547R80916J787061
40512E13935M25325r55101r36842n46073m89640K15505J726034K251810Q65997
40503C070950q70352j441726j377848j387474p29213Q75408J743295O60934p96244
40494b52270m91098R61860J273167K6903j013546p90798j56937p7043k33228R2896
40484f60094P44320Q76851J18262p61229n71728O60612J278100J09662j465797
$$ y = [1260296, 1483114, 1040209, 1179278, 1650032, 1175919, -83783, -590332, 111355, 769026, 402324, -610782, -1578906, -2244525, -2319898, -1566748, -555937, -246707, -700679, -1183541, -1368352, -1318765, -644622, 860280, 2023563, 1452683, -201576, -950433, -430759, -149840, -621586, -596631, 243621, 276847, -1187495, -2254042, -1273126, 513935, 939260, -15841, -952683, -1498756, -1988396, -1772891, -46857, 2204953, 3070950, 2200598, 758872, -618976, -2006450, -2735663, -1860255, -116960, 543974, -252270, -743368, 218492, 1491659, 1518562, 505016, -285782, -442719, -519762, -752990, -660094, 84226, 961077, 1079339, 318110, -253618, 406994, 1685094, 1794756, 328959]
40475C28959j144849P32416J354052l08656j787187r48019P28449P22248n19089
40466h41676p03777L90348R25738L75000Q4361M37992J20400j200934j799126
40457b211674n38388J212412J522798M41920n52413o57863k12134K62043M99981
40448b33318L56279p8409m42066n32705m63251k43663K75673Q83440J027764N78858
40438A128602K5820k40428k72835j39943J50305K43895k09730o92436k71733Q48979
40428E70496J325683O53675J730L57758R38502M73955p68441j440045j069930
40419A043383l88557J7671K40474L11482k0915o11793q25831l79205K55239M47119
40409H9067M3938o04869r35605n86680J61686N76174L96861J86710L73191N27437
$$ y = [328959, -815890, -83474, 1270578, 961922, -825265, -1773284, -1044835, -322587, -841676, -1545453, -1155105, -229367, 145633, 229994, 667986, 788386, -412548, -2211674, -2750062, -1537650, -14852, 427068, -125345, -783208, -995342, -733299, -233318, 122961, 44552, -397514, -930219, -1393470, -1637133, -1361460, -478020, 549744, 1128602, 1154422, 913994, 641159, 501216, 651521, 895416, 685686, -6750, -278483, 570496, 1896179, 2549854, 2551584, 2909342, 3847844, 4321799, 3553358, 2113313, 1043383, 654826, 672497, 912971, 1224453, 1203538, 591745, -234086, -613291, -358052, 89067, 133005, -471864, -1407469, -1994149, -1832463, -1256289, -859428, -672718, -299527, 227910]
40399B27910K28671k0180L13816N92537m1136r37120p09575L82954N76748n80345
40389C4280j366179o03832M79759L52462l18682Q5305J347375J706641N41123
40380B258252r23798j526182j303227o31725L41782J093569Q41882j77467o09568
40371f36482K08818J212057J091808J01584m62709j26257L24717J61557l33877
40362A541216m78347k24094j20426l76446m73689J7699O09952M81201k10681l82650
40352C83735L78236J101766Q38575K390m44036m43927n11357n21509m0868M75363
40342A218368J43029p52118r19550P707R07262Q13364M3848o31015r12116p36005
40332h17226j35609L22514m964o06012j85998J264913K014870R30386q44190j450711
$$ y = [227910, 456581, 436401, 750217, 1342754, 1301618, 364498, -345077, 37877, 614625, 34280, -1331899, -1935731, -1455972, -1103510, -1422192, -1336887, 10488, 1717129, 2258252, 1334454, -191728, -1494955, -2126680, -1784898, -691329, 150553, -26914, -636482, -427664, 784393, 1876201, 1977785, 1515076, 1388819, 1713536, 1875093, 1541216, 1062869, 838775, 718349, 341903, -131786, -114087, 495865, 977066, 766385, 383735, 761971, 1863737, 2702312, 2704702, 2260666, 1816739, 1305382, 783873, 743005, 1218368, 1361397, 609279, -310271, -302564, 604698, 1418062, 1461910, 830895, -81221, -817226, -952835, -630321, -635285, -1241297, -1427295, -162382, 1852488, 2782874, 1938684, 487973]
40322D87973o55239L07450M89417p2177q26424j081502l99094P50828J232729
40313B33961O11316l33435p78504p00252k49288N62158J084355L30933j195371
40304d34127j477267J56894J673353J216856j41852l12182M90269M98258m51175
40295A219027r05727n13121l89001q04037p19563J04679N59162J94656l6613L81761
40285i08777O16111R3558m56714l54652r2418k92443n99992m22865N3508L16458
40275b048226L71527N58619R42688J208251Q77344k62719j521539j558302p9691
40266a512048J268909Q64426n58745r84362r4572N93596L62402M0031j1027m99063
40256e30453j296026j067076L43833J170222M53448l72693P8074R13504P35755
$$ y = [487973, -167266, 140184, 629601, 557424, -269000, -1350502, -1749596, -998768, 233961, 845277, 511842, -266662, -966914, -1216202, -654044, 430311, 761244, -434127, -1911394, -1754500, -81147, 1135709, 993857, 681675, 1171944, 1670202, 1219027, 313300, -199821, -588822, -1392859, -2112422, -2007743, -1448581, -1253925, -1290538, -908777, -292666, -199108, -655822, -1010474, -1102892, -1395335, -1995327, -2418192, -2364684, -2048226, -1676699, -1118080, -175392, 1032859, 1910203, 1647484, 125945, -1432357, -1512048, -243139, 621287, 62542, -921820, -1016392, -422796, -60394, -20363, -31390, -530453, -1826479, -2893555, -2549722, -1379500, -926052, -1298745, -1220671, -307167, 428588]
40247D28588M2070L0883L16827j54339q52774m28379P85630J062925k8347j021013
40237A82071p95456O8087M87615K24237l10262o56212m53557K60933P82273M70212
40227B59941k35907l18433K78157N07005j57302q46652n76866K72109N24252k4123
40217c17819k96002L56818R34651J36224j432777j678450L7477J741026J579810
40208A060958M29538K19132P24633K56012r82315r30307O39128J265774k92346
40199B390207j871522j283228L49439P43074R3829Q2086O01181K35016p46446
40190E93636o49137N61545J019446K3944r72212q99444m79109m49597l39019J32372
40180a457575J67655n48703q87306r747J141203J245270N07534J7680M1004J06698
$$ y = [428588, 470658, 501541, 818368, 664029, -188745, -617124, 168506, 1231431, 1203084, 182071, -613385, -545298, -57683, 166554, -143708, -799920, -1253477, -992544, -210271, 259941, 24034, -294399, -16242, 490763, 333461, -513191, -1090057, -817948, -293696, -317819, -613821, -257003, 677648, 813872, -618905, -2297355, -2259878, -518852, 1060958, 1490496, 1709628, 2434261, 2690273, 1707958, 777651, 1416779, 2682553, 2390207, 518685, -764543, -415104, 327970, 421799, 503885, 1105066, 1340082, 593636, -55501, 506044, 1525490, 1549434, 577222, -322222, -801331, -1250928, -1589947, -1457575, -1289920, -1838623, -2725929, -2735676, -1594473, -349203, 158331, 176011, 217015, 323713]
40170C23713J46404L86990N61705L01516l4594O5796J85214m29792j363584j323595
40160a180227o8022J097961J143042O05454M52421N52184K11590l94662n10724
40151A909017k84713o76341j652507j742052j39200J724565J819409K01218j137520
40142B1876r32549L7122M67870K35215L7687J60422L07393K34509n5016n22059
40132g530j033627j211737p14111K79587J017918P82916k62205r28405k32943
40123b310137J116572J309379l6532j016442j29031J283800R56312p35311j314080
40114h75470p9067R64883M04270p20007j109636r99300o99962L89848J917389
40105h07052J933850p8069j596692o45968R25882L77607j343631j136673J097540
$$ y = [323713, 470117, 857107, 1418812, 1720328, 1685734, 1751530, 1936744, 1506952, 143368, -1180227, -1248249, -150288, 992754, 1598208, 2050629, 2602813, 2814403, 2419741, 1909017, 1624304, 947963, -704544, -2446596, -2585796, -861231, 958178, 1159396, 21876, -910673, -873551, -405681, -170466, -132779, 27643, 335036, 569545, 514529, -7530, -1041157, -2252894, -2967005, -2687418, -1669500, -886584, -1148789, -2077194, -2310137, -1193565, 115814, 79282, -937160, -1066191, 217609, 1173921, 438610, -875470, -954537, 10346, 414616, -305391, -1415027, -2414327, -3114289, -2724441, -807052, 1126798, 1048729, -547963, -1193931, -268049, 109558, -1234073, -2370746, -1273206]
40096a273206K293885J092904m44966n33375o5800k67268n06993P9845P35274
40087A110300M01932m56189p12847k50683L06136O44686O57312J28965o79693
40078A149919r34057l94629J08091m0208l44226k11384M0429q9827l49643k72893
40068a338428P222J52672K17008K76926J13775j96520p5780N90546R92099N60108
40058A299628o5133L0712O65962Q69513J98086q54004j470318j133652k7368Q59553
40048C72979N58258n98550j136905k90387R90480J371459P58774l5178n50664
40039A440266q08090p11690j88461L70981N11174L10263O1539k43880n58659m06058
40029b22615M08843J137648R40445Q8681m64868m23492k29600q5201J73316L68776
$$ y = [-1273206, 1020679, 2113583, 1668617, 1135242, 1069442, 802174, 295181, 375026, 1110300, 1512232, 1056043, 343196, 92513, 398649, 1043335, 1700647, 1829612, 1149919, 215862, -178767, -70676, -110884, -455110, -666494, -626065, -715892, -1065535, -1338428, -1331206, -1178534, -961526, -684600, -570825, -767345, -843125, -252579, 739520, 1299628, 1234495, 1265207, 1931169, 2800682, 2998768, 2144764, 674446, -459206, -486574, 372979, 931237, 332687, -804218, -1094605, -104125, 1267334, 2026108, 1990930, 1440266, 632176, -79514, -267975, 103006, 614180, 924443, 985982, 742102, 183443, -222615, 186228, 1323876, 2264321, 2353002, 1888134, 1464642, 1235042, 1149841, 1323157, 1691933]
40019A691933J37752k21485n3281M18989K37945o37544r81627j89696N83525J31463
40009A117974q49176q21377Q8465K42508p95444j364751k75840J128865Q31555
40000f97221p87066j399190p5415J499932J561812N15456k09040l37234n34151
39991d62117p85684m55895K78353M17024k87942q67510n66317J81760O03991O27655
39981a316682O00279O11627N88402N69807M61626o360o60790p52191m837O55298
39971G46179J59366j123690j632672n35044J195524J892136J026342l70045r44773
39962D13323m04310L78551M72247q8847m89140k23434K94435L48970j04266m16780
39952A80749j52078L46082M48792N5869l46976l31065M2129L88431L46854j92244
$$ y = [1691933, 1829685, 1608200, 1554919, 1973908, 2211853, 1574309, 592682, 402986, 986511, 1117974, 268798, -552579, -464114, -221606, -1017050, -2381801, -2657641, -1528776, -697221, -1484287, -2883477, -2958892, -1458960, 102852, 618308, 409268, 72034, -462117, -1247801, -1703696, -1425343, -1008319, -1296261, -2163771, -2730088, -2548328, -1944337, -1316682, -716403, -104776, 483626, 1053433, 1515059, 1508699, 847909, 95718, 90881, 746179, 905545, -218145, -1850817, -2385861, -1190337, 701799, 1728141, 1358096, 413323, 9013, 387564, 859811, 770964, 281824, 58390, 352825, 701795, 597529, 180749, 28671, 374753, 823545, 879414, 532438, 201373, 243502, 631933, 978787, 786543]
39942G86543q79051r65853n8360J105158J221200O5941j020588p55627N32951
39933C2314J510532J395080K75397j380168k603569k123969k3074J487367O34712
39924g95378j091896q11448J287634K021205K02392j399342m93937J137484P80341
39915H37055p45935p16773Q35895J317767j19283j515823j433983o44787p0653
39906b256520N27101J118032Q14862l72940r79176k11662Q32891Q94881J39476
39897E06945o63501j162378r75845K85430J785133J802136K46120p50212O8932
39888A142760J011591R7676j617475j532863M52569J723862P88082p89012r19373
39879C57817J91135Q15471K43845o47896r29729o38850k42160R2252L51461L33289
$$ y = [786543, -92508, -1058361, -1116721, -11563, 1209637, 1275578, 254990, -500637, 32314, 1542846, 2937926, 3213323, 1833155, -770414, -2894383, -2917457, -1430090, -795378, -1887274, -2698722, -1411088, 610117, 812509, -586833, -1080770, 56714, 837055, 91120, -625653, 210242, 1528009, 1408726, -107097, -1541080, -2185867, -2256520, -1729419, -611387, 203475, -169465, -1148641, -1360303, -527412, 367469, 506945, -156556, -1318934, -2294779, -2009349, -224216, 1577920, 1824040, 1073828, 1142760, 2154351, 2252027, 634552, -898311, -445742, 1278120, 2066202, 1277190, 357817, 548952, 1364423, 1608268, 960372, 30643, -608207, -850367, -758115, -406654, -73365]
39869g3365q3240n82745p71079o91736n11105K9510J069341J723365Q92981q26272
39859A75655j423696k87299P31680J67613o59927J41298J669179J490552l19115
39850A685940j149640n7440P76700k44854j476949p58744J096428J631836M37168
39841A940445o22046m08423J98966J38502k77716j87445M30674Q43098N90554
39832B646609p0944o37293r17054r85260p67795j11835N94369M80834n62993j251786
39822a583148m27646J113943J474811K84314p85158m19633O45607R57686L61673
39813A622449j75838j36042M4924j49416n72702o68301k65996O3600k70278q31288
39803a338888n14352P36125J509698R63243J97698M01235P06181l28386j924420
$$ y = [-73365, -156605, -739350, -1510429, -2202165, -2713270, -2683760, -1614419, 108946, 1001927, 175655, -1248041, -1535340, -803660, -636047, -1295974, -1154676, 514503, 2005055, 1685940, 536300, 478860, 1255560, 1010706, -466243, -1224987, -128559, 1503277, 1940445, 1318399, 909976, 1108942, 1247444, 969728, 782283, 1212957, 2056055, 2646609, 2575665, 1938372, 1021318, 36058, -731737, -843572, -249203, 231631, -331362, -1583148, -2010794, -896851, 577960, 862274, 77116, -342517, 303090, 1260776, 1622449, 1446611, 1310569, 1355493, 1206077, 633375, -34926, -300922, -237322, -507600, -1338888, -1853240, -1117115, 392583, 1355826, 1553524, 1954759, 2660940, 2332554, 408134]
39794D08134k001554n13794N35184M05106L94119R40447O67952p54053j414493
39785a332952k20824J169317J103423M64984N81537O54733m22962j384252l82299
39776B30705J629096K020891M49555q59137o35470N199j12751n86397o94200o12042
39766H35449o49476n01311N4385N58547M94969m0422n45439n63407M2811Q12061
39756D98167Q83436J6225q70456p90906l985M50044J92959k76150n45336o56637
39746a102639o18668k73805L26151Q75211J083518P43442j45000j024156j033459
39737a169405k5199J111505J484233J051541K01685p72921j395666j057811N5558
39728e16480Q40039O68010J92561K10726N28641N82704L98545K57056R6891j82115
$$ y = [408134, -1593420, -2107214, -1572030, -1166924, -772805, 167642, 835594, 81541, -1332952, -1553776, -384459, 718964, 1183948, 1765485, 2420218, 1997256, 613004, 230705, 1859801, 3880692, 4330247, 3471110, 2835640, 2840839, 2728088, 2141691, 1447491, 835449, 185973, -315338, -260953, 297594, 792563, 752141, 206702, -356705, -313894, 498167, 1381603, 1397828, 527372, -263534, -267519, 182525, 375484, 99334, -446002, -1102639, -1721307, -1995112, -1668961, -793750, 289768, 1033210, 888210, -135946, -1169405, -1194604, -83099, 1401134, 2452675, 2654360, 1881439, 485773, -572038, -516480, 323559, 991569, 1184130, 1394856, 1923497, 2506201, 2904746, 3161802, 3258693, 3076578]
39718C076578m76060q62025j387781j362489j14393J372360J235699m30029j426083
39709c74223p86312o1656k77011j29737J145927J687429J11987j552621q79832
39700a116049Q71309Q40660p21002j239361l00898K33076M3085O11210J730772
39691I52802J403496l58935j102438m7650O71426j08073o99321N5616O30345j70134
39681A227134q39041N2865J122250N92106n56922m05831M87572J72140j206266
39672F46007j638770n38643N78280O62962L52420L84504M70233J82513k71110
39663H28396n85063p67873p45201l00304L84746P53754N97288K49365J794k03683
39653B13219m30285n07865k78586J17896K66317j94582j051296j361485l23529
$$ y = [3076578, 2600518, 1738493, 350712, -1011777, -1126170, 246190, 1481889, 1051860, -374223, -1160535, -1222191, -1499202, -1628939, -483012, 1204417, 1316404, -236217, -1116049, -244740, 595920, -125082, -1364443, -1665341, -1432265, -1389180, -777970, 952802, 2356298, 1997363, 894925, 847275, 1518701, 1410628, 711307, 766923, 1397268, 1227134, 388093, 440958, 1563208, 2155314, 1598392, 1192561, 1680133, 1852273, 646007, -992763, -1531406, -953126, -290164, 62256, 446760, 916993, 1099506, 828396, 243333, -524540, -1269741, -1570045, -1185299, -431545, 165743, 415108, 416902, 213219, -217066, -724931, -1003517, -885621, -619304, -813886, -1865182, -3226667, -3550196]
39644c550196J507637K443686J532024k51512j189504q03772j2929L79221M81162
39635E35817N48265L20117l55930q41303m37210M15332N38628k60582p82645k06436
39625e25947O35961O02456M9899L5798K95093l01667j430041j415928m1618P74039
39615a321955p375q09882j08785R60847N46906p54120q82628L76882J297048R89740
39605B86678K02782m53672j067335j232555k53976J237388J624257N71985n83165
39596C32387r20268q39550o73641p1111Q05621J028399L93066j84847j83309m6492
39586c59745O0590N56846J099123N65550r76063j852608j124933J17682O24523
39577a289035O62983Q48743P51359p2196q26956o00016J39675L58681J3056k91890
$$ y = [-3550196, -2042559, 401127, 1933151, 1681639, 492135, -311637, -324566, 54655, 535817, 1084082, 1404199, 1048269, 206966, -230244, 185088, 723716, 463134, -319511, -525947, 110014, 712470, 762369, 798167, 1093260, 791593, -638448, -2054376, -2095994, -1321955, -1329330, -2139212, -2247997, -1287150, -740244, -1494364, -2376992, -2000110, -703062, 286678, 489460, 35788, -1031547, -2264102, -2518078, -1280690, 343567, 915552, 332387, -587881, -1427431, -2101072, -2172183, -1366562, -338163, 54903, -129944, -313253, -359745, -299155, 257691, 1356814, 1922364, 946301, -906307, -2031240, -1913558, -1289035, -626052, 222691, 974050, 901854, 74898, -525118, -385443, -26762, -13706, -305596]
39567c05596m21657m41194l2383P17064P90967k42592j032320k40892J160917
39558d7686J151638k00205q44892n6055M82876m05468j336356n88688J038292
39549h06544J373114J18487r29230p16313j28165m0046L6396N24759N87942l37969
39539c17569j057294k86417J064442J113789l5606n80259m3467J80227m59248
39530d21402o57758L12529J222570R60770J81617j99360m15950o25902j03505
39521B53609J019057J093608l69847j282104j49657J205153M51925j370890j544344
39512f93490k1153Q68204L44051j33528J67343L45449k6670l02290l53524o29411
39502d35019p17270L2704O93712j24375j561054j379167M81336J730853J221473
$$ y = [-305596, -727253, -1168447, -1200830, -483766, 307201, 64609, -967711, -1208603, -47686, 1103952, 903747, 58855, 2800, 485676, 80208, -1256148, -1844836, -806544, 566570, 685057, -244173, -960486, -1088651, -1128697, -1092301, -567542, 20400, -317569, -1374863, -1661280, -596838, 516951, 481345, -98914, -142381, 37846, -421402, -1079160, -766631, 455939, 1416709, 1598326, 1398966, 983016, 357114, 253609, 1272666, 2366274, 1996427, 714323, 564666, 1769819, 2221744, 850854, -693490, -714643, 153561, 497612, 364084, 531427, 876876, 850206, 547916, 194392, -435019, -1152289, -1119585, -425873, -550248, -2111302, -3490469, -3009133, -1278280, -56807]
39493e6807J29069n22172r75041j085600j32051J236929J327842K00167k74320
39484a51984L73404M93954n52166j188264m48264M79998N63557M53886O90959
39475G15080O20049R2510M7787M90694J75226q31033p85788N16881R07340m41504
39465A507242j261005M5315J516095P58900j218396j740714m17523R25716J073082
39456A188712K38707r08717j478800p02068O96414Q02869o43987j405208j11344
39447b323422J398058Q97545p93291j326363m18282L08564J70559k2196K20206
39438a888622M88706N09563M61889M49583M82740O01184N34630m8857o41872l08355
39428F40589O87401R91441K94060j73353J96612L71164m27114j336247j196221
$$ y = [-56807, 72262, -449910, -1424951, -2510551, -2642602, -1405673, -77831, 122336, -151984, 221420, 715374, 163208, -1025056, -1473320, -993322, -429765, 24121, 715080, 1335129, 1427639, 1475426, 1966120, 2141346, 1310313, 524525, 1041406, 1948746, 1507242, 246237, 291552, 1807647, 2566547, 1348151, -392563, -810086, 115630, 1188712, 1427419, 518702, -960098, -1662166, -965752, -162883, -806870, -2212078, -2323422, -925364, -27819, -821110, -2147473, -2565755, -2257191, -2086632, -2108828, -1888622, -1399916, -890353, -428464, 21119, 503859, 1105043, 1639673, 1590816, 948944, 640589, 1327990, 2319431, 2613491, 2440138, 2636750, 3007914, 2580800, 1244553, 48332]
39419D8332n3612J187213J492305J11312k268809l175693j162829J539567J725927
39410e56287K6803j93218J551995K237443O34044q88334p98705n51542j005123
39401D57076p49887M33809M74990r05796j057928Q07362J840063N87188m69774
39392A417103L56492J058184J87103m04602L98533P12431r2710K68555J926419
39383E827508J570846j070342j598073J134286K366518L16739j57980K741884
39375A1131386L444802K17065L69415O456667R154262N197910R315561L0603738
39367G5890806M7485024L0246571j4258807m5349141l9760578j7144218o369014
39360C0740643q570294p996824j683696R90709j573276k057502Q06480J130302
$$ y = [48332, -5280, 1181933, 2674238, 2785550, 516741, -2658952, -3821781, -2282214, -556287, -529484, -722702, 829293, 3066736, 3700780, 2812446, 2013741, 1462199, 457076, -292811, 140998, 615988, -289808, -1347736, -540374, 1299689, 1886877, 1417103, 1773595, 2831779, 3018882, 2614280, 3012813, 3725244, 3632534, 3901089, 5827508, 7398354, 6328012, 4729939, 5864225, 8230743, 8547482, 8389502, 11131386, 14576188, 14793253, 15162668, 21619335, 30773597, 35971507, 45287068, 75890806, 123375830, 153622401, 139363594, 94014453, 54253875, 37109657, 30740643, 22170349, 14173525, 12489829, 13480538, 11907262, 9849760, 10656240, 11786542]
39352A1786542j950229l156832j269122k30237p54544J29533J807569P40557k055510
39343E047727k034511O47662J351565p30293j707086n77187n37718k060000j613360
39334b213201J357795K657729M51037j647008q30472P24254M42911m57060j13068
39325C72917M67007j36332q07532p1992J109793J040620j4965o91464o14833k20518
39315D32701K33680M59314J23458l56551k14841K46211M8954o45914p64535k88549
39305g26072j51857k62449K96532J102263P40659m65593n40932P73635J229174
39296A995360l47244j978499j493760K86118J008309J59269p36435o00354O4198
39287a643038M06179M43278O99298J161386J133713K83641n67927l90318M32404
$$ y = [11786542, 9836313, 6679481, 5410359, 5180122, 4425578, 4555111, 6362680, 7103237, 5047727, 3013216, 3660878, 5012443, 4282150, 2575064, 1997877, 1460159, -599841, -2213201, -855406, 1802323, 2253360, 606352, -224120, 500134, 943045, 485985, 372917, 839924, 703592, -103940, -175932, 933861, 1974481, 1959516, 1268052, 653219, 432701, 666381, 1125695, 1249153, 892602, 677761, 923972, 972926, 327012, -437523, -726072, -877929, -1140378, -843846, 258417, 999076, 533483, -7449, 766186, 1995360, 1648116, -330383, -1824143, -1538025, -529716, -370447, -1106882, -1707236, -1643038, -1236859, -793581, -94283, 1067103, 2200816, 2484457, 1916530, 1526212, 1958616]
39278A958616M71632n30012j130060m85261K78512K5375n15465k43657K89648
39269A19328Q8885k20341M44871J274806O09425j143187j856773q56040L17599
39260a221427M53055J34968L07107Q78970J185964P83550l47730j538968j641925
39251a006436m43859O34831L54375n07689m49661L75191O74526K79855J18386
39242B9519L44987K68169j37772k85322k27634l25751j71637N43168Q07979j69908
39232F75798j030572j39788J345808R95098p79673j185669L52537J298093L04281
39223A835913p58798k29524P63566O71089Q377k14637m29613j125153j355000
39214h33780m01380O21095N14556m1728R5897M86333J42204n43136n78820j09675
$$ y = [1958616, 2430248, 1900236, 770176, 284915, 563427, 588802, 73337, -170320, 119328, 208213, -12128, 432743, 1707549, 2316974, 1173787, -682986, -1539026, -1221427, -768372, -633404, -326297, 552673, 1738637, 2522187, 2174457, 635489, -1006436, -1450295, -815464, -461089, -968778, -1418439, -1043248, -368722, -88867, 29519, 374506, 642675, 504903, 219581, -8053, -333804, -505441, 37727, 845706, 675798, -354774, -494562, 851246, 1846344, 1066671, -118998, 233539, 1531632, 1835913, 1077115, 847591, 1611157, 2282246, 2290623, 2075986, 1646373, 521220, -833780, -1235160, -614065, -99509, -141237, -45340, 440993, 583197, 40061, -538759, -648434]
39204f48434J84807M64642R70111Q78518l93457j592993j129305M48790J235057
39195D17736P43903J39442N2247K4948J3216N40275J156844N81472j083172j922094
39185F64817q35911P56662Q90697k95710j072389o26472J93931M41249K31932
39176C48806J43458K83509L81080L25205K00193L7826j48833k65289l18003m82789
39166E05163p20978o18828l3151M11046J28487l36557L3054R40367Q20110q15031
39156C13682k219874j595123M18252J639624J218583K79381p3350m819m6708j54605
39146b24957r4603P9016K87145N02686M08931k75232j010505q27389K91657J263991
39136D00740J364815R46160M57590k13741r79195j182839o77364l24831o26164
$$ y = [-648434, -463627, 1015, 971126, 1849644, 1456187, -136806, -1266111, -817321, 417736, 1161639, 1301081, 1353328, 1378276, 1391492, 1931767, 3088611, 3670083, 2586911, 664817, -171094, 585568, 1476265, 1180555, 108166, -518306, -324375, 116874, 348806, 492264, 775773, 1156853, 1482058, 1682251, 1720077, 1571244, 1305955, 987952, 505163, -215815, -834643, -867794, -456748, -328261, -664818, -631764, 308603, 1128713, 313682, -1906192, -3501315, -3083063, -1443439, -224856, 54525, -18825, -23644, -70352, -224957, -319560, -240544, 46601, 549287, 958218, 682986, -327519, -1154908, -863251, 400740, 1765555, 2711715, 3169305, 2955564, 1976369, 793530, 116166, -208665, -834829]
39127h34829p39306J43520J208521J058269j05224o82200j2226P57607M55418
39118A249550n04557q84556l16683M53503P05503M85756J85707j41143o89161
39109E43919j231550j021179K36874J553739J502800N0366j190653r86487n8617
39100f00788J20255m87038o19386J82085Q93783O70171J6815k44824j97914k65982
39090e32823k31015K71074Q23783P33192J06741m09111o29418p30773n46179N2544
39080a091985M22185m8745o66459k84761P06687P88015j91260o34999K12636J052865
39070B64179P28917l1240j87585j52433n90040q32731j31552O39700K90221n76800
39060e79364n56066K07354M98470K24350K16705L79313J3627m57701j65773K30179
$$ y = [-834829, -1574135, -1430615, -222094, 836175, 730951, 48751, 36525, 794132, 1249550, 744993, -139563, -456246, -2743, 702760, 1188516, 1374223, 1233080, 543919, -687631, -1708810, -1471936, 81803, 1584603, 1634969, 444316, -542171, -600788, -480533, -967571, -1586957, -1404872, -511089, 159082, 175897, -68927, -266841, -532823, -763838, -492764, 331019, 1064211, 1170952, 761841, 132423, -598350, -1144529, -1091985, -669800, -718545, -1385004, -1669765, -963078, -175063, -366323, -1001322, -788686, 264179, 993096, 961856, 774271, 621838, 31798, -800933, -932485, -292785, -2564, -579364, -1135430, -928076, -429606, -205256, 11449, 390762, 404389, -53312, -219085, 11094]
39050A1094m61051j316888l21443J902070K307197N2656j952785j371452L22046
39041h28556O33263j73794k48034N08805O03734l41056j053944n82488N77079
39032i04991J274077Q70489j81862o30992J69141J132287P34418o00338r30721
39023I31508J69010Q71806M1915j009090p76434J61104M15058r6447n81989p11666
39013e85225m43862K86154Q62458L65188o37919m14220J042229J551956K28593
39004B255352r78101o46103j87852q58319j141289K86786J475007K86694j483446
38995i91271p45343J600255J955272j74839j658710r15752K02311K01288J10848
38986d15941Q19833J200918K71339r97594j302869p55320o1637N64949R56423
$$ y = [11094, -449957, -1766845, -2088288, -186218, 2120979, 2173635, 220850, -1150602, -828556, -195293, -369087, -617121, -108316, 495418, 154362, -899582, -1482070, -904991, 369086, 1239575, 1057713, 426721, 595862, 1728149, 2462567, 1862229, 931508, 1100518, 1972324, 2014239, 1005149, 228715, 389819, 804877, 708430, 126441, -585225, -1029087, -742933, 119525, 484713, -153206, -567426, 474803, 2026759, 2255352, 1277251, 631148, 443296, -415023, -1556312, -1269526, 205481, 492175, -991271, -1736614, -136359, 1818913, 1644074, -14636, -930388, -728077, -526789, -415941, 403892, 1604810, 1876149, 878555, -424314, -1179634, -1241271, -676322, 280101]
38977B80101P69895K40413J3802M4260j75753m16360j27394J98390l15287j152925
38967f40858j039789j28891K91629N3719R8783M40506K96824P7897Q46416J819962
38957B116198J058256j073206j905973n84676O14913J05534o36066n523R49317
38948F38774O36980k33163r7341O57875N28670m40013q67728l85741J3963k13261
38938B39015m55243j02601N99239R94901P27919j5410o51670o97879k59975J74014
38928E52310L62399L73094K11089q7571j98907P1789L84730M27073L92144K87457
38918B775607m22464j579063j771811l55428J022604O39634n34648l95801Q10758
38909A89388J095719L00098J88075R92646Q94106n24761j248681k55405P20596
$$ y = [280101, 1049996, 1290409, 1304211, 1348471, 1172718, 756358, 628964, 827354, 512067, -640858, -1680647, -1809538, -1517909, -1464190, -1365407, -924901, -628077, -550180, 296236, 2116198, 3174454, 2101248, 195275, -389401, 225512, 331046, -305020, -310543, 638774, 1275754, 1042591, 945250, 1603125, 2131795, 1691782, 824054, 438313, 452276, 239015, -216228, -318829, 280410, 1275311, 2003230, 1987820, 1336150, 638271, 378296, 552310, 914709, 1287803, 1498892, 1411321, 1212414, 1284203, 1668933, 2096006, 2488150, 2775607, 2353143, 774080, -997731, -1353159, -330555, 309079, -225569, -621370, 189388, 1285107, 1585205, 1773280, 2765926, 3660032, 3135271, 1886590, 1631185, 2351781]
38900B351781J53746r52058j179416r40082r70086n77936P46344J625374O92644
38891I50311r91908j316653q3689J081951J184630O98928L10686J11842k4635
38882A921463j40572k67417l83379m18296m01724l25530k4944L56292K30330m19880
38872A26343o09912N2500L26867o12590j232431R2748J876312J402023p70657
38863F51203j455946M2015J013284J12737o18451K48481J021909K19198p29248
38854E05182k83521M42434O2463l86033L89105J230450N90417n44227m03956M39522
38844B041836K93762n92219p06681J660M19192M18600N68621N24743k48936r23238
38834A797340m03050P17175J035259M32358k71390q09399j091475m94106Q09806
$$ y = [2351781, 2505527, 1553469, 374053, -566029, -1536115, -2114051, -1367707, 257667, 950311, -41597, -1358250, -1441939, -359988, 824642, 1523570, 1834256, 1946098, 1921463, 1780891, 1513474, 1130095, 711799, 310075, -15455, -40399, 315893, 546223, 126343, -483569, -431069, -104202, -716792, -1949223, -1856475, 19837, 1421860, 651203, -804743, -762728, 250556, 363293, -255158, -6677, 1015232, 1234430, 505182, 221661, 664095, 726558, 340525, 729630, 1960080, 2550497, 2006270, 1602314, 2041836, 2335598, 1743379, 1036698, 1038358, 1457550, 1876150, 2444771, 2969514, 2720578, 1797340, 1394290, 2111465, 3146724, 3579082, 3307692, 2498293, 1406818, 912712, 1722518]
38825A722518J086101n32698k136060j614098P7797N14577m01252p21852K00404
38816a804563J139225J356307J228284P64201l64887j457738j377945m00228K26646
38807f90698K65469L84789N17299J06334m04155j25994N64516O04805J46064J40408
38797A508837M77629L54323M4565L48240O65561k49609j773392j839989q1105
38788e44940J456809J167499k05100r96945o26023K74776P50404L33250l96151
38779A213579l24432N44566P92322k12624j060889n64508J63287k56552p80336
38770d85587K73915J884611J654009j58831r97596k20420J95295n60707q12221
38761G72468K70135R46991q5772j384299j084856K92656R72154M84834k97058
$$ y = [1722518, 2808619, 2275921, 139861, -1474237, -1396440, -881863, -1283115, -2004967, -1804563, -665338, 690969, 1919253, 2683454, 2318567, 860829, -517116, -917344, -690698, -425229, -40440, 476859, 583193, 179038, 53044, 617560, 1222365, 1368429, 1508837, 1986466, 2340789, 2385354, 2733594, 3399155, 3149546, 1376154, -463835, -544940, 911869, 2079368, 1874268, 877323, 251300, 526076, 1276480, 1609730, 1213579, 889147, 1433713, 2226035, 2013411, 952522, 388014, 551301, 294749, -485587, -211672, 1672939, 3326948, 3168117, 2170521, 1950101, 2145396, 1584689, 772468, 1042603, 1989594, 1903822, 519523, -565333, -272677, 699477, 1184311, 887253]
38752H87253o41295l47394M58602J093667P49157k75738p50116l24601L1634j80069
38742G01100j88669M22764P59089J56997o45115q61997r27996j287090j106848
38733b977765L72196K034186K005011K63356j235666j075459P9183O80324J91423
38724C36789o31146q46470k49512O47196J158194Q92712j4120q99134j006314
38715f11805k75880M35524L34291k83651n43869k95314o4086J01630N72444R36340
38705C05624L30149p31605n53328J016441J840431O17130r76418q39785L81325
38696A389964O29304k42362o73147k08835Q8991k25753m16254j13359K09786L23914
38686G62249M30274L83174k9032l11154K1367M07001J60315k17293l3284R2956
$$ y = [887253, 245958, -101436, 357166, 1450833, 2199990, 1924252, 1174136, 849535, 881169, 701100, 512431, 935195, 1694284, 1851281, 1206166, 344169, -583827, -1870917, -2977765, -2605569, -571383, 1433628, 1696984, 461318, -614141, -534958, 145366, 336789, -294357, -1140827, -1390339, -743143, 415051, 1307763, 1293643, 394509, -611805, -887685, -452161, -117870, -401521, -945390, -1240704, -1304790, -1203160, -630716, 305624, 635773, -95832, -649160, 367281, 2207712, 2824842, 1848424, 1008639, 1389964, 2019268, 1776906, 1103759, 894924, 983915, 758162, 341908, 228549, 438335, 762249, 1192523, 1575697, 1546665, 1235511, 1256878, 1663879, 1824194, 1606901, 1573617, 1666573]
38676A666573o31707j369110r14644j57j21967o96884O7435J747465J918880M7412
38666A713296j503157j034269K98765P59408L65991r0504n03949p93425l53440
38657a141284P21073J171548L46282p08179q02106j79778K60430L13978K50964
38648B32928J15288n2676K894K48807K93107R0764j2735m8105l35981n78011j13788
38637a57508P54920Q51855j35755j070542r21629N580P76150R59465O98209K82181
38627B042926o6933l67201p87864j096185o85173L44775R08318N24680K36821
38618A054164Q42232J271446K78032j187972j203326J34524R38764M29437l61110
38609B196191o06896n20099k46649K70930M21562l31783j025605l42790J055448
$$ y = [1666573, 1034866, -334244, -1248888, -1249045, -1371012, -2067896, -2000461, -252996, 1665884, 1713296, 210139, -824130, -525365, 234043, 600034, 509530, 5581, -787844, -1141284, -420211, 751337, 1097619, 389440, -412666, -592444, -332014, -18036, 232928, 348216, 295540, 298434, 547241, 840348, 931112, 918377, 870272, 534291, -43720, -157508, 597412, 1449267, 1313512, 242970, -678659, -673079, 103071, 1062536, 1760745, 2042926, 1975993, 1608792, 820928, -275257, -960430, -615655, 292663, 817343, 1054164, 1896396, 3167842, 3445874, 2257902, 1054576, 1189100, 2127864, 2557301, 2196191, 1589295, 1069196, 822547, 1093477, 1515039, 1183256, 157651, -185139, 870309]
38600H70309J333031M07419r0984K84848K57162o33000j226349r01649m30027
38591a29240k48472J11703N01374J08957o64959l86450Q81294J344654L64064
38582A882925n29795k30781L40044Q4029o12395r15619p13461j22119P30241J095698
38572A008767L43107n79019k00845R43250R35849l35845r96272m01051M8477k42857
38562E23561j26323O35767N38813p80721j468041n27666M82992K01437m36197
38553i56378k74392J03467k5959r1203J53810k74222j332619j021482J425894
38544b293084L451138K429889n26423k154586j293987L74467J041543N46773j44440
38535A431290j42572M29585M45177o06045j364346m47769R40226N51537j011245
$$ y = [870309, 2203340, 2610759, 2519775, 2804623, 3061785, 2428785, 1202436, 300787, -129240, -377712, -266009, 235365, 344322, -320637, -707087, 174207, 1518861, 1882925, 1353130, 1122349, 1462393, 1546422, 934027, 18408, -695053, -817172, -86931, 1008767, 1351874, 772855, 572010, 1515260, 2451109, 2115264, 1118992, 717941, 766418, 523561, 397238, 1033005, 1571818, 791097, -676944, -1204610, -721618, -520181, -956378, -1230770, -1127303, -1153262, -1244465, -1090655, -1364877, -2697496, -3718978, -2293084, 1158054, 3587943, 3061520, 906934, -387053, -12586, 1028957, 1575730, 1431290, 1288718, 1718303, 2163480, 1557435, 193089, -254680, 685546, 1237083, 225838]
38526B25838r41785R41283J502466m97675k098776r48949R24783P20784n99175
38517g71206m09403J063716J488224L34168q33817j096890p84069m7061J033258
38508b3080J507596N93844q11249j149142k16551R99261J775780J878133J156982
38499E711574m0855p91456o76995j82736L24668Q73709R77184K1255j177946j031877
38489D006525K53800P55258j31706q97681o38911k54032l41457k77113Q444k34082
38479B249045n70458K36073J435674Q94105j024584j541131j17818O41077k80808
38470A921175o25700O92796J473203L80678o43245j57322K96462m32616q71116
38461B034315j17312L26062j89963j17977O87319K20749j172727l76852K458040
$$ y = [225838, -715947, 225336, 1727802, 1230127, -868649, -1817598, -892815, -172031, -771206, -1180609, -116893, 1371331, 1705499, 871682, -225208, -1009277, -1056338, -23080, 1484516, 2078360, 1267111, 117969, -98582, 900679, 2676459, 4554592, 5711574, 5670719, 4879263, 4202268, 4019532, 4344200, 5217909, 6195093, 6216348, 5038402, 4006525, 4260325, 5015583, 4883877, 3986196, 3347285, 3093253, 2751796, 2474683, 2483127, 2249045, 1678587, 1914660, 3350334, 4244439, 3219855, 1678724, 1560906, 2201983, 1921175, 1295475, 1988271, 3461474, 3842152, 3198907, 3041585, 3338047, 2905431, 2034315, 1917003, 2243065, 2053102, 1935125, 2622444, 2843193, 1670466, 1293614, 3751654]
38452C751654K858647m41698k642646p41584J580082P28640r60161m63754N09659
38443D178839j5558N3837J965473K450594j61402j940195l63169R59243l89169
38434F738493o78871K046848L094452M63414Q5254M402342N932950J163115o58626
38425B2589371O201908J1662242Q041393O659057J7760467K8835881K8085410
38418A29835729L4780535O9904611J03124356P4877737j7804444j00080630j07363953
38411A87273941o0648749k4975082k2297997k4208170j2595135k476624n541882
38404C4530302r717865m615574Q77958j941170n872519l061292R24132o85971
38396A0438001l270786q99308K307740P24893k272932j466310N61049n63311k300034
$$ y = [3751654, 6610301, 6168603, 3525957, 2784373, 4364455, 5093095, 4132934, 3669180, 4178839, 4163281, 4217118, 6182591, 8633185, 8471783, 6531588, 6168419, 7127662, 6738493, 6059622, 8106470, 11200922, 11664336, 11749590, 16151932, 22084882, 23247997, 22589371, 28791279, 40453521, 48494914, 55153971, 72914438, 101750319, 129835729, 164616264, 234520875, 337645231, 412522968, 394718524, 294637894, 187273941, 126625192, 101650110, 79352113, 55143943, 42548808, 40072184, 34530302, 24812437, 20196863, 21074821, 19133651, 13261132, 10199840, 11123972, 10438001, 7167215, 6267907, 8575647, 9300540, 7027608, 5561298, 6122347, 5559036, 3259002]
38387C259002o10314J903132R55458j409587r98221P53775O0561j916931j607480
38378C89395K33947M21606o14483k79185R33542P79230j85265j08143J46790r92123
38368G25311j900803m23265J600672J153144m98903m7927J753637J438577p57296
38359C043147j176233Q15988J850632M79412p37537j17044M95150m96179j655094
38350B502242j308602k01231L43925M99189O73446L41184m82848n41175N92743
38341B418873J465860R17777l16476j152798j621906j814309j134319K35501Q00008
38332b01789l8313p62304n9153J090289J089476K09029j64480K51637O75472P30065
38322B819929N31520J2398o67866p71766j06569L44764n4398m53395l7080M42526
$$ y = [3259002, 2648688, 4551820, 5507278, 4097691, 3099470, 3853245, 3913806, 1996875, 389395, 623342, 1044948, 430465, 151280, 1084822, 1864052, 1678787, 1570644, 1717434, 725311, -1175492, -1598757, 1915, 1155059, 656156, 608229, 2361866, 3800443, 3043147, 1866914, 2682902, 4533534, 5012946, 4275409, 4158365, 4653515, 4157336, 2502242, 1193640, 992409, 1336334, 1835523, 2508969, 2850153, 2367305, 1826130, 2418873, 3884733, 4802510, 4486034, 3333236, 1711330, -102979, -1237298, -1001797, -201789, -240102, -1002406, -1061559, 28730, 1118206, 1327235, 1162755, 1414392, 2089864, 2819929, 3351449, 3363847, 2695981, 1924215, 1817646, 2162410, 2108012, 1654617, 1617537, 2060063]
38312B060063K5388o62951n23708R6799K23522N7086K72512M23983j62586p77630
38302A032478m69150R4713j33343m46418L06310J240681P66251m39735n05957
38293A445830K88797J77925o64228n48796K56585o9478j157736p80078Q97318
38284a53861J246486j24848o00972O52481J240435J58193l01043J000709J760859
38275D878439N79280k67028J115565K952669L172342K678521K597143J607454
38267A9314385j071953l159033k759758j490567j371593j535040p77262l07764
38259F841415j076112j435317l21128M24640l28401n83113P46774J365343L39066
38250E973167Q92720M574962P044485M237301j190049m146073m062150l186487
$$ y = [2060063, 2085451, 1422500, 898792, 995591, 1219113, 1276199, 1548711, 1972694, 1810108, 1032478, 563328, 658041, 524698, 78280, 384590, 1625271, 2391522, 1951787, 1445830, 1734627, 1912552, 1248324, 699528, 956113, 886635, -271101, -1051179, -153861, 1092625, 967777, 366805, 1019286, 2259721, 2417914, 2116871, 3117580, 4878439, 5457719, 5190691, 6306256, 9258925, 12431267, 15109788, 17706931, 19314385, 18242432, 15083399, 12323641, 10833074, 9461481, 7926441, 7149179, 6841415, 5765303, 4329986, 4008858, 4433498, 4105097, 3521984, 4268758, 5634101, 5973167, 6865887, 11440849, 18485334, 22722635, 21532586, 17386513, 13324363, 10137876]
38242A0137876j930756l66870k72493j492999p94712J954747K293020l84082m17046
38233H726685L495420M547746O41161j05522N471042P850784K870652K462637
38225C5960605J2845931J9522102J5380722K4669133O5265051R9622227O8473256
38218C41739027k2657865r5154510r2383860m4603768j5065199j6917472j8801127
38211C6155226p189997M21382m437592p712721j906078K005579k280519n498771
38203I556509j778685J405943j041711l037898n74263R62161j366312k111321
38195B014423J116907K404858r67594l059725m53911J658214l09238j962755L0596
38186D71775J724728n6799j823806n84498P75334q2903m09128J419622K090891
$$ y = [10137876, 8207120, 7840250, 7567757, 6074758, 5280046, 7234793, 9527813, 9143731, 8726685, 12222105, 16769851, 17411012, 17305490, 22776532, 30627316, 33497968, 35960605, 48806536, 68328638, 83709360, 108378493, 173643544, 273265771, 341739027, 319081162, 223926652, 131542792, 86939024, 71873825, 54956353, 36155226, 28965229, 29386611, 24949019, 17236298, 15330220, 17335799, 15055280, 9556509, 7777824, 9183767, 8142056, 5104158, 4529895, 5492056, 4125744, 2014423, 3131330, 5536188, 4568594, 1508869, 1054958, 2713172, 2403934, 441179, 471775, 2196503, 2139704, 315898, -268600, 506734, 423831, 14703, 1434325, 3525216]
38177C525216j62101j916159j066739l77380j210121o04011K032234K438024o53405
38168B005558k320177J0390J950986K84215j390509J63170J821280M60038j023593
38159A961358M55545K068614M44388j973165j516603L05257L34015m81614O4599
38150A662394P22790k56758j134504j46524O90361n15149j572261l19128J169768
38141C00989O62071Q0476J409917K300396L70028j903960j349315M08674L61267
38132B640543m52476K23980R58453m12990j998594j101304N80148P6608j246138
38123g31770m45810J131783K55754j903659j483065J373235K823226J577376K1288
38114B618358m25433o92518j064915o83389R3549O9491l64722N2792R55347J055410
$$ y = [3525216, 3363115, 1446956, 380217, 2837, -1207284, -1811295, 220939, 2658963, 2005558, -314619, -304229, 1646757, 1930972, 540463, 703633, 2524913, 2984951, 1961358, 2416903, 4485517, 4929905, 2956740, 1440137, 1745394, 2079409, 1597795, 1662394, 2385184, 2128426, 993922, 847398, 1537759, 1022610, -549651, -868779, 300989, 963060, 1043536, 2453453, 4753849, 5123877, 3219917, 1870602, 2279276, 2640543, 2188067, 2412047, 3370500, 2957510, 958916, -142388, 437760, 514368, -731770, -1177580, -45797, 209957, -1693702, -3176767, -1803532, 1019694, 2597070, 2618358, 2192925, 1500407, 435492, -247897, -154348, -84857, -449579, -396787, 558560, 1613970]
38104A613970M48793k672l52193o67125j74203Q25849M88947j162360j290524
38095b71518R36138K040469j74920k400415j060150J700651J806446n3880n22213
38086B000608K41308k18336j286045n81485Q65027J47736j837436j550670R69740
38077a249553K152609R11174k20098K2333J41192m92445o65809k61964m51800
38068a14361q77458j50700J044263Q71944n0282L31483J378486O33905j462987
38059A604293j881353q4705J213184O69893j41497k00947l73501p88850l65324
38050c48807N57205L70177o79216p17271K41239L42710m07287m3250J422483J583396
38040B321379j72688j502053j000247q6015o0284j95582K83703Q69206J173893
$$ y = [1613970, 2062763, 2060091, 1707898, 1040773, 866570, 1692419, 2181366, 1019006, -271518, 664620, 2705089, 2530169, 129754, -930396, 770255, 2576701, 2522821, 2000608, 2241916, 2023580, 737535, 156050, 1021077, 1168813, -668623, -2219293, -1249553, 903056, 1814230, 1594132, 1616465, 1757657, 1265212, 599403, 337439, -114361, -991819, -1142519, -98256, 773688, 723406, 1054889, 2433375, 3067280, 1604293, -277060, -361765, 851419, 1521312, 1379815, 1178868, 805367, 16517, -348807, 208398, 578575, -100641, -817912, -576673, -233963, -641250, -684500, 737983, 2321379, 2148691, 646638, -353609, -439624, -499908, -695490, -411787, 457419, 1631312]
38031A631312J411895J161980o5537j107092n27458N75696J9949j564999j535410
38022C36K62470J270466N59170j52872l8089j33060m42138K74892J356687O12125
38012C569987j544526k112882m31219P57278R0925m96223J71330N20852k05275
38003C20247k80414Q79566J184072j61728q82925J36996O52056n90275j164208
37994I3387N08870J713401J1425k101143j187335J198334J101179j149368j614134
37985a425384O26293K097180O04859j573524j438769N71900J770612R11726p44212
37976A400681j343332m53069P52430J001683L89575m5011j7569l19671j245075
37967A20642j815959j152827K97994J473040J818879J295297J69763p55603o38363
$$ y = [1631312, 3043207, 4205187, 4139650, 3032558, 2505100, 3080796, 3100745, 1535746, 336, 262806, 1533272, 2092442, 1939570, 1901481, 1768421, 1326283, 1601175, 2957862, 3569987, 2025461, -87421, -518640, 238638, 329563, -166660, 4670, 525522, 320247, 39833, 919399, 2103471, 1941743, 1058818, 1195814, 1847870, 1257595, 93387, 602257, 2315658, 2327083, 225940, -961395, 236939, 1338118, 188750, -1425384, -799091, 1298089, 1902948, 329424, -1109345, -537445, 1233167, 2144893, 1400681, 57349, -395720, 356710, 1358393, 1747968, 1702957, 1685388, 1365717, 120642, -1695317, -2848144, -2550150, -1077110, 741769, 2037066, 2206829, 1451226, 812863]
37958H12863K48041P12550K83969k92369l84890k22463j03353J5753n4047n72999
37948D43055j021992o27722K35932N11408K59899M40703R51816P32718n8597L043
37938A870263J090149J592330P25596k86712m01439k43907n27915p54811m63766
37929B599788j94979k79603j51009L24807L46142k35006m16567O7992N1446r60404
37919A152607j682297j135632k32502p9613k11144J65877N25861Q6229n51029
37910a961643k83816O78590J166650P60201J47290N4210M73239P63201K95683
37901B093605p00244j123908m31382L63956R6109o85405o15207J97404M64233
37892c40839P623j29611K19925J09640n41421o63608J2752N27335M32781K40211
$$ y = [812863, 1060904, 1773454, 2057423, 1765054, 1380164, 1157701, 1054348, 1070101, 1016054, 443055, -578937, -1206659, -970727, -459319, -199420, 241283, 1193099, 1925817, 1867220, 1870263, 2960412, 4552742, 5278338, 4991626, 4590187, 4346280, 3818365, 3063554, 2599788, 2404809, 2125206, 1974197, 2299004, 2645146, 2410140, 1993573, 2061565, 2113011, 1152607, -529690, -1665322, -1897824, -1977437, -2188581, -2022704, -1496843, -1410614, -1961643, -2245459, -1566869, -400219, 359982, 507272, 561482, 1034721, 1797922, 2093605, 1393361, 269453, -161929, 202027, 298136, -387269, -1002476, -805072, -340839, -333216, -462827, -242902, -133262, -674683, -1338291, -1325539, -798204, -365423, -125212]
37882a25212N4209m42651p15520m3632P17695K25695p42240k85141J179492J320798
37872A143493j73315j106478n44803O4870N6083N31436J444736J097570m32442
37863B081150q02061M42900P67985q20580j815532o39663O27552J99472l31851
37854b90628N30671J119442J8791p57307N65373J708556P0969k306285j733076
37845a073494J096269K375067J172713q9489l51232r31688j981121j747639J29663
37836a400951J686438J609578P26209J04646k41662m53345m01388l17043m44743
37827H67739l12564L57892O76059l0837p28133k16822P67829P70657m2329o00792
37817A508699r01668j252767p54054J098435K418468J279095p97261p34009J173724
$$ y = [-125212, -71003, -513654, -1229174, -1272806, -555111, -329416, -1071656, -1356797, -177305, 1143493, 970178, -136300, -681103, -616233, -560150, -28714, 1416022, 2513592, 2081150, 1279089, 1721989, 2489974, 1669394, -146138, -785801, -158249, 41223, -290628, 240043, 1359485, 1378276, 620969, 1186342, 2894898, 2965867, 659582, -1073494, 22775, 2397842, 3570555, 3481066, 3129834, 2198146, 217025, -1530614, -1400951, 285487, 1895065, 2621274, 2725920, 2484258, 2030913, 1629525, 1312482, 867739, 555175, 913067, 1589126, 1558289, 830156, 613334, 1381163, 2151820, 2109491, 1508699, 607031, -645736, -1399790, -301355, 2117113, 3396208, 2598947, 1864938, 3038662]
37808C038662J549556o21580k195487o59002K153161L096062K537512L592437
37800A2491321O908758Q528292M348064l981261r585428p877160k086077Q58472
37792I604981r50375l003543j788892M55044K48143j543972j838902n16999J38059
37783H03544l64708n75357k43468l94468q00710k89438P59696Q47871j0988m79219
37773g47245l11149k61089r7399Q78768J817371J294812q9305n26611m846n823
37763A947484n95117m66927K99790K20521q03724j216178n03527J88996K98431
37754f30251M35601O13480J24698o68171n95023J56307K67198k90536k61303M33464
37744d14536N24786j75850m41372N8506K90026p0817j95433Q7617P7060j44534
$$ y = [3038662, 4588218, 3966638, 1771151, 1112149, 3265310, 6361372, 8898884, 12491321, 19400079, 27928371, 32276435, 28295174, 18709746, 10832586, 8746509, 9604981, 8654606, 5651063, 3862171, 4317215, 4565358, 3021386, 1182484, 665485, 803544, 438836, -136521, -379989, -774457, -1575167, -1864605, -1104909, -257038, -268026, -747245, -1058394, -1319483, -1416882, -538114, 1279257, 2574069, 2484764, 1958153, 1953307, 1947484, 1352367, 885440, 1185230, 1405751, 602027, -614151, -1117678, -928682, -630251, -194650, 418830, 543528, -124643, -719666, -563359, -296161, -586697, -848000, -414536, 110250, -65600, -506972, -448466, -158440, -229257, -424690, -337073, -260013, -404547]
37734d04547J22338M82940P4899l69943M37007J529138P66253j334373j977281
37725f73569n70290M50923q7139l64161P38411J480139M67564q11733n74789M54187
37715E09543O91715J96846j65013l39538m17291n40N76145J71333r85074j106968
37705h68842N7519L52855j101925j914939j50508K262212K342973M41927q39336
37696E81936o84059l09002j99409J90799N41149j773q30373n00814P11803J023224
37686E23481L5189o14963P1135R47271O44958m08589q26129k12309N92179P46356
37676A498579K28780l87100n74196l00687L2986J14875O9216J42127K22674j2484
37666A034770n21349p85372m16594K91182O47362M12450Q6817J48430L15079M0167
$$ y = [-404547, -282209, 200731, 275630, -94313, 342694, 1871832, 2638085, 1303712, -673569, -1243859, -792936, -880075, -1244236, -505825, 974314, 1441878, 630145, 55356, 509543, 1201258, 1398104, 1233091, 893553, 476262, 475722, 1051867, 1223200, 238126, -868842, -811323, -458468, -1560393, -3475332, -3625840, -1363628, 979345, 1421272, 581936, -102123, -411125, -610534, -419735, 121414, 119641, -710732, -1211546, -499743, 523481, 558670, -56293, 14842, 962113, 1607071, 1198482, 372353, 160044, 752223, 1498579, 1727359, 1340259, 766063, 465376, 498362, 613237, 682453, 824580, 1047254, 1034770, 513421, -271951, -688545, -397363, 249999, 662449, 749266, 897696, 1212775, 1252942]
37656A252942n02697o52971l64114j53819M0205P75093J655427J385700j42098
37647C293668j260275q92623p6915n9526l72192j68589K2229m31118o23641K88192
37637b80790J078962K50062j181147j073708M12127J242546Q20597L87393N01126
37628B157168O10576Q50611J691620K006259K38531k468159l164072j432268K2955
37619E13221k99905p06303L29124J543676J178414k35883r97505o23346J72279
37610H73772O73751M29904n46275j293477q20400K55624M38090k03296j20739
37601c13046R76245J482721M81438r21179j405643r11318O2177R49430P86554
37592A187379p63826k062928j253070P34800J321933L10261n7530Q35614J074658
$$ y = [1252942, 750245, 97274, -266840, -420659, -380454, 394639, 2050066, 3435766, 3293668, 2033393, 1140770, 1063855, 1004329, 632137, 463548, 485777, 54659, -568982, -280790, 798172, 1048234, -132913, -1206621, -794494, 448052, 1268649, 1656042, 2157168, 2767744, 3618355, 5309975, 7316234, 7554765, 5086606, 1922534, 490266, 513221, 213316, -492987, -163863, 1379813, 2558227, 2322344, 1324839, 701493, 873772, 1547523, 1977427, 1431152, 137675, -682725, -427101, 10989, -192307, -313046, 663199, 2145920, 2627358, 1706179, 300536, -610782, -548605, 400825, 1187379, 423553, -1639375, -2892445, -2157645, -835712, -525451, -582981, 252633, 1327291]
37583A327291n2012p30283p5264K76745o32853j283448n53117M02475O07045Q24656
37573A11235J242953N35461j177437j492652L01981J503757L55460r80582k85611
37564A14565R11179L34680r15809n30147Q63266J015084j12619q88962r89968
37555a98731j035887o34779N28489J051342o5166j079651o7643J563506J098645
37546A160125j048619j992942p85990P28352J110671P97575N15154L55832L45536
37537A185694L63173q2391q07125o94140L31861O22899m41630r62620L12334J458448
37527A286503M86165j042294n16898J236957J312668n02047j614917p64103O97661
37518E79695J368906J127797K29594p48679o40442O43308J139138l98581k043190
$$ y = [1327291, 1275279, 544996, 469732, 746477, 113624, -1169824, -1722941, -1320466, -713421, 111235, 1354188, 1889649, 712212, -780440, -478459, 1025298, 1380758, 400176, 114565, 1025744, 1360424, 444615, -85532, 777734, 1792818, 1680199, 791237, -198731, -1234618, -1869397, -1340908, -289566, -354732, -1434383, -1502026, 61480, 1160125, 111506, -1881436, -2667426, -1939074, -828403, -30828, 484326, 840158, 1185694, 1548867, 1466476, 659351, -34789, 297072, 919971, 478341, -484279, -171945, 1286503, 1772668, 730374, 213476, 1450433, 2763101, 2261054, 646137, -117966, 579695, 1948601, 3076398, 3305992, 2557313, 1916871, 2560179, 3699317, 3300736, 1257546]
37509A257546j428958M27464Q22901l24369q87195l19307N6288q0567J61960O58381
37499C44144M94030l0815Q183K79788J21190K01985R44482Q36304r90067k266697
37489e7473q18725J497042J576885M7974l53339L22547J37168m90561J32839J029148
37479C023505K19275j070283n48215M63124m12956j338930N78200K935585J682406
37470E531711q57472M33170L602253K728948l09792J635181O809993O483769L288213
37461B9345974J1301312L0281480L6342365J2585986k2955686l7482076k4676832
37454C4742523p700141m126414p321188n332202j39526N32961k184886k335985
37446F135142j73955L7532j461054j295328L33474O62138k56816m50324k51734
$$ y = [1257546, -171412, 256052, 1078953, 754584, -132611, -451918, -395630, -476197, -314237, 344144, 838174, 807359, 815542, 1095330, 1216520, 1418505, 2362987, 3199291, 2209224, -57473, -876198, 620844, 2197729, 2245703, 1892364, 2214911, 2352079, 1861518, 1994357, 3023505, 3242780, 2172497, 1624282, 2087406, 1674450, 335520, 913720, 3849305, 5531711, 4674239, 5107409, 8709662, 11438610, 11128818, 12763999, 19573992, 26057761, 29345974, 40647286, 70928766, 107271131, 119857117, 96901431, 59419355, 34742523, 27042382, 22915968, 15594780, 10262578, 10123052, 10656013, 8471127, 6135142, 5961187, 5998719, 4537665, 3242337, 3575811, 4237949, 3981133, 3530809, 3279075]
37437C279075j046646j702979m85951J199806R62802l08551k07062P04653J82776
37428B577923j149031p37701J059235J236537p57507k078580j177121R6358M1600
37419h88287l56437J86400R08542O79451R0104K16396O61459L58325n68586j040114
37409B47253o07937J36284M33084P9230m56238m25297L41408J043205R18907L61224
37399B071123J77574J35282m75333j100283m70732R60698J081793o81965k119839
37390d21682j369750L51492P19484k77961p09287K91556J652132K113133J363094
37381C712211k55184j832216k059933o47995Q23726P95573q6925k21980J96950
37372D24227k52743j289284j039184O89360J739861R52478j54117j35421J32649
$$ y = [3279075, 2232429, 529450, 43499, 1243305, 2206107, 1897556, 1690494, 2395147, 2577923, 1428892, 691191, 1750426, 2986963, 2229456, 150876, -1026245, -929887, -888287, -1244724, -1058324, -149782, 529669, 619773, 836169, 1497628, 1855953, 1287367, 247253, -360684, -224400, 208684, 287914, -168324, -593621, -252213, 790992, 1709899, 2071123, 2248697, 2383979, 1908646, 808363, 337631, 1298329, 2380122, 1698157, -421682, -1791432, -1439940, -720456, -998417, -1707704, -1416148, 235984, 2349117, 3712211, 3457027, 1624811, -435122, -1083117, -259391, 536182, 449257, 227277, 424227, 171484, -1117800, -2156984, -1467624, 272237, 1224715, 1070598, 935177, 1067826]
37363A067826n48520j341977q38730M83560J070102N92020j29466o36242q42573
37354a124000m04531N30747Q30584o001p16556j99227N48692J25092p61234n41321
37344a717755L49804K27378p60828q24031L08973R21466K97525j81089M41415
37335i37142J178741R55421J88953l41129o22108o14768J04060J072783R01155
37326A885966n14770j276546j92244J221863R29905n85338j192137l20230M78423
37317D34892L5432r21252j070227k20303P55087J084728P54959K55246j8485n7705
37307A032372j154J68402M16637L51157l45968j212754j350357n80818L36279
37298a186204P75880Q59438P77764K93909n86554j127358p42090M8703K39262
$$ y = [1067826, 519306, -822671, -1661401, -1177841, -107739, 484281, 354815, -281427, -1124000, -1528531, -997784, -167200, -173201, -889757, -1088984, -540292, -415200, -1176434, -1717755, -1367951, -1140573, -1901401, -2725432, -2416459, -1494993, -1197468, -1378557, -937142, 241599, 1197020, 1385973, 1044844, 422736, -192032, -87972, 984811, 1885966, 1371196, 94650, -97594, 1124269, 2054174, 1468836, 276699, -43531, 434892, 470324, -450928, -1521155, -1741458, -986371, 98357, 853316, 1108562, 1090077, 1032372, 1031218, 1199620, 1616257, 1967414, 1621446, 408692, -941665, -1522483, -1186204, -410324, 449114, 1226878, 1520787, 934233, -193125, -935215, -886512, -647250]
37289f47250l04271p55069n01196J98000P66921R57516P56586J68411n21063o29232
37279e10647J93660J201814J129168k92528j876654k280988j300793L41455J801170
37270a594343K281340J287954m27156j001592K67872J508215O40663j424134j918301
37261c79482l16494R87012M24091o92808p33581j44093K9209Q1096N63231Q42114
37251F60295L12054k99776k84132k49931o74448o46890L81793J121047M56794
37242G76806n28070l97219K57075K53543R9179O03121P56090m59273j545401o07674
37232g91823J188408J304266m084m32949J96323j2861j139098j167863K27717
37223f31964J008989L13025m64966o01849r53248j384345m79329J399913J914461
$$ y = [-647250, -951521, -1706590, -2207786, -2009786, -1242865, -285349, 471237, 639648, 118585, -510647, -316987, 884827, 2013995, 1721467, -155187, -2436175, -3736968, -3395513, -1594343, 686997, 1974951, 1547795, 546203, 814075, 2322290, 2962953, 1538819, -379482, -695976, 291036, 715127, 22319, -711262, -855355, -826146, -745050, -181819, 660295, 972349, 672573, 388441, 138510, -535938, -1182828, -801035, 320012, 776806, 248736, -148483, 108592, 362135, 461314, 1064435, 1820525, 1361252, -184149, -791823, 396585, 1700851, 1696767, 1263818, 1460141, 1447280, 308182, -859681, -631964, 377025, 690050, 225084, -376765, -1330013, -2714358, -3193687, -1793774, 120687]
37214A20687N89503k40252N37659R89909j71369j152468k80142J035150P27437
37205B156114o75668j343753r36597k33825M76548J011219P69171l1022j30235
37196A061952O20951P12913l09685p66958J31874N73539o91890j802636p48079
37187a218019J119403J201487k34736q30465K706O88212L99106n6637n3134J49934
37177A167857L83962O30228L78632o20300j393873r80571j15844j66319q58274
37168a574502p10925N19535J447623J138545J96688m03534m59773k62531M31K73990
37158A65547M99260N63055K95556k32200m38300J26383Q34332N66661n88990j283059
37148E08245q71755k58616k41877k67306L37865R79329P14564j56081m51311K62240
$$ y = [120687, 710190, 469938, 1007597, 1997506, 1826137, 673669, 393527, 1428677, 2156114, 1480446, 136693, -799904, -1033729, -557181, 454038, 1223209, 1192187, 1061952, 1682903, 2395816, 2086131, 1319173, 1451047, 2024586, 1332696, -469940, -1218019, -98616, 1102871, 868135, 37670, 40376, 728588, 1127694, 1071057, 1017923, 1167857, 1551819, 2182047, 2560679, 1940379, 546506, -434065, -549909, -716228, -1574502, -2285427, -1765892, -318269, 820276, 1016964, 613430, 153657, -108874, -108443, 165547, 664807, 1227862, 1523418, 1291218, 852918, 979301, 1813633, 2380294, 1791304, 508245, -363510, -622126, -864003, -1131309, -793444, 185885, 900449, 744368, 293057, 555297]
37138E55297J139441J065990j02956j277657j294686m79860l01912r87322q22575
37129b506240R20862J987369L33435k018450j471077J458103K600865M57207j779926
37120a7852j484189j43644M2942k89348J83176O23312q6244q24405j52282R88178
37110a160356Q82701q1867l41412K44482O39104M34292j34205q69136j130380
37101a516777r7593J456447J472083k34828j285807m65954L88615j64584o37430
37092a085828L14335J071700M0769j076641j50036J419490J024879o54877j064637
37083a60846k34797j28861o05000J31487J617323J493673k67008j089266r5595
37074F61110O59085n4877p18996r525R17830M88016q42807j558200j205176m26866
$$ y = [555297, 1694738, 2760728, 2657772, 1380115, 85429, -394431, -696343, -1683665, -2506240, -1585378, 401991, 735426, -1283024, -2754101, -1295998, 1304867, 1762074, -17852, -1502041, -1645685, -1602743, -1892091, -1708915, -1085603, -1171847, -1996252, -2148534, -1160356, -277655, -359522, -700934, -456452, 182652, 616944, 482739, -386397, -1516777, -1614370, -157923, 1314160, 1079332, -206475, -672429, -283814, -448398, -1085828, -771493, 300207, 340976, -735665, -885701, 533789, 1558668, 903791, -160846, -395643, -524504, -1129504, -998017, 619306, 2112979, 1845971, 756705, 661110, 1320195, 1265318, 546322, 536797, 1454627, 1942643, 1099836, -458364, -1663540, -2090406]
37064b090406K40194P15537J006509J029406O56716o7744o71593o16887q2765
37055A18967K44517K62414L92107L94808l46518j188954p07195P12426Q83037
37046G65609p29364j849045r02112O52329J030958P96106R55670P43317m57400
37037A006068j128680o7162J092455M29114r45650r00131p479k23903j103910
37028a849278n58035J277067J984844N96264j113929j203996L31539J997259K137306
37019C599041L14975j799352j930922k57588O88924j15401p91309j29066L35035
37010h5663m45963p90175M00474J143325m7602j088932P679J323958M56615j018234
37000a44518m53808J021504Q27674j59221M31928J531213M46271j856963k133956
$$ y = [-2090406, -1850212, -1134675, -128166, 901240, 1557956, 1490212, 818619, 201732, 118967, 363484, 625898, 1018005, 1412813, 1066295, -122659, -829854, -117428, 765609, 36245, -1812800, -2714912, -2062583, -1031625, -235519, 720151, 1463468, 1006068, -122612, -189774, 902681, 1331795, 386145, -513986, -521465, -745368, -1849278, -2407313, -1130246, 854598, 1450862, 336933, -867063, -535524, 1461735, 3599041, 3914016, 2114664, 183742, -73846, 615078, 499677, -291632, -420698, -85663, -531626, -1321801, -921327, 221998, 174396, -914536, -906857, 417101, 873716, -144518, -598326, 423178, 1250852, 1091631, 1523559, 3054772, 3501043, 1644080, -489876]
36991d89876m66387K49768l76660j09428J226091J483213L94241k07015j37966
36982A565981p84008j575137o29089J299630J507804j53921j237513q86862m03040
36973a296155j08030O34054R22281l12963j289930J95278K285289J476253j354067
36964A152010k147062k80669J017746N27843J92501N01697j37405j263300o71838
36955a108477Q97755M86351j413446j213390J276898K216630M38981p59700J99056
36946A020658O74260p74027j606261o8549J785698J905258J074992K90272q11589
36937C490712j591792m98023J362146R38246j427097j880316N09159J929711J08393
36928B941139k171509j884216K75J164091J245303P17819l05631q71863J24642
$$ y = [-489876, -956263, -706495, -1083155, -1192583, 33508, 1516721, 1910962, 1703947, 1565981, 781973, -793164, -1422253, -122623, 1385181, 1231260, -6253, -893115, -1296155, -1404185, -770131, 152150, -160813, -1450743, -1255465, 1029824, 2506077, 1152010, -995052, -1275721, -257975, 269868, 462369, 964066, 826661, -436639, -1108477, -210722, 275629, -1137817, -2351207, -1074309, 1142321, 1581302, 821602, 1020658, 1694918, 920891, -685370, -753919, 1031779, 2937037, 4012029, 4302301, 3490712, 1898920, 1400897, 2763043, 3701289, 2274192, 393876, 903035, 2832746, 2941139, 769630, -1114586, -1114311, 49780, 1295083, 2012902, 1707271, 835408, 960050]
36919I60050J409082P48532j052717j341351m42250q32671j914413q00033J810409
36910a455362K182494J87168m99707P44953O51249j188732j238294J070761J854856
36901B309386j73120j524758n44759R9253o88281m13363J267227J220139q27079
36892G24645j140763R12119J368757p14530j229026J105953K090649p1682j502554
36883A543568j53700O53594p55196j091687R87522J818545j74879j376603l6607
36874A414557O83242m82260m52570J257320R45828j533857j715842O68875Q16485
36865A601778j331375m58274K992637K353987k227203k747121J709112K613553
36857D507094j740933k535297K326744L418264j778856k886256L526547O328994
$$ y = [960050, 2369132, 3117664, 2064947, 723596, 281346, -551325, -2465738, -3265771, -1455362, 727132, 914300, 414593, 1159546, 1810795, 622063, -616231, 454530, 2309386, 2136266, 611508, 66749, 166002, -522279, -935642, 331585, 1551724, 724645, -416118, 496001, 1864758, 1150228, -78798, 1027155, 3117804, 3046122, 1543568, 1389868, 2043462, 1288266, 196579, 1184101, 3002646, 2827767, 1451164, 1414557, 2097799, 1615539, 1162969, 2420289, 3366117, 1832260, 116418, 785293, 1601778, 270403, -187871, 2804766, 5158753, 2931550, 184429, 1893541, 4507094, 2766161, 230864, 2557608, 5975872, 4197016, 1310760, 4837307, 11166301]
36849A1166301Q42063j835475L367986N205718o18227q34000Q690091J1274013
36841C7258470J828783J798805J9197939K7591755J7324184K9944036R0661065
36834B25605037J36864818Q3745359m6730089j35086927j14575660m5336631j4035052
36827I0450855k3463571k4638533p104437M80557q045023j0125986k40076L436184
36819B0749970m048663p358348j339085J903536j855254k885500J234262J343084
36811G744002l819078m504552J026755L139705q49514k359675J544977L165720
36803E088340n56431k723675j29833J391081r44645j884168R30973K388051p748
36794C551945j749056m35114K32101j401036j732669L93778J221118k81299m34759
$$ y = [11166301, 12008364, 10172889, 13540875, 18746593, 18128366, 17294366, 25984457, 37258470, 39087253, 40886058, 60083997, 87675752, 104999936, 134943972, 225605037, 362469855, 446215214, 399485125, 264398198, 149822538, 104485907, 90450855, 66987284, 42348751, 35244314, 35724871, 27679848, 17553862, 17313786, 20749970, 16701307, 9342959, 8003874, 9907410, 8052156, 5166656, 6400918, 7744002, 3924924, -579628, 447127, 3586832, 2737318, 377643, 1922620, 5088340, 4531909, 1808234, 1678401, 3069482, 2124837, 240669, 1171642, 3559693, 3551945, 1802889, 1367775, 1599876, 198840, -1533829, -1140051, 81067, -200232, -634991]
36785f34991J425562J331399j228384j679558J025416K089194m46935k292815
36777d11112p54384J152202J013851P02637J244422M77844j686917j858935N84984
36768D64592J781672J56750r69530K03878Q45777o89108j606970m3223J502355
36759A646193R31783L0754M73976P15270n27187j638896j308399p39930p57787
36750a174223k58136Q61080Q40961m59583q46900K43799P57120q026l08762K41577
36740a11093j02603j226507p20379J400394J988110J79193r55295J73028J077177
36731A702025K4770q63167K49304J560332J002295l61786p50014n33113n46292
36722A484354k73953M07534L29225n54696n81539M46863M85576j001814j699571
$$ y = [-634991, 790571, 2121970, 893586, -785972, 239444, 2328638, 1881703, -411112, -1165496, -13294, 1000557, 1703194, 2947616, 3425460, 1738543, -120392, 464592, 2246264, 2403014, 1433484, 1637362, 2483139, 1794031, 187061, 143838, 1646193, 2577976, 2608730, 3082706, 3797976, 3270789, 1631893, 323494, -416436, -1174223, -1432359, -571279, 269682, -189901, -1036801, -793002, -35882, -43908, -352670, -111093, -213696, -1440203, -2160582, -760188, 1227922, 1407115, 451820, 624848, 1702025, 1726795, 863628, 1112932, 2673264, 3675559, 3313773, 2563759, 2030646, 1484354, 1210401, 1617935, 1947160, 1392464, 810925, 1257788, 1743364, 741550, -958021]
36713i58021m09325Q38961M02388l60674M50M77862J04l76179K52279O79065p1192
36702D75718p87724l70756J69414j34524k38842Q44362J997957J818855P25950
36693D500410k74358j144746j769382j239955L82194J363724P14883l42309m72622
36684A717839r5790r0987l43366n78829r86607j199834m04123Q67978R68149j95929
36674c41499p60735J44485J146612J017734K12195o02467j379688j551278m02625
36665b517266R51361N58365r41396q20788J156068J986260L66265j114748m15804
36656g91683P06820J44537r10728m46452P22935O36333l86170p28278m09479m92566
36646a954731p34034j64716Q55698J169937O95258J65871k04695m66573k74609
$$ y = [-958021, -1367346, -528385, -125997, -486671, -486221, -8359, -8255, -384434, -132155, 546910, 475718, -312006, -682762, -513348, -647872, -886714, -42352, 1955605, 3774460, 4500410, 4226052, 3081306, 1311924, 71969, 454163, 1817887, 2532770, 2190461, 1717839, 1622049, 1531062, 1187696, 608867, -377740, -1577574, -1981697, -1113719, -145570, -341499, -1102234, -957749, 188863, 1206597, 1418792, 816325, -563363, -2114641, -2517266, -1565905, -1007540, -1948936, -2769724, -1613656, 372604, 738869, -375879, -791683, -84863, 59674, -851054, -1297506, -574571, 61762, -324408, -1052686, -1462165, -1954731, -2688765, -2853481, -1997783, -827846, -132588, 33283, -171412, -637985, -912594]
36637i12594L17986M67224K875l57Q06678J041157j19205j210575o81720N59061
36627B70530O13621m46805r45284k51302O13990O96119J22376m28769m24288J10744
36617f9068M44506o6756q50487p14788K33262N26360m08531j305466r63838K12137
36607b962669J211180J660539J433214L40126j035324j418759n23780M12590L70165
36598e12718k36533n46949l51478K08316R49131J372591J124489P23007O81042
36589C410898K95226j094904k189497j256395P71632J312878J70575l57075L69667
36580A433005L42153j117577j762730l02162J217511Q34279k47733j61329M25995
36571F61412j9506r73303r70406j55472M07571O76502R96729P97545k91252j201219
$$ y = [-912594, -594608, -127384, -124509, -124866, 681812, 1722969, 1603764, 393189, -288531, 270530, 884151, 437346, -507938, -759240, -145250, 550869, 673245, 244476, -179812, -69068, 375438, 308682, -541805, -1256593, -1023331, -496971, -905502, -2210968, -3174806, -2962669, -1751489, -90950, 1342264, 1682390, 647066, -771693, -1295473, -882883, -512718, -749251, -1296200, -1647678, -1439362, -490231, 882360, 2006849, 2729856, 3410898, 3706124, 2611220, 421723, -834672, -63040, 1249838, 1420413, 1063338, 1433005, 1775158, 657581, -1105149, -1407311, -189800, 644479, 396746, 235417, 661412, 641906, -331397, -1301803, -1457275, -1049704, -373202, 623527, 1421072, 1129820, -71399]
36561g1399r28263j20577K34723L72736O29114K96636q52236j439743n54772N16565
36551a917216L55118k54067R1729Q53833O21918l15725m97560L21429J043098
36542C02557R37773J34629r31368j482643p18782Q51108J526774P70310R248J49980
36532A549586J27123p71011j169204j0838J174604N63272r50427j273999l43833
36523a104727M06292O41530R28435R47398J59194n83474k47133L70592m2081q36382
36513F39644m98247N36966N67277l81333o65470R4984N78534K33061K2208M38229
36503A565853O44701J2833r50927j517093j430127o72253M06183R07288M02197
36494f31345k01992J10149Q50329Q30679N2173m99729m62317k10401J45693N99225
$$ y = [-71399, -999662, -1120239, -885516, -512780, 116334, 412970, -439266, -1879009, -2433781, -1917216, -1562098, -1816165, -1724436, -870603, -248685, -564410, -1061970, -740541, 302557, 1240330, 1374959, 443591, -1039052, -1757834, -906726, 620048, 1390358, 1399606, 1549586, 1676709, 905698, -263506, -274344, 900260, 1463532, 513105, -760894, -1104727, -698435, -56905, 871530, 1818928, 1978122, 1394648, 1147515, 1518107, 1476026, 639644, 141397, 678363, 1245640, 864307, 198837, 293821, 872355, 1105416, 1127624, 1565853, 2210554, 2223387, 1272460, -244633, -1674760, -2347013, -1940830, -1033542, -631345, -833337, -723188, 127141, 957820, 1009993, 510264, 47947, -162454, -16761, 582464]
36484E82464O11066q9288o58009l75933Q671l84989p48506J25827J448758J389665
36474A909726M9047o79989j91938N7634p40734j292152l65330J096141J247555
36465A089960n1597j029106l08461J284716J651878R5723j586502j362111K33656
36456A8156Q95621l6520q02125k36820M94828J79979l91577j00128M93514M63689
36446I78617L21465P31655Q51038j45100j190048r98366l69527o52798j088864
36437a561928j23069J537229J772086M22065o80340p15526n17476m44004P37M62827
36427A52601l0906j020946r44389L07597J176317R33617M19319J36085l72237
36418G57058r76191p88851M8995K63034m16453p48040q8338O46211O47838L13834
$$ y = [582464, 1193530, 1104242, 446233, 70300, 78971, -306018, -1054524, -928697, 520061, 1909726, 1958773, 1278784, 1086846, 1144480, 403746, -888406, -1253736, -157595, 1089960, 1038363, 9257, -299204, 985512, 2637390, 2733113, 1146611, -215500, 18156, 913777, 877257, 75132, -161688, 333140, 513119, 121542, 21414, 514928, 978617, 1300082, 2031737, 2882775, 2737675, 1547627, 549261, 179734, -473064, -1561928, -1684997, -147768, 1624318, 2046383, 1366043, 650517, 133041, -310963, -310226, 152601, 121695, -899251, -1843640, -1536043, -359726, 573891, 993210, 1129295, 757058, -219133, -1007984, -958989, -695955, -1112408, -1860448, -1948786, -1302575, -654737, -340903]
36408c40903J41186o7924l70504l11955J41029L95363K72164K25846L77995L66127
36398H28424J92085K00399L00631J98478R0510R3735l99870j505080j813659l09878
36388b124225J469636J275089m68534j417613r53853m64502k77142O89521K003712
36379b67911J601343n79464j799193o00435R95407Q87832K620J35016Q23740N42888
36369A741843n28600j047577p60838l71913Q816O26225R74559M44065m11770n31090
36359A43720J22810O94780O82289K17875l96604p29897l77606K94287K58244o98580
36349B11318j399737q85443J98435N93887J01939n14038o65142k56059N49548
36340b065292J231215J135790L58701j81535k5213J63902k60931q55030p90844
$$ y = [-340903, -199717, -267641, -638145, -950100, -809071, -413708, -141544, 84302, 462297, 828424, 1020509, 1220908, 1521539, 1720017, 1810527, 1904262, 1504392, -688, -1814347, -2124225, -654589, 620500, 151966, -1265647, -2219500, -2684002, -2961144, -2271623, -267911, 1333432, 753968, -1045225, -1645660, -650253, 237579, 240199, 375215, 1198955, 1741843, 1213243, 165666, -595172, -967085, -958269, -332044, 642515, 1086580, 674810, 143720, 266530, 961310, 1643599, 1861474, 1464870, 734973, 357367, 651654, 909898, 211318, -1188419, -2073862, -1875427, -1281540, -1179601, -1693639, -2358781, -2614840, -2065292, -834077, 301713, 660414, 478879, 453666, 617568, 356637, -498393, -1289237]
36331a289237n3457O74629Q65415M42737l08236q05706o22492o1125K37499K48241
36321f71732M10869O29939L98540j10428j93894J15785J59153K9645L81979P70831
36311A920687l9375j692359k106205n50820J016426Q37369j95837m15043o5722
36302a290879l15618q55970n39151L62078N38827p3512k28222M88260J055047
36293h59140P26709L5261j98112J22200N73565P20981L22109m05289p77496l94280
36283a33492L09177O96422P03158M58135k64580j416291k040820j290488K20724
36274b758055J069734Q51104L92513K73569J84204j24467k49211J04047M85336
36265B28774L28309k01249m41837j41024K49554K10843j64215l55429k14403j76503
$$ y = [-1289237, -1342694, -668065, 197350, 640087, 331851, -473855, -1096347, -1157472, -919973, -671732, -260863, 369076, 767616, 657188, 463294, 579079, 738232, 767877, 1149856, 1920687, 1881312, 188953, -1917252, -2468072, -1451646, -614277, -810114, -1225157, -1290879, -1606497, -2462467, -3001618, -2639540, -2100713, -2174225, -2402447, -1914187, -859140, -132431, -97170, -295282, -173082, 400483, 1121464, 1443573, 1038284, 260788, -133492, 175685, 872107, 1575265, 2033400, 1768820, 352529, -1688291, -2978779, -2758055, -1688321, -837217, -444704, -171135, 13069, -111398, -360609, -256562, 228774, 557083, 355834, -86003, -227027, 22527, 233370, 69155, -286274, -500677, -677180]
36255f77180m57634n22561Q0559P53943N74523k20044n11374q1699N2260o27474
36245a636681j247989r24369J5332Q00557J217315J186423M16124o96765q89693
36236a759746K12675J158553O61428m09875m41630L36888L70289n86435j165261
36227a623114o75480Q931J15396K7441K38137N27138O69684Q57390R62727M60145
36217A568395m52110p32379m0861O43535N33400P4157j89345n86926j243784j244881
36207a670799j37361Q17455M47622k06526N06389J779766J246255j104738k460796
36198g82733j297545M88436P82630K93815N73843J013790K71862p48786k21332
36189C73980J085994O81603j363133k100625k51161J855892J978127R38028M18792
$$ y = [-677180, -1134814, -1657375, -1576816, -822873, -248350, -468394, -979768, -1061467, -1009207, -1636681, -2884670, -3809039, -3793707, -2993150, -1775835, -589412, -173288, -870053, -1759746, -1547071, -388518, 272910, -136965, -578595, -241707, 128582, -457853, -1623114, -2298594, -2289663, -2174267, -2146826, -1908689, -1381551, -711867, 145523, 1108250, 1568395, 1116285, 383906, 343045, 986580, 1519980, 1594137, 1404792, 817866, -425918, -1670799, -1808160, -990705, -543083, -749609, -243220, 1536546, 2782801, 1678063, -782733, -2080278, -1591842, -809212, -515397, 58446, 1072236, 1344098, 595312, 373980, 1459974, 2141577, 778444, -1322181, -1573342, 282550, 2260677, 3198705, 3617497]
36180C617497K07947m70654r48347n81654m91223j539480k104764m40064J961206
36171g89536K179982K94004r18110l38041L99780K65458K79490R17693Q33562
36162C124282o13821j804884j256091J68175Q12643N69705L42858L54751K65895
36153A963513J03863J4803j93451m86110l64150J70362K99013l36169r49173p99711
36143e77210j48540M87337J003568J133687L90625p99141j131455k97538M30952
36134D92285K15833j50403N6745J48573m16674o66384J37327P68764n9744j190025
36124f63703n86401J279315J918572N21998j048612j201939n24901j62899p8384
36115e46954J42677J29424n03142j109861q09937J68154P94439N91595Q360l36810
$$ y = [3617497, 3825444, 3354790, 2406443, 1824789, 1333566, -205914, -2310678, -2750742, -789536, 1390446, 1684450, 766340, 428299, 828079, 1093537, 1373027, 2290720, 3124282, 2510461, 705577, -550514, -382339, 430304, 1000009, 1342867, 1697618, 1963513, 2067376, 2082179, 1888728, 1402618, 1038468, 1208830, 1507843, 1171674, 222501, -577210, -725750, -238413, 765155, 1898842, 2289467, 1490326, 358871, 61333, 492285, 708118, 557715, 614460, 763033, 346359, -320025, -182698, 586066, 526322, -663703, -1250104, 29211, 1947783, 2469781, 1421169, 219230, -305671, -468570, -546954, -404277, -274853, -777995, -1887856, -2697793, -2529639, -1735200, -1143605, -1135245, -1472055]
36105a472055k00032L43474R41078R98961K20627p88810r61057q3551P60069N43044
36095C01748k70350m09270K23704L41560o20198j374985o83356O02115P50964
36086a138068k01505o36328M4671P25529O61576N28852Q35999Q90051K01331m61660
36076A450448m18331k56494n83602p56815j37203M28617q5681q82309l97666J020175
36066f18861J364496M4090j070915l82921J060281J077181n58457j851122j292631
36057b228859L10513J145116P02497l9359l32914m49322o07959k79616P23600
36048a056303J369009O75983o85582j205598o02833O8494J51470J4461L4122J42728
36038a094049L73766P23567N78739m65118j380124p97316P43115J317073M76212
$$ y = [-1472055, -1672087, -1328613, -387535, 611426, 832053, 43243, -917814, -1001365, -241296, 301748, 31398, -377872, -154168, 187392, -432806, -1807791, -2491147, -1889032, -1138068, -1339573, -1975901, -1931230, -1205701, -544125, -15273, 820726, 1710777, 1912108, 1450448, 1032117, 775623, 192021, -564794, -701997, -273380, -359061, -1241370, -1639036, -618861, 745635, 789725, -281190, -664111, 396170, 1473351, 914894, -936228, -2228859, -1918346, -773230, -70733, -110092, -443006, -892328, -1500287, -1779903, -1056303, 312706, 988689, 303107, -902491, -1505324, -1436830, -1285360, -1270899, -1236777, -1094049, -720283, 3284, 582023, 116905, -1263219, -2060535, -1317420, -347, 475865]
36029D75865k63864n6109J77009j72136k82672K66124N25965M9296j86967K01584
36019G34095P8952q83460j109374P9704P77103l78745j494383l39230J803043
36010g32295K058876M37440o24702l28292p8123m33426m77118j63963m91954j169925
36000b003482p65447N32373Q96714M0378k01257Q63393J529459P11989k52136
35991A351984j38879R3694n96705j156851l06620R39431P22425o79879j341495
35982a112895n81133M74624R17346R29332O54921k10389j359633j666593o21053
35973b575473Q28405J384353Q24540p4779n86330n69792k38214J75281N30496
35964c01513P71613Q22693N01591k38621r12417p73912J25438N77027l19038j564589
$$ y = [475865, 212001, 155892, 332901, 160765, -121907, 144217, 670182, 719478, 532511, 734095, 813047, -70413, -1179787, -1100083, -322980, -701725, -2196108, -2535338, -732295, 1326581, 1764021, 1139319, 811027, 732904, 299478, -177640, -341603, -833557, -2003482, -2768929, -2236556, -1339842, -1299464, -1500721, -637328, 892131, 1604120, 1351984, 1213105, 1306799, 710094, -446757, -753377, 186054, 908479, 228600, -1112895, -1694028, -1219404, -302058, 627274, 1282195, 1071806, -287827, -1954420, -2575473, -1747068, -362715, 461825, 387046, -199284, -769076, -1007290, -832009, -301513, 470100, 1292793, 1794384, 1555763, 643346, -130566, -5128, 571899, 252861, -1311728]
35954a311728j288027M86572J541954O78524l55462L60150J620493Q86117j423402
35945A195191k267148o72094Q53786M06198o34039m52694K21221N158l81398L52864
35935a372955J343156Q99366m71520q19053J35863Q98320P49484L03785j25822
35926A540624p42054j123825p15013j58978m03748q92465m55672M81985N67087
35917a902059m5247l8737N93786O36511K7206j12540K38955O584o30304k83587
35907a509432R75944J376416L37602o67629o89312n06465o38488l86428L63198
35898a344594N10686k20988o13565j12432L23181K49242M97390J131765R13256
35889A333941k54936o90146J61241O08882j90210n91602M14490J016449l22142
$$ y = [-1311728, -2599755, -2113183, -571229, 107295, -248167, 111983, 1732476, 2618593, 1195191, -1071957, -1744051, -890265, -484067, -1118106, -1570800, -1349579, -1344421, -1725819, -1372955, -29799, 869567, 398047, -421006, -285143, 613177, 1362661, 1666446, 1540624, 798570, -325255, -1040268, -1199246, -1602994, -2495459, -2951131, -2469146, -1902059, -1947306, -1986043, -1392257, -755746, -728540, -841080, -602125, -595541, -1225845, -1509432, -533488, 842928, 1180530, 512901, -176411, -682876, -1321364, -1707792, -1344594, -833908, -1054896, -1668461, -1780893, -1457712, -1208470, -711080, 420685, 1333941, 1079005, 388859, 550100, 1158982, 968772, 377170, 791660, 1808109, 1485967]
35880A485967j893102j398634L31254R56385L97357K05660M06401j24668r27334
35871e60714m72683R19332J299127J97121p81831n73766J52329N56869O02646
35862A338430L52432j35554k35504M38625Q77431n1305j442997j322062K99711
35853A19207J277435M73616q22422j103948n95994k84513l47274l44940o0338
35844a689171M23317Q25131O66760j12576o20739k1539J057613J231449L60490
35835B120735l97627m98676n67309q89261q18033j20829M07477K56559o97J87159
35825c20502M46470K63482k07223o33974r73484j016055l79191N59901O83046
35816a577530k80012j048518m29775J028328J785603J183895j16658j120466j245450
$$ y = [1485967, -407135, -1805769, -1474515, -518130, -120773, 84887, 491288, 366620, -560714, -1033397, -114065, 1185062, 1382183, 600352, 26586, 178915, 735784, 1338430, 1690862, 1555308, 1319804, 1758429, 2635860, 2584555, 1141558, -180504, 119207, 1396642, 1870258, 1047836, -56112, -652106, -936619, -1283893, -1628833, -1689171, -1265854, -440723, 226037, 113461, -507278, -528817, 528796, 1760245, 2120735, 1723108, 1224432, 657123, -232138, -1050171, -1171000, -763523, -506964, -507661, -320502, 125968, 389450, 182227, -451747, -1425231, -2441286, -2820477, -2260576, -1577530, -1857542, -2906060, -3335835, -2307507, -521904, 661991, 545333, -575133, -1820583]
35807a820583m53492O98466J314467R75651J99302k22160j30865M0562k4855k37304
35797C39189m09898n33750o60975o34446j35368P80422J321887O98161o36402
35788A28820j208278m49756M23306K25378l92073j55855N78009M81089k35952
35779f05312j8355J147325J214803o87177k441278j798911L73711J398682M55797
35770i60715p64624o97065L56844J158462J047592L25890j79561R4857O83170
35761A064850M63422p21430j474574p00450O28473P29483m35560j236568q06183
35752b488537Q4678O68306J141345J501192R13519p85843k066391j432660M00380
35743b064011J279550L81137q86147q95806J91634R27064N25912l51446o85382
$$ y = [-1820583, -2274075, -1575609, -261142, 714509, 913811, 691651, 560786, 601348, 576493, 339189, -70709, -604459, -1265434, -1899880, -2035248, -1254826, 67061, 765222, 128820, -1079458, -1529214, -1105908, -880530, -1272603, -1428458, -850449, -369360, -605312, -623667, 523658, 1738461, 1051284, -1389994, -3188905, -2815194, -1416512, -960715, -1725339, -2422404, -2065560, -907098, 140494, 466384, 286823, 381680, 1064850, 1528272, 806842, -667732, -1368182, -739709, -10226, -445786, -1682354, -2488537, -2403859, -1735553, -594208, 906984, 1820503, 1034660, -1031731, -2464391, -2064011, -784461, -403324, -1289471, -2185277, -1993643, -1066579, -540667, -892113, -1577495]
35734a577495l28955J74937N68069R92966J232895P20320l50834q00245p6262
35725E55396O70003J71452r17381r64841R530L71529l75125p64538Q9063R88764
35715a66148P87512K95080N29630O13388n72115j822317j160395O77009J013731
35706A95375n08564j271643J1593J102102r2128j960275j579306Q05407K222835
35697a074604J309748k10244n00394M2987J44683k14561j30179N79596J112859
35688A059891Q41598K4137o53734q17686n52264o4699M89948Q13965M90206l93906
35678A237456r15288k94889Q26196R28565l34030j497624j194788R9574R17594
35669b27234P26409J72598j33837j96751k08432k71334m37073n39582k27706M30953
$$ y = [-1577495, -1906450, -1731513, -1163444, -170478, 1062417, 1782737, 1431903, 631658, 555396, 1225399, 1396851, 479470, -485371, -475841, -104312, -479437, -1243975, -1154912, -166148, 621364, 916444, 1446074, 2059462, 1487347, -334970, -1495365, -818356, 195375, -313189, -1584832, -1573239, -471137, -563265, -2523540, -4102846, -3297439, -1074604, 235144, 24900, -475494, -432507, -287824, -502385, -632564, -52968, 1059891, 1901489, 1925626, 1271892, 454206, -98058, -162757, 327191, 1141156, 1631362, 1237456, 322168, 27279, 853475, 1782040, 1448010, -49614, -1244402, -1144828, -227234, 499175, 671773, 537936, 341185, 132753, -138581, -575654, -1115236, -1342942, -911989]
35659i11989P76081M33403j06792k60519j22781M9242M08167Q96908Q31988m5568
35649A948140q45382p84256l97453m66453n95638j12041M64547L34455K4223M05890
35639b3968Q41216K50018n83432n8428J216601J016062p79056j743255p59088
35630f23330L87054K62550j6770O34398R68006k43299j536555q68427R73994J545177
35620A482798M68682m07331j59945J77404k40091q54934r75909p44844m64272
35611a718442j33528P7642j11217l91449j28788N73702R18151N68902j7472l96187
35601g58686m86326k10187L67537O26421M7520p41515n92057L89713P78263j00335
35591f79652j060244o88288O69360J406389P76166l25872o80412j35247N86842
$$ y = [-911989, -135908, 297495, 190703, -69816, -192597, -143355, 264812, 1161720, 1993708, 1948140, 1102758, 318502, -78951, -545404, -1141042, -1253083, -788536, -454081, -429858, -23968, 817248, 1067266, 483834, 425406, 1642007, 2658069, 1879013, 135758, -623330, -236276, 26274, 9504, 643902, 1611908, 1368609, -167946, -1036373, -62379, 1482798, 1951480, 1544149, 1384204, 1561608, 1321517, 466583, -509326, -1254170, -1718442, -1851970, -1774328, -1885545, -2276994, -2405782, -1832080, -913929, -345027, -362499, -758686, -1245012, -1455199, -1087662, -461241, -413721, -1155236, -1747293, -1357580, -579317, -679652, -1739896, -2428184, -1758824, -352435, 423731, 97859, -582553, -717800, -130958]
35582a30958R51359R59648O43713j19945j097285j541309r78800J56468J027162
35573a29947J185753N73228o50286j712345j420473L00135J704448J256083j98210
35564I08386p03147j23320K1102o18370p32340Q6648N56696J19656o2576N42873
35554d392O80351k64860q16878M0326Q79230K60768p18008m69596J66011m54889
35544g01937j555323j062179Q57311K039226J647029Q00521K24701l57113p24881
35535A167355l69129m918o16036j261955k96596J440841J419124m93519j638518
35526f53351p57105L58612K63576j3245M46161N07892n76211j195352K2634J569867
35516b6522J296007j96002p25650l5842K49836m00359p57331j20085N94109M10150
$$ y = [-130958, 820401, 1780049, 2423762, 2303817, 1206532, -334777, -1313577, -1157109, -129947, 1055806, 1629034, 978748, -733597, -2154070, -1853935, -149487, 1106596, 908386, 205239, 81919, 103021, -515349, -1247689, -1161041, -604345, -484689, -547265, -4392, 675959, 411099, -405779, -365453, 513777, 774545, 56537, -413059, -247048, -701937, -2257260, -3319439, -2462128, -422902, 1224127, 2024648, 2249349, 1892236, 1167355, 798226, 793308, 177272, -1084683, -1381279, 59562, 1478686, 985167, -653351, -1410456, -1051844, -788268, -801513, -355352, 152540, -423671, -1619023, -1596389, -26522, 1269485, 1073483, 347833, 311991, 561827, 161468, -595863, -715948, -121839, 288311]
35506B88311l57866p54701l87377L17577O41952K93563k33701k27842K73229N80424
35496D33569M44056K92350K85193O9947l08258k92837J05613K39081J19501M71447
35486A859662J102730P76357o29983j488115q94926j35113m56341j008678n38190
35477a412597L34330L30394j97957j26710K59378n6812p08275n29223K57892M09494
35467a440086j51826m08614j89193j46973q4660P20727J677616J404020R9725
35458A480736o12660k86228l3275k01905P3043O63377K19628j135632j324322
35449a157238L57342J728280J005282n02112p26578j237J43512k27178j21476
35440D98597J03760m77817j104489k96717J298421J461618j44368j342047o86214
$$ y = [288311, -69555, -824256, -1211633, -894056, -252104, 41459, -192242, -420084, -146855, 433569, 877625, 1169975, 1455168, 1525115, 1216857, 924020, 1029633, 1268714, 1388215, 1859662, 2962392, 3738749, 3108766, 1620651, 725725, 590612, 134271, -874407, -1412597, -1078267, -747873, -945830, -1072540, -813162, -869974, -1578249, -2107472, -1849580, -1440086, -1591912, -2000526, -2189719, -2336692, -2421352, -1700625, -23009, 1381011, 1480736, 868076, 581848, 548573, 346668, 419711, 1083088, 1302716, 167084, -1157238, -799896, 928384, 1933666, 1431554, 704976, 703739, 847251, 620073, 498597, 602357, 124540, -979949, -1276666, 21755, 1483373, 1339005, -3042, -689256]
$$ [...]
##END NTUPLES=NMR SPECTRUM
##END=
