##TITLE=31Pdec_LR-759-R2-RM1
 CDCl3, 128 sc
 16.12.2022
##JCAMPDX= 6.0         $$ Bruker NMR JCAMP-DX V2.0
##DATA TYPE= NMR SPECTRUM
##DATA CLASS= NTUPLES
##ORIGIN= UXNMR, Bruker Analytische Messtechnik GmbH
##OWNER= root
$$ XWIN-NMR		Version 3.5
$$ Fri Dec 16 15:29:57 2022 Russian Standard Time (UT+4h)  she@DPX200
##.OBSERVE FREQUENCY= 81.013821
##.OBSERVE NUCLEUS= ^31P
##.ACQUISITION MODE= SIMULTANEOUS
##.ACQUISITION SCHEME= undefined
##.AVERAGES= 128
##.DIGITISER RES= 16
##SPECTROMETER/DATA SYSTEM= spect
##.PULSE SEQUENCE= zgpg30
##.SOLVENT NAME= CDCl3
##.SHIFT REFERENCE= (INTERNAL, CDCl3, 0, 248.564)
##AUDIT TRAIL= $$ (NUMBER, WHEN, WHO, WHERE, WHAT)
$$ ##TITLE= Audit trail, XWIN-NMR		Version 3.5
$$ ##JCAMPDX= 5.01
$$ ##ORIGIN= Bruker BioSpin GmbH
$$ ##OWNER= she
$$ F:/spectra/data/she/nmr/P31/1/pdata/1/auditp.txt
$$ ##AUDIT TRAIL=  $$ (NUMBER, WHEN, WHO, WHERE, WHAT)
(   1,<2022-12-16 15:28:53.01 +0400>,<she>,<DPX200>,
      <continue with go, POWCHK disabled, PULCHK disabled
       configuration hash MD5:
       00 E9 B6 7A A2 85 ED C7 34 08 36 98 17 FE 4E 26
       data hash MD5: 32K
       C7 30 1F C9 23 3B D8 91 CA 62 50 B2 85 47 B1 05>)
(   2,<2022-12-16 15:28:55.01 +0400>,<she>,<DPX200>,
      <Start of raw data processing
       efp BC_mod = 2 LB = 1 FT_mod = 6 PKNL = 1 PHC0 = -10692.75 PHC1 = 278.8558 SI = 64K 
       data hash MD5: 64K
       66 0A 90 5F 24 69 94 C6 E9 D7 6A 58 9A 18 DA FB>)
(   3,<2022-12-16 15:29:17.50 +0400>,<she>,<DPX200>,
      <pk PHC0 = -223.1244 PHC1 = 550.2008 
       data hash MD5: 64K
       BD 54 30 ED 8B C3 08 92 A4 23 3E 0F 2B 22 14 34>)
(   4,<2022-12-16 15:29:21.65 +0400>,<she>,<DPX200>,
      <abs ABSG = 5 
       data hash MD5: 64K
       E4 03 F7 49 B0 5D 73 FC FD 69 FC 95 B8 CC EB A1>)
$$ ##END=
$$ 
$$ hash MD5
$$ 21 7E 14 1E 10 C1 CA 97 23 28 7D 81 3C 79 A6 07
##$RELAX= 
##$RELAX= 
##$RELAX= 
##$RELAX= 
##$RELAX= 
##$RELAX= 
##$RELAX= 
##$RELAX= 
##$RELAX= 
$$ Bruker specific parameters
$$ --------------------------
##$DU= <F:/spectra>
##$EXPNO= 1
##$NAME= <P31>
##$PROCNO= 1
##$TYPE= <nmr>
##$USER= <she>
##$AMP= (0..31)
100 100 100 100 100 100 100 100 100 100 100 100 100 100 100 100 100 100 
100 100 100 100 100 100 100 100 100 100 100 100 100 100 
##$AQSEQ= 0
##$AQ_mod= 1
##$AUNM= <au_zg>
##$AUTOPOS= <>
##$BF1= 81.014009
##$BF2= 200.13
##$BF3= 200.13
##$BF4= 200.13
##$BF5= 200.13
##$BF6= 200.13
##$BF7= 200.13
##$BF8= 200.13
##$BYTORDA= 1
##$CFDGTYP= 0
##$CFRGTYP= 5
##$CHEMSTR= <none>
##$CNST= (0..31)
1 1 145 1 1 1 1 1 1 1 1 1 1 1 1 1 1 1 1 1 1 1 1 1 1 1 1 1 1 1 1 1 
##$CPDPRG= <waltz16>
##$CPDPRG1= <>
##$CPDPRG2= <waltz16>
##$CPDPRG3= <>
##$CPDPRG4= <mlev>
##$CPDPRG5= <mlev>
##$CPDPRG6= <mlev>
##$CPDPRG7= <mlev>
##$CPDPRG8= <mlev>
##$CPDPRGB= <>
##$CPDPRGT= <>
##$D= (0..31)
0 1 0 0 0 0 0 0 0 0 0 0.03 2e-05 3e-06 0 0 0 0 0 0 0 0 0 0 0 0 0 0 0 0 
0 0 
##$DATE= 1671189933
##$DBL= (0..7)
120 120 120 11 120 120 24 19 
##$DBP= (0..7)
150 150 150 150 150 150 150 150 
##$DBP07= 0
##$DBPNAM0= <>
$$ [...]
##$SUBNAM3= <"">
##$SUBNAM4= <"">
##$SUBNAM5= <"">
##$SUBNAM6= <"">
##$SUBNAM7= <"">
##$SUBNAM8= <"">
##$SUBNAM9= <"">
##$SW= 501.771253377433
##$SWIBOX= (0..15)
0 1 3 0 0 0 0 0 0 0 0 0 0 0 0 0 
##$SW_h= 40650.406504065
##$TD= 32768
##$TD0= 1
##$TE= 0
##$TE2= 300
##$TE3= 300
##$TEG= 300
##$TL= (0..7)
0 120 53 12 22 120 120 120 
##$TP= (0..7)
150 150 150 150 150 150 150 150 
##$TP07= 0
##$TPNAME0= <>
##$TPNAME1= <>
##$TPNAME2= <>
##$TPNAME3= <>
##$TPNAME4= <>
##$TPNAME5= <>
##$TPNAME6= <>
##$TPNAME7= <>
##$TPOAL= (0..7)
0.5 0.5 0.5 0.5 0.5 0.5 0.5 0.5 
##$TPOFFS= (0..7)
0 0 0 0 0 0 0 0 
##$TUNHIN= 0
##$TUNHOUT= 0
##$TUNXOUT= 0
##$USERA1= <user>
##$USERA2= <user>
##$USERA3= <user>
##$USERA4= <user>
##$USERA5= <user>
##$V9= 5
##$VALIST= <valist>
##$VCLIST= <CCCCCCCCCCCCCCC>
##$VD= 0
##$VDLIST= <DDDDDDDDDDDDDDD>
##$VPLIST= <PPPPPPPPPPPPPPP>
##$VTLIST= <TTTTTTTTTTTTTTT>
##$WBST= 1024
##$WBSW= 4
##$XGAIN= (0..3)
0 0 0 0 
##$XL= 0
##$YL= 0
##$YMAX_a= 10110
##$YMIN_a= -15560
##$ZGOPTNS= <>
##$ZL1= 120
##$ZL2= 120
##$ZL3= 120
##$ZL4= 120
##$ABSF1= 248.5645
##$ABSF2= -253.2056
##$ABSG= 5
##$ABSL= 3
##$ALPHA= 0
##$AQORDER= 0
##$ASSFAC= 0
##$ASSFACI= 0
##$ASSFACX= 0
##$ASSWID= 0
##$AUNMP= <proc_1d>
##$AZFE= 0.1
##$AZFW= 0.5
##$BCFW= 0
##$BC_mod= 2
##$BYTORDP= 0
##$COROFFS= 0
##$CY= -3
##$DATMOD= 1
##$DC= 0
##$DFILT= <>
##$DTYPP= 0
##$F1P= 0
##$F2P= 0
##$FCOR= 1
##$FTSIZE= 65536
##$FT_mod= 6
##$GAMMA= 0
##$GB= 0
##$INTBC= 1
##$INTSCL= 6.047779e-11
##$ISEN= 30
##$LB= 1
##$LEV0= 0
##$LPBIN= 0
##$MAXI= 10000
##$MC2= 0
##$MEAN= 0
##$ME_mod= 0
##$MI= 50
##$NCOEF= 0
##$NC_proc= -9
##$NLEV= 6
##$NOISF1= 182.463
##$NOISF2= 159.3651
##$NSP= 0
##$NTH_PI= 0
##$NZP= 0
##$OFFSET= 248.5645
##$PC= 4
##$PHC0= -10915.87
##$PHC1= 829.0566
##$PH_mod= 1
##$PKNL= yes
##$PPARMOD= 0
##$PSCAL= 0
##$PSIGN= 0
##$REVERSE= no
##$SF= 81.0140089999694
##$SI= 65536
##$SIGF1= 159.3651
##$SIGF2= -187.1042
##$SINO= 113.3802
##$SIOLD= 16384
##$SREGLST= <1H.CDCl3>
##$SSB= 0
##$STSI= 65536
##$STSR= 0
##$SW_p= 40650.406504065
##$SYMM= 0
##$S_DEV= 0
##$TDeff= 32768
##$TDoff= 0
##$TI= <>
##$TILT= no
##$TM1= 0
##$TM2= 0
##$TOPLEV= 0
##$USERP1= <user>
##$USERP2= <user>
##$USERP3= <user>
##$USERP4= <user>
##$USERP5= <user>
##$WDW= 1
##$XDIM= 65536
##$YMAX_p= 472310573
##$YMIN_p= -136960898
$$ End of Bruker specific parameters
$$ ---------------------------------
##NTUPLES= NMR SPECTRUM
##VAR_NAME=  FREQUENCY,     SPECTRUM/REAL,   SPECTRUM/IMAG
##SYMBOL=    X,             R,               I
##VAR_TYPE=  INDEPENDENT,   DEPENDENT,       DEPENDENT
##VAR_FORM=  AFFN,          ASDF,            ASDF
##VAR_DIM=   65536,         65536,           65536
##UNITS=     HZ,            ARBITRARY UNITS, ARBITRARY UNITS
##FACTOR=    0.620285442955139, 1,           1
##FIRST=     20137.2065510682, 0,            0
##LAST=      -20513.1999529968, 0,           0
##MIN=       -20513.1999529968, -136960898,  0
##MAX=       20137.2065510682, 472310573,    0
$$ Real data points
##PAGE= N=1
##DATA TABLE= (X++(R..R)), XYDATA
$$ [...]
42356 -9616974 -13698175 -15499100 -5911261 5548383 9921111 13320673 19203464 15995176
42348 15995176 -755481 -12421416 -4243359 7696796 497552 -17322529 -19039484
42341 -19039484 -3202296 5771474 -1617901 -8843800 -7377661 -12574227 -33566541 -51192169
42333 -51192169 -43163249 -16002582 4430904 5009417 -4965843 -9410046 -720124 15475779
42325 15475779 24132606 14879046 -3912184 -13024256 -6800392 1906783 4622550 9241425
42317 9241425 20558072 25575039 13404304 -3010757 -3471183 9519406 16783655 13475553
42309 13475553 12948240 19482061 18475890 742336 -20992729 -31203308 -34615749 -46066412
42301 -46066412 -63955898 -69351415 -53021964 -31075554 -26034920 -38446531 -47344071
42294 -47344071 -38479316 -20912786 -10070854 -5660471 471130 2566804 -12350305 -35966672
42286 -35966672 -40410897 -17708147 4404830 1875937 -10212005 -3898457 15805870
42279 15805870 20184595 3789228 -9171303 -5020037 3370813 5923571 10984214 20839477
42271 20839477 19469598 1274534 -11579625 -585422 19152313 21644232 7279691
42264 7279691 -4883058 -9468949 -15755788 -25186722 -31534703 -37381838 -47135909 -48572222
42256 -48572222 -26812611 4615590 13565030 -5896521 -24172213 -19865104 -7900511
42249 -7900511 -9829056 -17848667 -9614114 14077528 29416900 24066268 12005430 10371450
42241 10371450 15443466 10289176 -9267890 -25564874 -19195882 6264993 27687405
42234 27687405 31839512 30726647 39028500 46572996 30548093 -7518959 -36251538 -31134070
42226 -31134070 -1891342 23685380 30576922 23290903 13047906 8209420 10962773 16414629
42218 16414629 19387680 23456441 34494721 45601835 43118212 30028633 24807170 30434296
42210 30434296 26085096 2355327 -17477696 -11424985 5393045 4830429 -9478837 -12508670
42202 -12508670 -3832694 -7350851 -24783844 -26281718 1206842 28061269 23462860 -1504294
42194 -1504294 -14641619 -9048934 -4132139 -10192754 -16740622 -14482444 -8345666 -4911407
42186 -4911407 -1921903 3813971 8199612 6104615 161709 -2711097 -1590268 -3247526
42178 -3247526 -11736939 -19441622 -14632463 368272 6721275 -7119301 -25437307 -22245559
42170 -22245559 3883615 27510432 30816209 23489009 21627878 24228265 23450807 23914046
42162 23914046 33879106 45067841 39690224 15877459 -8661444 -18456991 -13989358 -4127927
42154 -4127927 3847816 6481195 6099999 9962930 18939628 20971124 7750835 -6539611
42146 -6539611 -323507 21942358 31284998 14634798 -5728039 -4103581 14328995 26765526
42138 26765526 26897767 25754449 25738889 16324850 -3012748 -15390476 -9763618 2618984
42130 2618984 5145035 -237571 2749162 21245975 44403655 57105958 54494729 42014301
42122 42014301 27425816 15341065 6192001 -1490992 -6801236 -5732418 2330730 9643185
42114 9643185 7757256 -91712 -2041621 4635872 7863556 -824323 -10883389 -7283273
42106 -7283273 4528785 3382034 -16448908 -34072821 -30040306 -14135206 -12806074 -34125217
42098 -34125217 -57935590 -61411453 -44895102 -28658212 -29061767 -41888861 -48646190 -38004247
42090 -38004247 -19069195 -10307057 -16582217 -24262958 -21128484 -12157279 -9093931 -12675475
42082 -12675475 -15788958 -18658802 -27238410 -37333320 -34413975 -13857385 9248158 17509701
42074 17509701 11933544 8549153 18072932 34622406 43167579 34449382 13149785 -6670054
42066 -6670054 -14466853 -11793630 -7674781 -7793186 -11442118 -17037526 -24769606 -32584550
42058 -32584550 -34160529 -24259941 -5407057 12420295 20431577 20704235 24593556 36759980
42050 36759980 44039284 30560246 3735272 -9641209 1331742 16559116 15665432
42043 15665432 6433807 5337394 6269096 -5684867 -20169649 -12594935 13063709 24586204
42035 24586204 9561234 -7206764 -4185470 7540742 9814855 6598787 9589015 16045460
42027 16045460 19725625 25435211 34627178 34681393 21083259 11693555 18915245 27242039
42019 27242039 21613484 17378473 32455877 47689589 31250371 -7808050 -28602871
42012 -28602871 -18135885 -4889061 -9667857 -17923663 -10468131 7804123 22088347
42005 22088347 27480942 24196187 12729606 1802726 2803400 10851871 9712915 -2134781
41997 -2134781 -11456596 -16766316 -28443650 -39765311 -29053436 905246 17879383
41990 17879383 8118275 -2572644 6429154 16420175 4417108 -15638520 -16735898 -3002253
41982 -3002253 1115971 -8503244 -15251062 -12080635 -5846251 954296 9632205 13716619
41974 13716619 7984291 407245 -2518865 -9105142 -21943823 -22052008 759888 19791271
41966 19791271 6318575 -21957026 -24764217 -1641529 11108050 1900439 -2823134
41959 -2823134 8497647 12149004 -3354310 -11121743 9272562 34950427 35669589 20197340
41951 20197340 16900945 27149488 28477627 12884050 -5690820 -16169299 -18796262
41944 -18796262 -12086846 6850392 28102799 32933216 16007587 -7836264 -21572235
41937 -21572235 -22255617 -18056780 -16221839 -16276930 -12202384 -880700 11959687 17620588
41929 17620588 15449364 11975886 10179827 8486779 9524854 17197341 23400433 13018492
41921 13018492 -11818312 -27527055 -18351780 3790801 19469227 27646773 36563273
41914 36563273 40984645 28892524 6103228 -5910281 1229658 12232822 11576996 5247782
41906 5247782 10611955 30933205 49314752 49180153 35245575 27833424 35669888 42862610
41898 42862610 31361176 9894512 5097561 23517453 40093573 32171697 9705812
41891 9705812 -1018621 7338531 19212060 21235754 16076879 12104207 11328033 9834186
41883 9834186 3273220 -9301310 -23313213 -31509468 -31506890 -27518595 -22900649 -16537951
41875 -16537951 -8799969 -3366489 447834 8067859 17069945 14375819 -5860723 -30526587
41867 -30526587 -42906968 -41720368 -35358849 -25866469 -11000613 3915215 9359510 4190014
41859 4190014 -5287490 -15569413 -25879938 -31583729 -27260719 -13853050 3945868 21995061
41851 21995061 31796683 20776631 -11066750 -42494106 -51677523 -39303047 -19888778
41844 -19888778 97040 19986634 31005789 25788267 16005245 17944226 23999764 13654790
41836 13654790 -7704562 -10479259 11522084 25389399 7722885 -16959866 -11168203
41829 -11168203 19753392 35890397 19585456 -4991069 -11485540 -4916441 -4554186 -12097216
41821 -12097216 -13950036 -5985419 1890163 4734308 9711561 18842147 18669398 -560995
41813 -560995 -23792240 -25538813 -4073083 15015559 12842181 -786851 -6147616 1222084
41805 1222084 14646928 30326312 42011335 35044898 5386289 -24964359 -33373445
41798 -33373445 -30221464 -41991232 -64865707 -66174747 -37114573 -11960916 -18795085
41791 -18795085 -37870908 -32621806 -3337229 17748231 15198615 5879307 6400640 10750658
41783 10750658 7939718 2505369 5019647 13607970 17398848 12569830 4133152 -5127211
41775 -5127211 -16519827 -26073729 -24814333 -13829598 -9208367 -21236014 -34731819 -25436357
41767 -25436357 3672843 19827677 2830914 -24494178 -23027090 13415805 51243032
41760 51243032 56639863 28581730 -6163107 -18558264 1696118 38998257 64597669
41753 64597669 64443893 51904442 45591003 43748842 35282126 26334117 32223320 46132174
41745 46132174 42969620 18519884 -1883840 -2597558 1043197 -4990726 -5941923 14200174
41737 14200174 37627212 33576615 4497377 -15914272 -8704372 9426227 13311378
41730 13311378 -1483509 -21654041 -34277461 -35486469 -29080783 -21185192 -13715604 -4483888
41722 -4483888 3942885 2346595 -11600150 -24925859 -23427335 -8526454 8098910 19446293
41714 19446293 23274779 16125664 192544 -11204669 -9179553 -3613442 -7052225 -12508306
41706 -12508306 -6553767 2891151 -2699793 -15983764 -7668510 26294671 50527800 38495140
41698 38495140 10180260 413191 9241444 10221737 -4148772 -14675734 -10183815 -2654048
41690 -2654048 -3624491 -8486021 -11598182 -16642418 -21743709 -13033513 12589325 33632753
41682 33632753 30533199 14831814 12411042 25355400 32530116 25058625 17062542 17719158
41674 17719158 16506170 6078958 -1386807 4553390 12471948 8113982 -293693 3435463
41666 3435463 13215734 7822432 -15734814 -37805060 -44674677 -41185318 -33174214 -17836455
41658 -17836455 2397603 13770138 7610511 -8690298 -22191191 -25277031 -14466934
41651 -14466934 8027769 29312331 36763534 36044126 42732937 55100765 54817471 38047848
41643 38047848 23450263 22034114 21931093 13118557 3783562 -709721 -10757948 -28007057
41635 -28007057 -32653718 -16185387 -2934433 -13374987 -28162964 -19615351 -18954
41628 -18954 -2127842 -24250033 -34456014 -24348749 -18417917 -27382502 -30569028 -14544219
41620 -14544219 3508707 4410893 -7383717 -19306293 -28527273 -32807781 -25582852 -11445989
41612 -11445989 -5531969 -7413275 1587732 23805899 33440129 15934170 -5102643 -2213739
41604 -2213739 14806035 17469295 3471013 -4297075 4260428 15244232 15522555 7089554
41596 7089554 -3849368 -14102913 -18043923 -10194678 3743903 10109081 3975872 -6217252
41588 -6217252 -11324878 -10479406 -7311996 -4758583 -3914022 -2654668 2984002 11318310
41580 11318310 12858912 1818349 -14339915 -23348708 -21641786 -13090023 -662076 11943637
41572 11943637 16574805 9450571 -728952 -4538799 -7154527 -18761913 -32779868 -29799396
41564 -29799396 -5449443 20215604 26862932 16327044 5015745 3986190 13968506
41557 13968506 31206919 47651550 50122758 31247326 2775946 -10640862 3890058
41550 3890058 32673107 49880468 45070608 30607417 21050727 13285886 -5238170 -33327424
41542 -33327424 -53720822 -56070782 -49838719 -46893502 -42302327 -25487429 -4054276 465249
41534 465249 -17752427 -38169683 -39413294 -24514031 -11823990 -8944535 -7603776 -1433124
41526 -1433124 4030769 2688827 -69534 5762577 19459655 28465157 23302718 8636929
41518 8636929 -2727289 -3880423 792982 2779814 -607921 -3782852 341563 11195775
41510 11195775 19040282 14622028 232458 -11805546 -12551392 -5171434 1191255 2499057
41502 2499057 1814090 3196957 7215384 10859666 9304651 -415829 -15492703 -29264354
41494 -29264354 -37717279 -39868833 -31865514 -9982558 16026738 23356032 895651 -32680112
41486 -32680112 -47634304 -36626620 -17683117 -6362695 953607 14155251 32459601
41479 32459601 45956968 46691537 34420043 16429156 2768584 -2961350 -6524504 -11564853
41471 -11564853 -10406428 4352399 24665378 36469233 39583576 42212432 39873602 21454067
41463 21454067 -3147260 -6656005 15929942 35000525 27481940 9122711 7001425
41456 7001425 17638743 16744888 380794 -9690909 -616003 13778912 14988721 4400935
41448 4400935 -1277605 8700333 27184581 35533432 22012586 -4188699 -20794765 -16392827
41440 -16392827 -445564 12595201 18754002 19016571 11190317 -2750634 -12419663 -13723569
41432 -13723569 -17008428 -27765992 -31737554 -16891709 957073 -2362219 -20318675
41425 -20318675 -22250926 33951 18256694 8850188 -13762359 -19481319 -3499820
41418 -3499820 11517348 7986850 -6021370 -9817400 3819049 19798934 18829400 2347210
41410 2347210 -7828294 1606176 16722641 16939010 5708927 4174888 17591754 27092798
41402 27092798 18224824 1040500 -5580345 2626583 15333719 22224188 20931709 16844919
41394 16844919 19207524 31574862 44445276 44318153 30370848 13845035 2045977
41387 2045977 -5728758 -7206522 2880590 19035052 26513096 22173152 19575788 26797157
41379 26797157 33840087 30779050 23903153 22254032 20880139 11361104 -683809 -3078399
41371 -3078399 4337952 11479017 13136215 10888064 5401397 -1402233 -1297908 11141401
41363 11141401 27780980 35889514 34095931 29325984 23163634 13450718 4868142 4182196
41355 4182196 7854280 8238642 9344828 20490065 35287204 35472705 19206222 7082879
41347 7082879 11799791 18704130 9465576 -7973066 -10028406 8277152 26767955 27840709
41339 27840709 16280415 6816553 3066252 -1976353 -9187625 -7729416 9977024 33230798
41331 33230798 40653443 24184857 -201752 -9964335 -295693 14487542 20736666 18920867
41323 18920867 17670914 22382608 32034448 41188490 42673952 33524524 20166215 12478920
41315 12478920 11770911 11308374 9239449 11072046 16510203 16114319 8107440 6034599
41307 6034599 18265055 30952530 26868783 12657843 8258521 14343750 13166715 2212837
41299 2212837 1429719 18412540 30963281 20967273 5450171 10705762 28854053 27953192
41291 27953192 1697675 -18751926 -8609017 17488153 28427662 17142566 3445367
41284 3445367 4181923 14229394 16389618 1753655 -21669237 -37915500 -39637403 -34316555
41276 -34316555 -32611295 -35211211 -37261194 -40632896 -50339296 -60340744 -56909311 -39510747
41268 -39510747 -25603505 -28367325 -39974831 -43708252 -33434139 -14354405 5833788
41261 5833788 18058733 13323981 -6086688 -22748326 -21760505 -8599767 -1026007 -7015480
41253 -7015480 -18480282 -23152416 -15497551 271403 11417977 5601537 -14681633 -31700588
41245 -31700588 -33000732 -25708455 -23116883 -25748256 -26552609 -26693867 -31574790 -35793813
41237 -35793813 -27630636 -7898677 9185739 14880258 14380113 15707359 20341604 25353910
41229 25353910 25682360 15110063 -5458883 -22314673 -22118874 -9402466 -315263 -1438548
41221 -1438548 -7098606 -14471628 -25202568 -32584793 -25444602 -8465717 -1307979 -11559304
41213 -11559304 -25047963 -30126607 -33608262 -40926083 -37846670 -10637526 26026143 42559218
41205 42559218 33916164 26630727 41885504 66485828 71291349 50799969 29889684
41198 29889684 28562254 33457822 18364266 -12946881 -26444380 -6942987 15714918
41191 15714918 8746576 -14102269 -14851925 7192817 13477210 -11646717 -35017464 -26040678
41183 -26040678 -558738 10470980 9429541 19029831 38633899 45915486 33658450
41176 33658450 15599432 -222015 -16714458 -28246668 -23295263 -9018616 -7487006
41169 -7487006 -21584081 -28525039 -15896044 -1390162 -3893570 -14698114 -14280773 -3305871
41161 -3305871 1564450 -5526587 -14004592 -14314630 -7488337 542425 3393000 -4454898
41153 -4454898 -20562659 -31223794 -25705668 -12114227 -8165508 -16720171 -22428869 -14832489
41145 -14832489 -2872753 -665443 -8403779 -15418175 -15895868 -13015661 -10821618 -9725116
41137 -9725116 -8838923 -7088432 -3425495 -399658 -4026536 -13836421 -17330838 -4216724
41129 -4216724 15736554 20931607 5506242 -13311521 -19224128 -15494843 -12029787 -6409041
41121 -6409041 8804171 27179862 32445282 20944216 7803602 7959329 18997768 25745688
41113 25745688 17443475 -1030188 -13271576 -8286502 6374281 14225285 12942162 16065047
41105 16065047 27122236 28735293 10672563 -7400529 -2606194 13187758 9233375
41098 9233375 -14931888 -26418231 -8650314 15374677 19983453 10307884 2993698 -3541947
41090 -3541947 -18495185 -34681744 -37762886 -29894492 -23992895 -20919388 -11043644 5664133
41082 5664133 18560559 23168334 23057697 15886254 -6177684 -39250628 -64638572 -68738116
41074 -68738116 -57170373 -43982718 -33641879 -19828061 1292144 22938718 34437816
41067 34437816 32817489 23523592 10148191 -9451715 -32763274 -46424071 -39968624
41060 -39968624 -20953632 -6346701 -3683395 -11237850 -28073080 -46853406 -45753901
41053 -45753901 -13482286 20917511 14737898 -27096316 -50558018 -24810206 16921250
41046 16921250 28423546 10905959 -5320205 -12045854 -20109526 -23395064 -5392254
41039 -5392254 24865734 38465249 27502048 11341816 2964902 -2879848 -7246541 -571476
41031 -571476 16569121 29906724 33928268 37722387 45035183 48261084 45337908 43201670
41023 43201670 41479871 31895798 16818383 9400478 12135300 13672271 9448077 6945485
41015 6945485 8694098 9435458 11280331 20556607 28776476 21061569 6065694 9926133
41007 9926133 33573189 44866608 25378432 -2270360 -9694708 -111593 8746526 16049445
40999 16049445 28714901 38604698 34116244 22973546 20092822 21230742 11216487 -7066350
40991 -7066350 -14058390 -3304163 8626357 4543416 -14324083 -34067201 -42865716 -37918704
40983 -37918704 -24763188 -11834313 -3132652 2675923 5756681 3266368 -4552714 -13166329
40975 -13166329 -19947616 -23839964 -19234272 -2080163 16750290 19364744 6853724 1477965
40967 1477965 14875252 29716402 24705345 4834273 -7127296 -859580 12137098
40960 12137098 14377356 -415960 -21207083 -27595133 -11781612 7585459 7008190 -7376592
40952 -7376592 -7583814 11601140 22950260 11593067 -336340 7520978 19104805 13203800
40944 13203800 4919873 21172598 50583539 55601593 28809872 2110143 -759194
40937 -759194 9784650 14252936 8409304 -3084332 -15136538 -19296046 -10972675 -1646718
40929 -1646718 -5784248 -16641509 -15882272 -5329885 -4090784 -13501267 -13351930 1012078
40921 1012078 6435331 -11403315 -34017639 -37505939 -23370046 -7426339 3543881
40914 3543881 9346846 7621553 2551685 6786186 20135504 22393357 3690607 -13849478
40906 -13849478 -4721153 21973459 34754610 22480199 4186641 -13286 10552556
40899 10552556 24651591 32218965 30060999 25271194 30137461 44429463 49673177 32904136
40891 32904136 7741864 -3500775 -752899 -426603 -4920188 -807537 13431843 21835455
40883 21835455 17816773 14655762 21093000 26629566 22344495 18353289 26307576 39059893
40875 39059893 43388942 41531866 43701797 47769462 43072670 29064265 15105809 6156134
40867 6156134 2545705 8230077 23172097 32659636 23303284 7131842 8423739 25790044
40859 25790044 31115313 12446180 -6452140 -2142996 15002378 21917546 19420729 24255509
40851 24255509 36321095 39807473 32597179 29228937 32741519 26414813 793792 -28879671
40843 -28879671 -41656285 -34803218 -20782135 -11031701 -10572173 -19393722 -30089183 -29618986
40835 -29618986 -11344521 16197181 35464668 33168871 8983190 -23092412 -42883694
40828 -42883694 -40286148 -23076457 -3898613 14807730 33687455 42624360 31647019
40821 31647019 12598501 9539594 25668179 40001412 41011745 41548630 52091098 61577406
40813 61577406 58178646 49357380 45469528 41198995 30681125 24021174 28571068 29575743
40805 29575743 13353436 -3284775 5606040 32561494 45373769 35754995 28196848
40798 28196848 35491635 36084640 10831309 -20607430 -21585942 13276910 49835989 52913121
40790 52913121 21971421 -12570643 -22403147 -8061670 6462838 3027749 -12276335
40783 -12276335 -21425719 -16400973 -1784681 16575976 34269763 44370335 42891439
40776 42891439 36438700 34220172 34706066 30446512 23111449 21658228 26871460 29812681
40768 29812681 25890538 20003365 17994287 22750498 36773073 57041037 69013078 59198759
40760 59198759 34567029 16959934 16446427 21791113 19195703 8678495 -1646791 -7209383
40752 -7209383 -8030911 -4857894 2360374 15250487 34442096 52274675 54236611 35704741
40744 35704741 11160413 -2608124 -5653383 -7142291 -7910892 -4469429 -981201 -858153
40736 -858153 4365021 19618764 30604938 25737470 21850904 38765481 57705623 42193543
40728 42193543 -1418124 -25354604 -9870155 9474436 123719 -19736910 -16061620
40721 -16061620 9223304 29653538 34901823 32169434 23661452 8582494 -4108044
40714 -4108044 -6056927 -2448511 448722 6029578 11732483 2462456 -22834971 -39274950
40706 -39274950 -31348736 -18102997 -19499337 -21619814 -5188162 14261491 11491316 -1876985
40698 -1876985 2015955 13253828 -1702230 -35630670 -40076889 2136961 48227781
40691 48227781 55410667 32425900 11794026 2742403 -4494088 -11470116 -13167028 -12106894
40683 -12106894 -12377760 -11364720 -9828844 -15520346 -24807434 -17645823 13867861 46676865
40675 46676865 53320123 36301245 20482469 20738903 32360409 45708956 54489963 53020520
40667 53020520 38895465 19064279 5943817 6987974 19329663 31071530 29228777
40660 29228777 14390488 5428960 17724443 38737527 41438394 21313724 -592077
40653 -592077 -13270958 -28420371 -49434554 -56466442 -39619236 -21191343 -21844325 -27015100
40645 -27015100 -14573494 3271208 -992645 -21932944 -28644128 -15824999 -10378716
40638 -10378716 -24001036 -34608846 -25356117 -10717854 -7817611 -8013598 3115849 17515884
40630 17515884 18010476 6504156 -1481820 -1421741 -338384 1043497 8969459 22005927
40622 22005927 30723846 31550193 29211975 26383204 21855377 18296388 20959387 27674646
40614 27674646 29308941 21829863 10670523 2292275 -1708269 -1689713 1379970 2834610
40606 2834610 -3234342 -15566619 -24572255 -22113597 -9612840 4038903 9761601 4863648
40598 4863648 -3209118 -1549339 13702044 28999344 27137369 8877518 -7942389 -11588558
40590 -11588558 -8277242 -7663305 -8100643 -4017630 1752805 3936777 6750677 17540858
40582 17540858 31477938 35382442 27291926 19950958 21118179 21696648 11140018 -3622988
40574 -3622988 -5931730 6158600 14564094 4738710 -12895980 -13885158 8832398 33475918
40566 33475918 34245308 10960282 -14595745 -27553299 -32273788 -35303634 -31988871 -18716933
40558 -18716933 -5081826 124040 5696233 23758353 44038092 42051092 13731978
40551 13731978 -16578493 -27354238 -22758621 -18192811 -18878982 -21614258 -23796415 -20873896
40543 -20873896 -7823158 6894801 3377201 -20863984 -38853039 -27654593 -351393
40536 -351393 15518508 18250738 24136978 28840588 11315465 -21724664 -31153504 352730
40528 352730 38982736 45617783 27743762 20275522 32014395 41434479 37493551 33059011
40520 33059011 35616249 32102006 12275588 -13179450 -28876834 -33224856 -30012258 -16693970
40512 -16693970 4705772 17148599 7051298 -12747606 -16727902 -2546917 4653991
40505 4653991 -11434562 -33308341 -31910931 -4858674 20220821 18640171 -4470949
40498 -4470949 -21375010 -10089282 25488547 59714107 68534595 51346892 29641960
40491 29641960 22730121 28457409 32275938 30224778 32144977 41971455 47647464 37939210
40483 37939210 20214511 10953257 13466814 16635342 14296637 13430071 19939014 27145506
40475 27145506 25167572 14356275 2018649 -8479168 -17013751 -19890174 -14370773 -7889105
40467 -7889105 -10226941 -14940182 -2704730 29188293 53408608 42832837 7319866
40460 7319866 -16587142 -11558029 2662322 1705288 -11010237 -16100418 -8425214 1821052
40452 1821052 10462825 21802098 30419544 20610287 -8975642 -35993634 -41154641 -33594040
40444 -33594040 -36251703 -52560207 -63178014 -55394373 -40301718 -33913337 -32953275 -22489191
40436 -22489191 -3142875 5740669 -4507776 -13934726 -350136 24073944 23770481 -10212295
40428 -10212295 -43108396 -41283245 -15298432 909479 -1106620 -2790861 1421132 -5571838
40420 -5571838 -28331591 -43059392 -30960946 -5864056 7728302 7482159 7358312 12817554
40412 12817554 20018475 29429508 41921820 48145176 38805579 21041507 10105320 9511990
40404 9511990 12574448 16918468 22632077 22994095 14117003 7887655 16507663 28778722
40396 28778722 22621308 -1125874 -19674513 -22966664 -23182545 -26077866 -19166383 1232534
40388 1232534 15991940 12893542 9886493 27089760 49706794 43724924 3786885 -36944982
40380 -36944982 -46641740 -27561180 -4553024 5936430 8130755 15650057 34867638
40373 34867638 57527363 67385327 55917226 32263257 15739146 18150964 34660534
40366 34660534 50646301 54436573 43758672 24627706 8060604 5865984 22245068
40359 22245068 45070681 51309071 30707854 2456459 -3637509 15535823 32004663
40352 32004663 25918603 12880739 18414887 39431473 51743584 47537909 41544103 42017276
40344 42017276 39827527 30094675 22529456 22816450 22508723 15443728 6879087 -1223078
40336 -1223078 -15104562 -29777898 -25124197 3784505 30665739 30941114 16272841 15678138
40328 15678138 32961620 45225119 37968219 19989475 4920257 -2132765 2102621
40321 2102621 20593131 44275530 52002837 31514595 -4097805 -25875150 -14701957
40314 -14701957 21050620 52056953 55723103 38641944 25870076 28596242 34599056
40307 34599056 33191715 32139508 39903816 47967679 45795407 38841876 34532376 24655782
40299 24655782 2774877 -13847592 -5525231 15631537 21002634 9625610 6693082
40292 6693082 19583762 28843932 27662313 35550046 59672164 74449689 59782816 33946891
40284 33946891 25259075 31101126 29908969 18954631 14218959 20728698 26183400 21055275
40276 21055275 7958684 -5263058 -8302818 8672217 40510193 63684441 62972223
40269 62972223 52955483 56161230 69660602 74215458 68206916 67243308 73346652 70647277
40261 70647277 53549832 35578635 26867819 24772349 29078678 42132095 50346633 33903812
40253 33903812 3113882 -5366023 17195320 32789065 14146059 -10000711 364443
40246 364443 31657629 38400241 15732313 3588221 19347535 32496293 18433791
40239 18433791 -2809589 -2701999 12988093 23269672 29090961 42140851 53170743
40232 53170743 42566666 15567626 -691812 5616107 19409982 25292253 25432769 27026564
40224 27026564 28935348 27052162 21199969 12156605 1007750 -6524562 -4394287 3979989
40216 3979989 9438895 10707734 14169136 20095707 20774843 14068561 7685706 7393327
40208 7393327 11059375 16344371 23999252 31887209 36533961 41629464 52432261 60615682
40200 60615682 50647051 26042007 12435394 25043556 47178229 52365046 36160966
40193 36160966 14413700 402359 -3670895 -823372 2722042 377365 -3748144 4937448
40185 4937448 29154203 47710319 40603221 17800272 5778342 11228161 17280883 13475518
40177 13475518 9126407 14028859 24167816 33029732 41903276 50436436 49181242 32165703
40169 32165703 9856822 152747 9160948 26308120 36242362 32569261 22394842 18948750
40161 18948750 27216764 37241933 35569013 22214115 10911489 13237790 27971956
40154 27971956 44713120 51642063 42244454 23393964 14903059 29156546 50516132
40147 50516132 48808813 18036931 -12151817 -12513411 10476275 28090634 28527626 25167209
40139 25167209 29098763 33183594 29048772 23534412 26364895 32059312 28763472 19662843
40131 19662843 19464783 30202864 37635463 35963281 38227558 51621895 59506113 45788196
40123 45788196 24540440 22259734 37391255 43573253 32354418 24788819 34822113
40116 34822113 48871029 53296501 55626468 62101362 59798368 43424390 36713059 58508419
40108 58508419 85461159 81572211 53562283 41437261 58198443 74751284 68045981
40101 68045981 50831543 43728588 45754698 45858956 42092483 36494112 27961863 20484649
40093 20484649 23415222 35962769 46161062 50056206 55061970 60634058 56276023 44826705
40085 44826705 45446610 63988904 81558741 83040285 76053157 70431067 61060764 44881699
40077 44881699 33263176 31863372 28866502 19064179 17602758 32084877 44840990 44576543
40069 44576543 50742485 78604732 103376418 94219855 67062993 64823735 94409058
40062 94409058 122022115 127200687 123150908 121977533 117360323 109695473 114859623 135719052
40054 135719052 152499230 153627333 151834959 158372157 164990366 164247719 165809202 178648021
40046 178648021 195839667 209439055 222021333 231900924 227183435 208625247 198268078
40039 198268078 208131292 218670249 207963545 185788124 175675499 175775257 163838059
40032 163838059 135818309 114067269 114674222 126216610 126928278 110218002 87613470
40025 87613470 74202116 75017027 82142682 84511956 81044735 79410686 80975404 76855937
40017 76855937 63755868 52355026 51457643 54676938 53749210 54880652 68792778 93121152
40009 93121152 118275927 141962784 162440003 166800180 146512388 119370700 113519867
40002 113519867 130486877 146204917 149862867 157119292 178255148 198332330 202634397
39995 202634397 200332885 204547796 206393960 191636816 171346757 169878357 186503973
39988 186503973 195592471 188431649 189396804 218027739 254747708 263612867 239134655 210396679
39980 210396679 200804565 202264950 193591147 169104958 139295958 113437143 94403726
39973 94403726 86589000 95712442 118561458 142454465 159382203 174192145 193752955
39966 193752955 213311897 220978257 214714456 208270828 217143585 240935282 262941296
39959 262941296 268113493 258873897 249103235 243349129 230512142 203880707 178870106
39952 178870106 177298239 196308879 208910015 198984290 179689747 168738341 161754472
39945 161754472 145689581 126398476 122005933 133771710 144434857 145164381 143522175
39938 143522175 141610395 128292503 102780107 86423384 95647340 116785717 124376012
39931 124376012 114748803 104513645 102991438 104792618 106422984 110945612 114701623 107347547
39923 107347547 90534041 81109562 87302515 94026339 82662657 57488349 41202947
39916 41202947 47643167 68223425 84637399 87647414 81544564 74260353 67163434 57003154
39908 57003154 46864904 47917390 64087333 81234109 83151462 75540241 79117315 97355216
39900 97355216 108403408 97273858 80422367 84412577 110221916 133672701 135876325
39893 135876325 120188396 102506278 95952755 102294104 109690349 103371259 85764851
39886 85764851 77455046 89281176 106546080 115177093 127711172 159688357 193059420
39879 193059420 195410808 171505747 160492802 178035712 197071314 196725441 193453986
39872 193453986 203253596 206758410 181982262 146741887 134278839 142623896 142255225 124821917
39864 124821917 111592413 117221257 134718205 155765176 179102492 197371837 199683541
39857 199683541 189497155 179409325 168944839 148982464 125596934 114402621 112364642
39850 112364642 102939187 90168686 96688696 122075501 135289838 120173174 98509443
39843 98509443 92893253 95135385 90057431 84214119 88422501 93547538 87142405 76537499
39835 76537499 73862753 75198632 75129855 83001911 101975035 112182550 101657506 93962693
39827 93962693 112578659 135723103 126079390 93960662 86117657 113013824 132245939
39820 132245939 112926258 75614417 53086783 48099361 50759728 65656215 94828297
39813 94828297 117488790 115541565 104199915 110789628 133458342 145703829 135322907
39806 135322907 115101023 97162718 79084728 58557443 43685265 41819091 49804770
39799 49804770 61322656 75255966 91021825 102479345 104024550 100077371 100953450 107831628
39791 107831628 108809489 96121909 81963314 85088986 101960874 107384173 90516390
39784 90516390 72569110 74529982 84396758 78895971 64469129 66797914 85376438 92287844
39776 92287844 78981564 70157165 80438115 89152710 75646093 52714274 44048699
39769 44048699 50189231 57999515 65117184 73949100 78239332 75734300 77362685 84351456
39761 84351456 76018166 43565076 15513036 21071731 46309820 58369082 56496921
39754 56496921 62287572 72354259 63184942 38411102 28686621 42415437 56391843
39747 56391843 60066619 68835014 84376903 82601887 57072085 37567166 45106130 60461099
39739 60461099 59390474 50579813 54499921 68526120 77320047 78791535 78598245 76117603
39731 76117603 73201195 77923783 84499251 72490385 42338854 24956792 36080912
39724 36080912 50192524 44309936 36659162 50227362 67731000 61656214 43905256
39717 43905256 42739026 51708314 47921789 42819705 62981205 92868844 92459055 66576480
39709 66576480 59205814 78175143 85467811 69999173 66948602 86916599 89202283 55180775
39701 55180775 28998072 45374499 69727738 58465396 33657393 41483549 70988474
39694 70988474 75242498 50802254 34625173 34579485 24356349 5096389 12574644 53985173
39686 53985173 89622865 93089599 85614939 92511133 104897896 106253862 103420451 107057211
39678 107057211 107777334 95462996 81592486 80817651 87278165 87737512 82401980 76030749
39670 76030749 64839383 49705664 46450097 63852628 85227900 91517771 90402597
39663 90402597 101318444 121350119 129056112 117484506 101569273 93393135 89581294
39656 89581294 85618222 85732205 92723699 99738719 98689509 90850583 85531606 91041698
39648 91041698 106152362 117546056 109580642 81387692 49990783 31819241 27553512
39641 27553512 30828272 41651654 59382287 70889632 62744280 43057900 34685634
39634 34685634 44774659 55955034 52416182 41074129 38325887 45405411 47531624 34103501
39626 34103501 11596294 -3974518 -3735903 5643589 10252095 6204569 5334443 18990581
39618 18990581 39637289 48099953 39971610 34066460 48395704 75573015 91166123
39611 91166123 82796307 61583532 45177581 38863304 37165755 36555813 38613394 43002551
39603 43002551 45606023 45542056 47558269 53708892 58499052 58387466 61022441 75306364
39595 75306364 93858266 96884071 76765012 49115491 34280135 36466844 47163079
39588 47163079 59211611 66967768 60551892 35350791 6138073 -2435356 16770535
39581 16770535 45037851 59895146 56761231 45444044 35042666 28949931 27573620
39574 27573620 28359229 27506661 27517595 37288292 56895734 68381176 54544293 25926583
39566 25926583 14309708 33409052 58744289 58383928 35317751 22797295 39190759
39559 39190759 66149131 78264500 76784991 78524864 83828306 78317179 63766715 62495480
39551 62495480 83236067 103804931 102748715 92226517 99018090 122070721 132672509
39544 132672509 116234157 90922317 78011321 73986757 65474922 56243091 59716481
39537 59716481 71643121 71850976 55847922 45742282 59459162 82777803 87769178
39530 87769178 72580162 64301829 80231197 104019768 110615093 102002577 102219714 121961100
39522 121961100 144639409 149491723 135925135 120500397 118407424 131689959 149229828
39515 149229828 156182236 148773706 138531599 135131409 130749114 114783942 98224138
39508 98224138 101771490 120213073 125354801 111136973 106223655 126519634 145391397
39501 145391397 136170249 117515058 123184714 147859089 162902736 171175426 199181202
39494 199181202 238686511 245895364 207321093 161078875 137849382 124177447 105310601
39487 105310601 100756404 124827493 148460171 140654232 121287536 129251219 156154227
39480 156154227 157723798 123619429 91659696 90628496 107266110 117098057 115511544
39473 115511544 108684587 100575146 98211167 107259253 116230111 108108585 92099044 97169322
39465 97169322 126481736 146422198 133506422 105845842 92364051 95531071 103433578
39458 103433578 115733599 134328589 146178007 139955570 126900452 122877910 122169601
39451 122169601 111971275 100824759 106585022 124683722 135530218 137964584 146922001
39444 146922001 159780222 155073059 128855443 104358133 97103569 95520601 86868887
39437 86868887 78862151 81545983 88049979 89107199 89689683 95948305 102178338 106757164
39429 106757164 123051605 153862423 172073696 154000087 120722735 115101781 141673870
39422 141673870 161902819 152343877 134426807 134101169 142150921 136573985 122263361 120759497
39414 120759497 132045993 134473177 120507309 108009584 111742514 123702957 130165532
39407 130165532 132645283 139794517 147904731 143293796 122742313 101442149 97310739 111861795
39399 111861795 129889108 136188023 128796570 115491685 102932970 94942001 97460467
39392 97460467 114252245 135944505 145011070 138171776 133443133 145334657 162492159
39385 162492159 163264930 146660320 131993695 131286627 139047316 148717910 160560038 169496491
39377 169496491 163558331 142919958 125453562 123406123 127116048 122015061 110097627
39370 110097627 103489856 107242603 119599829 138326472 153909401 147759145 114111350
39363 114111350 76197464 62873139 73475057 82652237 76377443 65124875 62932904
39356 62932904 72387190 91783484 118343760 139767229 140155089 121817117 106917647
39349 106917647 110247080 123442904 132624665 136736497 138977872 134713528 121685899 111848089
39341 111848089 118191287 135526079 146554767 142113535 124794759 99155026 71938197
39334 71938197 57464695 66542230 88642517 98670250 85922114 66525862 62373022
39327 62373022 75601393 89607002 89716681 76300445 59556422 47401403 40644461
39320 40644461 37523760 38480580 43498303 47273416 43151627 32775816 25718899 27157074
39312 27157074 32320492 36523242 42805751 53300796 60624940 57253068 48106014 43483285
39304 43483285 43617316 41673803 38680364 41504084 46700180 41981201 26830482 16266170
39296 16266170 18346735 23647422 25969749 36457172 61489687 81107605 72271476 46685101
39288 46685101 40107071 63026035 86477982 84070729 65214913 53514759 51961417
39281 51961417 48151266 39824402 34268355 31257210 27159702 29440034 45689229 63118566
39273 63118566 62702948 51684363 55626149 76151614 85639838 71907149 57947653 62260632
39265 62260632 69052687 60440928 51743442 64409916 83608759 77724279 48616327 27303066
39257 27303066 25531134 26816495 24227383 30966284 48389149 57472179 51569458 46788643
39249 46788643 48672356 39200615 11856567 -9426311 -5070823 11839503 21539371 27364900
39241 27364900 37895035 43033383 33460687 23457653 26875489 28836715 11654424 -7287406
39233 -7287406 1517455 29137898 37643739 17154757 -2524393 -518761 8390713 4511564
39225 4511564 -8159655 -16539887 -18838554 -17880443 -12482913 -6062108 -6947311 -10705032
39217 -10705032 706249 31525817 60059710 65947897 55342856 46109699 40873775
39210 40873775 30165047 13656804 2125433 1174111 6018045 12640424 23915045 41270272
39202 41270272 56363332 57098763 42516482 26801134 22736619 23987705 14416862 -4714889
39194 -4714889 -12781188 -1421320 10931936 10313025 13079492 36919547 62513319 56460936
39186 56460936 24216613 4212792 10052184 16794209 11736395 18413862 50765675 78697434
39178 78697434 68904923 36496015 24356505 44510334 69354508 74940146 66853559
39171 66853559 62699551 68393118 75639074 72325029 54652497 34379695 29288050 41354133
39163 41354133 52583295 48462954 34849805 23907208 15961788 7027316 3892934 18179041
39155 18179041 50753494 90669001 123374484 135518802 123105184 100992853 91160354
39148 91160354 95115610 93106148 76451928 59944637 52522784 40418549 16005599
39141 16005599 -1579719 2244329 8068537 -7367240 -30133003 -30035339 -8657487 7233896
39133 7233896 10369749 15484866 22466212 14264886 -6616650 -14491506 -404462 14449612
39125 14449612 13438655 4870529 -1638301 -12214122 -29034303 -36330182 -21396658 6119373
39117 6119373 27417973 33929858 26430378 9307253 -7690503 -15380809 -16880355 -20097315
39109 -20097315 -19319346 -3357824 18494799 23585795 13324244 16587455 45860093 75772497
39101 75772497 79723340 65093900 55021931 54245269 51142734 39235903 21075609 3072349
39093 3072349 -2607050 13258163 35960380 34548974 4460744 -18867661 -7235262
39086 -7235262 20261846 26713421 7794814 -13983726 -29519455 -46185268 -59469789
39079 -59469789 -54127764 -33370101 -18985280 -18797986 -17060699 -1376996 21244627 39782776
39071 39782776 52066233 56989828 50520863 35560438 22188575 13421808 2883479
39064 2883479 -11083112 -22586656 -31113077 -41080785 -45019783 -26211950 12461787 39650913
39056 39650913 30618780 -146184 -17729509 -11342931 -2393089 -8980475 -20419712 -15588772
39048 -15588772 4832052 18463878 12349965 1134266 6739812 27158244 37849367
39041 37849367 24818320 3910365 -455603 12556218 20736619 9157969 -11079307
39034 -11079307 -17024114 668390 30541342 54059184 61907997 58134974 52432956 50930059
39026 50930059 54090382 59953694 65426573 65700667 58264510 48944636 48019783 56601738
39018 56601738 62012886 52570256 34094594 24912584 34065727 49885626 52562757 34683731
39010 34683731 6433200 -16471428 -24105015 -12458530 17033716 50167993 61400212
39003 61400212 39214911 8259195 6543367 36212676 58407121 46946525 22896850
38996 22896850 17500038 25945313 27598281 30866638 56527487 87051772 80626736 38807581
38988 38807581 12959734 29885855 55205895 51584235 31660800 24242875 25136252 17708496
38980 17708496 12021963 22899203 31980796 14229642 -14178584 -17506460 1635129
38973 1635129 10200632 3708133 10602888 36377502 49842795 35773629 19270541 20319479
38965 20319479 20380235 -2883406 -36019421 -50369480 -42805446 -32311237 -28717031 -25261435
38957 -25261435 -14882255 1194165 16411729 22211169 15501414 7229403 11989252 24471647
38949 24471647 21482609 -4394329 -28856262 -26002768 -1901120 16287008 16364848 11604181
38941 11604181 18221644 34418374 44057758 36076296 17373444 4532658 2859083 1417395
38933 1417395 -5644225 -4757216 15316412 37049817 31620838 -10243 -26845708 -29887413
38925 -29887413 -20314712 -11501636 423108 16956153 22784722 7912259 -14101313
38918 -14101313 -26693862 -33520017 -44714373 -54317039 -49303425 -30329450 -7274947
38911 -7274947 15827213 36005142 42190386 28227419 6946632 -5364561 -11238868
38904 -11238868 -22347187 -34885875 -33262499 -14525995 8276086 24811021 33381141
38897 33381141 30705595 13741269 -7351919 -14898252 -6246583 2988809 1757239 -3726869
38889 -3726869 -5103199 -6572673 -15612202 -27876761 -31538948 -23193563 -11838075 -8088667
38881 -8088667 -14253189 -24134928 -28673578 -22225484 -7067437 7343620 12213158 7810988
38873 7810988 1787443 -1995215 -8492462 -21058830 -31363223 -29581230 -22110476 -24781668
38865 -24781668 -36285479 -36040900 -17089688 -1941670 -9190547 -21913371 -13450677 8619181
38857 8619181 15086286 5314542 9238382 35677115 54541417 43913026 23078298 18656710
38849 18656710 24394377 19548888 6957368 4800996 13524576 19496195 25436249 49243710
38841 49243710 90148366 118696989 109296289 69899908 31555138 15844941 19477524
38834 19477524 27592888 33577946 39415192 40805115 28073006 9329776 13690229 50651630
38826 50651630 81552124 63104877 11990887 -12371495 9066020 32319855 22797873
38819 22797873 4766112 12508997 32735290 33001587 17657324 13959650 21846371 17731574
38811 17731574 -3708693 -27123778 -45457902 -58505607 -53995071 -24517800 6344531
38804 6344531 9508542 -6433451 -11676105 -4345161 -4479918 -8274565 6359324 30911089
38796 30911089 30570525 2715881 -15124681 -6487447 -105900 -16468967 -33254225 -27016399
38788 -27016399 -11447274 -7039365 -5215157 7202150 14644008 -3136956 -31832425
38781 -31832425 -38588793 -16918013 9316736 19010854 11204103 -2792654 -8310233 3263367
38773 3263367 20630438 18815492 -7985618 -32363631 -26581722 2856044 28080183
38766 28080183 34995372 29648697 20288584 10364688 3404709 1287774 1596736 3743318
38758 3743318 9607524 13465211 4802369 -12765690 -22269620 -21081282 -27561727 -47919682
38750 -47919682 -58589886 -40060621 -8678595 7186635 6161096 5341003 7445590 3861695
38742 3861695 1088749 15456190 43535303 62205570 59340561 45315660 33939245
38735 33939245 29115789 29962217 33162621 30653171 18951532 8782934 11906221 21838407
38727 21838407 22001843 9478819 -3717715 -8945475 -5802457 6211948 24365629 35237253
38719 35237253 28128413 13141392 8703760 14068043 12730475 1098340 -6638628 -3348552
38711 -3348552 903096 -2903611 -11514483 -20225094 -29415372 -36937865 -38401237 -37044685
38703 -37044685 -38830330 -37763513 -23591029 -4413275 -415238 -11334885 -13238737 4002830
38695 4002830 19183571 12978727 -2458089 -4983182 3770924 7196238 3642238 4438999
38687 4438999 9130218 6156761 -3164949 -3324150 9298033 18171969 11426065 -1057275
38679 -1057275 -4723470 -1149148 276576 1042833 8602277 18296665 17369715 7606109
38671 7606109 7187432 23548925 38853359 33735446 14750138 3875177 7676161 13455160
38663 13455160 13245980 13797224 20510837 27722792 29784609 27550767 19413577 1820800
38655 1820800 -15109927 -10871617 15388287 35340704 26533984 1452612 -14601724
38648 -14601724 -18044422 -18174353 -9676096 16973843 46495453 52554809 39075013 35456066
38640 35456066 47215257 46248134 22148580 7956644 30445805 62625711 59169287
38633 59169287 23280958 1780190 17390938 41508804 42039860 27013071 21960304
38626 21960304 26305154 18954350 -1461613 -9381256 10264992 38435751 47513511 37067153
38618 37067153 29421754 36335700 45725295 41583293 24683724 10382523 13929574 39134187
38610 39134187 73443115 93969829 87938936 67858406 56379038 57022182 54300362 43373605
38602 43373605 39460360 50142789 59008577 51542578 39840872 42421436 52935859 51453574
38594 51453574 38824597 36252856 52485546 72190427 78666988 71280612 58173204
38587 58173204 46306918 41689671 47831270 61146314 74757508 84770131 87207096
38580 87207096 77749693 64459296 67900637 92021947 107832342 89243356 55332685
38573 55332685 48765817 76974641 105618872 110751617 104680296 103360566 100965092 91467182
38565 91467182 87754704 100353736 117735757 125349064 126926308 131149830 133934307 129885322
38557 129885322 125660816 125969180 121287032 105887998 93692127 98743836 112783166 119864638
38549 119864638 121363301 128291807 139703154 147742984 154655124 164964148 168575199 152685705
38541 152685705 126308722 113046033 120668060 134733144 141277396 139919307 134803776
38534 134803776 127762144 122192863 121714404 123624724 123039315 122617600 128942260 140933947
38526 140933947 150966085 155761525 158346415 162057027 169399761 181741709 193106682
38519 193106682 191802665 176913412 164237178 165291035 170729953 168005191 164223984 173236399
38511 173236399 188960745 193404166 186414620 184148947 188654858 183146870 162483930 146346422
38503 146346422 152093831 170768494 180643248 172893336 154832054 137015339 124936803
38496 124936803 116847762 105136767 85852797 67494450 61173394 62164549 53957908 32940677
38488 32940677 15311025 14873277 27628500 44543653 64976491 87120769 97630667
38481 97630667 84940601 56870876 33599228 27410448 38123156 61800512 91316252
38474 91316252 111493887 107920628 83923914 59564129 49815684 50291049 48049204 39835754
38466 39835754 33391350 34923241 43470802 56988278 74755595 90136661 90342896 72839008
38458 72839008 55754016 58296061 72578817 71741054 50202886 37135464 57035375
38451 57035375 92127043 103640800 82492808 57000183 51488813 59049766 61046870
38444 61046870 54876668 50910592 54014227 60432250 66392121 69464418 65577851 53880723
38436 53880723 42451673 41147250 49106282 56078625 56885230 57760867 64597320 70747463
38428 70747463 65321122 52950081 53462044 74404993 94296512 88492764 66549074 62889830
38420 62889830 87575097 109673626 101485615 77577867 69533553 78553603 79994466 66727372
38412 66727372 58918241 69581707 85804568 90622936 83570800 72451681 61838100
38405 61838100 56852937 63166586 76487637 85578447 90089981 99928171 112841948 112046641
38397 112046641 94666351 82848873 93374049 113467484 122738777 123868399 131922800
38390 131922800 144166735 142619903 122729023 99939503 87514913 83739850 82871439
38383 82871439 84933955 90533560 95951005 98054935 98568498 101364032 109179616 122199176
38375 122199176 135852214 142352775 139162304 132818419 129202268 124610101 114005080 103845649
38367 103845649 106285083 121465503 135659869 138534666 133309322 126749209 117446996 100097425
38359 100097425 76596810 56493250 47909643 52357391 66619164 83653821 91300232
38352 91300232 78193391 47579512 20837534 17771440 33462714 44253527 38399112
38345 38399112 29045060 31416755 40600897 43210493 38958937 34558809 26351623 10651591
38337 10651591 5595362 35523311 89962377 124498550 113959397 83233876 70783535
38330 70783535 80628554 89322444 85707163 80524883 82396318 85218793 80633289 69338426
38322 69338426 58644509 57243833 70442431 92958899 110306849 114804729 114689962 119511486
38314 119511486 124491342 120443409 111452608 108418124 109969109 104850100 90905508 77296433
38306 77296433 68999851 63241993 60977454 66866213 75592910 72739830 54619219 35810658
38298 35810658 31372228 41023940 55854389 70823210 83614377 89173924 84395989 74570284
38290 74570284 67864103 64886937 59391378 49130235 41053827 43076211 52779181 58820163
38282 58820163 55701896 52701206 61879839 80792957 98736615 120329120 165162763
38275 165162763 232985772 284631996 278426243 220595224 159065039 127143739 114501394
38268 114501394 99474690 86801498 94649322 117185580 123947196 97586414 54678940
38261 54678940 22994492 11727017 13638591 24496781 42997284 55488439 42685231
38254 42685231 9945813 -7155119 15672100 55146705 65990435 38129037 6101911
38247 6101911 506897 14112438 24643600 28218103 33395646 38406981 34532267 23638412
38239 23638412 14790024 9216461 4648385 9608369 35746969 75696221 103230239 99871975
38231 99871975 74164237 52926606 56730628 81461323 101922984 99310509 85158010
38224 85158010 86351726 106413319 122929040 130448998 157035874 215860225 265344597
38217 265344597 252199263 182176604 113749551 87486512 95397274 116211678 141464483
38210 141464483 159971795 153998454 127307403 109234770 115034832 125652477 120410716
38203 120410716 105205255 92813152 80261504 65406041 63122028 81632855 101522803
38196 101522803 103181953 99724986 117133316 155819977 200838876 258280681 344082378
38189 344082378 435681354 472310573 420588222 316821049 226175610 175789938 146637553
38182 146637553 118279515 94656149 83343322 73280379 49832870 21504142 12131845
38175 12131845 26577131 42580097 43981436 44982806 66114060 98124894 110846249
38168 110846249 94288121 70173539 60783246 65055541 70549329 72009170 69855091 63655669
38160 63655669 56114212 54305533 60402165 68518139 73735297 76298279 76922439 77846517
38152 77846517 85589481 99048351 100211561 77176486 52624183 62081776 102096305
38145 102096305 131349504 132087477 137946097 184468909 261662411 335238416 385570563
38138 385570563 401571022 366239720 282974942 195748972 147512340 131517661 114218432
38131 114218432 89964485 77574132 77022977 70867775 61948399 68193778 81449693 72609084
38123 72609084 40822787 17456560 14625467 10260116 -5006999 -7945073 12044336
38116 12044336 27132259 16077171 1414052 11628269 34198407 39990906 32350139
38109 32350139 35012390 46122358 43315143 28220281 27043059 43723246 47744022 20179417
38101 20179417 -16141992 -28572886 -16163153 -1718718 2455856 1385056 -1086133
38094 -1086133 -7073444 -12034848 -5463636 10881885 19440714 10172287 -2763536 733812
38086 733812 17762347 25595411 12852798 -6719753 -15139924 -11158554 -2674752 9254206
38078 9254206 26034043 38959520 35738280 17903344 703549 -3487925 6493517 25044940
38070 25044940 42346042 46172277 33451135 18446417 17443565 26399618 26315650 10129233
38062 10129233 -9607677 -20625231 -23365707 -20077212 -7136596 13674979 28610189
38055 28610189 27177894 16684561 12741593 20166394 30808966 37107159 40714269 47004851
38047 47004851 54304609 51918581 32877638 8408216 952578 17199693 37159875
38040 37159875 39549360 29009637 24727700 30103786 31417805 22161061 9635653 -738812
38032 -738812 -8102728 -4232946 18632858 45564061 48298631 23973232 2082284 3103996
38024 3103996 12283271 7657409 -7237606 -16460865 -19579884 -25205895 -28882611 -19577332
38016 -19577332 -2047308 7157951 3869042 -104667 2629548 5359106 681912 -6787391
38008 -6787391 -6295897 4195695 13095040 8085446 -5471518 -6921977 11019634 25809594
38000 25809594 14154275 -9758899 -10235940 16269393 33439799 19170511 -3424086
37993 -3424086 -5570271 5130978 5931832 -1250655 526490 10795179 17874181 24893432
37985 24893432 40379416 51940515 39339447 9692493 -8455582 -5349476 929703
37978 929703 -3987846 -13560786 -16560113 -10332062 2990318 15510996 11205813 -15748687
37970 -15748687 -43674883 -46072051 -27912358 -15532503 -14971507 -9930824 -185443 -7096589
37962 -7096589 -32696454 -46647187 -29571534 -1771384 9297585 6887406 10909435
37955 10909435 25247646 38932190 45364277 43045777 30042859 12646653 5975617
37948 5975617 11576693 9186872 -13555498 -38342432 -40997321 -25089205 -11271900 -5539761
37940 -5539761 711545 9219514 15475681 22585240 32349096 30224772 3982993 -27529824
37932 -27529824 -31354864 -6094294 16076292 16239342 9928841 13317692 16535918 7646267
37924 7646267 -110956 11281888 31448563 34170139 16731141 2464120 3771525 4924982
37916 4924982 -11271493 -37067268 -50956118 -43715054 -22028146 4746509 27699845
37909 27699845 33688048 14382269 -17487848 -34748261 -25198439 -4503007 6702653
37902 6702653 7454219 7704790 5746794 -7662932 -26063438 -28363285 -8305426 13617419
37894 13617419 16894483 6767285 2115166 8110121 14900409 17160641 19797800 25443191
37886 25443191 29344813 28386150 25278843 22110358 18166770 15075542 15192293 13631819
37878 13631819 1865289 -17673877 -30527334 -28722734 -21112433 -18909645 -20131023 -17419726
37870 -17419726 -13266500 -15175644 -20157534 -17433122 -5896637 3652671 5150903 4390187
37862 4390187 6919894 10869032 16063179 27384632 41831965 45241373 32937856 22099184
37854 22099184 29028917 43113945 40687286 19057362 -2340208 -12015238 -16584708 -19351930
37846 -19351930 -11197127 8826663 22887753 16575235 -1884408 -15331117 -18300387
37839 -18300387 -14317679 -5949771 1286135 -1862042 -13047604 -15086763 -879675 12576865
37831 12576865 10239451 3675469 9869031 19602533 11971286 -9238475 -20909904 -17100358
37823 -17100358 -12638130 -12589555 -6945733 2779862 1437538 -8757772 -3840092 23818880
37815 23818880 48541114 46981628 28900820 16503353 12171006 4319012 -9590427
37808 -9590427 -23035291 -32470804 -35914039 -30276425 -20723734 -19505019 -25235303 -19682098
37800 -19682098 2445002 19439085 15245402 6801689 15839180 30048968 21316053 -7146822
37792 -7146822 -23265472 -13972335 -995177 -3980333 -13813162 -13174613 -3979613 -709223
37784 -709223 -7402047 -12573273 -3248389 19571995 36243064 22992938 -19639178 -57041616
37776 -57041616 -53313460 -13259726 22990166 28565311 17157459 17008988 33483310 48295732
37768 48295732 46428260 32450656 23136398 30536193 50796169 66869037 64489768 46107397
37760 46107397 26223339 15101283 12767557 16217513 22970187 27296573 23039489 13339695
37752 13339695 9504244 16545724 26340715 28340753 21174647 10685508 2129640 -2229884
37744 -2229884 -2127817 981217 5747782 13103881 23179917 30315600 25988077 8007121
37736 8007121 -15951356 -33732347 -36044184 -22309045 -3486582 5161448 -141393 -7366442
37728 -7366442 -5940947 -1414377 -3523885 -7414773 -1854847 8012666 4752742 -12799230
37720 -12799230 -23465075 -13213541 4968624 11009930 5046824 1806481 5811181 6701583
37712 6701583 -2396493 -14021879 -17417655 -13758228 -15005857 -28094984 -44024139 -46859911
37704 -46859911 -33498535 -18135059 -13712442 -16659933 -17479548 -18331511 -27175380 -39274405
37696 -39274405 -40547975 -29146517 -17866787 -12684508 -4894170 10077522 21678954
37689 21678954 20844523 14619157 13926941 17058720 15744528 9318354 2969421 -947216
37681 -947216 -991688 6347683 18210704 21347423 7628597 -11481852 -16380933 -1616118
37673 -1616118 21950782 42299954 53256109 50115078 30474069 1031950 -23852386
37666 -23852386 -32476189 -22872141 -3252201 11455175 9850482 -3181341 -9848476 -2026644
37658 -2026644 6509006 -1145296 -21082402 -34570454 -32873244 -23513572 -14339308 -4541487
37650 -4541487 7240526 16690484 19201017 15592868 11406472 13866543 26031437 39268938
37642 39268938 38487726 22725370 11212903 15946122 18230317 -6493497 -45553620 -57960957
37634 -57960957 -31117713 -1079687 -1736802 -17633234 -10828468 20966626 42288224
37627 42288224 32161736 10238189 3751877 10799529 11037377 -835135 -10160104 -6969095
37619 -6969095 459375 666640 -3285329 -28110 10406679 13577210 523608 -17133389
37611 -17133389 -20017198 -5504991 10591018 16938593 19014301 22983879 20256792 1985741
37603 1985741 -18551241 -16949277 7807821 28030520 24177754 11013497 13320591 27660497
37595 27660497 28330436 8170841 -7736567 4125819 33617904 50254596 40451369
37588 40451369 19606021 9200768 11418485 9353951 -10863785 -41090847 -57441573
37581 -57441573 -48060322 -29360521 -25192513 -33178581 -27868258 -697456 22553506 16810058
37573 16810058 -6512329 -18249866 -14035543 -13345869 -21410130 -20471936 -3285282 11145637
37565 11145637 6975141 -4666371 -6213098 -670592 -671090 -4053010 -15356 8779573
37557 8779573 10059221 4384492 6104276 22210037 44394971 61771099 68690677 61094371
37549 61094371 39048845 13780993 -525675 -3075551 -2954714 -494292 11992599 29286030
37541 29286030 32193625 15835880 2036414 10084485 27956754 29014678 9338463
37534 9338463 -9263060 -10575576 -1298375 4065012 -222007 -14364775 -38095656 -63119285
37526 -63119285 -71788020 -56171340 -32276389 -21940566 -23659035 -16281348 7378476
37519 7378476 27391922 25235165 11056023 7992861 17959463 20814485 5779064 -13837725
37511 -13837725 -21126178 -16017416 -8276789 -1846381 5281668 14165172 25484212 39239059
37503 39239059 47532963 37509766 9920586 -15661386 -25045966 -28180335 -39381487
37496 -39381487 -49052294 -35415913 -34910 30464384 39582177 36974390 34490957 27451391
37488 27451391 10646037 -5258427 -9058269 -8073943 -14659944 -22109020 -13183594 9451951
37480 9451951 20080838 2645973 -26470807 -37256030 -21059171 1965690 8663094
37473 8663094 -1825448 -12069996 -10784177 -4884963 -5083856 -8191514 -3097660 9807802
37465 9807802 17696192 14632734 9011019 7052447 1843257 -11938402 -23462806 -19446972
37457 -19446972 -5815465 -721604 -8243342 -13791796 -7020473 4425250 8354134 3318643
37449 3318643 -5918469 -17952002 -31049126 -37355314 -30912621 -17808599 -9551014 -8720585
37441 -8720585 -9276931 -8599412 -9454156 -10750459 -7689236 -3570635 -9600916 -26429789
37433 -26429789 -36635828 -26164414 -5433870 3924642 -1787496 -7947901 -8268358 -12769306
37425 -12769306 -24547890 -28098335 -13279744 4253881 3589981 -10289403 -14513348 -1953399
37417 -1953399 12593527 18098813 19126000 19515204 13812563 1557828 -7526096 -11721897
37409 -11721897 -24105926 -48691838 -64447393 -49945338 -15036179 8985291 6388798
37402 6388798 -10488518 -22586406 -23464835 -17655603 -12297345 -12306506 -15627825 -13738325
37394 -13738325 -3713296 4388375 1631230 -3721378 2570266 17370216 24006540 18103315
37386 18103315 11668868 9496631 1037089 -17163102 -29540947 -24114036 -12332847 -12262566
37378 -12262566 -23148088 -31572677 -34195811 -38332100 -45160976 -48088936 -45933772 -44338917
37370 -44338917 -44932261 -44339835 -41934371 -37265603 -23583949 1338765 20251449 10727935
37362 10727935 -22315595 -45966442 -38317643 -12847377 4676967 7950199 5855839
37355 5855839 412774 -11977395 -23662142 -19917107 -1309933 13464913 11354761 -65783
37347 -65783 -6532274 -6243938 -7480176 -12908957 -15105335 -7866104 3740372 8293966
37339 8293966 1887398 -7380200 -11633822 -15093374 -25347776 -35331934 -28472773 -6649835
37331 -6649835 2880659 -18276229 -50560267 -59673387 -41315981 -21481321 -15174236 -9685207
37323 -9685207 6157320 20497156 19167563 8827934 2649045 -3314235 -20735458 -44334615
37315 -44334615 -55418553 -47693260 -34219487 -28340706 -29488954 -29359347 -23860175 -17247372
37307 -17247372 -17572252 -25737701 -28909252 -14319865 7948368 11624208 -7814508 -20691011
37299 -20691011 -5249816 16186640 8492871 -22695572 -40771239 -34469249 -27267339
37292 -27267339 -28388510 -14454265 24810485 57961188 54229019 29106742 19204261
37285 19204261 29047606 32533633 17622722 637832 -2608683 3310428 5251221 -2639004
37277 -2639004 -16587623 -25976082 -20738539 -5286681 1710190 -7195527 -12642925 5793792
37269 5793792 37437877 53745271 46702825 31600126 16189959 -6299188 -31506985
37262 -31506985 -38303981 -18624843 7653866 18479112 13761180 4478323 -5665321
37255 -5665321 -16248388 -21900279 -20082133 -16289671 -12269674 -1064792 16790304 25481854
37247 25481854 14461005 -4751903 -15007960 -16034056 -16868847 -16355896 -8209747 978793
37239 978793 -3183913 -20656887 -33918362 -28314868 -5973638 19743784 35339764 34828549
37231 34828549 24421627 17502094 18800020 18441246 8351605 -3260659 -3905950 4143977
37223 4143977 9247037 8929769 9806678 13841489 18095809 23260915 28395166 23475675
37215 23475675 4796644 -7851472 8207866 41918592 57028555 41157815 21392034
37208 21392034 22060791 31987163 29547843 18763028 18349427 28701114 33302463 26640468
37200 26640468 19615331 19037516 19850407 18547693 18681132 19724378 12993854 -5918011
37192 -5918011 -28167124 -39481867 -33455109 -16019024 622159 9118193 13199723 19697138
37184 19697138 25078185 18951077 3115237 -5968854 -1049207 3837171 -2469110 -6439025
37176 -6439025 8781826 31315811 34519893 18384805 9964051 20079801 26596714 10660593
37168 10660593 -13895801 -22454317 -12986800 -581906 8034780 16525606 23850953 24117635
37160 24117635 17799053 10551622 4490344 332674 2026080 8759083 9899070 541569
37152 541569 -5406984 6928657 28414117 36518219 27472051 18174201 16485599 12003213
37144 12003213 1938800 3328829 25599153 48488232 46115093 23182948 8235437
37137 8235437 15202135 29871534 35021852 31916784 30887510 33773673 35557614 36043183
37129 36043183 39395736 43954623 40924557 25211144 3633124 -9339320 -3188557 19414601
37121 19414601 41842009 44034747 19897109 -14309618 -33774401 -29540509 -14480436
37114 -14480436 -2943064 7415429 25825703 47233041 54523956 42223327 25107941
37107 25107941 18658083 21878978 26067674 29912067 35255933 35532736 22077813 257598
37099 257598 -12398780 -5958895 11587643 24738209 25204794 16218556 7628512 6406782
37091 6406782 8132194 1125266 -15908207 -26316385 -14802796 10611595 27667610
37084 27667610 27443672 19170489 10012318 -2013280 -11994303 -3976121 26768132 60619131
37076 60619131 74525951 67330406 54417548 45517258 38874815 31736658 25656079 23229684
37068 23229684 26063560 33113841 37139086 28637676 7969494 -12881777 -24583300 -28026133
37060 -28026133 -23822210 -6851686 20360844 41445842 45234857 40317919 38160866 33706894
37052 33706894 19164822 5558959 8124920 16421210 4624373 -26748850 -43835843
37045 -43835843 -23422786 14104008 28318109 5102864 -30957091 -45325418 -27574195
37038 -27574195 2046228 18280667 21395760 33725512 62535879 82644456 71110381
37031 71110381 43788216 32351293 35132159 23054100 -7938440 -27251732 -20110052
37024 -20110052 -10778187 -18091219 -21774467 419710 29099420 29460840 4109832 -12862049
37016 -12862049 -4914484 13553255 26662675 31782613 28072817 16793023 11898371 25524867
37008 25524867 43433638 39692029 16151859 1291616 7421987 17069769 18432583 24845738
37000 24845738 45212336 61812216 57710306 45748465 47334601 57012822 52475377 31364154
36992 31364154 14051080 12099786 15447041 13070754 8018134 6445549 6744414 7470283
36984 7470283 14435830 29895671 42527191 39898920 27699539 24317434 34709493 41723176
36976 41723176 30655236 12398344 8984802 21364439 29088647 23373297 20491659 32335829
36968 32335829 42079650 27498476 -3380932 -21847386 -18423423 -11057686 -13849230 -19486558
36960 -19486558 -17537363 -10641329 -3845293 6847664 25394030 45956719 60097482
36953 60097482 65312957 62076220 52041428 42212056 39780193 40376024 33990498 24044409
36945 24044409 24643697 36147585 42483474 38176083 36425911 40743893 32135634 1234853
36937 1234853 -27317058 -24254790 4851515 30469365 37540915 32212313 20976923 6146928
36929 6146928 -4029002 -1837103 6860689 12615139 18375915 28182109 29960517 12121947
36921 12121947 -10376286 -11848646 6401781 19809614 19536574 20174518 27462679 27417216
36913 27417216 14766589 5662054 10783466 17973677 14063140 5146520 2524575 4496284
36905 4496284 4269768 2399848 773659 -3259706 -7714312 -3539165 10285917 21930333
36897 21930333 24802012 27212359 35951147 43704136 41566050 31598940 19334058 6862656
36889 6862656 -69991 6303238 19076003 18659369 1773843 -8794199 3792630 24698968
36881 24698968 27898027 7999715 -22034720 -49571927 -63059072 -49483401 -10627221
36874 -10627221 28082229 41515374 28829652 2066825 -32999541 -67727742 -79964099
36867 -79964099 -56881005 -17743592 8342189 17262935 21473536 20839388 9395634 -224525
36859 -224525 8426082 22085706 12669149 -15529252 -28180845 -14361405 -2658545 -13656953
36851 -13656953 -29423133 -27027248 -14083758 -9650483 -11786874 -7428717 810558 614583
36843 614583 -6569144 -8270853 -2172955 2318653 1252288 759009 3858438 2709926
36835 2709926 -12214344 -37553001 -53737258 -41573086 -7408617 15546826 3320160
36828 3320160 -27151100 -39397733 -26137518 -13783654 -18305590 -24847666 -20113110 -16626456
36820 -16626456 -27298406 -39355700 -35271420 -21275289 -12437079 -5550198 7931807
36813 7931807 15052023 -3924028 -40148912 -62262505 -55497014 -31685810 -4382625
36806 -4382625 20115512 29359721 12721524 -12558547 -13173218 11703058 21817858 -7612912
36798 -7612912 -46153452 -48547942 -16180124 9863454 6975366 -6951381 -8282915 2780943
36790 2780943 13829210 19544339 18686967 8131135 -8019807 -15810713 -10336151 -6773446
36782 -6773446 -18845784 -35370431 -34910399 -17595858 -2763780 2894056 11932166 26371116
36774 26371116 25481796 -2472846 -35261246 -42976905 -26841745 -11364530 -7430820 -6710031
36766 -6710031 -7583936 -19719950 -39737304 -47075186 -33094128 -14452983 -7509079 -7426193
36758 -7426193 -4010354 -643667 -2756613 -2681883 6725581 15240101 10349796 -169518
36750 -169518 -443868 5363539 -1051343 -19702691 -28037847 -13978543 5691536 9388630
36742 9388630 -906608 -7289207 -3253021 -215824 -8297300 -20817476 -22072820 -7178555
36734 -7178555 10020529 10799235 -7517997 -27831355 -32257613 -21541153 -11432832 -11450503
36726 -11450503 -13128042 -2298870 19800840 33366953 21513918 -7894582 -28951437
36719 -28951437 -26950267 -11698067 2390317 16627587 36577097 51813051 46708453
36712 46708453 26221246 9636073 555288 -13368145 -30333815 -32180073 -18714585
36705 -18714585 -13697786 -23258330 -20420726 6853219 23629250 -2707969 -45312919
36698 -45312919 -51061958 -17223416 8613048 1046350 -15077415 -15018259 -10099907 -16415316
36690 -16415316 -22497103 -12407781 3116858 3957141 -6286511 -8009547 2199705 7971297
36682 7971297 -549919 -12896112 -13354779 -962205 9937004 8115006 1400873 7140525
36674 7140525 24290885 28126202 4795301 -22264028 -21579663 -166727 6373812 -12874297
36666 -12874297 -31322503 -28888190 -17652550 -13891493 -14205265 -13529447 -18822326 -27299107
36658 -27299107 -17957158 13425199 35109657 20513655 -11827671 -26154270 -19623578
36651 -19623578 -15928379 -23673796 -32157691 -38511783 -47764337 -51794634 -38202463 -16696878
36643 -16696878 -7960452 -8982289 719998 19055495 19499212 -5991013 -32469606 -39207713
36635 -39207713 -34273606 -31617479 -29483602 -24868014 -26101962 -35355531 -38096223 -25640334
36627 -25640334 -11123803 -7903674 -8468956 -883628 9159158 10324993 6420523 6731850
36619 6731850 6648268 -2967969 -15667390 -17743613 -10249081 -4437558 -1318885 4569186
36611 4569186 5820221 -10328613 -34400274 -37881444 -11392687 19848861 29834930 24960382
36603 24960382 28263492 41496447 42490721 19754973 -7569695 -13112348 2355799 12423888
36595 12423888 953266 -15464594 -9716512 17861517 37924846 29828030 6323181
36588 6323181 -7347472 -6221520 -3402329 -3385247 3434898 19375729 30480435 26034890
36580 26034890 14060604 7582768 4720505 -5319404 -20646785 -24729694 -9757488
36573 -9757488 7337000 1654484 -27372289 -49172475 -34617677 8036569 40286230
36566 40286230 38590868 20676667 18807261 38655465 60175490 71516756 79878928
36559 79878928 87672840 81878846 58301847 36986613 36059895 42999020 31566073 488047
36551 488047 -24369264 -24448766 -7230893 10255453 19770368 19863955 10514175 -3448722
36543 -3448722 -13990524 -19943488 -26031588 -29168095 -18521161 4966362 22255624 19008468
36535 19008468 4323608 -4054713 -4349647 -7608562 -15690184 -17200521 -6130536 6651386
36527 6651386 5077958 -13409495 -33497914 -36044387 -17727072 4238344 11546386 7242089
36519 7242089 9536995 23511165 33441316 28468171 19224328 16866710 10927611 -13103811
36511 -13103811 -43817846 -53347782 -34326422 -7930746 5817840 8581657 11818512
36504 11818512 19493712 27261526 28296109 18052609 2140224 -3276462 9110818 22475671
36496 22475671 15992771 -3976797 -12966367 -6260684 -3152486 -11416549 -14985094 -5285700
36488 -5285700 2561455 -1191563 -1287439 14196007 28262513 20613935 1169256 -6449832
36480 -6449832 -1526094 -1927229 -13467752 -27238829 -38985472 -48049205 -45174975 -25591517
36472 -25591517 -7035695 -9016200 -20212655 -14573180 4789000 10304519 -1190488
36465 -1190488 -475378 23842297 42121297 29350781 5481743 5815629 30775476 50154775
36457 50154775 45454307 25801259 8609862 2071495 2219368 -4430693 -27649722 -53822878
36449 -53822878 -53727069 -23534571 -872525 -18484750 -56036091 -65514647 -36158834 -2957267
36441 -2957267 7794622 7638797 12996059 15447110 3024320 -13398202 -17872092 -16900399
36433 -16900399 -25323156 -35801702 -27934716 -3859321 9894556 -878504 -19678938
36426 -19678938 -23738935 -10321475 8796808 24246983 30286354 20990930 -1874070
36419 -1874070 -23135853 -27043792 -12930289 8185188 26757752 37025533 33363922
36412 33363922 16028670 -2282967 -6670880 2649505 10518837 3853308 -16532905 -37581827
36404 -37581827 -42047127 -21858557 7819827 16460010 -6482508 -32031632 -25543553
36397 -25543553 5939599 23581102 12552990 -589927 5928090 14650040 -438992
36390 -438992 -30328507 -42519915 -24864647 4188160 23245644 27233192 22371088 17479195
36382 17479195 18837954 23179322 19544360 5457136 -7690555 -13487695 -20558950 -31138806
36374 -31138806 -27002902 2542309 33618862 35619333 16960971 14017804 38203858
36367 38203858 63341311 66481880 53118833 37668010 25643571 22173473 33506552
36360 33506552 51076159 55595069 44898955 36737425 37262466 30341570 7509844 -15399635
36352 -15399635 -23827905 -24426476 -26048561 -22312273 -8237864 5312767 9101901 9261872
36344 9261872 10029967 2984575 -11887460 -16698693 -4929919 2419662 -9521509 -22399575
36336 -22399575 -15123497 566311 2614242 -3710723 -1695805 1898571 -7288889 -16063712
36328 -16063712 -3174793 17236412 13366512 -9102645 -13194843 8448114 23577160
36321 23577160 16905508 11475371 20514052 21556615 -419610 -22317532 -21196065 -11010210
36313 -11010210 -13287648 -18997798 -9780722 5847100 8721827 2875125 2153784 -724936
36305 -724936 -18673535 -36145840 -26034183 4730680 20335838 6355012 -16431290
36298 -16431290 -30305384 -40889212 -51641029 -48228976 -23533556 3871463 12684179
36291 12684179 5018447 -4060090 -9561655 -15476445 -21696202 -25520091 -28379430 -30047304
36283 -30047304 -24024126 -9377226 878155 -4719937 -18638905 -24778675 -20912442 -17348833
36275 -17348833 -17470190 -15640210 -14447405 -26790562 -53822776 -73783660 -63946575 -28153100
36267 -28153100 6241357 16334354 2873843 -15283794 -19750647 -7500607 7308561
36260 7308561 7263463 -8854154 -23282533 -20893386 -9643517 -10422210 -27528040 -41040988
36252 -41040988 -33684999 -15261929 -9933926 -23716158 -36763889 -29784272 -7905588
36245 -7905588 8290673 9174696 4019521 3892265 7319745 8195078 9642988 19426207
36237 19426207 34286382 40996161 35304673 28326971 28492565 28383737 18772101 5584300
36229 5584300 28316 -262648 -4732172 -10151151 -5337856 6681598 10224472 1022169
36221 1022169 -10370979 -19952920 -32898021 -42132521 -31151472 -6930870 -1165987 -23227144
36213 -23227144 -40833753 -29518094 -12313784 -19382061 -34075136 -19990725 15524427
36206 15524427 31599357 20573527 15571768 27981119 26495774 -6080793 -39185625
36199 -39185625 -42110133 -29309509 -28629081 -32704201 -16487436 13813127 23574309 -2575481
36191 -2575481 -40453408 -54526054 -33390341 432931 10053780 -17838013 -51707743
36184 -51707743 -48082253 -9080564 17634668 5515322 -15204189 -8124902 14231686
36177 14231686 17048748 658376 -6432756 2232338 5641667 -6148868 -21664504 -32551331
36169 -32551331 -38124523 -29711198 -1338983 27247727 29719911 13184781 7262458 15560270
36161 15560270 13434977 -5539671 -19895554 -22763720 -33694452 -56055060 -62254240
36154 -62254240 -39807552 -15916310 -14035759 -19375458 -12724524 -6605043 -17287774 -28473619
36146 -28473619 -17581144 2867736 5433421 -7221031 -12882500 -11712027 -20072467 -31411900
36138 -31411900 -22998255 -2078 6056272 -11677385 -21644460 -2645676 24093945
36131 24093945 27183543 5592537 -18915945 -30455879 -24730271 -3201782 21561366
36124 21561366 27679655 7871892 -17265754 -24248441 -16761736 -15994822 -27852551 -36999090
36116 -36999090 -31867062 -19066762 -9413546 -3134605 3794320 8258777 5031945 -1231399
36108 -1231399 462772 11546119 20676981 19798684 15171193 15926112 18620849 13166601
36100 13166601 148538 -9555799 -11302435 -10145300 -6859577 4962057 22858823 30984605
36092 30984605 21008808 6038269 2617662 7763549 5602493 -9597959 -28001245 -36940727
36084 -36940727 -30192105 -10280947 10069093 15829913 8049747 6359418 22913608 42669398
36076 42669398 42180087 20050400 -5115173 -19719480 -23062077 -17083700 -5487323 701734
36068 701734 -6823683 -20185353 -25810129 -23796272 -21795575 -16317994 278477 18611562
36060 18611562 20424249 7734092 2369558 14200112 29799682 35869364 35113448 35408573
36052 35408573 40574721 53577845 70983292 74910464 52064854 20269833 10469931
36045 10469931 20827431 18380546 -7993352 -29165739 -22295407 -2822695 8189323
36038 8189323 17482632 36714883 53982916 56227567 56969278 71798537 86027138 78876582
36030 78876582 63511689 68256595 89308570 97863495 87895148 81022715 85326505 84653734
36022 84653734 73030369 66876550 74001193 79018957 71200459 62085569 62116875 61336854
36014 61336854 48814951 33943849 31338591 36468835 33406364 20828683 14963308 26170966
36006 26170966 42939188 44492203 26805204 9748172 13039152 29667224 35919594
35999 35919594 27365656 24756582 35856055 35381208 3508175 -35746144 -43976513 -23683315
35991 -23683315 -11001048 -19110053 -24773841 -13255920 -573842 -450849 -1062040 8881989
35983 8881989 16767320 7864177 -8802688 -14684274 -7581160 2131287 9234141 14717049
35975 14717049 19545653 27276927 42523504 60046441 67586321 64151364 60078973 55183820
35967 55183820 37120536 8066439 -9862160 -6150464 4020977 8534752 15410818
35960 15410818 26117628 20611643 -8136640 -31390661 -25059286 -9344998 -14447194
35953 -14447194 -27016112 -11699425 25833368 42589294 25021679 9213800 23830346
35946 23830346 49002406 49658708 23535066 -3069615 -10203203 788049 15312185
35939 15312185 17447129 3422736 -10578106 -4747059 17164078 31029421 26088150
35932 26088150 18437858 24141767 36358458 40148260 35150975 29870792 24130399 11812769
35924 11812769 -4451900 -13884000 -11516822 -3740319 -262729 -3995956 -7486184 547555
35916 547555 20778753 37043714 32599711 12039684 -3099675 -1361548 7736698 12515303
35908 12515303 15285730 22155086 28099796 23993494 13457541 11570275 25763395 44355388
35900 44355388 48285821 34477836 23402575 36127548 64356559 76493364 59699499
35893 59699499 39300105 41286798 52211943 41804812 14038159 1941458 13764288
35886 13764288 22001935 13774320 13210616 34829142 50688300 33317277 2704841 -5400088
35878 -5400088 2623892 -7183941 -35046246 -44030502 -18992648 10718984 17136268 8285176
35870 8285176 2047351 -5366157 -23954669 -43863965 -47596704 -36255553 -24141991 -15356021
35862 -15356021 -3338192 11244521 18181470 12317998 -1078648 -14949657 -25740060
35855 -25740060 -31253563 -30466484 -24396039 -12677132 6566875 28314852 38540905 28719449
35847 28719449 7343289 -11516136 -25192393 -37163779 -41107383 -26425769 992996
35840 992996 20297248 22027655 18101781 19671723 20760710 14359388 9829681 17719043
35832 17719043 27669272 22142526 7741138 9602898 31344004 43739392 25256638
35825 25256638 -4763145 -11595488 8011080 25799446 24264846 16389031 19234126 27895675
35817 27895675 27605356 18877390 15582516 23027753 31654883 32918836 30424846 31008739
35809 31008739 32016234 24238937 5427156 -15026857 -26137277 -25886406 -18868464 -7145393
35801 -7145393 10116449 28356586 37085563 31631272 19154446 7982113 -2313036
35794 -2313036 -13133718 -17071533 -8105180 3659824 3298178 -4311152 227143 17503101
35786 17503101 22346310 1525679 -21207413 -17103219 4890128 12755604 1961358
35779 1961358 1671491 25943377 47584045 37408820 8751583 -1201721 15425144 28491514
35771 28491514 15055005 -9877147 -17903554 -6422978 1807168 -9023426 -30407375
35764 -30407375 -43175282 -36995626 -15247940 9422477 21400101 12977987 -5790754
35757 -5790754 -14609668 -5233522 9971063 16614555 17064050 21684381 28656004 26248577
35749 26248577 13303081 3396418 5815349 13920768 17044347 14583829 13146018 17301717
35741 17301717 27546696 40226622 46289642 38909639 25907181 23912149 35096263
35734 35096263 42298995 35158876 26726841 31130372 38450095 30567470 12093058 2822956
35726 2822956 4410478 -48222 -12315398 -11897751 8473218 24651891 13966418 -12325477
35718 -12325477 -27482221 -25587448 -19324288 -12543381 1568351 19386072 27222938 24540912
35710 24540912 26315853 36967454 40345486 24785423 3063024 -4534044 3550061 13009020
35702 13009020 15067626 12253059 7560899 1269452 -2015870 4781410 19358996 29241645
35694 29241645 27473203 22449309 26271137 37333722 41362883 29600158 10146082 -1817198
35686 -1817198 -1548667 2812744 4709323 8674967 20524157 33714324 34828882 21869279
35678 21869279 7762740 3899328 9193721 18225431 29222161 37491524 32308718 11979399
35670 11979399 -5925634 -3175314 14681274 26249111 23686651 19158574 22714835 29910225
35662 29910225 34010290 35181336 33240574 25947510 19381687 24337303 36032379 34854770
35654 34854770 16945333 5533307 17457234 36118006 36889052 23782023 16955290
35647 16955290 16274502 6787000 -5406004 4182739 35865145 56435862 44040077 17791510
35639 17791510 8192035 18381644 31045789 36995964 38964943 39492517 42314547 55677721
35631 55677721 77560323 86905332 67786559 35328531 18160420 19299333 15574827
35624 15574827 -3657006 -19259562 -11770521 9385642 19476719 11335212 503439
35617 503439 783778 7619273 9064524 4238582 2619186 7402312 9047648 -324576
35609 -324576 -13103389 -14878611 -3183434 11789280 22493537 28317039 26160326 13040959
35601 13040959 1684682 15037156 54154013 86990299 84637350 57565709 38940624
35594 38940624 40595574 44998158 36777378 22193814 15792585 23711073 42567065 61364116
35586 61364116 63195384 39287329 4338193 -14799459 -8508591 9259684 24667115
35579 24667115 38448996 52614932 58974123 50279485 31752159 13367276 -256446
35572 -256446 -6650594 -3370197 3956206 2919762 -7735116 -12221898 760431 21042177
35564 21042177 32153664 33116737 32329723 29414465 19516581 9780699 13583164 29073305
35556 29073305 39366691 35936091 27884758 24960227 24741087 22211335 20345054 23008204
35548 23008204 25467523 20700131 10434385 2213661 -1722944 -5506684 -10343040 -10448467
35540 -10448467 -436373 16147280 28062471 26325534 12760008 -1493326 -6165584
35533 -6165584 -117936 10539731 20177019 26645600 27471680 17588608 -5552638 -34817606
35525 -34817606 -54299062 -51027664 -27764257 -2563568 7420342 1440435 -8084105 -12474406
35517 -12474406 -14180405 -16571895 -15078187 -4980201 7653554 11751665 6373725 2043259
35509 2043259 6668904 17303785 27214758 33819753 35855114 28593063 8460267 -18433071
35501 -18433071 -36805632 -33533297 -9623182 18023099 28631082 15474907 -7414251
35494 -7414251 -19497251 -15078058 -6922277 -8564929 -18828730 -26857252 -27176523 -24089075
35486 -24089075 -23478894 -25784332 -26947323 -22537769 -11106661 3301818 12168831 9218587
35478 9218587 -3344640 -16901644 -23643227 -19988607 -6147432 12457327 24967692
35471 24967692 23137620 10797106 62050 -2285366 1513346 9477378 22045566 31400542
35463 31400542 22012784 -6926976 -29669095 -20862364 9689806 26704707 14424431
35456 14424431 -5894881 -8428462 5271582 17465630 21889762 24439871 26382437 24547670
35448 24547670 23211751 28657061 33813750 25043075 4949797 -7799009 -4429407 3860555
35440 3860555 6360359 6625201 7590902 487073 -16391780 -22155422 1592716 36036834
35432 36036834 39918544 3681333 -32102119 -25379725 14265167 38976933 23610346
35425 23610346 -6695709 -14980500 -1260279 2590595 -20707888 -51854028 -63171603
35418 -63171603 -52485937 -37767311 -29136633 -21777858 -12154422 -4817627 -1594124 2144152
35410 2144152 6513034 4344476 -5565260 -13173521 -11101698 -4281336 -88875 953384
35402 953384 -1573719 -12076853 -27036322 -30931597 -16943656 -1952105 -5904729 -23910570
35394 -23910570 -35562283 -36183327 -39136298 -48262835 -48516349 -28972081 1099751 25396733
35386 25396733 36585324 33954257 18970165 677669 -6534160 754672 10168728 11852949
35378 11852949 11556527 17957167 27335950 30391785 26005936 19140801 12663009 9576115
35370 9576115 14740102 25086580 27334177 16340343 6318894 10608486 19353006 13948521
35362 13948521 -2819508 -10300913 -1293345 9601924 10081205 3873119 -3118263 -11496821
35354 -11496821 -16249862 -4392752 23407769 43622131 36825421 13686017 -383120
35347 -383120 1592729 5927363 3653557 274988 189242 -1414620 -5476238 -1783089 15505890
35338 15505890 34020842 36456902 23913100 14578071 18772570 26247137 23231442 12839622
35330 12839622 8666475 13004299 14299570 7230503 2443673 10008509 23324126 28293572
35322 28293572 20800558 5658565 -14087024 -34710935 -45309671 -39001522 -27024331
35315 -27024331 -25134988 -27695827 -14580997 13903565 30300278 16943077 -9157064
35308 -9157064 -21233303 -17127070 -13135992 -15283217 -15018525 -8917460 -6994888 -20145541
35300 -20145541 -46317872 -68132726 -63899531 -30519914 3404666 3768045 -24129474
35293 -24129474 -37799233 -15899503 10688786 6420860 -16071846 -22301050 -14009085
35286 -14009085 -19166679 -35297620 -30813349 -3867652 9088723 -4534036 -10386810
35279 -10386810 11344208 26137851 1426616 -33525394 -28096071 12446349 37078401
35272 37078401 25302068 7045578 6986625 12894433 9433454 5745259 11285494 13083529
35264 13083529 -968088 -16246543 -11304439 9058784 21586992 17932115 10907992
35257 10907992 10883430 14375010 17484454 23933693 32988923 32294634 13925595 -9410370
35249 -9410370 -17012525 -7527738 -759631 -9070071 -20131083 -17212033 -5283411 -1608477
35241 -1608477 -6399193 -1634151 20151533 44160544 55972514 59706753 65152935 70901077
35233 70901077 70672721 64898720 55838219 41973388 26972168 22316815 30022766 35535885
35225 35535885 30841283 30699938 48547465 68763541 64784153 37163943 11091216 99878
35217 99878 -5420639 -14672695 -23062276 -24456547 -18609682 -4754162 15707034 30890137
35209 30890137 31066276 27971798 40080453 59357090 58444203 34419677 16788786 22094026
35201 22094026 29504831 18787615 6275235 17921875 44837583 54054893 34856008
35194 34856008 8628834 -4198532 -4178868 887446 9428226 20220792 27206141 27008391
35186 27008391 23747353 22432385 23149939 23723184 23684957 24633090 29046879 37274207 44104620
35177 44104620 42901676 35983969 34423045 42637056 50369192 46990737 36581070 29262358
35169 29262358 23625360 10252035 -9502752 -21176302 -15926710 -1637724 8754004
35162 8754004 12775673 17304926 26429021 35730212 37927193 31128336 20491376 12284582
35154 12284582 7658697 3861540 705252 2054948 9246153 16431540 16454279 10905978
35146 10905978 10732073 24219909 45188337 57187337 52328255 41804174 40598043 44776383
35138 44776383 36786427 15423572 4024733 18417319 41492272 46278728 33325991
35131 33325991 24569145 26973215 26226873 15509029 6009033 4243341 1213072 -8048626
35123 -8048626 -14003545 -10991922 -7814206 -9371400 -4995556 12095764 28344757 26830800
35115 26830800 10213908 -4715227 -6432636 5176981 21083377 25170681 7883740
35108 7883740 -15671839 -18399610 -484356 4484089 -23595154 -58702070 -62093814 -31732321
35100 -31732321 2563000 19521028 19924312 10999063 533226 -391972 10367298 16674964
35092 16674964 5280185 -10949612 -10184854 5010862 11896334 48046 -19842652
35085 -19842652 -35000176 -39335589 -27861215 -2196432 20680786 22710358 5946011
35078 5946011 -13558283 -25882254 -27533272 -14087982 8359708 17553482 4165676
35071 4165676 -6321779 12164225 42787125 48498164 27591524 9379197 1422899
35064 1422899 -15703375 -40273748 -42460125 -17082874 -540847 -16042686 -38523311
35057 -38523311 -36294350 -15762407 -337984 7610015 17490563 25169007 22427599 15009611
35049 15009611 9840481 403798 -15960257 -23571135 -11450727 5197604 6448308 -4437065
35041 -4437065 -13314195 -19326936 -26657607 -27561770 -15583190 -3361225 -6328127 -18561209
35033 -18561209 -22379851 -11504351 9162441 31702209 39592889 15504572 -26349193
35026 -26349193 -39853192 -5044317 36396658 35298774 3428741 -10553872 3449829
35019 3449829 11808853 1096366 -1735136 19338045 40239065 35287126 13954880 2734548
35011 2734548 12726134 36881612 59525917 61016089 34051527 1890907 -1885968 21948753
35003 21948753 37719459 26085558 9240844 13337708 32060158 44381957 45999269
34996 45999269 43539841 35647401 20554403 9380531 12332372 20461516 17440091 2518143
34988 2518143 -11428652 -16078583 -13076903 -8089841 -7984149 -16207740 -24561399 -19661144
34980 -19661144 -3346031 6275148 967224 -5337914 993422 14531837 24854092 32143159
34972 32143159 35697169 24919806 -918001 -20096571 -15679074 -1617635 -218902
34965 -218902 -6205411 1629944 21653705 30247775 19902432 10585291 18756598 35384978
34957 35384978 41277358 30330645 13268981 7932711 25111832 54501346 69645999
34950 69645999 58177856 38603706 32088784 29815785 12013742 -10560883 -6612678
34943 -6612678 24647272 46187569 35312234 12751004 6293131 12847389 14968303 12492023
34935 12492023 16138421 25104125 30707870 31095922 26738306 13073979 -8015895 -22031550
34927 -22031550 -21217361 -16325998 -14918103 -5184170 19599778 37962969 26945390 -659270
34919 -659270 -13130337 -5023896 3191078 4634659 13081213 29986212 36492608 26011881
34911 26011881 16838735 21187475 25976586 17532534 3860094 -2784313 -6982082 -17099521
34903 -17099521 -25998827 -22147209 -9383254 21097 3400483 4792078 2534685 -5354908
34895 -5354908 -10015427 -1336100 14667607 22045460 17346742 13498234 20095611 29784951
34887 29784951 27878219 10191417 -12188944 -25087420 -26420799 -25716727 -26830791 -19259743
34879 -19259743 3816801 26697939 27752262 12020338 6062109 18365865 28850191
34872 28850191 24673144 19724098 24133551 21189081 -2510429 -26350602 -23877233 -5433411
34864 -5433411 -1298594 -13324761 -17033507 -6538011 -1894824 -9414438 -8765119 10463213
34856 10463213 28045736 22966394 2118743 -14404722 -19050382 -15741274 -8773465 -4368221
34848 -4368221 -10037856 -22386133 -27139988 -18507797 -6206298 1664916 7469031 10708350
34840 10708350 4381182 -7267930 -6782717 9535985 21543378 15328195 4451128 4983784
34832 4983784 7922490 -2732005 -19556503 -23160368 -13859882 -7950236 -8796788 -5313269
34824 -5313269 3879042 8028156 6455477 11443019 25063836 32310254 23931626 10534067
34816 10534067 6114770 9522887 10156862 3498000 -5929274 -11505912 -9790924 -2553312
34808 -2553312 4850286 10392806 18647973 31322077 37991075 26381057 1792547 -14170500
34800 -14170500 -7746634 11099054 20098584 7290864 -19212682 -39722343 -40461162 -26009092
34792 -26009092 -13988548 -15414350 -24066488 -28525070 -27886458 -28360002 -30801515 -31632311
34784 -31632311 -31196000 -30224208 -22757330 -5831309 7426566 630767 -19834839 -28515882
34776 -28515882 -14465182 4779242 9302776 1903858 -2657100 -791528 258170 -2230897
34768 -2230897 -4193106 -3789016 -2345511 994258 6992850 11183832 8768711 2419475
34760 2419475 -1787766 -3548209 -6288364 -9165062 -9732869 -11994814 -21047992 -29793834
34752 -29793834 -23107257 328922 20644705 18771811 -1180509 -19866924 -27858341
34745 -27858341 -32594383 -41661256 -50016497 -47993445 -35372954 -21781566 -15085921 -13092534
34737 -13092534 -7291938 5247923 14207558 4555203 -23307953 -47046980 -44775318 -21094491
34729 -21094491 482090 9318119 15743336 25073407 24950000 10731613 2879161 17127313
34721 17127313 32104525 15356278 -24519126 -43333701 -22275862 6778209 8232190
34714 8232190 -11483985 -23038031 -18576957 -14577143 -21755211 -33186655 -38356638 -34089862
34706 -34089862 -23972241 -16077021 -15882983 -15157847 1179825 28789668 39892653 20038757
34698 20038757 -6385949 -7827819 9900070 16526745 6940049 6857286 27026763 42672402
34690 42672402 30913990 4308921 -10306747 -8692258 -5173618 -4236739 787291 5143836
34682 5143836 -6890690 -32817048 -43189105 -17197447 24068292 38652217 15601743
34675 15601743 -13342884 -18245091 -7256180 -5432099 -14925656 -18422335 -12020950 -8240400
34667 -8240400 -9012192 -2944513 8165312 8093610 -2097536 -657331 15083378 16762610
34659 16762610 -8631686 -31227897 -23561039 -5858750 -12570091 -35665019 -40374269
34652 -40374269 -23127482 -12388572 -18478838 -23439411 -19764001 -19602398 -22614023 -14004743
34644 -14004743 -1274585 -12792697 -46788058 -60723209 -31932820 5118471 7426742
34637 7426742 -18766158 -37049531 -35550174 -31321602 -33552510 -33093952 -24954121 -17311045
34629 -17311045 -17174707 -22639702 -29157252 -32756027 -29732857 -21994425 -18724783 -25371682
34621 -25371682 -35678112 -40092883 -36104552 -26706782 -16805398 -13492105 -19055693 -21942586
34613 -21942586 -8761720 12295680 17522300 1756647 -13635383 -14160918 -11012821 -14526080
34605 -14526080 -12497227 6227506 26470323 27608180 15003633 7881744 7663602 1800332
34597 1800332 -9036964 -10735064 951528 15766121 24499921 23946595 12192339 -5548397
34589 -5548397 -13330124 -2824296 12037011 14631126 9906001 10212910 8560503 -8251501
34581 -8251501 -27063179 -18958486 16849380 47946354 52944588 44928400 42197800 40531411
34573 40531411 29031914 13823995 7934364 9819066 8717291 3854871 3493595 9407682
34565 9407682 16037503 23634588 39162409 60951886 73244275 64566742 46565218 43388174
34557 43388174 60870331 77791832 74796444 59814771 50033762 39429232 9584927
34550 9584927 -29274419 -39912514 -11768490 17016536 11998689 -9019323 -8458826 10018706
34542 10018706 9096925 -22361417 -53636833 -57535144 -39854463 -17997111 1676301
34535 1676301 15749714 16651899 5515143 -4522476 -6019502 -3663744 571218 10793255
34527 10793255 21867287 21160806 11864043 13410979 30111447 41163547 33490769 22489064
34519 22489064 24036009 26298420 10798511 -13600176 -21780665 -9017675 6259764
34512 6259764 12412385 15743100 21183570 21426481 11209527 -1620163 -7079571 -6552631
34504 -6552631 -8374241 -14917044 -20289983 -19172059 -12823860 -4788069 6060052 23168112
34496 23168112 42638274 52851240 49004104 41974903 44204859 51579686 50549087 39769239
34488 39769239 30272839 24683900 13166509 -5729172 -17021994 -10971903 1244004
34481 1244004 4628648 1683209 4136009 12147137 15038439 7290438 -8027371 -27251127
34473 -27251127 -45871713 -53751445 -43044709 -20873405 -4029551 -1701 -1408766
34466 -1408766 -205111 1021058 -4190735 -13537953 -15779242 -3480734 16878002 30747628
34458 30747628 32187016 30145151 33611114 35628621 22064900 -5234692 -26628600 -29186744
34450 -29186744 -21254251 -16816245 -16613554 -13577274 -7709692 -4468078 -4110928 -3304960
34442 -3304960 -3645107 -8579719 -13954082 -11071124 562715 10580811 9183164 -2248034
34434 -2248034 -11908771 -8211799 7090200 16575590 5174064 -18228998 -27959840 -15035435
34426 -15035435 -511674 -5415685 -20045117 -19453241 -1223904 12301935 8097915 -784138
34418 -784138 3266751 20472658 40199039 55540431 61876396 52180295 26816442 2810010
34410 2810010 512287 19996817 38914681 36446569 14649931 -6399171 -11091643 -1975383
34402 -1975383 7865627 10557917 7728793 2995032 -1508677 -589985 11750906 29875358
34394 29875358 36213334 23865775 11391425 19810116 39263186 38182083 7924328
34387 7924328 -22598985 -26183015 -11676023 -3436096 -3738300 1117877 8745152 4682454
34379 4682454 -3167124 13298624 55544471 83151265 65214887 24190716 3160592
34372 3160592 6513238 4149061 -14605240 -26502279 -15596838 3984930 16337276
34365 16337276 26165853 38245009 39613505 21483424 -754689 -9430758 -9936007 -14527026
34357 -14527026 -17919211 -12014803 -8513862 -18663838 -23687486 1223439 40561573 52574981
34349 52574981 29880763 9278419 14347794 25063157 19215843 9566516 16353918 29978975
34341 29978975 28933118 16117241 9350587 8670619 745716 -11771898 -12055773 1618253
34333 1618253 11706493 8646949 3578462 9757183 25028772 36609980 34026955 16461649
34325 16461649 -4924336 -13599770 -4314903 9955778 14729366 11316649 8377888 4760533
34317 4760533 -5892809 -20453654 -31576482 -41786353 -55195794 -60494951 -43557548
34310 -43557548 -16071324 -8005309 -26060336 -41795113 -31739851 -9745380 -3755313
34303 -3755313 -15200246 -21258846 -10606376 2744034 2176694 -10165176 -20059498 -19373583
34295 -19373583 -10453759 2580218 18959805 36715764 48113752 44718727 28000291
34288 28000291 11937994 11688932 28589863 46926017 46964485 24105687 -3518285 -11057473
34280 -11057473 4574262 17867139 6601891 -14527697 -10826527 19738139 35150578
34273 35150578 6126431 -36526535 -38237867 5523871 42605440 33104091 -3734163
34266 -3734163 -22698433 -9896467 10764996 14778227 2141222 -10124705 -6747091
34259 -6747091 14097700 39746993 53670642 50282369 36869724 21344848 6593203
34252 6593203 -1371084 7168168 29105540 41866208 26271706 -8790254 -36031197
34245 -36031197 -40841311 -31595293 -21356586 -12445822 -1855048 8553812 13312930 10187287
34237 10187287 2473582 -2773820 898282 11888640 18439905 11467262 -220921 2425163
34229 2425163 21768508 35034037 22454071 -3746809 -12055644 8745267 36816577
34222 36816577 46786566 38796120 30945271 33537725 41354144 44962333 39055669 23786426
34214 23786426 7749381 5465027 20894130 37144729 34945157 17881800 4458659
34207 4458659 -1701261 -13571348 -31387186 -35771210 -20019599 -6893302 -16971488
34200 -16971488 -38311715 -46578254 -39786611 -30917572 -19289280 3556184 26620563
34193 26620563 27436353 7777741 -5144645 2565362 15799918 19820126 21377529 29947558
34185 29947558 39205974 41124673 41425885 46381174 48347038 39284489 26960058 22812672
34177 22812672 23206379 17394340 6710868 1753593 5607973 12038264 16106274 16511524
34169 16511524 12289823 6258034 5865237 12039268 14600637 7803568 1052751 2920786
34161 2920786 5103547 -2566196 -10494415 -1490878 21157035 37446341 39435832 36157463
34153 36157463 31303092 18578635 2124823 -1861608 7628122 8703272 -11608724 -36191957
34145 -36191957 -43474156 -38111625 -37616509 -41045289 -33346681 -14702481 -2552754 -4122368
34137 -4122368 -7648620 -5206349 -5126385 -12971466 -16549899 -3241153 18442315 28891319
34129 28891319 22808080 11091450 1507429 -7888496 -16915083 -20347422 -20431113 -27720953
34121 -27720953 -41769812 -44035930 -22174916 8066755 20236770 10998394 -279289
34114 -279289 -4013904 -12423470 -32757355 -47338572 -35516172 -4832583 16845956 16315072
34106 16315072 6211147 1528159 1292685 -516868 662070 12840998 30492721 36621931
34098 36621931 22995028 1141381 -9684645 -1970678 14545040 23810987 17170177
34091 17170177 -1761522 -21329084 -29617464 -21867566 -4677759 7572663 4887052
34084 4887052 -7751149 -14560373 -5721436 12247401 24739279 24751891 16873444 7924093
34076 7924093 -704548 -10022300 -17091274 -15939179 -5029217 8713665 15830287 14482127
34068 14482127 11840720 13021922 12080333 526797 -15932753 -18803616 -47755 24168789
34060 24168789 32020646 23183421 16158996 20781401 27320984 25740526 21252626 21754724
34052 21754724 21751537 12845529 2988743 7888614 24315883 30296882 17160093 4127759
34044 4127759 9625099 22532216 19309835 711123 -9935142 -3162045 4567442 733180
34036 733180 -2897296 7192014 20776052 19654864 8169928 7247025 22527565 38524144
34028 38524144 43732739 41465653 33015027 11440448 -18298070 -31622483 -12741754
34021 -12741754 20017856 33350268 18172700 -4029615 -11016824 -2900251 4977790
34014 4977790 1986926 -7736961 -10225143 3231962 22959773 27555968 9465172 -12420873
34006 -12420873 -15715948 -5152212 -6263037 -28603946 -50318905 -45685527 -17046530
33999 -17046530 9818826 15935075 5400745 -6613511 -13670323 -22017999 -36764223
33992 -36764223 -48933918 -42632651 -17263056 5435138 6274646 -3751464 4882016 39024449
33984 39024449 68935035 64739417 34225497 10137414 7830031 13349856 11930550 8813607
33976 8813607 14487797 24298035 25351479 15740332 4750114 -1503143 -3208387 830290
33968 830290 10898397 17291866 8266659 -9884996 -15792199 -3057202 7796746 -572086
33960 -572086 -14270912 -8468037 13683635 25217736 15782814 3818000 4890134 11811995
33952 11811995 15345696 21524622 33287648 35459444 18470577 701169 3242684 14842791
33944 14842791 9393914 -9789068 -14724459 -641373 4767867 -11967134 -26482203
33937 -26482203 -16518386 1614538 -567928 -21122927 -37123885 -42180707 -46792792 -49761067
33929 -49761067 -38416014 -16463800 -4617381 -8602281 -9623750 5352119 23760485
33922 23760485 28149901 20109000 11997126 8649153 9467787 16750244 28655082 33702530
33914 33702530 26364878 20282300 30784101 49527772 52479465 31355296 2365545
33907 2365545 -16388025 -22230582 -21423120 -19707726 -23238838 -35687385 -48487361 -45778217
33899 -45778217 -26070056 -7717668 -4266665 -5577084 4700628 22341693 28566479
33892 28566479 17680505 2488525 -6461298 -10679553 -11083549 -2693753 11075005 14017430
33884 14017430 -1408005 -19124319 -19235969 -5194424 3413778 374668 -1720960 4702901
33876 4702901 11019373 10882565 12946965 22770214 25138912 2798587 -32693993 -49016114
$$ [...]
##END NTUPLES=NMR SPECTRUM
##END=
