##TITLE=31Pdec_LR-759-R2-K1
 DMSO-d6, 124 sc
 19.12.2022
##JCAMPDX= 6.0         $$ Bruker NMR JCAMP-DX V2.0
##DATA TYPE= NMR SPECTRUM
##DATA CLASS= NTUPLES
##ORIGIN= UXNMR, Bruker Analytische Messtechnik GmbH
##OWNER= root
$$ XWIN-NMR		Version 3.5
$$ Mon Dec 19 14:08:18 2022 Russian Standard Time (UT+4h)  she@DPX200
##.OBSERVE FREQUENCY= 81.013821
##.OBSERVE NUCLEUS= ^31P
##.ACQUISITION MODE= SIMULTANEOUS
##.ACQUISITION SCHEME= undefined
##.AVERAGES= 124
##.DIGITISER RES= 16
##SPECTROMETER/DATA SYSTEM= spect
##.PULSE SEQUENCE= zgpg30
##.SOLVENT NAME= DMSO
##.SHIFT REFERENCE= (INTERNAL, DMSO, 0, 248.564)
##AUDIT TRAIL= $$ (NUMBER, WHEN, WHO, WHERE, WHAT)
$$ ##TITLE= Audit trail, XWIN-NMR		Version 3.5
$$ ##JCAMPDX= 5.01
$$ ##ORIGIN= Bruker BioSpin GmbH
$$ ##OWNER= she
$$ F:/spectra/data/she/nmr/P31/1/pdata/1/auditp.txt
$$ ##AUDIT TRAIL=  $$ (NUMBER, WHEN, WHO, WHERE, WHAT)
(   1,<2022-12-19 14:07:02.98 +0400>,<she>,<DPX200>,
      <continue with go, POWCHK disabled, PULCHK disabled
       configuration hash MD5:
       00 E9 B6 7A A2 85 ED C7 34 08 36 98 17 FE 4E 26
       data hash MD5: 32K
       3F 43 79 00 7A 4E 55 B8 76 7F F2 41 1B 8C 40 9B>)
(   2,<2022-12-19 14:07:05.76 +0400>,<she>,<DPX200>,
      <Start of raw data processing
       efp BC_mod = 2 LB = 1 FT_mod = 6 PKNL = 1 PHC0 = -10915.87 PHC1 = 829.0566 SI = 64K 
       data hash MD5: 64K
       AD EC 7C 22 83 E3 60 2C 07 A7 5A DA 1D 50 59 21>)
(   3,<2022-12-19 14:07:20.48 +0400>,<she>,<DPX200>,
      <pk PHC0 = 47.99445 PHC1 = 0 
       data hash MD5: 64K
       7D EE 3D DE D5 BC D0 27 86 28 A4 1D 60 D5 E8 56>)
(   4,<2022-12-19 14:07:40.65 +0400>,<she>,<DPX200>,
      <pk PHC0 = -11.6 PHC1 = 0 
       data hash MD5: 64K
       CE 5C 38 5A 80 19 91 FD 58 90 C0 E3 42 26 0F 9E>)
(   5,<2022-12-19 14:07:46.17 +0400>,<she>,<DPX200>,
      <abs ABSG = 5 
       data hash MD5: 64K
       D2 2E D1 46 C4 F0 63 AE 49 CF 4D 0C 44 74 2D 72>)
$$ ##END=
$$ 
$$ hash MD5
$$ D1 AE CE 60 28 3D 06 73 F7 81 B0 42 92 EE C1 FB
##$RELAX= 
##$RELAX= 
##$RELAX= 
##$RELAX= 
##$RELAX= 
##$RELAX= 
##$RELAX= 
##$RELAX= 
##$RELAX= 
$$ Bruker specific parameters
$$ --------------------------
##$DU= <F:/spectra>
##$EXPNO= 1
##$NAME= <P31>
##$PROCNO= 1
##$TYPE= <nmr>
##$USER= <she>
##$AMP= (0..31)
100 100 100 100 100 100 100 100 100 100 100 100 100 100 100 100 100 100 
100 100 100 100 100 100 100 100 100 100 100 100 100 100 
##$AQSEQ= 0
##$AQ_mod= 1
##$AUNM= <au_zg>
##$AUTOPOS= <>
##$BF1= 81.014009
##$BF2= 200.13
##$BF3= 200.13
##$BF4= 200.13
##$BF5= 200.13
##$BF6= 200.13
##$BF7= 200.13
##$BF8= 200.13
##$BYTORDA= 1
##$CFDGTYP= 0
##$CFRGTYP= 5
##$CHEMSTR= <none>
##$CNST= (0..31)
1 1 145 1 1 1 1 1 1 1 1 1 1 1 1 1 1 1 1 1 1 1 1 1 1 1 1 1 1 1 1 1 
##$CPDPRG= <waltz16>
##$CPDPRG1= <>
##$CPDPRG2= <waltz16>
##$CPDPRG3= <>
##$CPDPRG4= <mlev>
##$CPDPRG5= <mlev>
##$CPDPRG6= <mlev>
##$CPDPRG7= <mlev>
##$CPDPRG8= <mlev>
##$CPDPRGB= <>
##$CPDPRGT= <>
##$D= (0..31)
$$ [...]
##$SUBNAM3= <"">
##$SUBNAM4= <"">
##$SUBNAM5= <"">
##$SUBNAM6= <"">
##$SUBNAM7= <"">
##$SUBNAM8= <"">
##$SUBNAM9= <"">
##$SW= 501.771253377433
##$SWIBOX= (0..15)
0 1 3 0 0 0 0 0 0 0 0 0 0 0 0 0 
##$SW_h= 40650.406504065
##$TD= 32768
##$TD0= 1
##$TE= 0
##$TE2= 300
##$TE3= 300
##$TEG= 300
##$TL= (0..7)
0 120 53 12 22 120 120 120 
##$TP= (0..7)
150 150 150 150 150 150 150 150 
##$TP07= 0
##$TPNAME0= <>
##$TPNAME1= <>
##$TPNAME2= <>
##$TPNAME3= <>
##$TPNAME4= <>
##$TPNAME5= <>
##$TPNAME6= <>
##$TPNAME7= <>
##$TPOAL= (0..7)
0.5 0.5 0.5 0.5 0.5 0.5 0.5 0.5 
##$TPOFFS= (0..7)
0 0 0 0 0 0 0 0 
##$TUNHIN= 0
##$TUNHOUT= 0
##$TUNXOUT= 0
##$USERA1= <user>
##$USERA2= <user>
##$USERA3= <user>
##$USERA4= <user>
##$USERA5= <user>
##$V9= 5
##$VALIST= <valist>
##$VCLIST= <CCCCCCCCCCCCCCC>
##$VD= 0
##$VDLIST= <DDDDDDDDDDDDDDD>
##$VPLIST= <PPPPPPPPPPPPPPP>
##$VTLIST= <TTTTTTTTTTTTTTT>
##$WBST= 1024
##$WBSW= 4
##$XGAIN= (0..3)
0 0 0 0 
##$XL= 0
##$YL= 0
##$YMAX_a= 2367
##$YMIN_a= -8954
##$ZGOPTNS= <>
##$ZL1= 120
##$ZL2= 120
##$ZL3= 120
##$ZL4= 120
##$ABSF1= 248.5645
##$ABSF2= -253.2056
##$ABSG= 5
##$ABSL= 3
##$ALPHA= 0
##$AQORDER= 0
##$ASSFAC= 0
##$ASSFACI= 0
##$ASSFACX= 0
##$ASSWID= 0
##$AUNMP= <proc_1d>
##$AZFE= 0.1
##$AZFW= 0.5
##$BCFW= 0
##$BC_mod= 2
##$BYTORDP= 0
##$COROFFS= 0
##$CY= -3
##$DATMOD= 1
##$DC= 0
##$DFILT= <>
##$DTYPP= 0
##$F1P= 0
##$F2P= 0
##$FCOR= 1
##$FTSIZE= 65536
##$FT_mod= 6
##$GAMMA= 0
##$GB= 0
##$INTBC= 1
##$INTSCL= 6.047779e-11
##$ISEN= 30
##$LB= 1
##$LEV0= 0
##$LPBIN= 0
##$MAXI= 10000
##$MC2= 0
##$MEAN= 0
##$ME_mod= 0
##$MI= 50
##$NCOEF= 0
##$NC_proc= -9
##$NLEV= 6
##$NOISF1= 182.463
##$NOISF2= 159.3651
##$NSP= 0
##$NTH_PI= 0
##$NZP= 0
##$OFFSET= 248.5645
##$PC= 4
##$PHC0= -10879.48
##$PHC1= 829.0566
##$PH_mod= 1
##$PKNL= yes
##$PPARMOD= 0
##$PSCAL= 0
##$PSIGN= 0
##$REVERSE= no
##$SF= 81.0140089999694
##$SI= 65536
##$SIGF1= 159.3651
##$SIGF2= -187.1042
##$SINO= 113.3802
##$SIOLD= 16384
##$SREGLST= <1H.CDCl3>
##$SSB= 0
##$STSI= 65536
##$STSR= 0
##$SW_p= 40650.406504065
##$SYMM= 0
##$S_DEV= 0
##$TDeff= 32768
##$TDoff= 0
##$TI= <>
##$TILT= no
##$TM1= 0
##$TM2= 0
##$TOPLEV= 0
##$USERP1= <user>
##$USERP2= <user>
##$USERP3= <user>
##$USERP4= <user>
##$USERP5= <user>
##$WDW= 1
##$XDIM= 65536
##$YMAX_p= 266054772
##$YMIN_p= -192300501
$$ End of Bruker specific parameters
$$ ---------------------------------
##NTUPLES= NMR SPECTRUM
##VAR_NAME=  FREQUENCY,     SPECTRUM/REAL,   SPECTRUM/IMAG
##SYMBOL=    X,             R,               I
##VAR_TYPE=  INDEPENDENT,   DEPENDENT,       DEPENDENT
##VAR_FORM=  AFFN,          ASDF,            ASDF
##VAR_DIM=   65536,         65536,           65536
##UNITS=     HZ,            ARBITRARY UNITS, ARBITRARY UNITS
##FACTOR=    0.620285442955139, 1,           1
##FIRST=     20137.2065510682, 0,            0
##LAST=      -20513.1999529968, 0,           0
##MIN=       -20513.1999529968, -192300501,  0
##MAX=       20137.2065510682, 266054772,    0
$$ Real data points
##PAGE= N=1
##DATA TABLE= (X++(R..R)), XYDATA
$$ [...]
##PAGE= N=2
##DATA TABLE= (X++(I..I)), XYDATA
14129 -1814646 -19396840 -28437501 -26223980 -21635519 -22229648 -20146650 -4449591 14556108
14121 14556108 13471639 -7942987 -21540421 -11743117 2051742 312715 -3293083 11167182
14113 11167182 28442722 17248373 -16400003 -29694761 -1883916 35217194 37245607
14106 37245607 -384238 -41960761 -52170251 -27847289 4920793 19031494 12402244
14099 12402244 4850448 9224392 15588716 10572209 -101251 -1899942 5341895 10538788
14091 10538788 10653859 10537425 9207809 2511769 -6046426 -13018518 -26005173 -48370861
14083 -48370861 -61120764 -43239723 -5778941 18115515 15092424 478862 -11470735
14076 -11470735 -19497562 -18196325 1207070 27502457 34351925 16348666 -4243815
14069 -4243815 -12853837 -18053279 -24378852 -19386697 -457564 13600092 13160101 13463629
14061 13463629 22943941 23035977 924585 -22074187 -19598643 1674916 16630430 17060517
14053 17060517 10226946 -243536 -9509256 -5588996 8832570 8748276 -13689976 -25159493
14045 -25159493 929396 35022659 31177619 -847934 -12130895 4543013 4300501
14038 4300501 -33475055 -70540380 -69904515 -46250190 -31151724 -24871398 -13178552 -3624462
14030 -3624462 -11256635 -26017267 -25691844 -11135797 -2619011 -8519648 -19813065 -28889768
14022 -28889768 -33240574 -26476232 -6019157 14038976 16319169 3884834 -5549672 -5370549
14014 -5370549 -3324086 -2989968 -928531 -1059355 -12260279 -29258071 -33957818 -20280848
14006 -20280848 -1449544 12325776 26447870 44411576 54263020 45393492 27265805
13999 27265805 17581244 19164052 21292228 18216084 13168752 7373268 -1457743 -10004558
13991 -10004558 -11178493 -6914623 -7733041 -15936506 -20278349 -13943352 -8294506 -18543753
13983 -18543753 -41065187 -56212606 -52629108 -38436895 -26734576 -20077543 -14555932
13976 -14555932 -10731534 -11073152 -10234896 1487603 23363461 41124144 42895712 32740454
13968 32740454 23638369 21519063 22099368 20033414 13563731 1485131 -15650472 -29844650
13960 -29844650 -30278550 -18214300 -9110270 -12727667 -18311736 -10005415 7794573 14402615
13952 14402615 2617731 -10085936 -6657438 5180751 4656105 -13111848 -32594384
13945 -32594384 -40111490 -38130075 -34734251 -29490043 -17560527 -2976260 1639309 -9004773
13937 -9004773 -22923697 -23197341 -9733271 -1256620 -10998892 -27095929 -27054673 -8599054
13929 -8599054 7291207 6190621 -1491726 -128884 5936081 461365 -18294593 -33854473
13921 -33854473 -33075583 -20249934 -9242296 -9619947 -20337576 -30922858 -30394279 -19428190
13913 -19428190 -8937398 -2501833 9305847 28162873 35367292 17449661 -6352294
13906 -6352294 -5708636 16939762 30369055 22081043 12802328 16796309 17376900 -1844882
13898 -1844882 -25459307 -27855152 -10800805 1781162 -2961305 -16714071 -25919022 -22978174
13890 -22978174 -8401650 6140968 5702222 -5866576 -4145057 21522199 46211898
13883 46211898 41043743 13841283 -5178538 -8564446 -14883129 -30718959 -38832555 -28401158
13875 -28401158 -11485702 -1455192 3188160 4566347 -3966740 -20642566 -27122207 -13535907
13867 -13535907 1760439 -4869151 -27421516 -35719836 -14023845 20377774 39925532
13860 39925532 37671023 29122161 27974159 28448513 16145531 -7331804 -20460518 -7219770
13852 -7219770 21239133 38962570 34431823 17901872 3776464 -1917286 2335110 15895006
13844 15895006 30417431 32742721 19552465 3014369 -2307487 6219412 19632738
13837 19632738 27023981 23672681 14002237 7039810 6422618 7734239 8476352 13277502
13829 13277502 22498179 25069580 14431469 3038517 5391065 13607227 9084617 -5973315
13821 -5973315 -11271210 -2276904 3322193 -2240719 -3497463 8678699 17566878 7178822
13813 7178822 -10022166 -11494610 1593960 8360657 -1102160 -16130273 -22883298 -17553726
13805 -17553726 -4701170 6465763 6314861 -5648423 -17372188 -16737106 -4262516 10693432
13797 10693432 20035482 18664406 4783464 -14598510 -26388281 -26629104 -25098559 -28511446
13789 -28511446 -29397408 -20150758 -7457294 -1606219 -463125 3798071 9491571 9518664
13781 9518664 4974646 2739601 3882355 4853336 5521545 6339795 3111295 -5201922 -9233449
13772 -9233449 -878993 12605579 17149270 10482956 1896303 -2838211 -6347723 -12194932
13764 -12194932 -20214063 -25965568 -20543214 711954 23912170 24057547 -2620577 -26698335
13756 -26698335 -20230002 7891407 27045385 24474113 11598330 665979 -3758796
13749 -3758796 3027224 19613468 28173190 12917609 -12461274 -17726591 3031657 24648315
13741 24648315 26467587 13180065 -3149337 -19614221 -33298783 -34725943 -21127050
13734 -21127050 -3461414 7420143 11448494 12893188 14677928 20518380 29987962 31655846
13726 31655846 16205792 -4533299 -10006963 -2497440 -4741819 -23072326 -36884616
13719 -36884616 -32610949 -24332822 -27795359 -34900238 -30156631 -15990371 -5107473 -418413
13711 -418413 2138114 1394310 -4369654 -9227926 -7664602 -2511561 3746227 14350650
13703 14350650 25864193 24076215 5060913 -11612854 -5260955 18873100 37949392
13696 37949392 39644218 30680612 24321596 29029908 42287983 48345326 32197807 2970231
13688 2970231 -10150510 4913822 24951248 23196074 3982773 -10644206 -14748857
13681 -14748857 -18286286 -22672090 -18752768 -6016985 4491410 5862389 687841 -6755819
13673 -6755819 -12228138 -9436156 3150443 18057190 29503698 39889115 47476182 41037381
13665 41037381 19489556 2700027 6401305 19508720 23965335 22547120 25635714 25282240
13657 25282240 9432239 -9371461 -9600021 2309835 2123357 -9424933 -7968223 9827724
13649 9827724 18053698 5133349 -7206249 -724751 12086849 12259950 1972724 -6732744
13641 -6732744 -10340426 -7996170 3116046 14656547 9503432 -10689880 -20890440 -8177596
13633 -8177596 9763256 15166218 15198376 19059483 15327969 -3884367 -18525059 -9397431
13625 -9397431 6233932 79117 -18956301 -17587462 6835434 21626113 11846203 2010409
13617 2010409 13003000 28431586 23246246 3076267 -8133353 -6142846 -8629229 -23992994
13609 -23992994 -38043866 -34368958 -14691488 5356989 12372136 3497352 -14476105
13602 -14476105 -29296171 -30708145 -19361984 -7037746 -3405751 -3309408 6834199 28427914
13594 28427914 43455308 33732473 3180580 -26196061 -38066717 -33917586 -23555928
13587 -23555928 -13745266 -8126641 -8970137 -13863160 -16103415 -12103161 -4462032 3554403
13579 3554403 11211390 16898491 17555825 12959990 5538198 -3343198 -10680810 -8808595
13571 -8808595 4309183 14605214 6672595 -10864885 -12418686 8166912 27356307
13564 27356307 26017774 13849891 6872437 336482 -16073915 -31252020 -25513776 -2959459
13556 -2959459 12685299 11665059 5568940 1876841 -5815411 -17724512 -19670645 -5212826
13548 -5212826 10138756 9170033 -3441670 -9788556 -3625737 5378953 8628281 8085824
13540 8085824 7539976 3829055 -6886001 -17809797 -14760940 5990241 28522082 32368373
13532 32368373 14512544 -10146085 -27058066 -31148377 -21008244 501749 18188806
13525 18188806 14963903 -2796380 -8123231 8414534 22978253 15889927 4160272
13518 4160272 13380217 34201126 37065473 20225140 9422862 12708845 10899827 -2216831
13510 -2216831 -5019157 13785331 32677086 31074943 20100506 18690143 20468419 8770082
13502 8770082 -10834313 -18322928 -10250594 -305961 4572891 7605936 6883502 -2211603
13494 -2211603 -11660649 -7994485 4970615 8612261 -4151664 -21615758 -33232416 -39161580
13486 -39161580 -37596124 -22195334 234924 7102325 -12753869 -41151729 -51600381
13479 -51600381 -39155388 -18722697 -2970546 4738765 2145294 -11094163 -24951084
13472 -24951084 -25282349 -11669793 1411996 4756661 5859079 14543509 26075974 27934687
13464 27934687 18670127 9546575 7731154 7421453 829426 -9744340 -16582978 -18168455
13456 -18168455 -18649065 -17661783 -9016055 8087302 22957089 24193544 14433800 8746259
13448 8746259 17086518 32398463 39786126 35735538 32540215 41146695 54783642 56551714
13440 56551714 41668537 23341393 14213477 11285481 5882792 218861 2276495 8032455
13432 8032455 3301480 -13801122 -25068199 -15043113 6465747 14879633 872742
13425 872742 -19165598 -23147908 -7003760 13689607 20996963 10404474 -7833712 -18927720
13417 -18927720 -14865501 976631 17208332 22913995 16355189 6807675 5185463 11390521
13409 11390521 14610237 8655341 1520370 3342910 9433651 5923271 -7772474 -14147157
13401 -14147157 -986354 19627929 24880471 9021311 -12190387 -23692439 -27959376
13394 -27959376 -36043511 -48545581 -52598208 -37468146 -8447749 17323963 27403545
13387 27403545 24126793 18902859 19898399 26818855 34513184 37786783 33587860 22212857
13379 22212857 7131526 -8131993 -22447984 -34489177 -39186631 -30832033 -11016686
13372 -11016686 8531191 13056229 -3219719 -29709541 -45400931 -37983596 -18513700
13365 -18513700 -10366863 -20652080 -31267764 -24567282 -7937350 -1091678 -6344837 -7457239
13357 -7457239 4096936 18008422 22497634 18675411 13339174 9146731 6257734 3897519
13349 3897519 -2002712 -12217026 -15402753 -759680 19251998 17982013 -7879009 -30511506
13341 -30511506 -30795519 -23997246 -29608541 -37127106 -26163432 -4736017 1952611 -6748905
13333 -6748905 -6435563 11902727 29103158 29777416 21346273 13226074 800014 -17297023
13325 -17297023 -25838546 -13583876 5591171 7996516 -10751637 -34131248 -46279689
13318 -46279689 -44486780 -34563942 -23410892 -15209995 -10323838 -9035007 -15025530 -28316475
13310 -28316475 -37242900 -30530961 -17722153 -20084111 -36089250 -36667806 -7644975 23147158
13302 23147158 22294298 -175407 -4985858 19336785 42273723 37113273 14309111 -1931902
13294 -1931902 -8649961 -17936246 -28928237 -26672537 -6690689 15524391 23291401 16913594
13286 16913594 7917796 1838055 -5636577 -16795692 -24431521 -21318481 -12584445 -9848605
13278 -9848605 -13039287 -8606254 9013612 24536005 21129141 5486553 -746487 7810501
13270 7810501 13785235 5010681 -6669362 -4106992 8677071 11849387 -2613478 -20539337
13262 -20539337 -23271846 -7092725 17204142 37102993 45918858 41571459 25372902
13255 25372902 4879248 -6696060 -875202 15611918 26900954 26679439 23563690 23687810
13247 23687810 17856569 -3331531 -28919796 -37200826 -23787077 -5457075 3485461
13240 3485461 2901347 -5700172 -23788719 -41839433 -40466020 -16830318 7140580 15719454
13232 15719454 20906274 36414722 48405675 36482612 11066494 1434262 12549166
13225 12549166 22236798 18741301 10915057 -208271 -26140231 -57706846 -60787938 -24492712
13217 -24492712 14279861 18631369 1352370 -807073 16214919 26188280 20807596 19088829
13209 19088829 28863490 32817717 20676203 6531224 2390540 -504837 -9254223 -11010655
13201 -11010655 3171163 14215131 -1322905 -34049208 -52171132 -43947663 -26554855
13194 -26554855 -14702002 -5701298 62801 -9757344 -33913388 -44629495 -21596414
13187 -21596414 14250926 24732551 5695148 -11087370 -7047392 -282812 -10437495
13180 -10437495 -25573159 -23460035 -8232712 -1596463 -6963520 -7951401 -202651 1102736
13172 1102736 -9203844 -12071795 8209397 37653602 47375783 26419958 -9757846
13165 -9757846 -36639379 -39376723 -21634814 -2594986 711222 -8432178 -13571316 -10700801
13157 -10700801 -12407365 -22605778 -25322563 -9081248 14031869 27138927 31204015
13150 31204015 33332065 27722868 8558035 -9982672 -9351328 5383118 15403161 19325342
13142 19325342 30252695 45630087 46477358 28324528 8694056 -436974 -5565824 -12075686
13134 -12075686 -13046618 -4448011 7258777 18311976 29871214 33458011 16791445 -9506552
13126 -9506552 -16189891 2243133 14118143 -4361027 -32932989 -36317466 -11544473
13119 -11544473 15431990 26778090 24827668 17118422 9779964 9124237 13164293 8764347
13111 8764347 -8602697 -22730952 -19811953 -11186174 -14224135 -23141843 -21647868 -13950496
13103 -13950496 -16721044 -26980753 -26303170 -14444078 -9996857 -16398138 -16461556 -6102782
13095 -6102782 -4321764 -18781122 -28343622 -15734869 4690306 9998329 1326610 -6005199
13087 -6005199 -10250481 -19554683 -30063724 -29296670 -17480857 -7124585 -3007617 1080461
13079 1080461 6318157 5858970 201099 639907 11665941 21640147 18602389 7120521
13071 7120521 1023102 4112857 6311944 -2125975 -18725250 -31940476 -32657426 -21798093
13063 -21798093 -8698573 -2307456 -2548904 -1107446 7250708 16023660 14385935 2764253
13055 2764253 -6288601 -5754451 -4401521 -11954974 -21350518 -17944488 -2631510 9236762
13047 9236762 12162447 16642220 26119210 26370795 9884859 -5375982 445263 17672368
13039 17672368 20128174 4056266 -8085733 -2544877 9088755 13608943 16371388 26619994
13031 26619994 37729889 36140430 21522530 5626292 -4118287 -9719726 -14665913 -19545695
13023 -19545695 -23902780 -26035706 -22739287 -14243779 -6711495 -4846890 -5296988 -3190434
13015 -3190434 -1841513 -7945172 -18037901 -18676948 -3385571 17046174 26542116 22287897
13007 22287897 14837624 10982140 4849947 -10145130 -27731234 -35656562 -32655593 -27816684
12999 -27816684 -23121465 -9762724 12632171 26150169 16036728 -6201479 -15746009
12992 -15746009 -7120180 1021409 -5819172 -19667991 -25007968 -19772354 -13120658 -10259401
12984 -10259401 -8777059 -6506336 -4979837 -5333345 -6089222 -5980954 -5955288 -7154415 -8639644
12975 -8639644 -8988225 -9538580 -12479712 -13752737 -3246644 20479960 39427938 32829732
12967 32829732 5939361 -12484781 -7468697 3162755 -1654006 -13515840 -9994941
12960 -9994941 8501581 20552729 18066558 15278705 22104130 29977227 29367408 23350122
12952 23350122 17709571 12795127 9823975 10461892 7644758 -5692091 -16726800 -4265180
12944 -4265180 23771151 30631442 1836135 -29907545 -30904869 -13631432 -10499984 -20199733
12936 -20199733 -15586889 4566486 10739214 -7593386 -23280008 -15048522 159264
12929 159264 -2405427 -15478174 -14554816 1838538 13073044 12452213 16451908 33860017
12921 33860017 47504477 38645386 15505459 2618695 8546707 18784856 19004800 11394578
12913 11394578 5014699 1921506 -523409 -2030718 -1649848 -1855805 -3683004 -3264538
12905 -3264538 270108 -155916 -8635452 -16911425 -15612902 -8627649 -4975914 -2507583
12897 -2507583 6376049 17397974 18583788 9154700 -1642071 -11496885 -22345263 -23898813
12889 -23898813 -4257404 20968716 17598796 -19647752 -54442544 -57190010 -41060541
12882 -41060541 -32000418 -28158261 -15149822 -1329189 -5248838 -18952933 -16938117 1565119
12874 1565119 10260276 -2501429 -18500353 -22261779 -22267956 -28811968 -33740089 -27265446
12866 -27265446 -17363892 -15582969 -15920321 -5403107 11430664 15978813 2352835 -13649469
12858 -13649469 -15281526 -3682670 9678544 21127149 35238440 49537525 51498469
12851 51498469 37202802 22846576 24662778 32531592 20755537 -13775363 -42668236
12844 -42668236 -42376799 -22390019 -6300315 -989993 283191 -1891853 -10989145 -21811873
12836 -21811873 -27318586 -29976747 -30297386 -16337501 13729617 31117671 8586545 -32543750
12828 -32543750 -41267701 -5220336 33172900 37186409 19352683 9216979 8755602 4008028
12820 4008028 -2694369 -1097588 698202 -13143261 -35898639 -43862960 -30571944 -14366464
12812 -14366464 -11146006 -17524760 -23322237 -25382377 -24875705 -22394595 -19860860 -19759372
12804 -19759372 -20795978 -19950386 -17225888 -12216305 -342452 18475304 31994640 28390526
12796 28390526 14227962 7018485 11410329 17051451 19931452 28109398 40843354 40304196
12788 40304196 17106900 -9153913 -12165820 4883952 13523556 -368059 -19273890
12781 -19273890 -21892652 -11968875 -6901660 -8547398 -2885100 13616487 25104001 19413675
12773 19413675 5992466 351240 421105 -7683500 -24754029 -34854807 -28604984 -16529040
12765 -16529040 -12474469 -13938473 -9038850 2248150 5431131 -8496141 -28284253 -32545026
12757 -32545026 -12576663 17845342 35212313 27371074 2279089 -21644987 -31381933
12750 -31381933 -26636333 -16016527 -8979943 -9780330 -16502116 -25513576 -35630347 -44946533
12742 -44946533 -45613999 -30131665 -5457972 8466105 1260616 -14518995 -21478746 -21636169
12734 -21636169 -30435051 -51188162 -69305719 -70550054 -52356293 -19014076 19415417
12727 19415417 44205400 42154512 25963144 22134023 33280662 33452751 11227173 -5904933
12719 -5904933 9508740 39795956 43731717 14530007 -13099173 -13995609 -2410360 -2360786
12711 -2360786 -12340742 -15615050 -9779694 -7186254 -12665267 -17269963 -13658894 -6137679
12703 -6137679 -3532172 -8950869 -17892008 -22297612 -16684534 -3554780 8505508 14589733
12695 14589733 17785409 19872785 13549497 -6941874 -30501165 -37421334 -26104243 -19051188
12687 -19051188 -33341388 -54837480 -55789347 -33954356 -17035101 -24329552 -40076296
12680 -40076296 -36622079 -13297791 4235639 -147672 -15383332 -24716021 -28091675 -32127324
12672 -32127324 -29986530 -8992393 24073166 42996045 33906758 14326498 9914543
12665 9914543 20898817 26187334 17500699 11190964 20399774 32311478 27379302 10073501
12657 10073501 1095285 3368040 -1558465 -19346736 -28285851 -12176234 10943825 13136130
12649 13136130 -2440603 -9115953 -628256 -590088 -22519989 -44647291 -39456840 -12187771
12641 -12187771 8689726 10965774 8973438 15091113 19897950 9730503 -7785676 -10250990
12633 -10250990 8689738 27812953 24028705 1777044 -13482628 -8030909 6248033
12626 6248033 12431521 9428435 4629990 -2456721 -16069019 -30125929 -32609446 -22537713
12618 -22537713 -10764004 -4321011 -769005 1934948 815717 -5235999 -12721517 -18726272
12610 -18726272 -21671467 -18419694 -9118720 -2213268 -4429293 -9078090 -6365823 -1082338
12602 -1082338 -4247290 -10337872 -2852381 16358249 24562887 10145069 -12825854 -28335799
12594 -28335799 -35914527 -36254133 -22424770 1242719 13442588 6257657 1366643 16341371
12586 16341371 34090439 29951333 12116157 5677918 8296687 -4677557 -34344299
12579 -34344299 -50983930 -37859537 -14138153 -4703357 -9816165 -15410117 -14715399 -8443748
12571 -8443748 1485841 8348514 3468101 -9498920 -16244927 -14851509 -21929752 -45771274
12563 -45771274 -68347107 -67915004 -47944610 -28381996 -17384190 -9032108 -3486113 -9413151
12555 -9413151 -24298525 -30010003 -16773557 -89367 -2117514 -21473048 -33904119
12548 -33904119 -23824360 -3933040 2988091 -6484095 -16368021 -17136064 -17085479 -24339453
12540 -24339453 -31432685 -27826670 -18093670 -14727770 -18018383 -16462059 -5776622 4988929
12532 4988929 7898129 6472748 8490102 15795119 24311159 29339708 29012147 25218426
12524 25218426 20554015 13033829 -1378545 -18265913 -25305848 -19954093 -16792198 -26431063
12516 -26431063 -36442932 -28043522 -4481688 14622536 22488076 29371058 39323284 43233535
12508 43233535 37335506 29763495 24569727 16472239 5854247 2148499 7394782 12212153
12500 12212153 11811866 9789494 4589734 -7682268 -15533786 -2741449 18302045 14011131
12492 14011131 -18306579 -38063753 -20053525 6242767 2569088 -21947857 -34205902
12485 -34205902 -31885855 -33992820 -34247153 -10466011 26194635 38117650 20125294 8214408
12477 8214408 21220541 35162482 29483370 18890564 18196639 11598284 -14729509 -38005511
12469 -38005511 -29150723 1533788 20025659 16290470 7148919 2338492 -2169578 -3009295
12461 -3009295 8421801 22991110 20324026 1635258 -8755929 -1202325 2970304 -15838453
12453 -15838453 -44764076 -54987493 -38037951 -12507655 -605674 -8213973 -24553664
12446 -24553664 -33490612 -26493908 -9370822 4349595 7975909 6886344 8800532 13771000
12438 13771000 16377534 14027479 9573603 6738015 4852946 -676800 -10855930 -17123705
12430 -17123705 -9011059 10093876 22950173 20098192 12922518 15499729 21538034 13781954
12422 13781954 -7952086 -24571227 -23493891 -11185655 1524914 10615873 11918265
12415 11918265 252875 -16746152 -19319062 -527629 21663925 27237880 17417854
12408 17417854 5072374 -5273690 -14640377 -18429962 -13937326 -10261786 -14371688 -14944836
12400 -14944836 1613807 24545354 28608839 9438675 -10897213 -15612249 -11222184
12393 -11222184 -9053399 -7391790 -1297270 4683943 4939234 3694257 7294086 13355483
12385 13355483 16391290 17207713 18058598 14646866 2558780 -11704929 -15131607 -3770341
12377 -3770341 11701446 17364113 10889573 3442689 5105064 9280135 -1333872 -29309698
12369 -29309698 -52751045 -51192612 -32197732 -16964218 -7740982 8380077 27183074
12362 27183074 27104679 6357170 -8127272 -1142960 7713893 -1377151 -15570657 -13971382
12354 -13971382 -3942516 -5215968 -13872310 -12341077 -4030590 -6538248 -17535109 -19744191
12346 -19744191 -16159885 -26380765 -47152786 -51636388 -34250675 -21815848 -28806563
12339 -28806563 -34829648 -22916709 -8751835 -10049634 -14503665 -4087782 11617187
12332 11617187 14437669 11080953 17787621 26600280 18741909 1147085 -3275724 4045003
12324 4045003 149168 -17625903 -25952898 -15337051 -3556664 -1523615 3103444 15605029
12316 15605029 17161864 -3225651 -24694792 -24800531 -14198135 -16703810 -29876560 -32226545
12308 -32226545 -20646384 -13209944 -16785936 -17154771 -5203813 7983498 9874219 4989485
12300 4989485 5760535 14378073 20861704 14050227 -8042315 -33583873 -43052806 -27538713
12292 -27538713 -916759 13677531 8717757 -3994062 -11685844 -12158886 -9036571 -7842593
12284 -7842593 -15923580 -32971121 -42620466 -29723268 -6416609 -1217440 -18290245 -30565335
12276 -30565335 -22921288 -17132171 -35477852 -61766475 -64857249 -45814874 -31698574
12269 -31698574 -30533901 -23929323 -3393199 16852384 28185589 39761882 52625036
12262 52625036 48452893 19351231 -13096171 -26165646 -25622767 -28771079 -33867512 -28093470
12254 -28093470 -15007798 -11047776 -19312598 -26669574 -24598173 -15467438 -391718 21080657
12246 21080657 39290117 40453055 27275096 17785255 19647552 20556306 9525519 -6830379
12238 -6830379 -17292232 -22676457 -29131202 -34335306 -32263025 -26332483 -26208076 -32827788
12230 -32827788 -36104536 -28988468 -17199404 -11978048 -16608709 -23420540 -23663418 -17718967
12222 -17718967 -13340508 -14648629 -16783700 -13047726 -3378206 7222629 14537531 15351639
12214 15351639 6718540 -8497852 -19229383 -17211432 -7670442 -881278 3441312 12066799
12206 12066799 20549925 14704778 -6224095 -21905590 -15278135 5277300 17901408
12199 17901408 14201127 3863423 -2811473 -5787538 -9568215 -15693249 -22388658 -26132644
12191 -26132644 -23204256 -14189421 -6327247 -6506704 -12294242 -14776805 -10318677 -4484743
12183 -4484743 -3184645 -4364018 -1183072 8249125 16144462 10946018 -9775048 -31660459
12175 -31660459 -33727971 -11019385 16688886 25989705 17206519 11008631 18073716 25508466
12167 25508466 19453072 7709236 6398304 13040127 11437087 1058609 337248 14573233
12159 14573233 20868327 24028 -30819562 -37398825 -13998043 9940241 8561736
12152 8561736 -12814239 -31936985 -35403998 -24009913 -5662873 8647318 10755273
12145 10755273 4276369 1551368 8459786 19638256 29202379 34453476 27533130 -494876
12137 -494876 -40563332 -65790241 -60487934 -37039839 -16446397 -6472868 -7000858 -18381826
12129 -18381826 -31104508 -25554012 615351 21596131 18461071 7013279 8613320
12122 8613320 13503330 3238371 -8799164 1659691 20056113 9660520 -24328102
12115 -24328102 -35802895 -10748653 9674841 -2577223 -18168202 -4507170 16588180
12108 16588180 6157673 -25605279 -35874996 -16738043 -2048557 -11257231 -26031224
12101 -26031224 -26605384 -18606228 -15226034 -17603557 -21497849 -24286126 -19428357 -1759063
12093 -1759063 16903795 15451236 -7046731 -26418592 -25387914 -14844136 -13689879 -20927592
12085 -20927592 -19983608 -2856327 20746553 34226385 27055237 1433189 -27253453
12078 -27253453 -39852622 -29916971 -10357087 135195 -3049869 -6933613 2577873 23607471
12070 23607471 40769563 44116485 39561507 36001117 29311376 11173855 -9523746 -12100150
12062 -12100150 4258024 12756778 -4510361 -27584241 -24303912 4877787 28862866
12055 28862866 29372687 21082810 24583827 37056482 39280325 21741370 -5466347 -25124316
12047 -25124316 -29939927 -27660824 -30073431 -37703481 -39973286 -31751487 -21303335 -16432941
12039 -16432941 -12072724 -794708 12542456 17870675 14897167 9417242 1751045 -7696498
12031 -7696498 -8469049 7363992 26583109 26783950 6654470 -11953298 -12801020 -893091
12023 -893091 11114385 16409175 12332692 505084 -8793025 -6002763 2977200 5468236
12015 5468236 4078993 11990442 26091905 26576980 8020214 -11004408 -17330858 -20802694
12007 -20802694 -31307671 -38688792 -30931115 -16260728 -11135445 -18551289 -31870525 -47602258
11999 -47602258 -60807054 -60548225 -44456192 -26501326 -17445079 -10992566 -2453251 -3092458
11991 -3092458 -16549922 -19389107 7479812 40996177 41288061 8576358 -18080727 -17937812
11983 -17937812 -10025834 -11918435 -12622608 -2131626 3577026 -8633883 -18651055 -674727
11975 -674727 32694777 44188349 24608337 2796821 52065 1307277 -16200519 -45152637
11967 -45152637 -57475469 -43089391 -21755971 -15701295 -23352342 -26057496 -13813791
11960 -13813791 3502399 9582053 370212 -13136403 -17603725 -9383312 4849796 15030642
11952 15030642 14024586 1291640 -15218733 -22055682 -10822397 11202416 24112580
11945 24112580 13681803 -13554473 -37249123 -45329447 -44192947 -45304754 -48596175 -45903529
11937 -45903529 -36501398 -29103429 -27706410 -24974101 -14177354 -523183 5830722 3571135
11929 3571135 130672 -75037 -529082 -5256803 -11812203 -14004136 -9389822 -1983287
11921 -1983287 2471120 3089864 4483610 10391918 19010173 26589294 32151989 34096746
11913 34096746 26217484 5851547 -15576415 -21464248 -11815628 -4887731 -12291406 -23662461
11905 -23662461 -23409662 -11840959 211665 7798371 10699963 4839133 -10048028 -20383059
11897 -20383059 -13167495 2503282 4893465 -10587356 -27381203 -32679394 -28227945 -16028949
11889 -16028949 5049274 23338653 17977647 -10347840 -32500434 -28950904 -16451314
11882 -16451314 -20231095 -37332568 -48208995 -48959557 -46979531 -37188337 -12408488 9597952
11874 9597952 2506218 -24912344 -34856198 -16716790 -3607855 -18563997 -36536700
11867 -36536700 -24125821 7819599 21541399 7367372 -9275174 -9052738 1628954
11860 1628954 11583973 20299948 28141744 30557271 27398040 23928547 20487489 14488931
11852 14488931 11822050 20048714 30697860 27079929 11435848 4004466 10768319 13853751
11844 13853751 2106723 -10901616 -11940846 -10228182 -17603137 -25090584 -20041677 -11821420
11836 -11821420 -16548882 -26494414 -20307527 1620432 17923228 20951219 24176391 31758013
11828 31758013 28136604 8687087 -3696582 9847668 33763012 39383292 24676706
11821 24676706 11047242 6977401 -1709490 -23747857 -45715758 -51760013 -44355477 -34284898
11813 -34284898 -22030760 -3518822 13172515 14040674 1187652 -7640134 -4930437 -3145843
11805 -3145843 -11106962 -16379885 -5466801 10319832 8579100 -10023294 -22246343 -17189301
11797 -17189301 -9973138 -15310260 -26860274 -32564343 -33814984 -36935191 -39249550 -37141000
11789 -37141000 -36340834 -39979410 -37018029 -18810663 1024218 978414 -18337680 -34701243
11781 -34701243 -32622256 -17450866 -3835654 -3213515 -19502026 -43647611 -55593492
11774 -55593492 -45194966 -27254282 -21631164 -24471679 -17608002 -1479507 4946926 -2132624
11766 -2132624 -2334070 16840198 39386182 42201950 21514947 -9614966 -34503168 -36757922
11758 -36757922 -9057298 31275514 50998570 36810516 9722841 -4916185 -5599320
11751 -5599320 -2395704 4162975 14354485 15528624 -345330 -15116959 -4119637 26000648
11743 26000648 41183379 23454239 -8068864 -24578738 -20615033 -11518959 -8510875
11736 -8510875 -7426499 -202969 10933127 15849309 11681488 8380107 13669580 18976339
11728 18976339 11558296 -3229580 -7505804 1261085 6652703 2184811 3002777 17977614
11720 17977614 30094334 21088615 -516056 -14414070 -17695556 -19129568 -17190319 -7175002
11712 -7175002 -594044 -11532305 -28603117 -26360499 -3171788 17194466 21574101 18986522
11704 18986522 14354780 -259275 -19475303 -17752193 14991588 52111021 62133820
11697 62133820 45519718 23326094 5650735 -8712263 -14285264 -4419761 10465345
11690 10465345 12046779 1542330 -420456 15687026 33564464 32804991 13913747 -5540557
11682 -5540557 -12618134 -9966831 -8268313 -12949975 -19004790 -18290174 -11082312 -6761871
11674 -6761871 -10733367 -15554114 -11107323 -252782 4308635 -1224698 -5506301 1220463
11666 1220463 11515865 9550252 -7606711 -25841738 -31865653 -27558673 -22568421 -19496765
11658 -19496765 -14815500 -11160458 -16928336 -30468803 -35479579 -20780884 2059117 11577413
11650 11577413 3723178 -5332446 -3756775 1166283 -1996849 -9500540 -7736666 6728226
11642 6728226 21902984 25063115 16022679 4439903 -1090306 1275683 8296389 14695555
11634 14695555 14802986 5321131 -10350258 -22239261 -22651044 -15393979 -11629893 -14902325
11626 -14902325 -15998707 -6853503 6473124 12486752 11885503 15724218 25827053 28501391
11618 28501391 12976709 -12468210 -30282975 -34080819 -31220600 -28540368 -25462341 -21973343
11610 -21973343 -23484198 -31696738 -37279153 -31371575 -22502776 -29651974 -53124692 -64386680
11602 -64386680 -39396070 3267440 17587917 -11430278 -43596629 -32218300 16797151
11595 16797151 54646600 51360846 24266910 3901411 -3848645 -10562547 -19702817 -25817036
11587 -25817036 -28727696 -30977631 -25942411 -4583092 26566119 47732544 48228963 36402648
11579 36402648 25945704 21744664 20907333 18129628 6968237 -15246615 -39595770 -50567907
11571 -50567907 -43327901 -28623740 -16475664 -4534865 10191576 18075968 7920208
11564 7920208 -13890401 -28713668 -28787048 -22592312 -17149079 -8822247 4244000 13515944
11556 13515944 11891760 5063361 2941459 6959659 13723316 23899207 37353150 44373506
11548 44373506 32869004 3694608 -28376469 -47721172 -47675626 -32999802 -19209552
11541 -19209552 -22049789 -37838858 -42016464 -20411705 5585152 3349883 -25199045
11534 -25199045 -43660373 -28943661 2615965 23374963 27300894 23172372 13991586
11527 13991586 210154 -9281509 -6977247 -263361 -924151 -7745996 -12037796 -12766756
11519 -12766756 -12793715 -8000983 4144274 11503882 286776 -21930443 -33539018 -28563711
11511 -28563711 -22157906 -25109940 -29535987 -24651671 -12403195 -759891 6945238 8725606
11503 8725606 -257564 -19624214 -36887855 -36881530 -17640208 6371386 16826500 7751192
11495 7751192 -9351106 -18318327 -17081353 -17852321 -25848018 -28341766 -14849965 1402228
11487 1402228 -1345320 -20967373 -33026515 -26207101 -17338705 -23655506 -36000514 -32152817
11479 -32152817 -7658825 19197226 29819566 23409564 13287719 11059427 15578994
11472 15578994 16380595 7971789 -2154813 -3858824 708994 569392 -6738517 -11092951
11464 -11092951 -5331112 4030063 6103821 -575387 -7809432 -7051766 3479983 16882710
11456 16882710 21465813 11097020 -7403752 -21133318 -24382013 -20331902 -12974513 -5837987
11448 -5837987 -5856095 -16409505 -26359415 -19656791 353551 9824385 -4979786 -27975395
11440 -27975395 -34784456 -24580075 -16715657 -20319235 -22980881 -12509969 3158556 7084799
11432 7084799 -2311549 -10120962 -8387866 -7643124 -16884119 -23264201 -8775994 16782874
11424 16782874 21710916 -2648451 -24280091 -11982051 22852239 44291438 37691847
11417 37691847 16108841 -7299134 -27289779 -33699649 -19212959 69063 -1387566
11410 -1387566 -21016172 -30052357 -16880876 -1535163 -153776 -3810400 -4839005 -15170416
11402 -15170416 -39038864 -52242168 -33350834 1612576 20006270 15397378 6570549
11395 6570549 4470223 4466186 5580346 13722592 25874351 29391885 18515089 -1002338
11387 -1002338 -21819641 -37898759 -41557151 -30443950 -14058660 -1709023 11018342
11380 11018342 31208956 50074496 51113073 33997597 15338381 6586458 4634472
11373 4634472 3860721 4601885 8575867 15833099 26088219 35136852 33587584 18954232
11365 18954232 4423852 3853440 12280053 14459447 8928289 8087367 15329240 17972166
11357 17972166 5856295 -15446215 -32905113 -37681584 -27862289 -10004021 1733300
11350 1733300 -1220653 -9309062 -6548703 5684311 9738131 -2135391 -17021756 -21312326
11342 -21312326 -18122806 -17305454 -18721996 -14947508 -4333916 7494509 16654876 24975530
11334 24975530 34869107 43385330 42633887 27120381 1043602 -24174650 -40256446 -45484707
11326 -45484707 -37622920 -13427882 19180947 39219451 33706796 13169703 -4638576
11319 -4638576 -17807677 -33151288 -45132489 -42246483 -31231587 -32856154 -50492399
11312 -50492399 -62680711 -53317628 -31736729 -14646116 -4468764 3428963 6090906
11305 6090906 -488984 -9511016 -11959569 -11703615 -19562020 -35088279 -45704892 -44251020
11297 -44251020 -38033698 -37175614 -39668739 -33327946 -12646731 10307495 17119277 5724980
11289 5724980 -5577212 -2417666 5049473 -2760020 -23694489 -33703336 -20089742 628299
11281 628299 6424601 -432108 541623 17791565 35989591 35549092 15904762 -4607863
11273 -4607863 -9442259 -564247 7379196 7304919 7243230 14416095 20126008 11162859 -7432041
11264 -7432041 -14782137 -1732097 16598425 22303944 18399551 20974901 33919186 43821431
11256 43821431 39996248 28491219 20682050 15237802 1129786 -22395665 -39384930
11249 -39384930 -36229902 -19477386 -5858145 -347671 3752834 6680545 973291 -9762754
11241 -9762754 -9067910 7316791 20549654 14093227 -3554086 -13940318 -13614510 -9885446
11233 -9885446 -3868503 5816752 12712777 12796503 15242448 25355137 27789429 8034958
11225 8034958 -18996088 -26191331 -13361670 -4075752 -9062969 -19609003 -32080765 -47564995
11217 -47564995 -49274181 -16984044 30613802 45737309 16832542 -11632281 -3824810
11210 -3824810 16832727 8846939 -23252460 -39840739 -24871019 -477530 10093129
11203 10093129 5930822 -3544049 -11515778 -13324223 -8805040 -5616045 -9840318 -16288153
11195 -16288153 -16335772 -8891475 3732027 19846957 29082813 14305524 -21537442 -44377429
11187 -44377429 -25677619 18306956 44901109 37344874 17640682 9525583 11173804
11180 11173804 9666732 4289441 4443994 12571916 18511926 11193490 -6515263 -18153992
11172 -18153992 -13206160 -2426833 -3125697 -11758068 -8271121 10178395 21159762 11153749
11164 11153749 -4013520 -6657727 -3930458 -8510444 -12068108 -1125346 15801274 21451251
11156 21451251 18454496 20710198 26677799 25290608 18284591 12119493 -869159 -25420664
11148 -25420664 -38946178 -17633623 19816057 30349481 6465963 -18037330 -22604199
11141 -22604199 -21254657 -23646726 -15921795 4819564 14407817 732967 -13018132 -7309905
11133 -7309905 536878 -11163720 -27597790 -20221598 6390786 21673977 14013521 1199672
11125 1199672 575868 11676657 25859555 33811654 25677579 887530 -23479887 -28559447
11117 -28559447 -16497296 -5850916 -7751858 -18018547 -28551374 -34357008 -32357708
11110 -32357708 -24183566 -17713704 -17562440 -18390156 -14738906 -10070305 -7562296 -1240405
11102 -1240405 12375220 22240747 15124939 -6513276 -29703231 -45463984 -47375290 -28661044
11094 -28661044 2398058 16297020 -5522404 -39184868 -43764013 -15573832 8930591
11087 8930591 6590147 -3899057 2400912 16687974 11467066 -17385311 -43184433 -40654260
11079 -40654260 -13184416 13180011 17220158 2892043 -7382184 -182861 13287661
11072 13287661 15081079 6923152 5474091 14915198 22058864 20771457 22456990 34468457
11064 34468457 44798563 39902494 24701202 12540887 6998117 7251699 19706289 45653520
11056 45653520 64548539 51111171 9666948 -26509459 -33072333 -16245700 5598157
11049 5598157 22498262 26675373 6274537 -35450650 -66766129 -57065820 -18177909
11042 -18177909 5680284 -6692756 -28874766 -27714572 -9147799 -3945374 -20411863
11035 -20411863 -36537920 -37010361 -32312145 -33667614 -31421551 -13515773 10040560 19373645
11027 19373645 12234739 1387723 -9192714 -25641241 -43153990 -44413186 -24723183
11020 -24723183 -2274684 5053458 571699 -2041256 858254 3506398 2906149 -625831
11012 -625831 -8653479 -19528570 -23296264 -13359417 -179516 -1291690 -18021824 -33326925
11004 -33326925 -34274707 -26319776 -22103197 -25577049 -32336697 -37847961 -38826693 -32308223
10996 -32308223 -20710287 -14090594 -19671733 -30664515 -33025079 -23946526 -16735237 -24138222
10988 -24138222 -41452748 -50617762 -39609083 -14707956 6228384 11126910 4653114
10981 4653114 2410984 13493589 29610785 34700322 25198462 14797776 15612548 21105972
10973 21105972 15916883 -971374 -14005023 -12756673 -4310519 587488 2439551 5256911
10965 5256911 3516884 -9818955 -26972603 -31541518 -20800502 -8444353 -3160301 2069948
10957 2069948 14523786 28563957 35764395 37075450 35338544 26186081 9274630 247980
10949 247980 14674495 42347626 53780768 34647437 992061 -22399142 -26544297
10942 -26544297 -18369764 -9953854 -13373842 -32803207 -53163124 -49329315 -18063251 10822408
10934 10822408 9766639 -10022902 -15958073 -1379126 7702519 -6072866 -27141416
10927 -27141416 -32617582 -22058015 -8804435 1848643 9996535 9822154 -821005 -8970461
10919 -8970461 -3929023 1101733 -13717890 -39912330 -47207302 -26555355 -2245112 5121799
10911 5121799 3181555 4210868 1798684 -10015013 -15102363 2043302 25627474 27816935
10903 27816935 10677996 619213 4466836 1700505 -16014631 -28639569 -23167485
10896 -23167485 -17782082 -31514482 -50818783 -49773221 -30080954 -16541869 -19291859
10889 -19291859 -23733886 -17233292 -5503087 1286500 3080780 5336394 10859126 20128409
10881 20128409 30735377 34300754 23452155 4389291 -7250985 -6822343 -7492097 -20868064
10873 -20868064 -38852749 -43172068 -29015170 -10645872 -3005922 -4367776 -1930498 7799254
10865 7799254 11934575 -795813 -21264934 -30160824 -25165995 -22829490 -29380148 -27736712
10857 -27736712 -6307233 15457189 11186666 -11973336 -21109606 -3492038 18982005
10850 18982005 24074951 15250328 6466369 1943717 1935761 10610156 24649916 28224811
10842 28224811 13453836 -5159435 -9955157 -4070960 -3159154 -11734804 -21047945 -23817691
10834 -23817691 -18585514 -4905091 14227937 29367116 33119101 26776650 12455032
10827 12455032 -11420541 -38229730 -49448853 -36396354 -15343580 -6607696 -8802348
10820 -8802348 -9254300 -8064273 -11591407 -12121770 1383455 17659258 14100996 -7585700
10812 -7585700 -21728930 -16380935 -6126468 -3437320 -2144408 3130654 4484624 -2132365
10804 -2132365 -7543191 -6840104 -6902768 -7978588 276678 14084637 11872622 -9141088
10796 -9141088 -18184062 4950402 33419082 28737355 -4543958 -30592845 -36475656 -40039928
10788 -40039928 -48572882 -45845803 -25578381 -6009743 182961 4285808 15932964 21745760
10780 21745760 7431273 -15548887 -24871281 -18350022 -11778266 -12527717 -13171281 -9100661
10772 -9100661 -5953796 -7157478 -7057727 -1289181 5455288 7901133 9549147 16227815
10764 16227815 24048287 22497088 10482905 1210089 5146762 13150903 6386627 -16551361
10756 -16551361 -33423925 -25987713 -5440322 1069880 -14427346 -32613591 -35363770
10749 -35363770 -28206938 -26061919 -27328098 -16398339 10517164 35777566 40512803 25167287
10741 25167287 4416340 -10840199 -18819984 -20183976 -16964373 -16772235 -26827917 -41285382
10733 -41285382 -44280267 -29929678 -10474431 454731 2834686 1594902 -5281696 -17635127
10725 -17635127 -22223828 -8562530 9507584 7756046 -13261502 -26796019 -17193034
10718 -17193034 944144 7919503 4198630 -694751 -7274523 -18609469 -26582990 -22659479
10710 -22659479 -14015101 -12848832 -15842393 -10299600 3053738 9159096 -2055 -16157730
10702 -16157730 -27464007 -29965912 -25946942 -19709620 -15377838 -12667428 -6952208 965355
10694 965355 728145 -13827674 -32848262 -42295358 -41696298 -39048462 -34748380 -24880921
10686 -24880921 -15383893 -15943535 -21314922 -15949485 1392984 14402813 14597490 14053161
10678 14053161 25150464 40030650 40087182 19464701 -8089228 -22683156 -15845076 2132935
10670 2132935 12570544 9501962 6234443 14735844 26004466 23228106 8481479 -291809
10662 -291809 3512306 9257537 10920587 15374285 24775203 30134373 29782197 35630613
10654 35630613 51067367 60445519 53502344 43577149 44985299 46616882 29196953 447552
10646 447552 -10054680 9115567 35802248 43010546 27894728 6015717 -10402133
10639 -10402133 -18627944 -17766109 -7267967 6847723 13424237 8270277 -202781 -2957334
10631 -2957334 -3886727 -12434468 -24433822 -24243064 -10839100 -6073452 -23856732 -44286164
10623 -44286164 -38379623 -11060640 4196961 -7402318 -24741845 -25771287 -15832586
10616 -15832586 -10118942 -8425239 -2468254 6977963 15546661 25596592 36655995 37227107
10608 37227107 21770062 5788054 6905930 18315348 18670462 3846992 -8838530
10601 -8838530 -6965035 2707754 8300482 7724288 5309180 2850781 -1457513 -9662783
10593 -9662783 -20773856 -27982853 -22014452 -2327111 18035467 24575745 15803067 657776
10585 657776 -14226118 -27399913 -35399520 -31298845 -12863211 11490807 27845668 29900358
10577 29900358 27159733 34319001 48180148 44905282 12997264 -20306152 -17917127 14470265
10569 14470265 32204106 13417277 -13311537 -17442725 -12288594 -26645421 -54248095
10562 -54248095 -64894842 -53301060 -42802543 -43942916 -40573578 -20815987 3093094
10555 3093094 12460449 2082098 -21027643 -43654788 -49966366 -34111563 -10258417
10548 -10258417 2503013 2682212 888998 -832583 -5451745 -3775242 14461579 34142936
10540 34142936 26010072 -11291434 -44340232 -47218459 -29480106 -14127392 -8170706
10533 -8170706 -5631915 -2548105 2795267 12117633 20743733 19716114 10194375 4741799
10525 4741799 10066337 19486145 24455443 21628883 9332279 -7991143 -14119397 889504
10517 889504 18638818 12036640 -11887551 -16105466 13135379 45089896 48045869 28136986
10509 28136986 10073455 2997715 3145656 10361042 22924855 30506586 27767661 22975629
10501 22975629 23586615 27877078 36236291 50646482 59022438 46840205 28985214 35551366
10493 35551366 58559401 57463868 32494309 34833110 69408789 50858613 -78499659
10486 -78499659 -232911886 -269395383 -171151564 -61208915 -34075515 -57576977 -60116086
10479 -60116086 -34910088 -15359697 -7542816 177177 -2052387 -27083093 -56755317
10472 -56755317 -65505425 -59077233 -56677997 -53725041 -35873971 -13740006 -8789750 -15108060
10464 -15108060 -8085548 14570032 30077901 25869034 11162474 -5398796 -24749640
10457 -24749640 -42108517 -44558123 -29528543 -10733816 -1621086 -3358171 -9670459 -13689641
10449 -13689641 -10557891 -1492038 6599484 11005934 16221953 21003544 13651211 -8908415
10441 -8908415 -28839130 -28820761 -15950220 -7877988 -4256787 8237270 28304064 39267710
10433 39267710 35434312 29330446 29715140 29317623 19605372 4912868 -3459296 663069
10425 663069 13376787 21230149 10092502 -17437477 -38666217 -36276428 -20890649 -14083738
10417 -14083738 -16577284 -13358243 -5397094 -10281403 -28209892 -33719485 -12715629 13801980
10409 13801980 18883081 6481148 894047 9447348 15285140 5332401 -11052412 -16079929
10401 -16079929 -6842644 2391700 -572283 -9917478 -9556796 4743321 19119012 20763581
10393 20763581 13605488 7185674 935676 -6795903 -4264658 18302838 43512030 41467535
10385 41467535 12017534 -11837388 -9921458 -188634 -5331698 -16948388 -13291791 3527348
10377 3527348 12094773 5508405 -2274055 -2266069 -2343567 -9608199 -16751856 -13813344 -4388547
10368 -4388547 -1758753 -11329041 -22479908 -19890830 -1584275 18243417 26319499 24378162
10360 24378162 20095294 11457121 -6651113 -24407453 -23470092 -3342461 15880570 21216700
10352 21216700 19628924 17807110 9518268 -6662771 -16916787 -13469981 -8406935 -11216863
10344 -11216863 -11455415 -2255290 -1488502 -24564693 -52072284 -53939047 -35197169 -25839183
10336 -25839183 -30328779 -21298305 13081905 46452845 49111143 22307897 -12100261
10329 -12100261 -37088476 -46642927 -43174763 -37051327 -35856260 -31066903 -10511601 15645935
10321 15645935 22152651 5746492 -7169754 2683420 24373182 39459388 45838186
10314 45838186 46546269 35911236 13678959 -3533779 -2369835 7785096 10138709 3634349
10306 3634349 -2808651 -7096410 -10960290 -11498097 -9288162 -13305283 -23920129 -23540668
10298 -23540668 -348346 29451034 39733874 25831861 2970850 -15807607 -23799280
10291 -23799280 -14560920 8134002 23135144 15528156 498466 3041714 20822986
10284 20822986 30154483 23856934 17577761 19016511 16842138 5092451 -4281269 -1369095
10276 -1369095 7209208 11480462 10920513 8123585 3510389 1234262 7281425 18208481
10268 18208481 24662531 27102970 32556093 35598372 22580097 -1681635 -13245590 -2809241
10260 -2809241 10649962 9701641 972084 -4541873 -12014548 -25813505 -30608608 -11678261
10252 -11678261 18215307 33710754 29610273 18857021 6679841 -11080666 -29525044
10245 -29525044 -37425603 -36393482 -36175317 -32721757 -14505905 8255465 7609660 -19962079
10237 -19962079 -40431130 -27368984 -61117 4816466 -14359286 -25871110 -14174467
10230 -14174467 -780325 -8680469 -27131401 -27405539 -3072848 21939316 23737857 3832140
10222 3832140 -18661907 -30288716 -32405776 -32497151 -34080683 -35502979 -34376400 -31207550
10214 -31207550 -28923198 -28508521 -26051733 -17468378 -6586009 -3328476 -10968506 -20468395
10206 -20468395 -21892206 -15740726 -7056813 4213467 16455737 16999470 -3617335 -29441561
10198 -29441561 -31221705 -6575894 11567752 -886525 -23933986 -21387447 7773562
10191 7773562 29649029 23071639 2547465 -9799687 -11833515 -10129971 -678523 21107428
10183 21107428 41846552 41095081 18654423 -4256272 -11790784 -8489329 -5153210 -2316146
10175 -2316146 5369327 16539336 23086268 19608737 8266083 -2886834 -4271199 6703667
10167 6703667 18412616 14772593 -1361177 -4810580 19311160 48131750 45653667 12628130
10159 12628130 -11715178 -3818731 13293166 9410139 -5055094 1760353 28821084
10152 28821084 40806598 21838178 -1335905 -713346 15008429 20787644 12440902 2271776
10144 2271776 -7126665 -20232710 -28242411 -16902826 6308356 16071055 4505845 -7317063
10136 -7317063 -412475 17054144 26302421 25075651 24174401 26323543 24469786 18218978
10128 18218978 17361506 26169236 34322680 29062450 11533800 -3793755 -4531461 7515816
10120 7515816 19164150 19181071 8379612 -3270986 -8481720 -9421587 -11741500 -14502513
10112 -14502513 -10279698 3771120 18692909 21598994 10131653 -5080294 -13401493
10105 -13401493 -14929653 -15289567 -15431320 -13988217 -15947531 -27520301 -41454775 -40112035
10097 -40112035 -19090326 3608650 11105732 9733815 14650026 22463429 16626107 -3371458
10089 -3371458 -18949536 -21184966 -21711868 -26482183 -19126180 12663745 48409406 54368934
10081 54368934 27200125 -1602959 -5757261 8328163 18640597 17570573 15525018
10074 15525018 22251021 33608988 36043292 21391064 -1955075 -14525117 -6577782
10067 -6577782 9577132 14983315 8048388 2140398 1545651 -4266496 -19196332 -30593914
10059 -30593914 -29852536 -27034038 -31361314 -31644053 -15469114 3013891 -158285 -17789401
10051 -17789401 -16200482 12665960 32224906 11841771 -25846882 -34004078 -5441168
10044 -5441168 22121909 22250544 10804508 12003824 20987846 20427650 15764332 26003165
10036 26003165 45407528 43630310 10893414 -21177747 -19366154 7299337 23481803
10029 23481803 16793373 6726019 6337360 1996155 -18220151 -37522212 -30694065 145822
10021 145822 29187428 40675550 40861063 38640557 33124494 23365792 14152445 6621832
10013 6621832 -3317938 -11989943 -7874680 7885332 15818322 4670104 -9357065 -5001978
10005 -5001978 12572286 20937312 15161083 12697875 22550663 28835210 12677675 -22421593
9997 -22421593 -55122086 -67536173 -56363300 -31317874 -8604694 881121 1705474 5714053
9989 5714053 11701094 5282144 -14715787 -24541235 -4906342 27868707 39023369 19882669
9981 19882669 -4658896 -14160765 -16720407 -26714473 -38348009 -38111642 -30947173 -33599575
9973 -33599575 -46125791 -49200186 -31676735 -5314430 12498651 18196695 18566007 18268085
9965 18268085 17738678 16412600 12460505 4541117 -3643081 -6910724 -7086658 -8711371
9957 -8711371 -7187893 4309659 14994517 3664909 -26645168 -42973239 -25761661
9950 -25761661 2532057 11201514 3757178 1302124 1074279 -15149135 -40628243 -47284881
9942 -47284881 -28727117 -7323676 3063069 10190062 17085641 15175857 8524031 12221911
9934 12221911 20793461 12514539 -8263088 -11381975 7359590 17308582 9075953 11773225
9926 11773225 34117134 40689072 16454152 177114 14565279 21397614 -2331788
9919 -2331788 -7496092 32952583 33118774 -95021180 -272322484 -318212754 -190063707
9912 -190063707 -37934897 7275790 -15182622 -8896718 24610750 28903071 11387967
9905 11387967 19107895 40871007 27995061 -10794530 -20408388 5445562 17475622
9898 17475622 -2098894 -15973774 -1993923 15635700 17704028 17830072 23906483 20293141
9890 20293141 5307809 2901646 18935821 25379813 7066428 -12207921 -10400351 -360251
9882 -360251 -524687 -3308102 3174826 8503994 599944 -8912671 -5312418 1325462 -6155385
9873 -6155385 -20940366 -23597854 -13882737 -7793351 -9935250 -10438018 -5657698 -2995009
9865 -2995009 -6338866 -11997244 -18074510 -24787229 -26805805 -18045303 -4217148 811549
9857 811549 -7116740 -17295793 -18801970 -12427379 -5045837 1127378 7969877 13161367
9849 13161367 9681924 -3295284 -13748319 -8508241 8764408 20407327 18690534 16321047
9841 16321047 25331559 36116674 30809012 10612582 -6002695 -9394533 -7011992 -5958631
9833 -5958631 -3555115 1810322 4959960 3592165 1391933 -2271893 -12978567 -26811599
9825 -26811599 -28469839 -11478379 10345979 19931590 16867179 11864183 8565214 1189633
9817 1189633 -11989803 -21713243 -17431940 -1136356 12843110 14767731 12519954 19294183
9809 19294183 30411556 28050387 12833861 9417571 26927959 36081903 10599688 -25967907
9801 -25967907 -28155369 5400149 30600084 21777733 -1032037 -15254785 -27360695
9794 -27360695 -44692869 -49913183 -28336001 3158045 18726723 17356213 13290964 9600042
9786 9600042 2193971 -4465112 -5830102 -8620778 -15873964 -14794934 2391863 20957846
9778 20957846 26962765 31679631 49111125 64305876 52551020 20473646 -1150335
9771 -1150335 -774940 5252210 5201964 6289111 14488926 22910307 23793516 14747048 -5792749
9762 -5792749 -31272271 -39932621 -18061170 12790454 18318266 1159720 -1424769 25155703
9754 25155703 48955864 38558782 6844356 -11980957 -8840819 -1332455 -2021279 -6538077
9746 -6538077 -6925403 -146468 12653411 22996205 16822899 -8022265 -31067159 -29340687
9738 -29340687 -6012929 12944626 9624885 -9710824 -29677280 -44212693 -53853975
9731 -53853975 -53844032 -36814448 -7673513 14008180 13663356 -523991 -8353445 -4150529
9723 -4150529 -477060 -3750451 -2741184 8717414 13908621 -3152762 -27212990 -28877846
9715 -28877846 -8319802 4168297 -5779365 -16693802 -8293770 5643406 231256 -21323816
9707 -21323816 -33919661 -28279343 -21115592 -27660664 -41026914 -44277313 -33182669 -20430914
9699 -20430914 -19832955 -30153261 -37253808 -33478067 -29031273 -35284482 -41368519 -23999353
9691 -23999353 16669768 49630066 51474236 35867820 30122042 36662097 37275577 26023533
9683 26023533 15207474 11574243 8280303 1995044 -1503187 -2357563 -8869356 -19343262
9675 -19343262 -19605237 -6206978 5539929 6841046 10696912 26997519 38937318 25479381
9667 25479381 -3529620 -19053732 -14938221 -12532699 -21838012 -24650031 -6145566 20006450
9659 20006450 33568221 35972363 37754629 33619334 14408932 -5692073 -1950435 22001651
9651 22001651 35020239 23034534 7208568 7812605 14678204 9880993 -1631702 -6093461
9643 -6093461 -9231617 -24090773 -40134789 -33509522 -6989646 7988310 -4900386 -24723321
9635 -24723321 -25116138 -8830546 2842963 970028 -5065563 -4069222 6194938 19342303
9627 19342303 23746662 11583987 -9839394 -23215609 -22096582 -16668341 -14407947 -9580817
9619 -9580817 -945946 -3380549 -25493732 -48093226 -45077189 -18847108 4849532 12580068
9611 12580068 12668884 11158838 1999585 -14167153 -22709719 -15736954 -3825157 1970486
9603 1970486 4948758 10135653 11503579 3714682 -5795992 -9053274 -10554546 -14750422
9595 -14750422 -12201729 4599425 20572224 13900754 -10492496 -23501517 -9760721
9588 -9760721 14148151 23390546 12352960 -5789596 -13937055 -1730814 25143179 41876107
9580 41876107 25191379 -16428398 -47338979 -47056003 -32376806 -27061308 -27683564 -18021622
9572 -18021622 -2595197 60966 -8002081 -3665087 19284727 35588909 22557098 -8851560
9564 -8851560 -29929418 -29082639 -17742294 -9838085 -8711932 -10770246 -11088256 -5955459
9556 -5955459 3325859 10666722 14006184 19931865 33087523 44927059 41515728 21212395
9548 21212395 -3253464 -20070121 -27891887 -29170554 -22915677 -9865627 636331 -2386296
9540 -2386296 -16869886 -26527193 -18904491 -1484468 6355841 -2794583 -15656554 -16346052
9532 -16346052 -6180907 753360 -3640265 -15179384 -25792270 -28908454 -19749631 -1521259
9524 -1521259 10340409 3179540 -12968296 -14678450 2647294 17294376 12309784 -1794138
9516 -1794138 -6089496 -689617 1517854 -2081693 -3832230 -2610021 -4264038 -8248462
9508 -8248462 -8436616 -5613229 -5793908 -7433712 -3533297 4135978 6209692 1651954 -420101
9499 -420101 3637123 6957400 5130061 2261900 776090 -3587477 -12271918 -19337195
9491 -19337195 -21053354 -21775897 -26381093 -34051009 -41562531 -44696617 -35766464 -10725558
9483 -10725558 18544086 30491249 17505423 -5815779 -21423429 -24717131 -19748287
9476 -19748287 -10390967 -2362377 -1882536 -4945163 471049 14046691 18497843 5632571
9468 5632571 -7425924 -3471698 5725295 -3738373 -28560820 -38996544 -20704013 4580069
9460 4580069 7812607 -12842584 -35876749 -44256252 -38457292 -27370049 -17312818 -10842600
9452 -10842600 -9409518 -12626423 -15744245 -11913529 -745470 7164374 1031085 -13862467
9444 -13862467 -19894286 -11804731 -6685196 -18459067 -31915213 -19853550 16531367 44063038
9436 44063038 39159926 15636669 1387855 2231121 3861874 87447 171166 8670854
9428 8670854 14576202 6834964 -9461425 -19940652 -18342499 -9881212 -18248 12453171
9420 12453171 28861152 41687435 38097211 15243549 -10794585 -18137796 -3947615
9413 -3947615 10214645 4794086 -11115348 -11530909 8555291 22745276 8346661 -22032932
9405 -22032932 -38236068 -31972224 -19208711 -7848594 12495157 42968854 61622680
9398 61622680 52831288 33769200 31278710 41975956 37021676 3751545 -37306516 -58603442
9390 -58603442 -52472545 -29815128 -7692440 -1748904 -15315369 -29872663 -20257362 13201521
9382 13201521 40033619 34947213 6309720 -18920986 -26925216 -23008648 -16032436 -10014692
9374 -10014692 -6211494 -3327934 1049138 3699767 -2362893 -13835190 -15954897 -4049960
9366 -4049960 6191141 2406879 -3167838 6575334 22943883 22363391 3297957 -10632890
9358 -10632890 -5432732 6274904 7569146 -1509473 -11462949 -17257321 -18432542 -17541659
9350 -17541659 -22253816 -36048306 -45047795 -31176910 -2362976 10453742 -5130958
9343 -5130958 -25051362 -25045785 -13866567 -11288313 -11808331 2993665 26893290 33974997
9335 33974997 19630631 7928064 11973841 12552255 -10253864 -43290261 -56298186 -41528720
9327 -41528720 -19742690 -9607796 -6468884 4587086 24187802 35136255 22856003
9320 22856003 -5327568 -25765540 -24255762 -11848867 -10473766 -25828305 -41555674
9313 -41555674 -40289452 -23256646 -6070704 -65130 -1817489 498005 12557837 25906106
9305 25906106 26066567 9859874 -9132149 -16077385 -11342721 -5356063 -1963087 3244836
9297 3244836 10402496 12799652 7920170 1100858 -2816345 -1644735 9586053 32508203
9289 32508203 52795000 50963234 31246870 21081403 32147221 41931529 29710940
9282 29710940 10770847 10663103 20903284 11800120 -17155423 -33990756 -24156254 -10544330
9274 -10544330 -12753949 -16598582 -2561363 19755617 28518703 23788366 21416146 24853144
9266 24853144 25238821 20327733 12151964 -5227860 -32872210 -50120056 -37297136 -10894563
9258 -10894563 -6417712 -25239453 -30641324 -5250730 19940565 11897542 -16558448 -30167987
9250 -30167987 -22534825 -15029467 -16282116 -13307729 -253208 11817038 17260607 24182476
9242 24182476 33460683 30274625 7607502 -17768517 -25701345 -18012635 -10790914 -9256988
9234 -9256988 -3978055 10140135 22453505 17308928 -7417449 -33738882 -37155293 -11946325
9226 -11946325 17446758 19233432 -8301610 -32067029 -23376563 7982960 29106530
9219 29106530 24777135 8332577 -3633634 -9450343 -12550013 -10150811 -1153697 5518674
9211 5518674 1474752 -8628210 -15360411 -20082066 -29782018 -38520406 -29658376 -2451381
9203 -2451381 16845878 3536262 -31721791 -52515518 -40398656 -14118077 472129
9196 472129 4211174 14000157 29223269 30980017 14928423 2586166 10494557 25922469
9188 25922469 27458994 15986302 7389403 4157547 -4645293 -18714496 -23111016 -11455964
9180 -11455964 5674857 18530941 26722268 26682685 11200954 -10479008 -13277684 8578695
9172 8578695 24889591 6918095 -30903517 -47245365 -25252006 10980779 27979936
9165 27979936 15355058 -10466395 -21487874 -1053694 35891873 51605849 28263220
9158 28263220 -6886864 -16484098 -2894564 1382602 -13815230 -24523463 -15142075 -962957
9150 -962957 1898002 1041654 7346115 13622916 10993393 7046096 9792086 10169407 -1727412
9141 -1727412 -17809834 -26448125 -30992125 -36494822 -33997795 -18768728 -8864107 -20378816
9133 -20378816 -35816413 -25175668 7593179 27399664 16189427 -7784806 -21001460
9126 -21001460 -21084291 -17447512 -16457971 -21996644 -33490158 -38904062 -26321657 -5839041
9118 -5839041 -2069603 -20279486 -38015602 -36656299 -23768750 -15890830 -14946806 -11687856
9110 -11687856 -379020 18332570 39191559 52059702 50897677 45239126 48138609 50994611
9102 50994611 30691041 -11517057 -41020444 -33825354 -9788347 -3151097 -15379070
9095 -15379070 -19928638 -5115185 11463340 10966050 -2982622 -13183437 -10351414 -1609230
9087 -1609230 -2459097 -20265157 -43152987 -49967749 -34981310 -15737526 -11048886 -19507472
9079 -19507472 -27173941 -27925103 -26255858 -26624683 -30315732 -37614589 -43600642 -37296673
9071 -37296673 -15310498 8031660 14319022 1976190 -14305759 -20632468 -12679460 6187251
9063 6187251 25232320 30045489 17335545 2533043 1852863 10387046 9829926 -4715536
9055 -4715536 -18893016 -20321804 -13177763 -8254708 -8181918 -7628183 -2829746 3286095 4132910
9046 4132910 -2866358 -11573701 -13386752 -8826368 -6645897 -9509623 -9694509 -3745646
9038 -3745646 -786932 -8049347 -18091225 -20607133 -17602689 -15368817 -11144426 -1957058
9030 -1957058 2138871 -9399429 -28019312 -36254784 -32376610 -27367789 -23304808 -15818509
9022 -15818509 -13387648 -28301315 -48018472 -43902627 -15491000 1958084 -12768018
9015 -12768018 -35622221 -34758010 -16158681 -6403243 -6805535 4097293 28622665 41673063
9007 41673063 28468757 5054054 -8321873 -13801594 -22450795 -29822647 -23080998 -5769744
8999 -5769744 2290014 -8660049 -24654690 -25279562 -6544868 18143805 33288534 31845105
8991 31845105 15964654 -4759289 -17867289 -18195545 -12642680 -8719257 -1887111 14955790
8983 14955790 31667093 27605493 3794597 -9215612 10551776 43536456 52022303
8976 52022303 28827352 2351782 -4257515 2830018 8447791 11810869 18611579 24668988
8968 24668988 21610448 11638357 4929539 5366229 6792521 1710551 -10890696 -24155175
8960 -24155175 -27915599 -18987234 -7921054 -8952967 -21907624 -32403157 -31935242 -26935163
8952 -26935163 -23543062 -16106821 67373 15497989 18149618 10194855 579246 -11500001
8944 -11500001 -30151759 -45433748 -41921226 -24926871 -18308326 -30413844 -41066998
8937 -41066998 -33147217 -19434229 -20368309 -28093184 -17075656 12579346 28353729 9643646
8929 9643646 -22275640 -33184685 -19745272 -5841153 -4291985 -4411179 2387143 5784759
8921 5784759 -5626053 -23285318 -27046053 -9325629 16432174 28595806 16047540
8914 16047540 -10934263 -27090123 -16411383 8800700 21542107 13028421 -721963
8907 -721963 -7550474 -16551324 -36520125 -53585730 -47778245 -22239892 1727102 13013787
8899 13013787 17687878 21942063 24505887 23950445 18737132 2495295 -25610778 -48745852
8891 -48745852 -47890576 -28360847 -13168141 -10605077 -8541458 -2189411 -3568352 -15490494
8883 -15490494 -19512876 -4296947 12814644 10304558 -5449633 -11945116 -5058843 -1722853
8875 -1722853 -11970050 -26632269 -33354039 -29807775 -18608180 -1892225 14620270 22013127
8867 22013127 18081909 10332464 4792255 -1766007 -12433716 -18308193 -6112000 21272047
8859 21272047 41670147 38479877 22659316 18483223 29217821 32243784 13498078 -9116350
8851 -9116350 -9709450 9792455 24642538 20793058 4753879 -15963086 -40900878 -63352120
8843 -63352120 -69352442 -56826626 -40114060 -29159146 -18663170 -3468505 10931608
8836 10931608 20353592 28825275 35440243 30460613 14537198 5277834 11807960 18748173
8828 18748173 11385151 1690087 8640350 23605229 19941895 -5695600 -24904597 -15293492
8820 -15293492 10127858 19418083 -1665757 -36025752 -54054651 -42592670 -15916273
8813 -15916273 1855122 2549054 -3744549 -8557868 -12962360 -13800424 -1077165 20736171
8805 20736171 26884579 4031283 -26829668 -37896002 -32002262 -30632242 -36113782 -33470990
8797 -33470990 -24337869 -27996777 -45560628 -52178502 -34504378 -11337970 -4176526 -8124859
8789 -8124859 -7276161 -1595934 -835184 -4030514 -3037681 786176 -627178 -6471238 -7132086
8780 -7132086 2461387 18850713 35675413 45100473 39492406 21938339 9828458 15885381
8772 15885381 28836205 25835604 3340483 -17567393 -19182616 -8715430 -6310533 -20122264
8764 -20122264 -40028660 -51020342 -46815292 -32894761 -20466423 -15992131 -14680683 -7076462
8756 -7076462 6402357 12330470 -110793 -23813964 -39319308 -34301737 -13156843 11073085
8748 11073085 28347801 34818338 30742374 19666547 8047282 2387235 5029989 11704769
8740 11704769 13993558 8125263 2440366 9623280 27030540 33645634 17733562 -86606
8732 -86606 10029547 42181223 55661445 28680844 -10597666 -21630304 -1478134 22459188
8724 22459188 33590324 34331019 23967320 -996869 -26163357 -28766903 -12453740 -5663156
8716 -5663156 -18225736 -26408333 -12488274 6974791 9112832 -1765249 -8824932 -11689257
8708 -11689257 -17820356 -20177924 -9114969 3039104 -4612162 -27350739 -38042558 -24897500
8700 -24897500 -5448102 -488844 -11861490 -29385293 -43665130 -47081818 -35766969
8693 -35766969 -17104983 -6224468 -10582744 -24163606 -36983254 -42362267 -36091605 -19045136
8685 -19045136 -1520204 4759536 339584 -4481735 -5219083 -6285061 -9044590 -9155537
8677 -9155537 -8327271 -16232890 -34331509 -47277549 -38835145 -11657694 15198221 25689181
8669 25689181 19090562 5553084 -4957456 -8161269 -3619401 7530286 20400742 25513860
8661 25513860 16862924 1016587 -8784323 -9274687 -10465182 -19661943 -30573288 -32768359
8653 -32768359 -23979876 -8316129 8886050 18917157 12689416 -6111745 -20273214
8646 -20273214 -20067545 -15361726 -17307546 -19148893 -8620146 9732220 20371402 19381443
8638 19381443 16079276 15295320 12372345 5082332 -1185511 -812184 6384148 14882292
8630 14882292 14962325 1260200 -16227671 -20733497 -13466008 -14095413 -28233421 -34937771
8622 -34937771 -21797628 -10351724 -22843542 -42457944 -36779507 -8488061 9678626
8615 9678626 4512857 -4146549 2310718 20989092 40171856 47489392 29581405 -10200214
8607 -10200214 -39440264 -30840169 -2484410 7587454 -1495105 -1080535 8567810 -3241133
8599 -3241133 -36317370 -49082434 -25800080 -5882405 -21951754 -51734751 -60068525
8592 -60068525 -50102760 -41137718 -30689277 -13798131 -9784388 -32152184 -55970074 -51533574
8584 -51533574 -29425554 -17065015 -11595723 5867230 27357062 30600508 22439561 29235885
8576 29235885 50273901 58190484 43114758 22850815 10523044 2217921 -4569292 -7347984
8568 -7347984 -10682207 -17211625 -13551496 8747754 28108637 19199764 -5360462 -13549559
8560 -13549559 -5445675 -7584420 -21177945 -18933769 4635386 22200661 19735503 13182955
8552 13182955 9923184 -5350118 -32459863 -43426098 -27102585 -9872955 -11172999
8545 -11172999 -13260220 1123075 14903106 9130776 -700612 6817199 18942119 11710372
8537 11710372 -6687670 -11116447 -3593161 -5831049 -16602800 -12879223 8604060 24467656
8529 24467656 22488869 16836577 19000289 19322918 7661178 -8173281 -16338489 -17776179
8521 -17776179 -17511106 -11265419 6385954 27170995 34779992 25136219 12831243 13706161
8513 13706161 24279290 24325333 2521311 -25687855 -33530852 -14367570 11696044 22995181
8505 22995181 17701510 8206536 5800010 15039753 31889792 42178158 33092834 11635567
8497 11635567 -39399 7186055 19293170 22508859 20013437 17268856 10094403 65175
8489 65175 1842824 17786904 24543074 6943646 -12427342 -4534620 19563463 24860898
8481 24860898 5952845 -9817121 -9655155 -10088058 -20552972 -26850562 -21534133 -19784612
8473 -19784612 -29895768 -34914633 -21961496 -7158106 -10890817 -26049476 -31642639 -24269909
8465 -24269909 -15953237 -11296575 -5961755 -129018 3325698 6921459 9674388 -1126340
8457 -1126340 -31579256 -61468024 -62549571 -34401655 -4564933 6578747 4554626 3190658
8449 3190658 4800973 4474722 3083095 7443011 20164783 32872811 31158015 10532315
8441 10532315 -12718996 -16472073 -2016534 5363938 -6611729 -16684491 -3263595
8434 -3263595 17615831 13511926 -13318358 -26118702 -6206038 23585622 36291503
8427 36291503 35476448 38165769 44484633 43515493 35917679 31243145 29232736 20497904
8419 20497904 4561312 -4725387 6005189 33496490 56481111 52146135 20326985
8412 20326985 -10605373 -12324643 10154268 26983770 23981903 15902997 17079218 22349777
8404 22349777 26742631 39915384 63433788 73758519 50656143 9734521 -15149703
8397 -15149703 -12908902 503708 9404057 10177475 4090089 -2182540 3151554 17623289
8389 17623289 16650423 -12432171 -40614928 -30686422 7014654 24983491 3340329 -28240965
8381 -28240965 -36245826 -19202873 8083948 34529881 47004160 34368542 10138815
8374 10138815 4245136 19702243 24941641 2574819 -24557848 -33781658 -37041503 -49692629
8366 -49692629 -54562757 -30758138 3371081 12818303 -1942298 -11073953 -5215855 -3498937
8358 -3498937 -13952301 -19856015 -10088599 5109982 15330454 23233321 29448329 25364924
8350 25364924 10288206 -519197 5448645 21254508 28079271 12912828 -20410877
8343 -20410877 -49866672 -50147374 -20577269 8352783 10594185 -1449993 2847440 26283515
8335 26283515 42935133 39891080 31309941 27072591 15778487 -9580059 -32074086 -32306325
8327 -32306325 -14139133 3811549 10552938 6932160 -1157198 -5228114 276397 8970587
8319 8970587 8917982 735716 -3503687 -1186339 -2399287 -8999175 -9954639 -4236280 -7682290
8310 -7682290 -26241043 -41807920 -38490503 -25868045 -21128915 -23656555 -23579416 -21549389
8302 -21549389 -22489892 -21260844 -12035355 -2280763 -881143 -1602421 5337203 14779457
8294 14779457 17094762 17989518 28585184 42704864 44069677 31713454 19036080 11042700
8286 11042700 1902469 -7046316 -6705862 2298428 10070640 15745967 26421796 36689005
8278 36689005 30337283 7990175 -7223520 -1441095 9482464 3692335 -15728224 -27703934
8270 -27703934 -22649032 -10955004 -5586921 -8350418 -14037079 -19275642 -23334439 -24031177
8262 -24031177 -17839559 -5867943 3068691 565064 -10224214 -18244340 -20348845 -23484534
8254 -23484534 -27371260 -18864159 5974630 27439085 25771375 8853791 -2413484 -7050291
8246 -7050291 -18395215 -31460416 -25718781 -3370559 5438047 -13276518 -34785332 -33299475
8238 -33299475 -18845975 -15885190 -23793543 -23199985 -10166896 683216 2362588 3527331
8230 3527331 11388757 23306375 34382806 39662577 31886990 11407531 -5280220 -2632633
8222 -2632633 11085596 14711221 5767518 1854129 9492989 12875202 836014 -14037259
8214 -14037259 -15175666 -6239188 -1153291 111499 9771633 29693895 44776175 41193806
8206 41193806 22775312 5608703 251737 2327722 483185 -7920623 -12526669 -4425612
8198 -4425612 8543511 8423925 -10254896 -31721021 -35952976 -19177045 5636302 23606002
8190 23606002 28905454 24518472 16675528 10250463 7265212 7536346 8851894 7628789
8182 7628789 3917895 5383438 17855477 29742308 19220631 -13652765 -36317429 -22762245
8174 -22762245 7995565 16751568 1142746 -3046318 19662368 38871214 26044201
8167 26044201 -2768961 -15869066 -13574860 -17234547 -27008715 -24067567 -8123393 -659343
8159 -659343 -10011882 -20551608 -19764511 -11698588 -63530 16978166 29177604 17484052
8151 17484052 -13334370 -28787229 -7907868 25570746 33114000 9015102 -19459853
8144 -19459853 -29165949 -20565836 -6933607 -943617 -8800122 -23721203 -27274614 -8918070
8136 -8918070 17826006 29219169 19140420 3181401 -2596817 3412124 13133194 17904698
8128 17904698 12317274 -2160011 -16085801 -20990575 -19331391 -19940357 -25551075 -31657413
8120 -31657413 -35154056 -35285237 -27588623 -7728809 16712003 28231658 18283337 -2188517
8112 -2188517 -15840579 -17864352 -17148739 -21980047 -30237621 -33901918 -29275628 -19748964
8104 -19748964 -8877369 5219626 24272697 40725416 42202692 27996949 13256729
8097 13256729 10163424 11380412 1953179 -16316210 -25232555 -16340114 -4150624 -6378615
8089 -6378615 -20000289 -27344275 -21934876 -16385019 -22190905 -31269233 -25298447 160018
8081 160018 28811213 41475728 34489260 17940595 1592960 -11758305 -21790901 -26250273
8073 -26250273 -22569543 -11234269 3009699 12713860 13093220 8248557 9005073 20718589
8065 20718589 35460474 40108190 30169178 12424095 -3143615 -10680297 -11436233 -12708799
8057 -12708799 -19395063 -24765391 -17858033 -2706296 3037449 -4331426 -5153509 11670083
8049 11670083 25015185 11732545 -14082153 -20532544 -7451918 -3752463 -18217997
8042 -18217997 -27821184 -18732244 -4681731 3370225 11931282 18542667 5755766 -22959012
8034 -22959012 -36220423 -23319554 -14805821 -30529139 -43463169 -27375786 -6157984
8027 -6157984 -14475808 -36784785 -32695554 -4660325 8609192 -3896333 -16192436 -16244947
8019 -16244947 -19744733 -30705101 -31649629 -20095624 -16134224 -25176592 -28596342 -19918592
8011 -19918592 -15668841 -20512416 -15728204 5424832 22627197 21594907 12386100 2743304
8003 2743304 -15523941 -39212436 -44441817 -23480779 -3071679 -6254345 -20783266 -24899917
7995 -24899917 -20340203 -18651525 -16510872 -7036965 1768997 -23390 -7882199 -15015324
7987 -15015324 -23693392 -30120056 -19105276 8504706 24183235 8172583 -21126845
7980 -21126845 -35224881 -34872321 -38405269 -46858181 -45925235 -32492005 -17262868 -8335582
7972 -8335582 -8582554 -19586964 -33709189 -34497442 -19056008 -5799209 -6155026 -5708055
7964 -5708055 10723438 33584541 45621694 45772747 38426274 20147123 -2680245 -6584738
7956 -6584738 13510766 24554654 223707 -35913613 -44455803 -27584316 -16346090
7949 -16346090 -17556941 -13358771 -2195538 679961 -2687193 2732603 10606715 851588
7941 851588 -21164491 -29730725 -20433695 -9800379 2518693 29377799 54909164 44103839
7933 44103839 863755 -28085372 -19397419 -1103234 207487 -2121045 10167437 25419397
7925 25419397 27817680 26053285 31042745 32875234 23683734 16866228 20323516 17364098
7917 17364098 -1428894 -14755521 -6491603 1965884 -12435782 -30432021 -20313741
7910 -20313741 5983273 8325469 -18516746 -38179961 -29480719 -12854502 -12732604 -24720813
7902 -24720813 -32748919 -35035825 -37780619 -38590373 -30894405 -17231212 -7702774 -8138933
7894 -8138933 -14923211 -19832260 -18302297 -13945281 -13891964 -19270316 -24104455 -24040513 -19852304
7885 -19852304 -11741081 650188 10712342 8824090 -2201624 -7685415 -1861597 5334291
7877 5334291 7863547 13914910 27717536 37573487 34002540 24107289 14733514 -1524166
7869 -1524166 -26639043 -40680146 -27350589 -3095249 3601069 -6982780 -10251203 3804456
7861 3804456 21066264 29005331 27403774 15508313 -6183545 -21153459 -10455945 14678047
7853 14678047 19716255 -5769415 -32016864 -31772195 -16499932 -14448617 -31149143 -50148419
7845 -50148419 -59821688 -60115384 -50163105 -27669349 505522 20459630 25561902 21760094
7837 21760094 19069401 21829264 24875614 16936483 -7193386 -35713377 -48433368 -39679596
7829 -39679596 -24030246 -14955734 -8427444 4524771 19380979 23888976 15806375 3615629
7821 3615629 -5997334 -11074590 -9330818 -1557551 2875059 -4451923 -17110695 -20084199
7813 -20084199 -9203597 5722338 15810901 19681494 16116994 4213099 -6710854
7806 -6710854 -1592882 19949748 39445603 42277633 33439936 24016918 14799903 3542574
7798 3542574 -3615877 -1882817 71546 -7206317 -16211323 -13625397 -3634192 -1887559
7790 -1887559 -9261613 -11677192 -6242747 -6030969 -14105295 -14333923 1917086 18375151
7782 18375151 15863260 -2966019 -23059720 -36716455 -40660264 -28559031 -4347304
7775 -4347304 8570247 -8297772 -40984461 -57618255 -45972633 -21099651 -1851788
7768 -1851788 3093713 -8017783 -27484952 -35755692 -21322041 -1153323 -1767333 -21815728
7760 -21815728 -34976981 -29496939 -20525398 -19856527 -19092321 -11494274 -6463539 -9608666
7752 -9608666 -9696092 -576543 2832560 -11535887 -27991436 -21677711 7458076 36477595
7744 36477595 47649835 39456502 17423617 -8345528 -20573807 -7513038 19876522
7737 19876522 35573053 26054559 2980132 -12076635 -9396559 2759030 9505437 5626984
7729 5626984 -234414 312112 1755644 -6135382 -18999085 -21395892 -9630995 3950831
7721 3950831 10791672 13122799 9117513 -7128440 -24229854 -16914829 15910869 40365242
7713 40365242 33117353 15404526 18748758 36876303 39818372 20872942 -523679 -12135659
7705 -12135659 -14844343 -3824367 23462959 44866598 33269200 -439621 -16984882
7698 -16984882 -4796329 6947373 -1616156 -12981735 -8528782 -96701 -4122640 -10643880
7690 -10643880 -2420586 14765515 24565983 26554765 27077964 18256440 -8389084 -37449542
7682 -37449542 -44455685 -29667753 -13711998 -4355737 7450510 20405479 19437652 4808995
7674 4808995 -1203393 11323825 20409149 3965819 -24625364 -33377204 -15550505 5228075
7666 5228075 12248722 15964634 29338721 41286562 31187613 1696957 -20804930 -19133768
7658 -19133768 -4286891 2821122 -3591576 -14557031 -21227442 -19002045 -4615116 18146543
7650 18146543 33943316 30306090 15255217 7610100 9768373 4880130 -15102649 -33837178
7642 -33837178 -32500212 -15708223 -2922924 -881670 1468814 12269815 24280838 26758603
7634 26758603 20241364 12841932 7036439 -1794104 -14157233 -21646248 -17893964 -9383667
7626 -9383667 -7755413 -12958381 -13535679 -5487595 199592 -4645975 -10869998 -6821544
7618 -6821544 669929 -3956352 -18006114 -21498917 -7132075 8525432 11084072 10059108
7610 10059108 22254237 43422857 50884416 32062606 224916 -18991792 -11688327
7603 -11688327 13394973 35126149 41149584 37871506 37102747 37661639 29097678 10588679
7595 10588679 -6668727 -15672773 -17620777 -8990941 15857744 43275253 44321712 14590229
7587 14590229 -10847931 -2996018 18806191 17305176 -4021176 -7736661 16097184 33472720
7579 33472720 20060740 -3302785 -6786121 4664648 7637786 102889 -2023401 3966236
7571 3966236 6221424 1986213 -1406253 -5563358 -17409141 -27925978 -19726120 968445
7563 968445 5666150 -14299268 -31809909 -24764678 -10070344 -15249144 -34010639 -38277168
7555 -38277168 -24881857 -18482763 -27443087 -28619383 -7179456 15946385 15950287 3116633
7547 3116633 4986900 21858128 28111937 14584460 1336306 2875237 6508477 -1748305
7539 -1748305 -10867770 -3076160 16098578 26868378 25053493 21126209 15221817 -1876023
7531 -1876023 -22214026 -21641740 3754116 25721002 22772398 10352123 12403708 20521298
7523 20521298 8698250 -20448139 -35022516 -20765767 -277056 3378306 -2297830
7516 -2297830 955220 11066894 13641334 8710610 9232558 18173315 24989373 24080503
7508 24080503 21771214 22757944 21304194 10462702 -6775581 -19686377 -20616723 -12049916
7500 -12049916 -3304300 300392 2658898 7013077 5514848 -9875535 -28050846 -27516838
7492 -27516838 -8207238 4927565 -1125086 -8383205 -901273 5439060 -9770210 -32410188
7484 -32410188 -32842106 -13082127 -1679604 -6415244 -7209703 2397113 2549201 -15150989
7476 -15150989 -29834244 -25499595 -15058718 -14421212 -17534892 -14479385 -11888715 -17039266
7468 -17039266 -21566599 -18862725 -18289219 -24091997 -20581963 613703 17549043 6138608
7460 6138608 -23726065 -43131568 -41191514 -25311734 -566134 25984885 35617623 20926446
7452 20926446 5868751 13728402 27725065 16643899 -11104391 -17841852 3224668
7445 3224668 19234540 12527181 4429843 14051835 29701676 36400893 40095766 47122685
7437 47122685 47411504 36362535 28456035 30891503 27948569 11053392 -138238 9824024
7429 9824024 21505153 10983883 -7040019 564447 32113474 51653266 41007411
7422 41007411 20554100 13562455 16767843 16519489 12796766 12981207 15269955 12177330
7414 12177330 3288718 -6431371 -16367495 -28460087 -37591898 -32870545 -11059839 16219209
7406 16219209 32325637 31147775 20324048 9912348 1427835 -10528845 -28551951
7399 -28551951 -46881458 -54747466 -45102566 -22785310 -3623146 117431 -5795410 -5182478
7391 -5182478 4623017 7656459 -5930757 -22812769 -25348787 -15726088 -6090760 4892650
7383 4892650 25244581 45281008 43135178 15808671 -15017512 -31032739 -33866979 -31820672
7375 -31820672 -28144731 -25263628 -22926072 -10565795 18230855 42026797 28132287 -18993961
7367 -18993961 -52013115 -37682612 2939119 27838162 26556742 18827199 18249266 22000449
7359 22000449 27262623 34919068 39832687 34377745 20352566 6503204 -2101055 -4619411
7351 -4619411 -1544447 2133757 628751 -594548 9199215 22458942 16683243 -7643760
7343 -7643760 -17066655 7604326 37476324 34929153 6613734 -13863963 -19410847 -28380801
7335 -28380801 -39893845 -32035956 -6210308 6078341 -9036132 -26616833 -23857305
7328 -23857305 -13626279 -18840813 -35619225 -42422941 -31559532 -13657302 -401965
7321 -401965 2595671 -6703985 -23265203 -32997240 -24050327 772522 26120108 35972187
7313 35972187 24595951 2361683 -11001505 -7261923 -727259 -8131096 -23068211 -26240158
7305 -26240158 -16515995 -10349846 -10463569 -144476 24540486 41382141 33726787 14787533
7297 14787533 4561866 290482 -11439672 -26954969 -30649994 -20227021 -8097836
7290 -8097836 -1577778 2620725 6691045 8124668 6599540 4181996 954210 -1264611
7282 -1264611 3953726 16958035 24535063 15542631 -334871 -3127976 10028359 21723513
7274 21723513 18959268 7878831 544106 -1725132 -5763350 -14410235 -23070496 -25597796
7266 -25597796 -20421510 -12338394 -9000550 -14008973 -23727583 -31737428 -34038917 -28825724
7258 -28825724 -16185328 -1534359 6205313 5460452 5970636 14925429 23962330 19335296
7250 19335296 2394204 -10507059 -8779731 1298711 8074181 8127582 4667998 16663
7242 16663 -4565879 -6335541 -4168483 -1918071 -4043914 -9213807 -12446038 -13156510 -16418072
7233 -16418072 -24223654 -29506064 -24256012 -12823405 -9743785 -20431865 -31223438 -27254666
7225 -27254666 -15097763 -14466918 -28200531 -36512450 -26275261 -9932181 -4628122 -7172397
7217 -7172397 -5507442 -3110121 -10961295 -21725022 -15982021 5374598 18534146 12166981
7209 12166981 3183237 7143400 13902135 8023288 -3963155 -6037853 -256693 -1295865
7201 -1295865 -10973032 -18147983 -19266115 -19597328 -17442461 -7448486 1990038 -3214615
7193 -3214615 -15841887 -11857437 12141685 29249670 20244233 -893516 -13189338 -18599710
7185 -18599710 -26574228 -28174334 -11075664 12350769 19329220 11997647 11240456 19168042
7177 19168042 17190655 3080577 -926868 13431665 22195308 5676272 -19653048 -26068704
7169 -26068704 -14462048 -7259341 -12973158 -20422228 -22080935 -21109915 -16252036 -45037
7161 -45037 23829942 37101120 27407323 2497006 -20438426 -31315399 -29395521 -17306863
7153 -17306863 487984 16190061 20671614 9221774 -12796703 -30505369 -31187795 -17995290
7145 -17995290 -6184031 -2920931 187022 8853075 12336102 -106852 -18851956 -26002731
7137 -26002731 -20870528 -14874058 -6386768 15473783 41289775 42734537 13874763 -12790240
7129 -12790240 -8213107 14439520 23130343 13502160 7205925 12971941 16990370 11180972
7121 11180972 5236885 5744827 5947358 3758193 8657579 20274974 20994976 4735176
7113 4735176 -6391748 5672843 22389946 14188501 -12015049 -21326322 -4900715 6200226
7105 6200226 -11287751 -39449238 -47697029 -31854120 -7676511 15273247 33014713
7098 33014713 35904138 21116529 6527696 9683867 20107366 15216431 -2034473 -7349400
7090 -7349400 3932002 7390643 -12455742 -38800505 -48460808 -41662009 -32409084 -24544449
7082 -24544449 -13136914 -426259 4474838 -1108303 -9358003 -9483109 4368239 28457781
7074 28457781 50340111 59065055 54666006 42485329 22926998 -2214781 -18698579
7067 -18698579 -12895985 4424506 6451591 -14037044 -35377782 -37751975 -25021914 -10701166
7059 -10701166 -1076174 1152804 -4949913 -10511073 -6050208 -2312791 -17575074 -40035344
7051 -40035344 -34893472 463787 24728872 14822065 1517107 14919052 32312764
7044 32312764 19984522 -5002250 -3619073 16861264 16656066 -6715562 -16691214 -2511705
7036 -2511705 7256319 283272 -1284404 11260345 15105826 2227612 -415436 21605811
7028 21605811 41525838 34372453 14335158 4097308 -1376848 -12813719 -17048546 -530649
7020 -530649 19957124 21040289 9993998 9403755 19574903 24412945 21714766 19038542
7012 19038542 10130993 -14484022 -39290064 -35754213 -2828407 29299964 38460193 32446216
7004 32446216 28061366 27007574 20006146 3193548 -15826534 -23427528 -12010871 8886162
6996 8886162 19148737 12894877 8907803 25818738 54515697 68639728 57285140 33461563
6988 33461563 13942394 5238299 7721443 18483822 27703159 24037621 7629722 -9747576
6980 -9747576 -19243419 -22866776 -26045297 -29327766 -29986524 -27202330 -22928627 -19171684
6972 -19171684 -15559756 -10296552 -4614128 -3825474 -9553917 -13559271 -6957675 5698111
6964 5698111 11196502 6603452 2003574 2232457 -1261673 -14505952 -28116955 -28258344
6956 -28258344 -13162236 7010081 20243199 19151876 5232191 -10089093 -15784357
6949 -15784357 -13262810 -9800752 -3077924 13633150 32831581 37786403 27637129 18136997
6941 18136997 14870309 7751533 -3207577 -2066813 13539496 22692747 14667563 7395864
6933 7395864 15621061 24428610 15016954 -4249247 -14535178 -15283043 -13908777 -5312372
6925 -5312372 14115467 28924458 26110822 18640821 22570786 27088825 14539411 -5889647
6917 -5889647 -14440032 -15718007 -25106159 -34403702 -26913550 -15031346 -23047188 -40115485
6909 -40115485 -33091151 -4023331 9458903 -5017454 -17736339 -11028343 -6997755 -23447884
6901 -23447884 -40446144 -34199642 -13891804 -1302069 1013283 -847296 -10996094 -28905111
6893 -28905111 -35991892 -21049437 -3178800 -6760965 -26921293 -41339089 -44166721 -45325838
6885 -45325838 -44592797 -30512906 -4502727 13030726 5393305 -21132134 -43305881 -42028872
6877 -42028872 -18290093 9457391 24566757 25926675 18861010 2127760 -22238432
6870 -22238432 -34958158 -18058545 14567965 29809075 20619765 12542403 20156246 26943969
6862 26943969 20211275 15334210 25119149 31505296 13664804 -15388326 -27596058 -21163743
6854 -21163743 -16105830 -18430495 -15732691 -4121408 4724460 3522820 -2206736 -6089093
6846 -6089093 -6810583 -3162608 4552474 9892100 6245980 -6464006 -26624743 -51968979
6838 -51968979 -68723450 -56555326 -18367498 11859771 9777837 -6874606 -8610261
6831 -8610261 188967 -4031082 -16738898 -10326641 16327137 31604837 21156985 9150587
6823 9150587 16234059 27199237 19856271 1617715 -5523728 300932 3646364 -1436552
6815 -1436552 -7714358 -11363734 -14419763 -13997024 -3956799 13556478 28648854 34149982
6807 34149982 28634478 14303565 -256278 -2502515 8208648 13884787 -585196 -25325118
6799 -25325118 -39491900 -41661153 -46734498 -54151306 -43600598 -10520644 17164424 14711427
6791 14711427 -4295084 -10360711 -3549530 -9009315 -30843436 -41556281 -25372761 -3505239
6783 -3505239 829108 -1079586 13698096 37248887 41394147 23471129 10133220 13999782
6775 13999782 16593996 3466536 -10709718 -7883553 3575792 4098923 -6291631 -11592396
6767 -11592396 -5244393 4771983 9629031 4584609 -12009649 -30582416 -30146993 -3107394
6759 -3107394 27176746 32414617 16941223 7606549 9895724 1437416 -25158613 -40553701
6751 -40553701 -17796911 23978413 37652049 5915404 -36722696 -43153898 -5065029
6744 -5065029 39840449 48352348 15214880 -25495317 -40479361 -31561085 -24586540 -31457779
6736 -31457779 -37236804 -25565766 -2146875 14651395 16411818 8799245 189824 -4355307
6728 -4355307 -2425523 3233033 4124011 -4431612 -15647271 -20203764 -19132056 -18969258
6720 -18969258 -17686699 -7558460 8422478 16777477 14082806 14034095 26075311 38448975
6712 38448975 34338918 17284402 7092555 13961513 29120535 39177236 37491981 22960473
6704 22960473 1603846 -10409294 -1092528 17206076 19076382 2990228 -2698294 17934096
6696 17934096 40281693 32950875 3890939 -12373812 -4469921 6955042 7902202 9158057
6688 9158057 19318933 26035671 17618567 3736335 -641841 2648590 3828444 3976011
6680 3976011 8809362 12168493 2525998 -17260005 -30823197 -28844903 -18575919 -12387416
6672 -12387416 -14182968 -17798373 -14696198 -4066091 3335352 -3694296 -19618512 -24229215
6664 -24229215 -8057368 11763784 10394639 -13937727 -37565646 -39158171 -22237797
6657 -22237797 -8157796 -11190088 -24061769 -28736996 -19321683 -8567720 -9018387 -15654590
6649 -15654590 -15849436 -9757522 -7841702 -12335370 -16426864 -19552085 -26225574 -30543593
6641 -30543593 -21773016 -6629951 -3471600 -10536601 -5647008 14976736 26809883 19314140
6633 19314140 16369479 32495783 40438057 15225373 -15950198 -10043214 22501018 32031353
6625 32031353 7434060 -9855919 4119635 19531035 5534940 -20756265 -26201310
6618 -26201310 -13189221 -7146180 -11430170 -8327963 2718003 -556403 -27236896 -55113066
6610 -55113066 -58343524 -39670685 -24578814 -29246919 -43464670 -45887632 -30131705 -10102814
6602 -10102814 -565839 -759981 -2066913 -3773262 -10707171 -19566018 -20578799 -13200546
6594 -13200546 -8571440 -13631905 -22246017 -25223642 -21149655 -14278012 -8421486 -5311455
6586 -5311455 -3630917 860019 9109708 14599849 12035991 6740910 6148802 5586246 -5076349
6577 -5076349 -21888481 -27420345 -12712678 12448568 32085424 35951125 19838482 -11450337
6569 -11450337 -38996507 -42044261 -21149618 1172314 6301096 -3878158 -17058757
6562 -17058757 -24331414 -21669320 -11151404 -4242919 -11160094 -24558317 -27809848 -20873985
6554 -20873985 -19860178 -27093360 -23440217 -530058 20438031 17949923 1533822 -4525488
6546 -4525488 3458094 8840244 2515706 -8163729 -15081811 -18344320 -20263720 -21800547
6538 -21800547 -24248478 -26547957 -23806555 -14935381 -6566344 -3166328 -767061 2347492
6530 2347492 -1355495 -14502735 -23226312 -13368900 8087565 21234645 18292268 8139348
6522 8139348 553743 -1145792 4476327 15734344 24241312 24034358 20892598 20866369 15035435
6513 15035435 -8004147 -36958353 -44308730 -21943909 6011472 13206364 985834
6506 985834 -10180589 -8505384 928964 9830583 16631226 21869966 21667509 11401066
6498 11401066 -4895067 -13958483 -7481374 4229015 907505 -21717145 -42760512 -40587934
6490 -40587934 -20095099 -5375231 -8858650 -19864874 -24082374 -22183750 -23819659 -31570342
6482 -31570342 -38496557 -38467603 -32566781 -24868432 -16030427 -4294913 7867763 12877175
6474 12877175 7681357 697668 1906494 7515172 4265247 -9577451 -19028106 -13689620
6466 -13689620 -3483407 -4131861 -15104785 -22402646 -18026874 -7025007 1162679 424757
6458 424757 -8915723 -17892174 -15285475 -3020218 2162530 -9790854 -28390132 -39986674
6450 -39986674 -46993487 -54830587 -51999703 -25502595 10667737 27932949 23038044 19551373
6442 19551373 26499093 23955003 728115 -20837997 -17304012 -872062 47806 -16380173
6434 -16380173 -27321858 -23180012 -18117217 -22201359 -25799028 -18350530 -5464665 1740719
6426 1740719 2272641 1429814 287935 -2585797 -5399698 -6488821 -8151802 -10882988 -9515547
6417 -9515547 -2018993 4125220 3480806 4777899 18768235 36936132 38365126 20398900
6409 20398900 5623040 9627675 17284434 6019795 -18765488 -31490039 -24654428 -17285563
6401 -17285563 -22896158 -30275383 -25311931 -14403933 -12060095 -16491865 -12588607 6024696
6393 6024696 29567742 43518378 39722527 21349843 3659753 2169966 12071433 9435453
6385 9435453 -16070859 -41474582 -40281061 -21767557 -17224784 -31100705 -33354592 -6340128
6377 -6340128 25941704 29496105 3399823 -24579145 -32815863 -20752067 1056170 19037826
6369 19037826 20379331 4366610 -12500991 -15367617 -11259487 -16830150 -30294099 -33818141
6361 -33818141 -23630516 -16596050 -20316132 -17678491 4889792 31047836 35845065 21633335
6353 21633335 10518045 8646299 4111323 -1585920 9493696 35294681 44158152 19431885
6345 19431885 -11166520 -14505568 82511 1131099 -12285667 -13881458 580308 6081272
6337 6081272 -6162385 -13363139 -2908080 4931679 -5376412 -14275423 696720 25000581
6329 25000581 27091161 3983057 -18793368 -23417842 -13774579 -749495 6766853 2668021
6321 2668021 -7882791 -8445480 5828968 17025745 11844782 4453022 11260219 19735072
6313 19735072 9889910 -7038787 -4238276 14674569 20550498 7280512 36690 11671963
6305 11671963 24497017 23238119 15944981 12792740 12009964 16403688 35704416 60557035
6297 60557035 61617361 29771975 -6518789 -18845969 -11429459 -2317154 3603174 5707926
6289 5707926 -4499430 -25402617 -34642997 -18291264 5476090 12279302 5327388 2318066
6281 2318066 4266856 1635224 -569609 10220865 28471980 35405302 26680720 15615594
6273 15615594 11144889 10121221 9769702 11796254 14433009 13086219 8321411 4132092
6265 4132092 1287575 -670385 -1137473 -4190846 -15977235 -28736910 -22055500 7432582
6257 7432582 32359095 27454114 3917947 -7495415 2228473 15659309 18370968 13291539
6249 13291539 8723092 8270747 11066880 11305200 2802424 -8013426 -4974599 12281242
6241 12281242 21418619 9469026 -6512888 -7988478 -3063145 -3098597 6133504 37785592
6233 37785592 66919417 59186213 25752993 8786701 17315892 20085903 3223494 -8737691
6225 -8737691 1267617 16008212 17862514 14728653 14709642 5735388 -19476782 -42735327
6217 -42735327 -43831484 -25760320 -2880708 16642105 25944984 19163667 6825615 8414407
6209 8414407 19811840 15001587 -8481078 -17586518 4777567 28230330 19710391 -8293489
6201 -8293489 -22642954 -18104324 -10324634 -2208072 8721479 7335371 -17568874 -40550169
6193 -40550169 -26295639 15810651 39254510 22052678 -11061420 -29259333 -27475354
6186 -27475354 -13407765 7557890 24954215 24757871 8879794 -4888204 -8961332 -13456558
6178 -13456558 -21619320 -18429154 5181123 33145642 42120079 28047398 5296034 -11777309
6170 -11777309 -18345446 -17903739 -18608461 -25276205 -31196595 -24510938 -5617459 9711707
6162 9711707 8880040 -2576659 -9409637 -5317192 1644578 800230 -6951583 -8641500
6154 -8641500 5036295 25837330 36730873 33791211 28559137 27319532 23233091 14490655
6146 14490655 11557480 14783361 4904649 -25301972 -48339697 -36422493 -4477391 10925816
6138 10925816 5484659 5579808 16877840 13578216 -13723751 -35818723 -27112472 -1769902
6130 -1769902 11547677 8984782 5891098 9064801 13767388 16636650 16428334 11852070
6122 11852070 8642910 15494858 24666564 15559648 -10352059 -20671596 2266926 27909447
6114 27909447 16770364 -21747033 -42474550 -28453878 -8464745 -8348016 -16526278 -10737674
6106 -10737674 4627616 6693065 -12374910 -36402969 -45151325 -31916585 -4263577
6099 -4263577 22526008 32436788 18246589 -9970854 -28593512 -19465259 11718801 39588918
6091 39588918 45518513 36322611 31171767 34855637 34872761 23574542 9804461 5100740
6083 5100740 9887152 18039247 24757092 25692572 19317860 14032827 19944140 29512282
6075 29512282 23013404 151998 -13725062 -5248544 4169578 -8130391 -29284353 -32864692
6067 -32864692 -22191097 -21369952 -32355869 -34140577 -22264256 -15266587 -18024405 -12293488
6059 -12293488 6091285 13016185 -3424622 -16364537 2032915 36866823 50928363
6052 50928363 35152981 12249456 -1515251 -10875267 -19749065 -21037171 -14150930 -12169766
6044 -12169766 -21511826 -28771838 -18808119 3249135 18353763 16146826 1878607 -15368345
6036 -15368345 -30848867 -39969116 -35812073 -17241214 4997194 17617550 19604278 21053167
6028 21053167 26623203 28441035 19544649 5755110 -3941802 -11576189 -23282657 -33372582
6020 -33372582 -30096437 -15892859 -5307230 -334112 13909076 41020037 58741273
6013 58741273 47012555 17395282 -2756313 -6258067 -7116984 -11431393 -9397381 2475227
6005 2475227 11973641 10685370 6027888 5528749 4512479 -107374 1321421 13777749
5997 13777749 21092119 5631879 -22753350 -37980376 -34833103 -32313687 -38368173 -36947246
5989 -36947246 -20755452 -11949603 -29182134 -51928661 -44907789 -9144362 19958658
5982 19958658 23125840 15994105 13508948 7019261 -9623104 -19676341 -10858936 -787246
5974 -787246 -9358834 -22900342 -15131659 7846045 15566011 619834 -14935089 -20250360
5966 -20250360 -28382516 -42117413 -41688508 -20909073 -4603763 -10171856 -18514895 -6897122
5958 -6897122 12630783 15710801 7746877 11126506 22306565 16244196 -9898505 -30223759
5950 -30223759 -29607055 -20283117 -13828039 -5306851 5022951 1590638 -19168801 -33525039
5942 -33525039 -21352949 3946777 15292871 8842979 1734864 2923247 7205908 13043522
5934 13043522 25159965 38897184 40110841 24705776 4607053 -9376460 -18094766
5927 -18094766 -23665529 -22068450 -13617744 -9218936 -15569280 -22392240 -16814891 -5423615
5919 -5423615 -7408772 -25293079 -36913625 -23320645 5579574 22904665 16374383 -2282548
5911 -2282548 -16277466 -20434994 -17967506 -11797713 -4495975 448508 3012488 7324888
5903 7324888 13601611 14700316 5489656 -9169956 -19972559 -21258007 -10507259 10904919
5895 10904919 29997588 26393703 -3570666 -35058727 -41145514 -24908149 -10233212
5888 -10233212 -7284039 -6699006 -4405626 -8327945 -17988705 -21660645 -20651570 -31777835
5880 -31777835 -54098289 -58239554 -27351583 12917862 28104928 20117115 12477534 7301773
5872 7301773 -8945729 -26439987 -18959905 7362581 11509814 -22199351 -55025432 -46769100
5864 -46769100 -11460078 6665150 -5585394 -22627007 -23605301 -13765344 -3448636 7574682
5856 7574682 18515987 20457186 10265403 -1618844 -5447163 -4239789 -4847107 -6058514
5848 -6058514 -3335077 1332715 2306099 -650026 -2710471 -1356650 1618088 4383580
5840 4383580 7523359 12254310 18132812 22594960 22781820 18767916 13843075 9428929
5832 9428929 1932832 -10690346 -21021947 -18517692 -5354013 2193746 -6653960 -22689658
5824 -22689658 -29125286 -23559948 -17254257 -13824828 -1808441 25151553 51241123 54837142
5816 54837142 39011733 30666993 44409526 60901034 53436776 27322110 14711776
5809 14711776 30190808 50036429 44350479 15798287 -6928565 -5795272 10788458
5802 10788458 24533875 25232366 12736054 -5946089 -19287659 -20870187 -17742447 -20253848
5794 -20253848 -24680288 -18417542 -2531409 6922700 4307324 3603761 13007086 18026520
5786 18026520 5840789 -7871743 1661418 29483926 45526900 37678575 26310320
5779 26310320 29475769 36338140 29622607 16839731 17831066 29528877 26853070 1349158
5771 1349158 -21569420 -15596131 9180283 18275551 -1880360 -27442089 -30237052 -13142751
5763 -13142751 -1165273 -6098892 -16053402 -18665265 -17368583 -18150453 -15175564 -2880007
5755 -2880007 6768353 -4087164 -31552045 -49017880 -38060736 -9816146 10022217
5748 10022217 10120845 1498807 1322183 14361699 29245415 30793349 17047920 2858973
5740 2858973 2657218 11880746 13422686 2305894 -7350644 -4736270 112655 -7409379
5732 -7409379 -20219490 -15706971 11291139 37148654 38874976 23610315 16149120 22937027
5724 22937027 25157613 10628287 -3822245 4922757 29773647 37411130 10135616 -31347233
5716 -31347233 -53903797 -49509499 -37139371 -34747306 -40761743 -40946665 -24615412 5419022
5708 5419022 33161507 41539291 28961294 10343339 -2163845 -11665430 -22614627 -25181858
5700 -25181858 -8463339 16894060 27199572 16038324 -432826 -8883132 -11856793
5693 -11856793 -12710484 -6741561 4947150 9989371 3857968 -244061 7402607 15274184
5685 15274184 8510752 -6061251 -9425056 1067948 8771505 1762404 -13826601 -25929365
5677 -25929365 -32036748 -38960831 -50997784 -60197478 -50580613 -17422454 19443733 32488330
5669 32488330 18325529 -65639 -6033579 -7451765 -14537379 -18501033 -7785179 9179763
5661 9179763 15839542 11889761 8337774 7292205 4187189 1860283 4834628 7526135
5653 7526135 5119639 6166494 15773212 19142126 5590628 -4540307 12175057 37790576
5645 37790576 33975486 3595063 -10707796 5627164 16159457 -6722813 -39637688
5638 -39637688 -49064739 -39876388 -35241763 -36531959 -33648168 -32429267 -40276639 -42437700
5630 -42437700 -23954467 -937195 1003293 -12047760 -13432451 1154552 12935173
5623 12935173 14868974 14741972 7661072 -20028107 -56960026 -69346779 -45542522 -11693017
5615 -11693017 5216211 6085246 3463640 189979 -4381691 -6008584 -4919350 -8975859
$$ [...]
##END NTUPLES=NMR SPECTRUM
##END=
