##TITLE=31Pdec_LR-759-R2-C1
 CCl4, 128 sc
 21.12.2022
##JCAMPDX= 6.0         $$ Bruker NMR JCAMP-DX V2.0
##DATA TYPE= NMR SPECTRUM
##DATA CLASS= NTUPLES
##ORIGIN= UXNMR, Bruker Analytische Messtechnik GmbH
##OWNER= root
$$ XWIN-NMR		Version 3.5
$$ Wed Dec 21 14:26:49 2022 Russian Standard Time (UT+4h)  she@DPX200
##.OBSERVE FREQUENCY= 81.013821
##.OBSERVE NUCLEUS= ^31P
##.ACQUISITION MODE= SIMULTANEOUS
##.ACQUISITION SCHEME= undefined
##.AVERAGES= 128
##.DIGITISER RES= 16
##SPECTROMETER/DATA SYSTEM= spect
##.PULSE SEQUENCE= zgpg30
##.SOLVENT NAME= DMSO
##.SHIFT REFERENCE= (INTERNAL, DMSO, 0, 248.564)
##AUDIT TRAIL= $$ (NUMBER, WHEN, WHO, WHERE, WHAT)
$$ ##TITLE= Audit trail, XWIN-NMR		Version 3.5
$$ ##JCAMPDX= 5.01
$$ ##ORIGIN= Bruker BioSpin GmbH
$$ ##OWNER= she
$$ F:/spectra/data/she/nmr/P31/1/pdata/1/auditp.txt
$$ ##AUDIT TRAIL=  $$ (NUMBER, WHEN, WHO, WHERE, WHAT)
(   1,<2022-12-21 14:25:58.28 +0400>,<she>,<DPX200>,
      <continue with go, POWCHK disabled, PULCHK disabled
       configuration hash MD5:
       00 E9 B6 7A A2 85 ED C7 34 08 36 98 17 FE 4E 26
       data hash MD5: 32K
       4A AF DD A1 AE 38 62 5B D7 13 2C 2E 17 8F E7 31>)
(   2,<2022-12-21 14:26:02.10 +0400>,<she>,<DPX200>,
      <Start of raw data processing
       efp BC_mod = 2 LB = 1 FT_mod = 6 PKNL = 1 PHC0 = -10879.48 PHC1 = 829.0566 SI = 64K 
       data hash MD5: 64K
       93 D3 6B 52 29 1A CD 43 C1 2E D4 77 A8 25 7A C7>)
(   3,<2022-12-21 14:26:16.89 +0400>,<she>,<DPX200>,
      <pk PHC0 = 1.215741 PHC1 = -36 
       data hash MD5: 64K
       7B C4 EB DD A9 15 DA 9F 6F 6A 16 28 33 2B 77 5C>)
(   4,<2022-12-21 14:26:23.98 +0400>,<she>,<DPX200>,
      <abs ABSG = 5 
       data hash MD5: 64K
       3E 49 84 7B 54 98 2B 91 B7 74 CC DD C7 57 C1 19>)
$$ ##END=
$$ 
$$ hash MD5
$$ E7 0C D6 E5 26 6E 1A 91 D3 B0 19 4A D1 95 91 61
##$RELAX= 
##$RELAX= 
##$RELAX= 
##$RELAX= 
##$RELAX= 
##$RELAX= 
##$RELAX= 
##$RELAX= 
##$RELAX= 
$$ Bruker specific parameters
$$ --------------------------
##$DU= <F:/spectra>
##$EXPNO= 1
##$NAME= <P31>
##$PROCNO= 1
##$TYPE= <nmr>
##$USER= <she>
##$AMP= (0..31)
100 100 100 100 100 100 100 100 100 100 100 100 100 100 100 100 100 100 
100 100 100 100 100 100 100 100 100 100 100 100 100 100 
##$AQSEQ= 0
##$AQ_mod= 1
##$AUNM= <au_zg>
##$AUTOPOS= <>
##$BF1= 81.014009
##$BF2= 200.13
##$BF3= 200.13
##$BF4= 200.13
##$BF5= 200.13
##$BF6= 200.13
##$BF7= 200.13
##$BF8= 200.13
##$BYTORDA= 1
##$CFDGTYP= 0
##$CFRGTYP= 5
##$CHEMSTR= <none>
##$CNST= (0..31)
1 1 145 1 1 1 1 1 1 1 1 1 1 1 1 1 1 1 1 1 1 1 1 1 1 1 1 1 1 1 1 1 
##$CPDPRG= <waltz16>
##$CPDPRG1= <>
##$CPDPRG2= <waltz16>
##$CPDPRG3= <>
##$CPDPRG4= <mlev>
##$CPDPRG5= <mlev>
##$CPDPRG6= <mlev>
##$CPDPRG7= <mlev>
##$CPDPRG8= <mlev>
##$CPDPRGB= <>
##$CPDPRGT= <>
##$D= (0..31)
0 1 0 0 0 0 0 0 0 0 0 0.03 2e-05 3e-06 0 0 0 0 0 0 0 0 0 0 0 0 0 0 0 0 
0 0 
##$DATE= 1671618164
##$DBL= (0..7)
120 120 120 11 120 120 24 19 
##$DBP= (0..7)
150 150 150 150 150 150 150 150 
##$DBP07= 0
##$DBPNAM0= <>
##$DBPNAM1= <>
$$ [...]
##$SUBNAM3= <"">
##$SUBNAM4= <"">
##$SUBNAM5= <"">
##$SUBNAM6= <"">
##$SUBNAM7= <"">
##$SUBNAM8= <"">
##$SUBNAM9= <"">
##$SW= 501.771253377433
##$SWIBOX= (0..15)
0 1 3 0 0 0 0 0 0 0 0 0 0 0 0 0 
##$SW_h= 40650.406504065
##$TD= 32768
##$TD0= 1
##$TE= 0
##$TE2= 300
##$TE3= 300
##$TEG= 300
##$TL= (0..7)
0 120 53 12 22 120 120 120 
##$TP= (0..7)
150 150 150 150 150 150 150 150 
##$TP07= 0
##$TPNAME0= <>
##$TPNAME1= <>
##$TPNAME2= <>
##$TPNAME3= <>
##$TPNAME4= <>
##$TPNAME5= <>
##$TPNAME6= <>
##$TPNAME7= <>
##$TPOAL= (0..7)
0.5 0.5 0.5 0.5 0.5 0.5 0.5 0.5 
##$TPOFFS= (0..7)
0 0 0 0 0 0 0 0 
##$TUNHIN= 0
##$TUNHOUT= 0
##$TUNXOUT= 0
##$USERA1= <user>
##$USERA2= <user>
##$USERA3= <user>
##$USERA4= <user>
##$USERA5= <user>
##$V9= 5
##$VALIST= <valist>
##$VCLIST= <CCCCCCCCCCCCCCC>
##$VD= 0
##$VDLIST= <DDDDDDDDDDDDDDD>
##$VPLIST= <PPPPPPPPPPPPPPP>
##$VTLIST= <TTTTTTTTTTTTTTT>
##$WBST= 1024
##$WBSW= 4
##$XGAIN= (0..3)
0 0 0 0 
##$XL= 0
##$YL= 0
##$YMAX_a= 10032
##$YMIN_a= -11431
##$ZGOPTNS= <>
##$ZL1= 120
##$ZL2= 120
##$ZL3= 120
##$ZL4= 120
##$ABSF1= 248.5645
##$ABSF2= -253.2056
##$ABSG= 5
##$ABSL= 3
##$ALPHA= 0
##$AQORDER= 0
##$ASSFAC= 0
##$ASSFACI= 0
##$ASSFACX= 0
##$ASSWID= 0
##$AUNMP= <proc_1d>
##$AZFE= 0.1
##$AZFW= 0.5
##$BCFW= 0
##$BC_mod= 2
##$BYTORDP= 0
##$COROFFS= 0
##$CY= -3
##$DATMOD= 1
##$DC= 0
##$DFILT= <>
##$DTYPP= 0
##$F1P= 0
##$F2P= 0
##$FCOR= 1
##$FTSIZE= 65536
##$FT_mod= 6
##$GAMMA= 0
##$GB= 0
##$INTBC= 1
##$INTSCL= 6.047779e-11
##$ISEN= 30
##$LB= 1
##$LEV0= 0
##$LPBIN= 0
##$MAXI= 10000
##$MC2= 0
##$MEAN= 0
##$ME_mod= 0
##$MI= 50
##$NCOEF= 0
##$NC_proc= -8
##$NLEV= 6
##$NOISF1= 182.463
##$NOISF2= 159.3651
##$NSP= 0
##$NTH_PI= 0
##$NZP= 0
##$OFFSET= 248.5645
##$PC= 4
##$PHC0= -10878.26
##$PHC1= 793.0566
##$PH_mod= 1
##$PKNL= yes
##$PPARMOD= 0
##$PSCAL= 0
##$PSIGN= 0
##$REVERSE= no
##$SF= 81.0140089999694
##$SI= 65536
##$SIGF1= 159.3651
##$SIGF2= -187.1042
##$SINO= 113.3802
##$SIOLD= 16384
##$SREGLST= <1H.CDCl3>
##$SSB= 0
##$STSI= 65536
##$STSR= 0
##$SW_p= 40650.406504065
##$SYMM= 0
##$S_DEV= 0
##$TDeff= 32768
##$TDoff= 0
##$TI= <>
##$TILT= no
##$TM1= 0
##$TM2= 0
##$TOPLEV= 0
##$USERP1= <user>
##$USERP2= <user>
##$USERP3= <user>
##$USERP4= <user>
##$USERP5= <user>
##$WDW= 1
##$XDIM= 65536
##$YMAX_p= 357963413
##$YMIN_p= -135564026
$$ End of Bruker specific parameters
$$ ---------------------------------
##NTUPLES= NMR SPECTRUM
##VAR_NAME=  FREQUENCY,     SPECTRUM/REAL,   SPECTRUM/IMAG
##SYMBOL=    X,             R,               I
##VAR_TYPE=  INDEPENDENT,   DEPENDENT,       DEPENDENT
##VAR_FORM=  AFFN,          ASDF,            ASDF
##VAR_DIM=   65536,         65536,           65536
##UNITS=     HZ,            ARBITRARY UNITS, ARBITRARY UNITS
##FACTOR=    0.620285442955139, 1,           1
##FIRST=     20137.2065510682, 0,            0
##LAST=      -20513.1999529968, 0,           0
##MIN=       -20513.1999529968, -135564026,  0
##MAX=       20137.2065510682, 357963413,    0
$$ Real data points
##PAGE= N=1
##DATA TABLE= (X++(R..R)), XYDATA
$$ [...]
##PAGE= N=2
##DATA TABLE= (X++(I..I)), XYDATA
40302B0224079J0053279L625476q412935j1597897l649364L971561K397624l291263
40294A3320560k866077L567099O356382J803724k129760Q42273M971268K822058
40286B8687527j282392J036049N907586K295914p991759j0855784l001207J879586
40278A6675520l276476n757718M601385J5003523Q515704p790453j3364749n672277
40270H934459N47179J625998Q023068J7594782J2089016j0727929k5513894j4607830
40262b035151N236327R331919J195456N36276Q221049Q610459J61444k594514
40254B8663265K873188K147222q492725j2604124q86868J1876135R629375j129938
40246C2075530m676942r05220r88311o154766o827368K34926P518551Q792087
$$ y = [20224079, 30277358, 33902834, 25489899, 13892002, 10242638, 14214199, 16611823, 13320560, 10454483, 14021582, 20377964, 22181688, 20051928, 20894201, 25865469, 28687527, 27405135, 28441184, 34348770, 36644684, 28652925, 17797141, 14795934, 16675520, 13399044, 7641326, 12242711, 27246234, 35761938, 27971485, 14606736, 8934459, 9481638, 11107636, 19130704, 36725486, 48814502, 38086573, 12572679, -2035151, 3201176, 12533095, 13728551, 14264827, 22485876, 31096335, 31257779, 28663265, 31536453, 33683675, 25190950, 12586826, 11699958, 23576093, 33205468, 32075530, 27398588, 26493368, 25505057, 19350291, 12522923, 12757849, 20276400, 29068487]
40238B9068487M966179j439569q153152r871093k460958Q630207J2265847N417198
40230C8423146l750582p710968p571647p365557p013793m359584M73461N844913
40222F969389J0303427J1574745P607893P48813k887682q65948J997470M35355
40214C5883462l805295n019104k232199m33017k786358n330111j932801O800446
40206B1145023J2615717Q935123o53634n981450k385965L790244L356523m489537
40198C6332044j1632790j0528626j899352O496409P338272R66693l988832N11601
40190B3595419J1007064J4233125L248029j1811035j4907789l951872P608126
40183B9021067Q821803K905318j591245l415970o369258r518254p606126l17973
$$ y = [29068487, 34034666, 32595097, 24441945, 14570852, 12109894, 20740101, 33005948, 38423146, 34672564, 26961596, 19389949, 12024392, 5010599, 651015, 1124476, 6969389, 17272816, 28847561, 36455454, 37204267, 34316585, 33450637, 35448107, 35883462, 32078167, 27059063, 24826864, 24393847, 21607489, 16277378, 14344577, 21145023, 33760740, 42695863, 42042229, 36060779, 33674814, 37465058, 40821581, 36332044, 24699254, 14170628, 12271276, 18767685, 26105957, 27072650, 23083818, 23595419, 34602483, 48835608, 52083637, 40272602, 25364813, 21412941, 29021067, 37842870, 40748188, 39156943, 35740973, 29371715, 19853461, 12247335, 11929362]
40175A1929362N693676N735436L133829L346693N168210K231833o792223j3560985
40167A6885831q742287N769377J6911815J4093458L78782j1893445j4503876r427456
40159I472199l118492R84184L522833N974010Q044357P347240J823704o332680
40151B7717355j0796940p938226j832695J507073K997543P452766J2608420R857417
40143D1572713j556918j0000241o926612N78490Q05321m782593m920776L181037
40135A7950421R967722Q387781K563684j005611k303949l903887n154006m644693
40127B1857462l186359r52176L018480N909921K665469m105472m166615M697483
40119B5738193J0082545K721443p610833o021933M051863O391128j794406n952091
$$ y = [11929362, 17623038, 23358474, 26492303, 29838996, 35007206, 37239039, 30446816, 16885831, 8143544, 13912921, 30824736, 44918194, 45296976, 33403531, 18899655, 9472199, 6353707, 7337891, 10860724, 16834734, 24879091, 32226331, 34050035, 27717355, 16920415, 8982189, 7149494, 8656567, 11654110, 19106876, 31715296, 41572713, 40015795, 30015554, 23088942, 23667432, 24472753, 19690160, 14769384, 17950421, 27918143, 36305924, 38869608, 37863997, 35560048, 31656161, 26502155, 21857462, 18671103, 17718927, 20737407, 26647328, 29312797, 25207325, 21040710, 25738193, 35820738, 38542181, 30931348, 24909415, 28961278, 35352406, 33558000, 27605909]
40111B7605909J721072J0531247R310921J884901l309814o232501q280058m166189
40103B9065488P160353J3247258L840649j1039778j3354176k648413N596235M214652
40095C6082268J025168J619385J571190j489442k649906q41105k041797o691064
40087B6584697o746856o47953J927424l069432n819389J03085N452895J403674
40079A9188145m257994n31310P489328Q000601L037095K877282N715050J139143
40071D2657340q588715r485661N73482O864792R56174o768521m691893K931382
40063B4448380N111277P72449k621024j099607K293968K540314k640208r760459
40055A9045090j0572218j531366Q434274P668043j267391m736463J520763P585030
$$ y = [27605909, 29326981, 39858228, 49169149, 51054050, 47744236, 41511735, 33231677, 29065488, 36225841, 49473099, 53313748, 42273970, 28919794, 26271381, 31867616, 36082268, 37107436, 38726821, 40298011, 38808569, 36158663, 35317558, 33275761, 26584697, 19837841, 19189888, 21117312, 18047880, 12228491, 12331576, 17784471, 19188145, 14930151, 14398841, 21888169, 29888770, 32925865, 35803147, 41518197, 42657340, 34068625, 24582964, 25156446, 32021238, 32977412, 26208891, 21516998, 24448380, 29559657, 30332106, 27711082, 26611475, 28905443, 31445757, 28805549, 19045090, 8472872, 6941506, 15375780, 23043823, 21776432, 17039969, 18560732, 26145762]
40047B6145762P107130N561094O046048K258847o313439p595472L186030J1090770
40039D7486770L463329q296025o469845L748461L452197p701855j1063366k69237
40031B4350429Q991569M992838l353529l678355J397591K512110j117919l836925
40023C0257809l005980P38073N886544P926890K393147n988883o065617L451646
40015C5593629J0242712O333778o49055j268969J177259p57566m708519m006431
40007D1956838j21450J259113O98385R73739j387977q769094j2271865k805783
39999A9531906J1078078J1782262j225558r436163k457955P560323N318882n869329
39991C6282446j1059861m742570M634924P723725M251517N69870J489445M805328
$$ y = [26145762, 33252892, 38813986, 44860034, 47118881, 40805442, 33209970, 36396000, 47486770, 50950099, 42654074, 36184229, 39932690, 43384887, 35683032, 24619666, 24350429, 33341998, 38334836, 34981307, 31302952, 32700543, 35212653, 34094734, 30257809, 27251829, 27989902, 33876446, 41803336, 44196483, 38207600, 32141983, 35593629, 45836341, 52170119, 51521064, 50252095, 51429354, 50671788, 45963269, 41956838, 41835388, 43094501, 43792886, 44766625, 43378648, 34609554, 22337689, 19531906, 30609984, 42392246, 41166688, 31730525, 29272570, 36832893, 42151775, 36282446, 25222585, 20480015, 25114939, 32838664, 37090181, 37660051, 39149496, 43954824]
39983D3954824L567786m457848j1196719p046716N516808J3639579R892386n54255
39975E3315845r429625j3824181j2886378n287199N031280Q699545L046260k182568
39967B6482979J833280R766229J0226005K625925k948461q88770L255622K026022
39959E2378831m019181p829205m765227J639125L656121n3298j248870N359259
39951D5117555J0543154K247458j2855772j4919250j187893P322452j547232j0716591
39943B4003881k148939J1553802O994669j0145220j2849434L705766J5228898
39936C6343423P994635j918370J718789J0121342P557465l720805j1171676j1011602
39928C5913201o711139O8992N995885M564309k299974k965512M763679P306024
$$ y = [43954824, 47522610, 43064762, 31868043, 24821327, 30338135, 43977714, 53870100, 53315845, 43886220, 30062039, 17175661, 11888462, 16919742, 25619287, 28665547, 26482979, 28316259, 38082488, 48308493, 50934418, 47985957, 47097187, 50352809, 52378831, 48359650, 40530445, 35765218, 37404343, 41060464, 41007166, 39758296, 45117555, 55660709, 57908167, 45052395, 30133145, 28945252, 36267704, 34720472, 24003881, 21854942, 33408744, 40403413, 30258193, 17408759, 21114525, 36343423, 44338058, 42419688, 44138477, 54259819, 61817284, 58096479, 46924803, 35913201, 29202062, 29271054, 35266939, 39831248, 37531274, 34565762, 39329441, 46635465]
39920D6635465j821131q894274k930613M884625J494460m089694K468211J3580960
39912E1328009J2257294J581566k424685M92027j747782p368228m318124L401605
39904E3201682L00325j0467598r474832M553751J1164556L752274l33480O560982
39896E9257660P820128n727085j6831481j0657195J672034N607286O376577J0959481
39888E8477405R179020n507189j6389213q350252N284462N199177j407193K519270
39880D9005487J0259825M534394p841098o891764L487093L165528n276845j438715
39872D9003905J0753852N017931j8003961k3598226J352244K3234409J3194363
39865F0954517r229763j0846136L819742P554766k285427n488005K359048N428428
$$ y = [46635465, 44814334, 35920060, 32989447, 37874072, 39368532, 35278838, 37747049, 51328009, 63585303, 65166869, 62742184, 63234211, 61486429, 54118201, 49800077, 53201682, 53502007, 43034409, 33559577, 38113328, 49277884, 53030158, 52696678, 59257660, 67077788, 61350703, 44519222, 33862027, 35534061, 41141347, 47517924, 58477405, 67656425, 62149236, 45760023, 37409771, 42694233, 47893410, 46486217, 49005487, 59265312, 63799706, 55958608, 49066844, 52553937, 55719465, 50442620, 49003905, 59757757, 64775688, 46771727, 23173501, 24525745, 47760154, 60954517, 51724754, 40878618, 44698360, 52253126, 49967699, 44479694, 46838742, 52267170]
39857E2267170j259914n120765j484867l88151m167557j559628R103956J1946316
39849E9336560r31076j3595947q994195N770669J1367967M404635j758336L7605
39841E5637882K435372q28830m354120j581505L579708L341681j474503l996889
39833E2758796l252657m267724o740842l832939M912077R444683L860824l759750
39825D9122468l997295j33737M21725M42817N390891Q683693J139329r470517
39817E1599374p799442K034209J322800r503400q050111J0876234K0765039M572294
39809F5816997j4860874r468446R363836J0398419o923388j4759061l881365N332600
39801D1018718O78600m786940r43192K560492r77968j108224P207263R780458
$$ y = [52267170, 51007256, 45886491, 44401624, 44013473, 39845916, 38286288, 47390244, 59336560, 58405484, 44809537, 35815342, 41586011, 52953978, 57358613, 55600277, 55637882, 58073254, 57244424, 52890304, 51308799, 54888507, 58230188, 56755685, 52758796, 49506139, 45238415, 38497573, 34664634, 39576711, 49021394, 52882218, 49122468, 45125173, 44991436, 45413161, 45855978, 51246869, 59930562, 61069891, 51599374, 43799932, 45834141, 47156941, 37653541, 29603430, 40479664, 61244703, 65816997, 50956123, 41487677, 50851513, 61249932, 54326544, 39567483, 35686118, 41018718, 41697318, 36910378, 35967186, 38527678, 37549710, 36441486, 43648749, 53429207]
39793E3429207j266420q858986K114427J6881065J3028007k766041o163137M740631
39785G1138753Q278024l300841j2170431o174983J985489k174209j1147075r138456
39777C7296271K764796J0309090Q245376M682139N481612O300648J739054n916372
39769G0902614j0140810p764028j027093M899465N208791q95418q158622q887647
39761D4137252p30372R817116J3455739P749394o75411l979697j303104K295615
39753G0766532K910179N33303l852452q847294r915228k440956R325587J2671804
39745G1151475J983094j0722882r303359M480582J2292676L983410q886154r623131
39737E5355711J377851R402438O134532k061552o335603o562169o627371n491470
$$ y = [53429207, 52162787, 43303801, 45418228, 62299293, 75327300, 72561259, 66398122, 71138753, 79416777, 76115936, 63945505, 57770522, 59756011, 57581802, 46434727, 37296271, 40061067, 50370157, 58615533, 63297672, 68779284, 75079932, 76818986, 70902614, 60761804, 52997776, 51970683, 56870148, 62078939, 61183521, 53024899, 44137252, 43406880, 53223996, 66679735, 74429129, 73753718, 69774021, 68470917, 70766532, 73676711, 74210014, 70357562, 61510268, 51595040, 49154084, 58479671, 71151475, 73134569, 62411687, 53108328, 57588910, 69881586, 73864996, 64978842, 55355711, 56733562, 66136000, 72270532, 70208980, 63873377, 57311208, 50683837, 45192367]
39729D5192367L36457Q358664J1151157O380028K94171p87902J886232L302687
39721G6113861K302457J048153n43565m313623q457208q269208l427542M19463
39713E4872788m96131k860337j818797J747091L045290L10389l515880n142259
39705D6142154m515230m250785o374646r258361q742258m034240n9779K03878
39697I110733K396710J1756817J9735808J2195106p083120j6083723n209768O855892
39689C3674455R00628j2851209j1404731L798648R915003K69607o258885K013353
39681B0056869J1120813O483010l469049l460462L875074N761901J171200j237083
39673D0302273L31771J461538L107003Q054697J0350384K714268q710011j1341055
$$ y = [45192367, 45528824, 53887488, 65038645, 71418673, 71712844, 70924942, 72811174, 76113861, 78416318, 79464471, 78920906, 74607283, 66150075, 57880867, 54453325, 54872788, 54376657, 51516320, 49697523, 51444614, 54489904, 54800293, 51284413, 46142154, 41626924, 37376139, 31001493, 21743132, 13000874, 8966634, 8906855, 9110733, 11507443, 23264260, 43000068, 55195174, 48112054, 32028331, 26818563, 33674455, 34575083, 21723874, 10319143, 14117791, 24032794, 24302401, 18043516, 20056869, 31177682, 37660692, 34191643, 30731181, 34606255, 40368156, 41539356, 40302273, 40634044, 42095582, 45202585, 53257282, 63607666, 66321934, 57611923, 46270868]
39665D6270868n715243l551606p363490p448416o63616L255842j169951n367579
39657A8246809j208780N462731M358706l298485o657400J42597J0965099J4462396
39649D2473673O124330n656121p764163N86924M521755n668501j7117846j0816669
39641F683382Q530996J6341714L223297j1915545j0409452J114549N048956r96121
39633A7621776n511404k203365M489970Q062272N204778k667350p027693R29935
39625A8898919J4922676J5816290j840568j7664755j2679328K876534O028560
39618B6358328l682372o414590M166341J1470037L275520j0685418j5278216r537106
39610c27476k018302K493391M386634N047897O480805R255750R021496J978307
$$ y = [46270868, 40555625, 37004019, 29640529, 22192113, 21528497, 24784339, 23614388, 18246809, 17038029, 22500760, 26859466, 23560981, 16903581, 17046178, 28011277, 42473673, 48598003, 42941882, 35177719, 35764643, 40286398, 34617897, 17500051, 6683382, 15214378, 31556092, 34779389, 22863844, 12454392, 13568941, 18617897, 17621776, 12110372, 9907007, 14396977, 22459249, 27664027, 24996677, 17968984, 18898919, 33821595, 49637885, 47797317, 30132562, 17453234, 20329768, 26358328, 22675956, 16261366, 20427707, 31897744, 35173264, 24487846, 9209630, -327476, -2345778, 147613, 4534247, 9582144, 16062949, 25318699, 34340195, 36318502]
39602C6318502o302318o709586r64047R08581k360670j864518M175081O426604
39594B9627629J818488m63642L314986L481156m226055p562186J888581J1314947
39586C9193904N336718q958249j3035632m944229J958430K858135M619565P131755
39578C4160397J661350r543876j0743569L290196J6066483J1593334l497173j0245775
39570C2741367k213972R777311J3462803P249652j895694o678553n563708l236017
39562D3643189m369839p023839n452922P42616N562520N768106N061653O453865
39554E0385349O292829K76271q658760j2992147q986340L96128Q539394R372750
39546D4625474K073892o260352o580983R75982O316797K874040l231512k485570
$$ y = [36318502, 30016184, 23306598, 22342551, 23251132, 20890462, 19025944, 23201025, 29627629, 31446117, 30982475, 34297461, 37778617, 33552562, 25990376, 27878957, 39193904, 44530622, 35572373, 22536741, 17592512, 19550942, 22409077, 27028642, 34160397, 35821747, 26277871, 15534302, 18824498, 34890981, 46484315, 42987142, 32741367, 30527395, 40304706, 53767509, 61017161, 59121467, 52442914, 46879206, 43643189, 39273350, 32249511, 26796589, 27539205, 33101725, 38869831, 43931484, 50385349, 56678178, 56954449, 48295689, 35303542, 26317202, 26713330, 35252724, 44625474, 46699366, 40439014, 33858031, 34834013, 41150810, 44024850, 40793338, 38307768]
39538C8307768M044578O991071K733974k423373k665946m78453j059578l661018
39530D1789023l189167J071033L014845k169778j0144418j1527525l882069M807488
39522A9769432O936179M808029M405589M200232j210943q500228p942786M0052
39514B2505556K709211n422093j2649333q226159O52397K108379K05427O085743
39506G969128J4611098R568414q053395j7206233p614580M925884L696707m459160
39498C437863l162059P155507J2577098P952553N20656m518038p832899p662351
39490H468330j167103O453969O466495M90666j409967L260130O846516N587790
39482C4996826M034858L686811o4055o227648o151149J678684O718357K555208
$$ y = [38307768, 42352346, 49343417, 52077391, 49654018, 46988072, 46509619, 45450041, 41789023, 38599856, 39670889, 42685734, 40515956, 30371538, 18844013, 14961944, 19769432, 26705611, 31513640, 35919229, 40119461, 38908518, 30408290, 22465504, 22505556, 25214767, 19792674, 7143341, -1082818, -430421, 1677958, 1883385, 7969128, 22580226, 32148640, 24095245, 6889012, -725568, 4200316, 7897023, 3437863, 275804, 7431311, 20008409, 27960962, 28481618, 23963580, 16130681, 8468330, 7301227, 13755196, 20221691, 20712357, 19302390, 22562520, 29409036, 34996826, 39031684, 42718495, 42654440, 36426792, 30275643, 31954327, 38672684, 41227892]
39474D1227892l273714k734313N49003Q72625J327558N155649O103484j251745
39466D7976439r730984r610451l225797J504551M123038O143809J741018j0738044
39458B8183579j6401736k076186J8385312J8559131k001690j5947010p616959
39451B1084441P885583J2077737Q376162Q356954J0475367P410612K256570K548653
39443H0472079O121502N392202j20775n231614p316828n762673k42947M291143
39435G7602089J40700r293986j0001665P7879K871739j3409988l3361228l5478594
39427b0853054k2242260j1247113o776016q57432N237207L510397q92155M389185
39419d9731241J4489195J2278042j359078o553200K255263P005574j978369r153113
$$ y = [41227892, 37954178, 35219865, 35768868, 36641493, 37969051, 43124700, 49228184, 47976439, 38245455, 28635004, 25409207, 26913758, 31036796, 37180605, 38921623, 28183579, 11781843, 9705657, 28090969, 46650100, 44648410, 28701400, 21084441, 28970024, 41047761, 49423923, 57780877, 68256244, 75666856, 77923426, 80472079, 86593581, 91985783, 91865008, 86633394, 79316566, 73553893, 73310946, 77602089, 77742789, 68448803, 58447138, 58525017, 61396756, 47986768, 14625540, -20853054, -43095314, -54342427, -61118443, -61975875, -56738668, -53228271, -54120426, -49731241, -35242046, -22964004, -24323082, -30876282, -28621019, -21615445, -23593814, -32746927]
39411c2746927j552349Q720869O197096k299558k252627L327446L204617P05253
39403a6696180O133148J4196913J0230550m450117j2657464o209542N670229J2652305
39395H869842J2873140O192458o828474j7391643j4191722j02997R038366N528436
39387C987406j748023k975308J82630K091129K197101J433814j007390k580902
39379A580457J874230R892934J1449250M190646j493182J274597M992760J153129
39371C4914821n604723o864369n157755p217587r332496l157112P805774J1610307
39363A6996860O441420K259449L596750M337974J802568J915114N295065K114854
39355D4760054j0403928j7533551o449937J2405599J7649689O161706m731813
$$ y = [-32746927, -34299276, -25578407, -19381311, -21680869, -23933496, -20606050, -17401433, -16696180, -10563032, 3633881, 13864431, 9414314, -3243150, -9452692, -3782463, 8869842, 21742982, 27935440, 21106966, 3715323, -10476399, -10579396, -1541030, 3987406, 2239383, -735925, -553295, 1537834, 3734935, 5168749, 4161359, 1580457, 3454687, 13347621, 24796871, 28987517, 27494335, 28768932, 33761692, 34914821, 29310098, 22445729, 17287974, 10070387, 737891, -2419221, 5386553, 16996860, 23438280, 25697729, 29294479, 33632453, 35435021, 37350135, 42645200, 44760054, 34356126, 16822575, 10372638, 22778237, 40427926, 46589632, 41857819]
39348D1857819l223519L703144N786666M291186M499991M654862J582812o99890
39340F2453071K157872N363106K503510k354213j437950J587226l136092j2299121
39332E4837409j1068219K255087R069288l267630k1655563k6258388j8490926
39325a4578942j4345286j7103575j5364485o248866r75780l539872j940613J0821032
39317f3276387K2219009J8494863N826550l52463J433435J204798k331472p98195
39309a7579862N716479N954576l403914r854393l105611R447855J3394306O363888
39301F933324j508867j827935M076862Q914822O609914k026966q347466m461059
39293H362629N468103Q770104J921082l826407j39173M603284o73365r852052
$$ y = [41857819, 38634300, 42337444, 48124110, 52415296, 56915287, 61570149, 63152961, 62453071, 64610943, 69974049, 72477559, 70123346, 68685396, 70272622, 67136530, 54837409, 43769190, 46024277, 55093565, 51825935, 30170372, 3911984, -14578942, -28924228, -46027803, -61392288, -67641154, -68616934, -72156806, -74097419, -63276387, -41057378, -22562515, -16735965, -17088428, -15654993, -14450195, -16781667, -17579862, -11863383, -5908807, -9312721, -19167114, -22272725, -12824870, 569436, 6933324, 5424457, 3596522, 7673384, 16588206, 23198120, 21171154, 12823688, 8362629, 13830732, 22600836, 24521918, 20695511, 20556338, 25159622, 24486257, 14634205]
39285A4634205q055555L613720P913960k209702j2348499p872023N943130J3818578
39277A5437814J1288704N563528J842968n55298j374849J289960N009796M176332
39269D2678955j851408p574519q999034p244946l970329J208607O760710P581862
39261B8589898R90052p952981j0690819m759410K974921L846572k460410p308505
39253C229318l884390L765890O134364J268793l400792k897123j289981k951735
39245b5656m122700L62881O880967P409992J579056l253024k787345K39283K069625
39236H353079J357154k481726p485479o907252L156196J4467948J4311583L164546
39228B7936049n428099m592410k235498n067265o990962j773049L915243J809214
$$ y = [14634205, 6578650, 10192370, 18106330, 15896628, 3548129, -4323894, 1619236, 15437814, 26726518, 32290046, 34133014, 33577716, 32202867, 33492827, 38502623, 42678955, 40827547, 33253028, 24253994, 17009048, 13038719, 14247326, 21008036, 28589898, 29579950, 21626969, 10936150, 6176740, 9151661, 12998233, 10537823, 3229318, -655072, 3110818, 9245182, 10513975, 7113183, 4216060, 2926079, -25656, -4148356, -3785475, 3095492, 10505484, 12084540, 8831516, 6044171, 6283454, 8353079, 9710233, 7228507, -256972, -7164224, -4008028, 10459920, 24771503, 27936049, 22507950, 17915540, 15680042, 10612777, 3621815, 1848766, 5764009, 7573223]
39220G573223k306195J733345R058136O095786n755344r934688p46708O989138
39212A2706693J351704q152784o456387L751968Q175612L450226j107506j187685
39204A2531841k041947m905639l535758J685448J92348j0421879j5067819k176337
39196b3739742J5352046J5711375j03879r616781k203255P104862L300892o120399
39188c14881o325284N72908K413214m90801J980785Q470708O898897k667164n315215
39179E223167L176480O960842l556393j3276576n660616R138027R005751n303420
39171E707262j1787282j626241R761242R677389N732358P609145Q806861J49740
39163C4030474j1050489j1081866j776893L040957n73217l057471J037530N498367
$$ y = [7573223, 5267028, 7000373, 16058509, 22154295, 16398951, 6464263, 5717555, 12706693, 14058397, 5905613, -550774, 3201194, 11376806, 14827032, 13719526, 12531841, 10489894, 5584255, 2048497, 3733945, 3926293, -6495586, -21563405, -23739742, -8387696, 7323679, 7219800, -2396981, -4600236, 2504626, 5805518, -314881, -6640165, -6067257, -3654043, -4144844, -2164059, 6306649, 13205546, 10538382, 5223167, 8399647, 15360489, 11804096, -1472480, -7133096, 2004931, 11010682, 5707262, -6080020, -7706261, 2054981, 11732370, 17464728, 25073873, 33880734, 34030474, 22979985, 11898119, 10121226, 13162183, 12588966, 9531495, 10569025, 16067392]
39155A6067392M693938J539377n71895l566770p543410o902628J33915N589382
39147I439301K459019m325950n156552L02516M289515L360390J483633J362431
39139A3214303K10449m330473r538625j0876270o561229J826501J0149435J3019877
39131G113968P871932j529971q184280q601734m687074l36104J296100o97123
39123g754286l007832o49477M682077L608628p048966j5106472q538369L970018
39115b9844679K938359j1654908j7770322m480646J0328083P301875m802791m164243
39107e2149272R738032J6993153Q675191k410173m035516l97775l51819l246504
39099b7184683l362462P86636P020668J2065125J0578116p0310j1487643j0509764
$$ y = [16067392, 20761330, 22300707, 21728812, 18162042, 10618632, 3716004, 3849919, 9439301, 11898320, 7572370, 2415818, 2718334, 7007849, 10368239, 11851872, 13214303, 13424752, 9094279, -444346, -11320616, -17881845, -16055344, -5905909, 7113968, 14985900, 13455929, 5271649, -3330085, -8017159, -8353263, -7057163, -7754286, -10762118, -11411595, -6729518, -3120890, -10169856, -25276328, -33814697, -29844679, -26906320, -38561228, -56331550, -60812196, -50484113, -43182238, -47985029, -52149272, -42411240, -25418087, -16742896, -19153069, -23188585, -23586360, -23938179, -27184683, -30547145, -29760509, -22739841, -10674716, -96600, -166910, -11654553, -22164317]
39091b2164317K282138J0259166K369679j2380430j8561182j3529732n318086
39084e7042764O77471L858027L322715k49167j787439J305163L703467R00715
39076d5311812j695294K896343J0299975J0185579J806530n856556p755066o552902
39068d1983203l762513K048889P285085M470042n253649j0296977m163701N177319
39060d6478708P288093L788756L397287O954022O318893k001371r768775p194686
39052c7696489L557387R943385M516128n100693n472929M834397J2543507P059106
39044e816201n114987r211377k016788N091257K834266m372827o837929l169854
39036b8614440L38359M44940L67806K461574L418836r5149m596251l590069K203624
$$ y = [-22164317, -19882179, -9623013, -7253334, -19633764, -38194946, -51724678, -57042764, -56365293, -52507266, -49184551, -49433718, -51221157, -49915994, -46212527, -45311812, -47007106, -44110763, -33810788, -23625209, -21818679, -27675235, -35430301, -41983203, -45745716, -43696827, -36411742, -31941700, -37195349, -47492326, -51656027, -46478708, -39190615, -35401859, -32004572, -25050550, -18731657, -20733028, -30501803, -37696489, -34139102, -24195717, -19679589, -24780282, -30253211, -25418814, -12875307, -5816201, -10931188, -20142565, -22159353, -17068096, -14233830, -18606657, -25444586, -28614440, -28276081, -27831141, -27463335, -25001761, -21582925, -21678074, -26274325, -29864394, -27660770]
39027b7660770L939173l069808j0535545o591441P491187J6867432J0963676m034085
39019a2630181j3544025j0896051j798728L881310J176809o627634j0952057o386534
39011e7777091K629448O918267M429181J266577O49235l35073p64133N641142
39003c7342447J5800177J3829806o025870k3955097j8125386L439782J2953299
38996c9425736J707046j0992242r077595J28366L561655K448196M021127O577042
38988d1052141M706416L36031j880316k890394m193336j997434M844130Q638053
38980c3488991L841565l036449m113949l036826o142239q400424j914815P393255
38972d8898873P434203J162477K807414J2456527J2625089m177128k0845423j8767972
$$ y = [-27660770, -23721597, -26791405, -37326950, -43918391, -36427204, -19559772, -8596096, -12630181, -26174206, -37070257, -38868985, -34987675, -33810866, -40438500, -51390557, -57777091, -55147643, -48229376, -43800195, -42533618, -41884383, -42219456, -42983589, -37342447, -21542270, -7712464, -13738334, -37693431, -55818817, -52379035, -39425736, -37718690, -48710932, -57788527, -57660161, -54098506, -51650310, -47629183, -41052141, -36345725, -36009694, -37890010, -40780404, -44973740, -46971174, -42127044, -33488991, -29647426, -32683875, -36797824, -39834650, -45976889, -54377313, -56292128, -48898873, -41464670, -40302193, -37494779, -25038252, -12413163, -16590291, -37435714, -56203686]
38964e6203686l296560O071876K909249j898058M37094N480751N028551j363046
38956d2833829p453200p795724j829431O152483R764512N946697j548512o259726
38948d5856730o481208n657038n357030k184584O109909J4909724J6950910J0895759
38940a6670288K171543m088773p025899o794417k358926M571597P551865K395546
38932b0247752n727418p538369j462663N246992P336134O998185O622162L409142
38924e363587l749434q092709l248583N612025P022038j272979r728750j0376510
38916b9198489n263877J73640M464514P066310N021312j501582n642949k725371
38908b7606492J319440j506638o962147l077792J0199606J6919006O244920j1259547
$$ y = [-56203686, -59500246, -53428370, -50519121, -52417179, -51980085, -46499334, -41470783, -42833829, -50287029, -58082753, -59912184, -53759701, -43995189, -38048492, -39597004, -45856730, -52337938, -57994976, -63352006, -65536590, -59426681, -44516957, -27566047, -16670288, -14498745, -18587518, -25613417, -32407834, -34766760, -30195163, -22643298, -20247752, -25975170, -33513539, -34976202, -29729210, -22393076, -15394891, -8772729, -5363587, -9113021, -17205730, -20454313, -14842288, -7820250, -9093229, -18821979, -29198489, -34462366, -34288726, -29824212, -22757902, -17736590, -19238172, -24881121, -27606492, -26287052, -27793690, -34755837, -37833629, -27634023, -10715017, -4470097, -15729644]
38900a5729644j7237957r474302j474888j072713k066854J321352M419573K712474
38892c8602959J766366O988447J1363627N310949n952769q282200m70779L847537
38884b4031781j687401o401048j252629N613947K380023o819156q428792l48196
38876d0975033O477577N269525L68824k966451m626077l943872J586817Q577184
38868c0231506Q093078j589941j0424861r728548k687429L413621P720062J1426916
38860b4008608J0103133M01917r862818r338779L25759N850314Q86502o612620
38852c2255200p824430m210537r05725K148857N937932O607658K183700n30153
38844b8847898M635787J0609313N106632r453196j6182622p064602N284437O015829
$$ y = [-15729644, -32967601, -42441903, -43916791, -44989504, -47056358, -45735006, -41315433, -38602959, -36836593, -29848146, -18484519, -13173570, -19126339, -27408539, -27879318, -24031781, -25719182, -32120230, -33372859, -27758912, -25378889, -32198045, -40626837, -40975033, -34497456, -29227931, -28859107, -31825558, -36451635, -40395507, -38808690, -30231506, -22138428, -23728369, -34153230, -43881778, -46569207, -43155586, -35435524, -24008608, -13905475, -13503558, -23366376, -32705155, -32379396, -26529082, -25642580, -32255200, -40079630, -44290167, -45195892, -43047035, -37109103, -30501445, -28317745, -28847898, -24212111, -13602798, -8496166, -17949362, -34131984, -41196586, -35912149, -29896320]
38836b9896320j254549k439785M361232P137656L67176n486856O7660J1011379
38828a6132407J2267761j26102j3860469j5260608m074704Q025037J0436888L192047
38820a5532557m938758o005629k99094N145526M600328o18669m417598k960470
38812b5026921J163555J719746m020819j0839005r785020J451014J3667253J4911896
38804a6758301M312869o527020p564324j878756N21823k476601k831826M367037
38796b8835099J1847109R366894j448696q395133n095011Q59584p3430n130728
38788b6904510m335680K890923N650510j959460j0844739r047710J803853R321443
38780c3425370O849072P0281k396214J021497N379360N647070J368861k973165
$$ y = [-29896320, -31150869, -33590654, -29229422, -22091766, -21724590, -27211446, -27143786, -16132407, -3864646, -3990748, -17851217, -33111825, -37186529, -29161492, -18724604, -15532557, -20471315, -26476944, -26776038, -21630512, -17030184, -17648853, -22066451, -25026921, -23863366, -22143620, -26164439, -37003444, -46788464, -45337450, -31670197, -16758301, -12445432, -18972452, -26536776, -28415532, -27893709, -30370310, -33202136, -28835099, -16987990, -7621096, -9069792, -17464925, -22559936, -21700352, -21773782, -26904510, -31240190, -28349267, -22698757, -24658217, -35502956, -44550666, -42746813, -33425370, -26576298, -26506017, -28902231, -27880734, -22501374, -16854304, -15485443, -18458608]
38772a8458608k501659J728584L308320l52819l532837j208667K271285N85130
38764a8161271k674087P58619Q716608R996699J611048o541349o901161l258679
38756a6453573o35587K558785O234311L582584p005121j4414826r351958J323344
38748c4162041N546572M165941N571580Q128773L248066o183569o665598M151848
38740a6198428J1125121K998860j1392192j5973743p998325K415508P281835O786466
38732b0954898L632836n33894l317384k224945J459893K943996m24769n608115
38724b5027280p341357m344063m09450J171904J978169M376717N149946n31123
38716b4976537q278164o363732O658907J4977880N664105j0647522j2185801L309083
$$ y = [-18458608, -20960267, -19231683, -15923363, -16276182, -19809019, -21017686, -18746401, -18161271, -20835358, -20076739, -11360131, -1363432, 247616, -6293733, -13194894, -16453573, -17089160, -14530375, -8296064, -4713480, -11718601, -26133427, -35485385, -34162041, -28615469, -24449528, -18877948, -10749175, -7501109, -13684678, -20350276, -16198428, -5073307, -2074447, -13466639, -29440382, -37438707, -35023199, -27741364, -20954898, -17322062, -17855956, -21173340, -23398285, -21938392, -18994396, -19419165, -25027280, -32368637, -36712700, -37122150, -35950246, -33972077, -29595360, -24445414, -24976537, -33254701, -39618433, -32959526, -17981646, -12317541, -22965063, -35150864, -31841781]
38708c1841781J4963846Q105266o778117j1199033l522832L380591K514368k16530
38700b4594222K207417P667783Q461687J416443p390066q452852l33740O855326
38692a4162224L622146n512411p943903j191747M570672L352480J181291K814608
38684a3269088K703509l066556p088399l385855Q1098n414434j1993660o445493
38676d7878878O769557J1146747M389801O34577N357501P076471n67803o640402
38668a9712429k297804L453326j67973o819934m708315K862387M492253J010858
38660b1887631J791970N264044J511916o547770l984034J0197139J6546676L646941
38652F539251j2733264j1984612J697642P850216Q31750n151446r53855M436800
$$ y = [-31841781, -16877935, -8772669, -15550786, -26749819, -30272651, -26892060, -24377692, -24594222, -22386805, -14719022, -6257335, -4840892, -12230958, -20683810, -21017550, -14162224, -10540078, -16052489, -23996392, -25188139, -20617467, -17264987, -16083696, -13269088, -10565579, -13632135, -20720534, -24106389, -24025291, -29439725, -41433385, -47878878, -41109321, -29962574, -25572773, -24938196, -19580695, -12504224, -13072027, -19712429, -22010233, -18556907, -18724880, -25544814, -30253129, -27390742, -22898489, -21887631, -20095661, -14831617, -13319701, -19867471, -23851505, -13654366, 2892310, 6539251, -6194013, -18178625, -16480983, -8630767, -7799017, -12950463, -13904318, -9467518]
38644i467518O26939p436120q064856l95526N790167M296984j345001n089327
38636b1084258n234238l134857P677K816433L275356J285167J86435L091886Q033526
38627a0756873R343912M710597j412338l320945j197701J55312j394493l216696
38619g089225l182381k481911j794871N15411L598842K495368m047709q434152
38611b0420628l305030O858980J0431065M064773l816870n437713k342180M07911
38603a3559692K028567M173174O049511N651135L347910J245654N18442P81796
38595A0236497N25496j857425n347648n974764k598508m55027l376431n539473
38587a4387283L43849Q570264O039458o515697j2368586l081672Q116214N973993
$$ y = [-9467518, -8840579, -16276699, -24341555, -24737081, -18946914, -14649930, -15994931, -21084258, -26318496, -29453353, -29445676, -26629243, -23353887, -22068720, -21882285, -18790399, -10756873, -1412961, 3297636, 1885298, -1435647, -2633348, -2478036, -3872529, -7089225, -10271606, -12753517, -14548388, -14032977, -10434135, -7938767, -11986476, -20420628, -23725658, -16866678, -6435613, -2370840, -6187710, -11625423, -13967603, -13559692, -11531125, -7357951, -1308440, 4342695, 7690605, 8936259, 9454701, 10236497, 10761993, 8904568, 3556920, -2417844, -5016352, -5471379, -8847810, -14387283, -14043434, -5473170, 566288, -5949409, -18317995, -21399667, -13283453, -7309460]
38579g309460n043897r806435m330259L830882R976321J3672243J0859920j095357
38571A0753958j2716852j0744300K629270J1216481O666111k522590n539528k001842
38563b259292K621140M763464K740829k987197p019010l870972K782088L435517
38555B06567l437715r141896p707336k488673J882116N241893P247408N552837
38547b644799J226458j775028l824147p691848r298993j802918R764724J1509646
38539d536905K131029l160096L243320Q316785k7700j1859143j0022582L403205
38531a2512087J1055512N690798l014432n440073l209598k484740n253671q811462
38523b3979753q475151j446145Q080747J0906232M515752j810356O51962P533753
$$ y = [-7309460, -12353357, -22159792, -26490051, -22659169, -12682848, 989395, 11849315, 10753958, -1962894, -12707194, -10077924, 1138557, 7804668, 5282078, -257450, -2259292, 361848, 5125312, 7866141, 4878944, -2140066, -6011038, -3228950, 206567, -3231148, -12373044, -20080380, -22569053, -20686937, -15445044, -8197636, -2644799, -1418341, -3193369, -7017516, -14709364, -24008357, -25811275, -16046551, -4536905, -2405876, -5565972, -2322652, 5994133, 5966433, -5892710, -15915292, -12512087, -1456575, 4234223, 1219791, -4220282, -7429880, -9914620, -15168291, -23979753, -32454904, -33901049, -25820302, -14914070, -10398318, -12208674, -11556712, -4022959]
38515d022959Q205791J014559n756673n419829Q61577O995044O909813K41670
38507I028993m356903J761660J2385309J1103652m198781j4851007q450405K098619
38499D521137M01654o679609l258804N806972L088180r359562j1689306J59407
38491a7009931P607266P03149p038649l491852K968512O31136n980253o212545
38483b7823167k37645N343949Q252406P602294R28977p334447n938603N562066
38475a3644170J1437501K461215q442532n822605M759094P956774L626547L142778
38467E474602P179872N707717k127700n805343k127927j89681m231359n758405
38459a878224J207760Q559531N919777l545617p700219k317641M152709K907450
$$ y = [-4022959, 4182832, 5197391, -559282, -5979111, -5117534, 1877510, 8787323, 9028993, 4672090, 6433750, 18819059, 29922711, 25723930, 10872923, 2422518, 4521137, 4922791, -1756818, -5015622, 791350, 3879530, -5480032, -17169338, -17009931, -9402665, -8699516, -15738165, -19230017, -16261505, -15630369, -21610622, -27823167, -28060812, -22716863, -14464457, -6862163, -5933186, -13267633, -19206236, -13644170, -2206669, 254546, -8187986, -14010591, -9251497, -1294723, 2331824, 5474602, 12654474, 18362191, 16234491, 10429148, 8301221, 8111540, 3880181, -1878224, -670464, 7889067, 13808844, 10263227, 2563008, 245367, 4398076, 7305526]
38451G305526l359784m339476L363024J0370128O811051l300890p554959l660008
38443E634612j768282o019425o554032K630256J0150551L872726q291268r452230
38435i797092L21964N875774J973581j403640O13970N95939l552438j976610P321720
38426b6832R013329n632341j9067340r713425J4156545K2951479O829898j1467447
38418G043866r897217M027674Q715391N29468n212591n06960M443041k91149q105256
38409G46267o773236J910912M356563m547778j3473622j0035156K935862J1872567
38401a3007621R630226K382490k48251K767823M204897n85402o505846m916631
38393f278315L965864R601453M652695m614034o991339j982886J167649j298487
$$ y = [7305526, 3945742, -393734, 2969290, 13339418, 20150469, 16849579, 9294620, 5634612, 3866330, -2153095, -8707127, -6076871, 4073680, 7946406, -344862, -9797092, -9475128, -3599354, -1625773, -3029413, -2415443, -1819504, -5371942, -7348552, -26832, 8986497, 3354156, -15713184, -25426609, -11270064, 11681415, 18511313, 7043866, -2853351, 1174323, 9889714, 10419182, 5206591, 4699631, 9142672, 8851523, 746267, -6026969, -4116057, 240506, -4307272, -17780894, -27816050, -24880188, -13007621, -3377395, -994905, -1243156, 1524667, 5729564, 5144162, -1361684, -6278315, -2312451, 7289002, 11941697, 7327663, 336324, -1646562, -478913, -1777400]
38385a777400l189932o46287J448142j41913O7819N827491R948908M680581m974672
38376A1242737q352439m994361k773771l216930l57097O177600Q338780K220611
38368H285130n886488r069816p590174m081376J498078P996247J0428332O087827
38360G667760p53272m069657k888314k67910J240056P08884j632237l886691l802857
38351g684238j603439Q33550L311394O300158P256407K956182m272990q033542
38343i36518o440195l790953k595539n2542N276789R220343P860557L032789j189979
38334A0384752l395440l544477j158520K306561L463914K129944K026775L622537
38326A5836046J707498n595655j0643284n393338O343687J2403233P239799k196002
$$ y = [-1777400, -4967332, -5613619, -4165477, -4307390, -4239571, 1587920, 11536828, 16217409, 11242737, 2890298, -2104063, -4877834, -8094764, -8451861, -2274261, 6064519, 8285130, 2398642, -6671174, -14261348, -18342724, -16844646, -8848399, 1579933, 7667760, 6914488, 2844831, -43483, -311393, 928663, 1637547, 5310, -3881381, -7684238, -9287677, -8454127, -5142733, 1157425, 8413832, 11370014, 7097024, -936518, -7376713, -11167666, -13763205, -13815747, -8538958, 681385, 8541942, 11574731, 10384752, 6989312, 3444835, 2286315, 4592876, 8056790, 10186734, 12213509, 15836046, 17543544, 11947889, 1304605, -4088733, 2254954, 14658187, 21897986, 19701984]
38318A9701984o189903l466897o20441k592469o366611n015516K948162J0811470
38310I209779J1541170N750796q52114m940127o195117l679868J761112L493430
38302A6089061m076146j4666369j5242907l857306O906836P870481N117011P827301
38294E967962J2832322J0316718j21526q489430p999629k309415J142718L9347
38286A1379067j787088j36926L629612L715222j362084m365590Q09824P976833
38278A9858870O388651j897125m343860J292892K646946n941285j2399390o055044
38270d49345N254948Q386336L871367o12798n075270j1301566j1687065m00767
38262a2014160J1499428R445026j427978m302183K110070L742258l046279o315030
$$ y = [19701984, 13512081, 10045184, 9424743, 6832274, 465663, -4549853, -1601691, 9209779, 20750949, 26501745, 25649631, 20709504, 14514387, 10834519, 12595631, 16089061, 12012915, -2653454, -17896361, -21753667, -14846831, -6976350, -1859339, 5967962, 18800284, 29117002, 28995476, 20506046, 12506417, 10197002, 11339720, 11379067, 9591979, 9455053, 13084665, 16799887, 15437803, 11072213, 11882037, 19858870, 26247521, 24350396, 20006536, 21299428, 23946374, 18005089, 5605699, -449345, 4805603, 13191939, 17063306, 16450508, 11375238, 73672, -11613393, -12014160, -514732, 8930294, 7502316, 3200133, 5310203, 9052461, 6006182, -308848]
38254c08848j104302K598795o73708k494486K676417P573879O591569N263332
38246B0122648P091311N013111m698714j2816147j1282878n511935k986244r68217
38238f037065M098561O225046Q91968l601344J110706P950083N675536j396117
38230A4917374l30443Q124487J0141559J059186p604374n936416J301451L764509
38222B5437333m36086m416081k017080N069467Q219715R95937j1101210j4272275
38214G479720l616186Q622691Q150958k838306r969787n937966L087397Q286393
38206A3264914P030300J542316l900500m436939P45689N769409N058933J065344
38198B6139466l61770O48416j05360k489201l142347k620232l361113k750715
$$ y = [-308848, -1413150, 1185645, 511937, -1982549, 693868, 8267747, 14859316, 20122648, 27213959, 32227070, 27528356, 14712209, 3429331, -2082604, -5068848, -6037065, -1938504, 4286542, 5178510, 1577166, 2687872, 10637955, 16313491, 14917374, 14586931, 22711418, 32852977, 33912163, 26307789, 20371373, 21672824, 25437333, 25001247, 20585166, 18568086, 23637553, 31857268, 32853205, 21751995, 7479720, 3863534, 12486225, 20637183, 17798877, 7829090, 1891124, 4978521, 13264914, 20295214, 21837530, 17937030, 13500091, 14245780, 20015189, 25074122, 26139466, 25777696, 26426112, 26320752, 23831551, 20689204, 18068972, 14707859, 11957144]
38190A1957144K768148Q334616N598200l227562o885153j926757K743315J066061
38182B0428012j299536J441879M602985J661300l782960l576212J814651M541185
38174B5831304K049837K11009K821902N038490J186984n007199l859794O265588
38166C4538121J3644406O435586j0746442j9739517j0069580Q005380J5518247
38159C7586201O226104q437562j3668466o257144M106626N885290j717038p539412
38151A6184599k439525P632094R549891K860438K14737N456977N913533n095189
38143D0277555j2912387l204906J2989505J4607292L033011k101842M029014N697647
38135F2414889m340987j2767044r453529l174449l653615n307242q73956L487833
$$ y = [11957144, 14725292, 23059908, 28658108, 25430546, 18545393, 16618636, 19361951, 20428012, 19128476, 20570355, 25173340, 26834640, 23051680, 19475468, 21290119, 25831304, 27881141, 28092150, 30914052, 35952542, 37139526, 32132327, 28272533, 34538121, 48182527, 54618113, 43871671, 24132154, 14062574, 22067954, 37586201, 43812305, 35374743, 21706277, 15449133, 19555759, 25441049, 23724011, 16184599, 13745074, 21377168, 30927059, 33787497, 34002234, 39459211, 45372744, 40277555, 27365168, 24160262, 37149767, 51757059, 54790070, 52688228, 56717242, 62414889, 58073902, 45306858, 35853329, 32678880, 29025265, 23718023, 22844067, 26331900]
38127B6331900K32881m287033o85353O442320O409253M71314j788475P25682Q24936
38118C4677425k498098k328988L389491P556425M185733l817940q797481o559167
38110B5807400l16160K204671k175551o177091j013784Q885947R855143K6297
38102C7096872n910867R58527R659600P305972j004797l181708n03494j589143
38094D2830962m259860o54960N063592K328832n339782m029056O617497J1638088
38086E4195313N163858j586170j372357k124588r114434j2203209k346906J1453856
38078D2065363J4175290N352669l736523p034998p003838n490056j577740L417927
38070D0168094O629040P978487Q497712O902810K682381p43112p59005K31145
$$ y = [26331900, 26564781, 22277748, 21592395, 28034715, 34443968, 34915282, 33126807, 33852489, 34677425, 32179327, 29850339, 33239830, 40796255, 44981988, 41164048, 32366567, 25807400, 25491240, 27695911, 25520360, 19343269, 18329485, 27215432, 37070575, 37096872, 31186005, 32144532, 41804132, 49110104, 48105307, 44923599, 44420105, 42830962, 38571102, 37916142, 42979734, 45308566, 39968784, 35939728, 42557225, 54195313, 59359171, 57773001, 56400644, 54276056, 45161622, 32958413, 30611507, 42065363, 56240653, 61593322, 57856799, 50821801, 43817963, 38327907, 36750167, 40168094, 46797134, 54775621, 63273333, 70176143, 72858524, 72115412, 71356407, 71587552]
38062G1587552j07525N93160L672137M421074l99068n070265l181577Q43680j785546
38053G0573622q759125q449710K578254J3777355J4449468N347215n225260q998250
38045G5293569l78357J8353866L1184678J9134884j5447200m4572188m4456609
38038C9112643k2866052n989719m287210n531714P31978Q257658P411273j53721
38030A6685136o819082q855350m734936O427361J7708831J6178966J277468q723395
38022B9144999o61934J2357574R033547q065885j7148511j0621959l018982l781077
38014G237772l501882N274073J2906143J0110636M740509P019025J0597933M093629
38006E8477838p610427j0085179k006260M447437L146829n9579k3474J495927
$$ y = [71587552, 71480027, 72073187, 75745324, 80166398, 79767330, 74697065, 71515488, 72359168, 70573622, 61814497, 53364787, 55943041, 69720396, 84169864, 89517079, 84291819, 75293569, 74915212, 93269078, 124453756, 143588640, 128141440, 83569252, 39112643, 16246591, 10256872, 5969662, 437948, 1169926, 9427584, 16838857, 16685136, 9866054, 1010704, -3724232, 2703129, 20411960, 36590926, 37868394, 29144999, 28483065, 40840639, 49874186, 41808301, 24659790, 14037831, 11018849, 7237772, 3735890, 9009963, 21916106, 32026742, 36767251, 43786276, 54384209, 58477838, 50867411, 40782232, 38775972, 43223409, 46370238, 46310659, 46287185, 47783112]
37998D7783112K571922L719745L418058l72067m593441m471779r40108K135962
37990D9251404M686583O962642M622795l315935p556583j068405P313977N365783
37982F6262261k104062j399098O132127P304544J888119K651187R485347O778996
37974I6999421p467400j3068837R57236J7111013J5668155K798496l297831K65031
37966A09965284M214124N697572P165830O354206K323400J459472L204868p068534
37958A33316222l2823051m8163314k9652585M156866J4761817K81253l813283
37951C8063925J6991891L4232226K6566462J6015803K6625648L4296634k701755
37944A90090834p3085889j12986288q4214707k0540813J9274752K0074658J0187450
$$ y = [47783112, 50355034, 54074779, 57492837, 57120770, 52527329, 48055550, 47115442, 49251404, 53937987, 60900629, 65523424, 62207489, 54650906, 53582501, 60896478, 66262261, 64158199, 62759101, 68891228, 76195772, 78083891, 80735078, 90220425, 96999421, 89532021, 76463184, 77420420, 94531433, 110199588, 112998084, 109700253, 109965284, 114179408, 119876980, 127042810, 133397016, 135720416, 137179888, 140384756, 133316222, 100493171, 52329857, 22677272, 26834138, 41595955, 41877208, 38063925, 55055816, 89288042, 115854504, 131870307, 158495955, 192792589, 190090834, 117004945, 4018657, -80196050, -100736863, -81462111, -61387453, -51200003]
37937e1200003R842633R573142j223431j1771623q041109L775068P735349K855005
37929c8454969J162965N395146N592250r91726k959327N908832J4042818Q866897
37921a437114l645227p975998j347204N143706M315362M8422k377976k289349
37913i565378N60399O344707J0039642N347847m080084o562349J141442Q274253
37905A1500479N932331J7960J094746P713579Q996284J211179o867504n845963
37897B3753091L296714J2231296J5199524J2784277P378652j139275j2374055
37890F1130224j9637593j3646525M024131J7439119J5487177J0513618K2590704
37883I7900855M2668239L0880847l2570580j07243427j26820248p4077371q22960
$$ y = [-51200003, -41357370, -31784228, -33007659, -44779282, -52820391, -49045323, -41309974, -38454969, -37292004, -31896858, -26304608, -27296334, -30255661, -24346829, -10304011, -1437114, -5082341, -13058339, -14405543, -9261837, -4946475, -4898053, -7276029, -9565378, -9004979, -2660272, 7379370, 12727217, 8647133, 2084784, 3226226, 11500479, 17432810, 17450770, 18545516, 26259095, 35255379, 36466558, 29599054, 23753091, 27049805, 39281101, 54480625, 67264902, 74643554, 73504279, 61130224, 41492631, 27846106, 31870237, 49309356, 64796533, 75310151, 97900855, 140569094, 171449941, 138879361, 31635934, -95184314, -169261685, -170084645]
37876a70084645L3212232K2040404K012443k553684J003771J099738K029806R647464
37868a01592471J6098959J1692086J431634k404956J981694O292753O227552N058192
37860e5214557M987910M084981J860414O68068R56170N54202j188800k682878
37852d5974490k475471Q96074Q172854J4657595J1928360N68141n787037J309077
37844a6704897J0025233N001833o798562n336215R342725J4930341K213406r443317
37836C230547k694185J1255122J2224520J533448n601558o703483j0622972j6076118
37828a3454679j2347974J1339P608994M790180K61837R62121L454194M368350
37820d345638O179936Q519744N802132j602573m809901n58204K270079l085937
$$ y = [-170084645, -136872413, -114832009, -112819566, -115373250, -114369479, -113269741, -111239935, -101592471, -85493512, -73801426, -72369792, -74774748, -72793054, -66500301, -60272749, -55214557, -50226647, -46141666, -44281252, -43613184, -42657014, -42102812, -43291612, -45974490, -48449961, -47553887, -39381033, -24723438, -12795078, -12226937, -18013974, -16704897, -6679664, -1677831, -8476393, -13812608, -4469883, 10460458, 12673864, 3230547, 536362, 11791484, 24016004, 25549452, 19947894, 13244411, 2621439, -13454679, -25802653, -25791314, -18182320, -13392140, -13130303, -12168182, -8713988, -4345638, 1834298, 10354042, 16156174, 14553601, 9743700, 9185496, 11455575, 8369638]
37812H369638r530554p012468J320952L274146m585809j1512801o350709P971607
37804a8055998J7037430J1848484N3335l821809J841300L878400m720721j2394264
37796d333843o639580M872145M971669n965666j0117395N59720J3223038J4071940
37788A0642028N425645k713073o216899n717769k182386M35084k719083p923322
37780a0969775n391366M397172Q498344J296841o154153m162294J293115J959805
37772i232311J771648N427562N094699n701683j5206521q727036O303291J0056023
37764a0214328J022509l442831L409872Q693459L915749j765291J89713L383492
37756E192344M18178l291343j159603J125256l402144q184907l371875O080689
$$ y = [8369638, -1160916, -8173384, -6852432, -3578286, -8164095, -19676896, -26027605, -18055998, -1018568, 10829916, 10883251, 7061442, 8902742, 12781142, 8060421, -4333843, -10973423, -6101278, -1129609, -7095275, -17212670, -16652950, -3429912, 10642028, 16067673, 13354600, 7137701, 1419932, -762454, -327370, -3046453, -10969775, -16361141, -11963969, -3465625, -2168784, -8322937, -12485231, -11192116, -9232311, -7460663, -2033101, 3061598, -2640085, -17846606, -26573642, -20270351, -10214328, -9191819, -12634650, -9224778, -531319, 3384430, 1619139, 1808852, 5192344, 5610522, 2319179, 1159576, 2284832, -1117312, -9302219, -12674094, -6593405]
37748f593405P429852J244810l4462O046366P299853k334438j1797103j0303355
37740i041882m012625m494348q811967m715114P585541J3382080N535739m250615
37732h823191k810901N793793Q392773K801729j490770K16913K333556M59814
37724F873716k188447k586328k909636l892211j695424L654946M736110k135370
37716a42644r483131r683968o761367q460316j2256214r897274k496743M62171
37708e8719486l320607n402332m74872N672221N469637n64152o888505j0044326
37700g4272422r525986o433040l814124m148664n085683k348927K466304L003675
37692a00158867j699092m914546k360393K211939M574565O103898Q244622P924745
$$ y = [-6593405, 836447, 2081257, 2046795, 8093161, 15393014, 13058576, 1261473, -9041882, -13054507, -17548855, -26360822, -31075936, -23490395, -10108315, -4572576, -8823191, -11634092, -5840299, 2552474, 5354203, 3863433, 4080346, 6413902, 6873716, 4685269, 2098941, -810695, -4702906, -6398330, -2743384, 1992726, -142644, -9625775, -19309743, -26071110, -34531426, -46787640, -56684914, -59181657, -58719486, -62040093, -67442425, -67917297, -62245076, -56775439, -57339591, -64228096, -74272422, -83798408, -90231448, -94045572, -98194236, -103279919, -105628846, -103162542, -100158867, -101857959, -106772505, -109132898, -106920959, -102346394, -96242496, -87997874, -80073129]
37684h0073129L872463J171187L301500N363445K188948k105479q91133K971746
37676f4200452J513421m269740m957364K363180R151703P793639J285543k620380
37668e3940450j069341K967169M650524L85717q013430j1415929k547784J1038802
37660e7944722J1946655m041785j8522750j2731262O968852J7028575P612715
37653d9683722o569296q172178J065325O508522J148077p905800j0542200m607453
37645g8758725M162508Q859512P196543K641099K71293J260619K569001J921945
37637d9876205L30874q74515j832972j632763J468557M866192K141209o635606
37629e2045229j0675567j833886J1863798J5297411O922812j14152J983087N819519
$$ y = [-80073129, -76200666, -75029479, -71727979, -66364534, -64175586, -66281065, -67172198, -64200452, -62687031, -66956771, -71914135, -69550955, -60399252, -52605613, -51320070, -53940450, -55009791, -52042622, -47392098, -47006381, -55019811, -66435740, -68983524, -57944722, -45998067, -50039852, -68562602, -81293864, -74325012, -57296437, -49683722, -56253018, -64425196, -63359871, -56851349, -55703272, -63609072, -74151272, -78758725, -74596217, -65736705, -58540162, -55899063, -55627770, -54367151, -51798150, -49876205, -49545331, -50419846, -52252818, -53885581, -52417024, -47550832, -45409623, -52045229, -62720796, -64554682, -52690884, -37393473, -30470661, -30584813, -28601726, -22782207]
37621b2782207K659004m636330q992270j0253421j0606850o624372L912475J2792805
37613d4531166J0317342M16394m322144r34246K205790J237532J319069L370399
37605c0921030J12823r081442j2173626k044729J0438322J1531023M205852M61535
37597b7471272R39152k998187j0099965q566382L288998J0575951K630429j0763254
37589d2464530j2444342j30446J2640085J3807678M225859n995333p757790j183409
37581c9302228M071752k19994q587983o930447P301293J8356730J2206156m185532
37573a7290253j2920547q930873k508051j171977j369838J322187N019797P161203
37565c0688352Q026125O022399j594854j0353817j0177053L86816J0195694J0586128
$$ y = [-22782207, -20123203, -24759533, -33751803, -44005224, -54612074, -61236446, -57323971, -44531166, -34213824, -33797430, -38119574, -39053820, -36848030, -35610498, -34291429, -30921030, -30808207, -39889649, -52063275, -54108004, -43669682, -32138659, -27932807, -27471272, -26532120, -29530307, -39630272, -48196654, -44907656, -34331705, -31701276, -42464530, -54908872, -55039318, -42399233, -28591555, -24365696, -30361029, -38118819, -39302228, -35230476, -35450470, -44038453, -50968900, -43667607, -25310877, -13104721, -17290253, -30210800, -39141673, -41649724, -42821701, -44191539, -42869352, -37849555, -30688352, -22662227, -16639828, -18234682, -28588499, -38765552, -38378736, -28183042, -17596914]
37557a7596914N778581K668609m13718o669099j0902634p025743J89865J574486
37549c2396567j991805k155231K379873M586350J511633k262316l882717n318594
37541c9529374n958857j476831P113379J1300343N846287l960935q893193n407522
37533d0966703K697376Q116240N467695k654525o517973j687230K721877k988526
37525c5811769j1433982o898589Q454041J3543776r85882j6913304j3627350L705071
37517e9967988J4496304J1732036N425725K866875J409833m52236M35668K551523
37509b1502260o99009q633095j1196091l803853M841497N565043J807581K650699
37501c0969488P966930R083819K703514m083869m818613l228670o449038j2159995
$$ y = [-17596914, -11818333, -9149724, -9563442, -16232541, -27135175, -34160918, -33971053, -32396567, -34388372, -36543603, -34163730, -29577380, -28065747, -30328063, -34210780, -39529374, -45488231, -46965062, -39851683, -28551340, -22705053, -26665988, -35559181, -40966703, -38269327, -30153087, -24685392, -27339917, -33857890, -35545120, -32823243, -35811769, -47245751, -54144340, -45690299, -32146523, -33132405, -50045709, -63673059, -59967988, -45471684, -33739648, -28313923, -25447048, -24037215, -24489451, -24053783, -21502260, -22201269, -30834364, -42030455, -45834308, -40992811, -35427768, -33620187, -30969488, -23002558, -13918739, -11215225, -15299094, -20117707, -23346377, -29795415, -41955410]
37493d1955410j0317900J131381J0366533P266473j521976k400771M176627M976194
37485b8278849l583127q418768o38436R533528Q266806j398714o257605l139654
37477c3914819J89798K07421J080480M159643N096180J912069k572666o032381
37469b9874275p012335k305705P454195J2456692M495299q775509j1904279l133570
37461c8599487M601644M369989K929374M891156L855385l822699q980325k944520
37453c3699483P878792J0492071K905873n133262n578271K99324N606664M991337
37445a2236955k28246l079688j47524K147826k680447p820384j286286J2668477
37437a2663227J5206192L18583j4777395j4652444o185391k723726j671290O490604
$$ y = [-41955410, -52273310, -51141929, -40775396, -33508923, -35030899, -37431670, -33255043, -28278849, -31861976, -40280744, -40919180, -31385652, -23118846, -24517560, -30775165, -33914819, -33725021, -33517600, -32437120, -28277477, -23181297, -21269228, -23841894, -29874275, -36886610, -39192315, -31738120, -19281428, -14786129, -23561638, -35465917, -38599487, -33997843, -29627854, -26698480, -21807324, -17951939, -21774638, -30754963, -33699483, -25820691, -15328620, -12422747, -17556009, -23134280, -22834956, -17228292, -12236955, -12465201, -15544889, -15692413, -13544587, -16225034, -24045418, -25331704, -12663227, 2542965, 2861548, -11915847, -26568291, -32753682, -35477408, -37148698, -30658094]
37429c0658094J6950753J6141116L626241p575607r970357p101234k799815J545867
37421a9841130J519560m722156p686319J924135J4722306J2298626m240967j3418450
37413a9444395m993664N554599K171045q251547r246974L71452Q355251Q213112
37405a7271121M022000K19534k569211l342656r64950J928924J235526l096678
37397a9838632p727363j0113293q849820l081410M715509Q684446O222771J715686
37389b8272106L60654J630518K029688N91722j584259l369250k420401L040712
37381b7992722Q225037M112537r180623j8086602j1920038J897112P611313K339413
37373d2994573k265944J787097Q884448R970502M881035O05314J424647M210041
$$ y = [-30658094, -13707341, 2433775, 6060016, -1515591, -11485948, -18587182, -21386997, -19841130, -18321570, -23043726, -30730045, -28805910, -14083604, -1784978, -6025945, -19444395, -24438059, -18883460, -16712415, -24963962, -34210936, -33839484, -25484233, -17271121, -13249121, -13029587, -15598798, -18941454, -19906404, -17977480, -16741954, -19838632, -27565995, -37679288, -46529108, -49610518, -44895009, -36210563, -29987792, -28272106, -27911452, -26280934, -24251246, -23659524, -25243783, -28613033, -31033434, -27992722, -19767685, -15655148, -24835771, -42922373, -54842411, -52945299, -45333986, -42994573, -45260517, -43473420, -34588972, -24618470, -19737435, -19132121, -17707474, -13497433]
37365a3497433K458670n763297j3681692j1715508Q29225J3028742J4233716N615713
37357h491864l468936o807783m467683J339004P081102P211269l39334q934823
37349a6879048r730043k886053L230130L237317n06337l554641l897937j164892
37341c2151504L102105M577284P22467m381287m812331j032759K232477M193341
37333b7550207P093151R101396O510868K003998J564004L383335l9596p779579
37325e712630r510062j756256N615474M114983j836299m095596k803621k207053
37317a8191060j836072O57692L442352L948133L550567L430950J303697k523829
37309f217570k382414L306220O621233J560628n515976n218929P05798L575681
$$ y = [-13497433, -11038763, -16802060, -30483752, -42199260, -41370035, -28341293, -14107577, -8491864, -11960800, -18768583, -23236266, -21897262, -14816160, -7604891, -7944225, -16879048, -26609091, -29495144, -26265014, -23027697, -23534034, -27088675, -30986612, -32151504, -29049399, -24472115, -23749648, -28130935, -32943266, -33976025, -31743548, -27550207, -20457056, -11355660, -4844792, -2840794, -1276790, 2106545, 2066949, -5712630, -15222692, -16978948, -11363474, -7248491, -9084790, -13180386, -15984007, -18191060, -20027132, -19369440, -15927088, -11978955, -8428388, -4997438, -3693741, -6217570, -8599984, -5293764, 1327469, 2888097, -2627879, -7846808, -7141010, -3565329]
37301c565329J404936j198160l048060o392354r176705o741301k19665M677824
37293b4258814N859299M770529R89601m971461o686127N92832R465569Q048215
37285f190357k577613r142572m952229K455733M190518Q96781k194194k956117
37277b0470050j790717M49938J813332J557266K924291P674758R767035K917057
37269D842910p145521q470948q00455L856337q765m325922k663664k93128l033332
37260a8042488o601671m461337J877202P190943J0134954J0580223O410562r86540
37252F101848m512955n37259N344087O412538K699934l041685r902789j5018708
37244a2454989j3098871m769540K230891M640903P711414J3074508J3272660N106881
$$ y = [-3565329, -2160393, -3358553, -6406613, -12798967, -21975672, -28716973, -28936638, -24258814, -18399515, -13628986, -12639385, -17610846, -24296973, -23704141, -14238572, -6190357, -8767970, -17910542, -22862771, -20407038, -16216520, -15319739, -17513933, -20470050, -22260767, -21810829, -19997497, -18440231, -15515940, -7841182, 1925853, 4842910, -2302611, -10773559, -11574014, -7717677, -7726442, -12052364, -14716028, -15009156, -18042488, -24644159, -29105496, -27228294, -20037351, -9902397, 677826, 7088388, 6101848, 1588893, 1051634, 6395721, 12808259, 15508193, 12466508, 2563719, -12454989, -25553860, -30323400, -28092509, -23451606, -15740192, -2665684, 10606976, 15713857]
37236A5713857k599119l197975l372492r786095j5061110r697529O90998L837152
37228b3472313j37555j931369J30611L97466j281979p07027K74559k127204k894140
37219c1748951M186213J1532828O267914p808935j3268613m691936N084115O594638
37211b3852727N134978N982417M329118k353953n684691J85392P011733M437176
37203d810557m115880p286568k489335K107829P0501n666210p625785k811873
37195c2627878L684930M424147l62033j926262M309935J0269322O442074l079586
37187h865351o656456k973384j077584l774388l809868K035726P141758O090051
37179a1889496J043282m888369j0134922r486517J342991J4185152J4802260L667781
$$ y = [15713857, 13114738, 9916763, 6544271, -3241824, -18302934, -28000463, -27309465, -23472313, -23609868, -25541237, -25410626, -25013160, -26295139, -27002166, -26727607, -28854811, -31748951, -27562738, -16029910, -9761996, -17570931, -30839544, -35531480, -30447365, -23852727, -18717749, -12735332, -8406214, -10760167, -16444858, -16259466, -9247733, -4810557, -8926437, -16213005, -18702340, -16594511, -16524010, -22190220, -29816005, -32627878, -28942948, -24518801, -24880834, -26807096, -22497161, -12227839, -5785765, -8865351, -15521807, -18495191, -19572775, -23347163, -27157031, -25121305, -17979547, -11889496, -10846214, -15734583, -25869505, -35356022, -34013031, -19827879, -5025619, -1357838]
37171a357838l715908q06678J606152l151797n202023K755865R801562L826200
37163C755535q251221j1654567n532772K63258K156485L163250K972248M92055
37155a2635729M90292N944637R773669N491363p88265r94247K7482n529483j0903162
37146i123443m315214Q349000Q990597m850713j5123427r170558M607425J1568787
37138i067546Q614792J758313l818755n678810l630798j567102l938799q288252
37130b5616957p370511J27336P402218Q840794N068122j461284q709848j2246193
37122c3966323p537686L114919J1485949J2326115P164007L48427l873736k625784
37114a3564112J651300J564509m952268r353252m918797J575032Q32108k569648
$$ y = [-1357838, -5073746, -5880424, -4274272, -7426069, -12628092, -9872227, -70665, 3755535, -4495686, -16150253, -21683025, -21419767, -19263282, -16100032, -13127784, -12635729, -12145437, -6200800, 3572869, 9064232, 8275967, 7281720, 7309202, 1779719, -9123443, -13438657, -5089657, 3900940, -949773, -16073200, -25243758, -20636333, -9067546, -452754, 1305559, -2513196, -8192006, -11822804, -13389906, -17328705, -25616957, -32987468, -32860132, -25457914, -16617120, -11548998, -13010282, -21720130, -33966323, -41504009, -38389090, -26903141, -14577026, -7413019, -7064592, -10938328, -13564112, -11912812, -10348303, -15300571, -24653823, -29572620, -27997588, -27165480, -29735128]
37106b9735128J739192J0234324J0165515J885251j193663M086330N605155j738298
37098A048678o655685j450606N093895L946965J43317K71101q78433q584380j4126169
37089b1191317o357034R799426J8911689J4227030J497226j0872325j6341380
37082a0326685j1016630M78395N666010L1140m444032L025686J3175847R363758
37074E953489n806416j2702578l342212P715092N538956m701101p172035K317179
37066a2199626J1940306R753880k037046j0476621p641591K50306K119956k343758
37058a0634194l230008L254348Q271605M375291k891440m403585q85983J414155
37050d729811J981937L653118M445797J557372j252189k38532o01266p627433
$$ y = [-29735128, -27995936, -17761612, -7596097, -5710846, -6904509, -2818179, 2786976, 1048678, -5607007, -7057613, -1963718, 1983247, 2126564, 2397665, 1519232, -7065148, -21191317, -27548351, -17748925, 1162764, 15389794, 16887020, 6014695, -10326685, -21343315, -20864920, -15198910, -15167770, -19611802, -16586116, -3410269, 5953489, 147073, -12555505, -15897717, -8182625, -2643669, -7344770, -14516805, -12199626, -259320, 9494560, 7457514, -3019107, -10660698, -10410392, -8290436, -10634194, -13864202, -10609854, -2338249, 2037042, -854398, -5257983, -6143966, -4729811, -2747874, 905244, 5351041, 6908413, 5656224, 5417692, 4816426, -2811007]
37042b811007j3879550q592582L648364Q535405M576763L637146Q380030P080157
37034A0574726m414866j2996798r100234j865375k284276m330977K882263J3461300
37026h074237J1503613l995599j5744370j0848212L837370J2016794O623247n053608
37018i735002j1181386p559851j21191M182643N954855Q633864Q631907j19385
37010a313546j1811117j1731093J678210J0869282M037662o638161m273587O240176
37002a2942174P938850N20607p35669P180887R099906k349826j3322238r690060
36994a4299717K829356R232011N323131k125642o977335o825638j342859M905197
36986i281496M372215k325115m586993K196140P713482K562116o033518n995237
$$ y = [-2811007, -16690557, -25283139, -21634775, -13099370, -8522607, -4885461, 3494569, 10574726, 6159860, -6836938, -15937172, -17802547, -20086823, -24417800, -21535537, -8074237, 3429376, -566223, -16310593, -27158805, -23321435, -11304641, -4681394, -9735002, -20916388, -28476239, -28597430, -24414787, -18459932, -9826068, -1194161, -1313546, -13124663, -24855756, -23177546, -12308264, -8270602, -14908763, -19182350, -12942174, -5003324, -4482717, -5218386, 1962501, 11062407, 8712581, -4609657, -14299717, -11470361, -2238350, 3084781, 959139, -6018196, -12843834, -14186693, -9281496, -4909281, -7234396, -11821389, -9625249, -1911767, 650349, -5383169, -11378406]
36978a1378406l28114j037536p693566p722075K533724J1912787J1836270O429416
36970D552500J592812l713951r769881j0738399m447193J161074o58827m565260
36962b6587125j805138N719502Q984873N922305K818323K899762K268470j569808
36954a348836m456765k028289L550175O938609O487759M040312K17684n294497
36946H106152r276208o645463Q21688L036794n184913j3462025p534096R331199
36938b0806872J7879002Q859256m406141o443491r51422l66130m007433k113058
36930a2356289M345098N273503P34378J073484P281956Q774130L178353K53526
36922A8558139J742869l205333j4906500j5859405Q91139J5076515P765790r295821
$$ y = [-11378406, -11706520, -12744056, -20437622, -28159697, -25625973, -13713186, -1876916, 4552500, 6145312, 2431361, -7338520, -18076919, -22524112, -21363038, -22021865, -26587125, -28392263, -22672761, -13687888, -7765583, -4947260, -2047498, 220972, -1348836, -5805601, -7833890, -4283715, 2654894, 9142653, 13182965, 13400649, 8106152, -1170056, -7815519, -6993831, -3957037, -9141950, -22603975, -30138071, -20806872, -2927870, 5931386, 1525245, -4918246, -5869668, -6235798, -10243231, -12356289, -8011191, -2737688, -2003310, -929826, 6352130, 15126260, 18304613, 18558139, 20301008, 17095675, 2189175, -13670230, -12779091, 2297424, 10063214, 767393]
36914G67393j2672170k804683J756436l027217l978380K768706O022554J591408
36906i575953q22536L248648N237866L10039l840173j146013L228648L324756
36898c4718Q15456j848614n627680q117034l834559M748118P833358L720667J561614
36889g83392M661499M255948m253560j1965805j0756042m884147p19693L189149
36881b1256043P494796N771032l135306p935744j317677O958069N432714o00451
36873h588610L27949N714359M985631j025485k916856r43793l598365r369966
36865a5415136o750880N492209J3216391O916442n203217r783735m404461M354979
36857a1577408J0844988J2367697P373124k190026r914595j0689674n766226k56190
$$ y = [767393, -11904777, -14709460, -12953024, -15980241, -19958621, -17189915, -11167361, -9575953, -10398489, -7149841, -1911975, -1601936, -5442109, -6588122, -3359474, -34718, 780738, -1067876, -6695556, -14812590, -18647149, -13899031, -6065673, -2345006, -783392, 3878107, 8134055, 3880495, -8085310, -18841352, -23725499, -24445192, -21256043, -13761247, -7990215, -11125521, -19061265, -20378942, -13420873, -7988159, -8588610, -8260661, -2546302, 2439329, 1413844, -1503012, -2446805, -6045170, -15415136, -22166016, -16673807, -3457416, 3459026, -1744191, -11527926, -15932387, -11577408, -732420, 11635277, 19008401, 16818375, 6903780, -3785894, -9552120, -9808310]
36849i808310K204671J477220L31827K349321P748651J1519605Q829130J781543
36841B6433658k863607k380880n57395j397284m215776n794323m513506j615551
36833C095336j18005k151999n990711p201987m331758r56271j5919L96749K418160
36824a4856405L570046J209431j637570n23518K882461L367496L75979k246093
36816g858173l155090m064748m349337j235817M535692Q332977P069056J353216
36808F27776o264669j1172733p821532L193807J2017994J0594573M344059M310555
36800I829830R480636P627198n152800j6835705j5839306n764378K459157N761023
36792h434345Q298024J0244462O429360l630284j1343175q324055K445414Q482528
$$ y = [-9808310, -7603639, -6126419, -5794592, -3445271, 4303380, 15822985, 24652115, 26433658, 23570051, 21189171, 20631776, 19234492, 15018716, 9224393, 4710887, 3095336, 2977331, 825332, -5165379, -12367366, -16699124, -17655395, -17671314, -17274565, -14856405, -11286359, -10076928, -11714498, -12238016, -9355555, -5988059, -5612080, -7858173, -11013263, -15078011, -19427348, -20663165, -16127473, -7794496, -725440, 627776, -5636893, -16809626, -24631158, -21437351, -9419357, 1175216, 5519275, 9829830, 19310466, 26937664, 21784864, 4949159, -10890147, -16654525, -14195368, -8434345, -136321, 10108141, 16537501, 12907217, 1564042, -6760013, -4314599, 4167929]
36784D167929J900873j0652928j5370878p815778K859788P243315O569894O297007
36776d800778N845790K297144j077142M10944L028695K37218m009811K9441R699206
36767A1660707J0261924k666688j4244705j1263735m31186L937742J052636K23939
36759a469366K586253M40177o519399q013570L65345Q278016M713630n877063
36751e495977r218498j94438J0985001J2130204L090548o162755p770261k288633
36743d924809N392830J1193188J1961039N424462o365309j6184601j7998629j3038502
36735b4540331o950254k768929P6960J736468J315623k13242m02301J094372K207873
36726b8443761J734690N93094J45082J103049L090512L782604O40900m597055
$$ y = [4167929, 6068802, -4584126, -19955004, -27770782, -24910994, -17667679, -11097785, -4800778, 1045012, 3342156, 2265014, 2675958, 5704653, 5941871, 1932060, 1961501, 11660707, 21922631, 19255943, 5011238, -6252497, -6683683, -2745941, -1693305, -1469366, 1116887, 1557064, -4962335, -12975905, -12610560, -4332544, 381086, -5495977, -14714475, -14908913, -3923912, 8206292, 11296840, 5134085, -2636176, -4924809, 468021, 11661209, 23622248, 29046710, 22681401, 6496800, -11501829, -24540331, -31490585, -34259514, -34182554, -32446086, -31130463, -31343705, -31746006, -30651634, -28443761, -26709071, -26115977, -25970895, -24867846, -21777334, -17994730, -17353830, -21950885]
36718b1950885o239129k155578K513036K519205m53020j824326q58387J281870
36710b7167214N247078R405715P386281k669087j1153819q187016J970827O915523
36702a8251712L068205l130936p433341r976280q106471N01668Q941710P916515
36694b6470642O61427j834944P25130p96901n591774k273946R394477J4094200
36686a2092973M520664p076351q511469l354520J101023N787524J0116765N995279
36678c514058o673345j3024986m524341O544482P142614L608298O228762Q184182
36670C971608q11148j1745015q884006L138342O763135K50186l085937m57231
36662a0860066j606758o493847l933597N662305Q057501l62837o480404l839755
$$ y = [-21950885, -28190014, -30345592, -27832556, -25313351, -25766371, -27590697, -28449084, -27167214, -21920136, -12514421, -5128140, -7797227, -18951046, -27138062, -25167235, -18251712, -15183507, -18314443, -25747784, -35724064, -43830535, -43328867, -34387157, -26470642, -25809215, -27644159, -26919029, -27715930, -33307704, -35581650, -26187173, -12092973, -7572309, -14648660, -23160129, -26514649, -25413626, -19626102, -9509337, -3514058, -10187403, -23212389, -27736730, -21192248, -14049634, -10441336, -4212574, 3971608, 3160460, -8584555, -17468561, -14330219, -7567084, -7316898, -10402835, -10860066, -12466824, -18960671, -22894268, -17231963, -9174462, -9537299, -16017703, -19857458]
36654a9857458j831079m732829k190416R173407J3837492R34507j5713837j6489387
36646c6869600l317578P040938P904929N494472L259565j043911n185629l113347
36638b5830161L844619O987847K660305l481103n805480n383778n283063m463302
36630c6754116J77957P314001R641492J321494j2297931j6570052m373628J1881795
36622c9658988J3303709r79870j2149006o686312P091383J2462507N245807n601752
36614b6972522j1222802q900832J83114J1557159J8342678J6990275J0143210
36607A0120280J263138q775381j6792066j5996644n262811O054792Q776816M545709
36599a6066167K68240k345781m865613n106756j97366O554836Q995633N843794
$$ y = [-19857458, -21688537, -26421366, -28611782, -19438375, -5600883, -4666376, -20380213, -36869600, -40187178, -33146240, -25241311, -19746839, -16487274, -17531185, -22716814, -25830161, -21985542, -14997695, -12337390, -15818493, -21623973, -27007751, -32290814, -36754116, -36576159, -29262158, -19620666, -18299172, -30597103, -47167155, -51540783, -39658988, -26355279, -27335149, -39484155, -46170467, -39079084, -26616577, -21370770, -26972522, -38195324, -47096156, -46913042, -35355883, -17013205, -22930, 10120280, 11383418, 2608037, -14184029, -30180673, -35443484, -29388692, -20611876, -16066167, -15797927, -18143708, -23009321, -28116077, -28313443, -21758607, -12762974, -6919180]
36591f919180j80007o827572j0612866o421646M215035J0454174N809849j853799
36583a2336012l256420l032909r238327j4263370l792622J6990710K4990083J0569556
36575F630689r341626j5679751r664341k634941K238706O531811O147159j883222
36567a7655516r090757n277026N607819J1192353Q992212O820016O873722K769786
36559A0232609o163051j0427751n081001J418058m8192n387324m325189L575323
36551a6206518Q688921N558878n56877k492688l79286Q48968p83821k724100k585241
36542a0631764j207207p00994j305876j277209M23638K045496M26595m903744
36534a7131065r532474p875256K8866P101687O666930M43966l558912j038636
$$ y = [-6919180, -7099187, -13926759, -24539625, -30961271, -26746236, -16292062, -10482213, -12336012, -15592432, -18625341, -27863668, -42127038, -45919660, -28928950, -3938867, 6630689, -2710937, -18390688, -28055029, -30689970, -28451264, -21919453, -15772294, -17655516, -26746273, -32023299, -26415480, -15223127, -6230915, 589101, 7462823, 10232609, 4069558, -6358193, -11439194, -10021136, -10069328, -15456652, -19781841, -16206518, -7517597, -1958719, -2515596, -5008284, -5387570, -4538602, -5322423, -8046523, -10631764, -11838971, -12539965, -13845841, -15123050, -14699412, -12653916, -12227321, -17131065, -26663539, -34538795, -34509929, -27408242, -20741312, -20297346, -23856258, -24894894]
36526b4894894M027940N922440M610807L602441L220938N49405m852502r658321
36518a7471746j1342152j0003422n533866K116534Q867348Q600504K229012j198407
36510b3736195K902362O786061K171398n229836l388096O023890Q109627k257102
36502h617891j0941249n460464N758553O665409j570726l789143L899912Q244571
36494e811028J245590o489163l054534N340913L995434p359561j3802308o556711
36486c2491368N496182Q477579P13231o846113m256826O476375J3690420Q752221
36478A1701l910559j1528834q031336j43829L464696L066399K763221P07945o377057
36469a9977653j2316954o535837R196662J9660459J5286505L411177m003010n347039
$$ y = [-24894894, -20866954, -14944514, -10333707, -6731266, -3510328, -2960923, -7813425, -17471746, -28813898, -38817320, -44351186, -42234652, -33367304, -24766800, -22537788, -23736195, -20833833, -14047772, -11876374, -17106210, -20494306, -14470416, -6360789, -8617891, -19559140, -25019604, -19261051, -12595642, -14166368, -17955511, -14055599, -5811028, -4565438, -11054601, -14109135, -8768222, -4772788, -12132349, -25934657, -32491368, -26995186, -18517607, -17804376, -24650489, -28907315, -22430940, -8740520, 11701, -3898858, -15427692, -23459028, -23602857, -20138161, -17071762, -14308541, -13600596, -19977653, -32294607, -38830444, -29633782, -9973323, 5313182, 8724359, 4721349, -625690]
36461f25690n677588n393873j385865M318179N630148J381744l068210l156031
36453g977186N28438M786020O807292N188329J253342j455697j583649j909761
36445E637128m040267m315161L56521N311165K989260n890223j2128025r572218
36437b1651820j701949M167411M591402Q81168l253318l524812J451855O938513
36429a2101550N968103j948484r320853r316549k705119M907878Q972200P580032
36421g964342J401722n219828o473718j312054N016972P589770O573934L455403
36413C067859k380509r132103r829180j026905Q935266Q619086n89457o098577
36405h434520k577834J037065k767143p151129k412856O508791O224596l354376
$$ y = [-625690, -6303278, -11697151, -13083016, -8764837, -3134689, -1752945, -4821155, -7977186, -7448748, -2662728, 4144564, 9332893, 10586235, 9130538, 7546889, 5637128, 1596861, -2718300, -2361779, 2949386, 5938646, 48423, -12079602, -21651820, -23353769, -19186358, -14594956, -13713788, -16967106, -20491918, -19040063, -12101550, -6133447, -8081931, -17402784, -26719333, -29424452, -24516574, -15544374, -7964342, -6562620, -11782448, -18256166, -19568220, -14551248, -6961478, -387544, 3067859, 687350, -8444753, -18273933, -19300838, -10365572, -1746486, -2335943, -8434520, -11012354, -9975289, -12742432, -19893561, -22306417, -15797626, -9573030, -12927406]
36397a2927406o728667L996192J5181732R586705q974734j9868762j2290515L032626
36389b8992829J0417737P886117L878061K330453m60123o089589r433327o167802
36381b6631302L54134L615701K558415J494129K487388K614540Q9577j362154
36373a4779572J976611O756202O274203L71908m297503m685633n382716r194690
36365b2961190j0535595m188439M813738Q005050O365461O946776Q834884L991197
36357A271882o787428j0994680k759225O518217M052689n767739q544113n90042
36349b3600439P776892P697158J323888m207594n120342k407918J04447q73511
36341a9307419l230292n40540P715814J1887281N351339l215795j542827N943198
$$ y = [-12927406, -19656073, -15659881, -478149, 9108556, 133822, -19734940, -32025455, -28992829, -18575092, -10688975, -6810914, -4480461, -4940584, -11030173, -20463500, -26631302, -26277168, -22661467, -20103052, -18608923, -16121535, -13506995, -13417418, -14779572, -12802961, -6046759, 227444, 599352, -3698151, -8383784, -13766500, -22961190, -33496785, -37685224, -32871486, -24866436, -18500975, -11554199, -2719315, 1271882, -5515546, -16510226, -19269451, -12751234, -8698545, -14466284, -23010397, -23600439, -15823547, -8126389, -6802501, -11010095, -16130437, -18538355, -18433908, -19307419, -22537711, -23078251, -15362437, -3475156, 1876183, -1339612, -2882439, 3060759]
36333C060759L642891r604707j6618382q216071K628513K390869j764946L350282
36325b1130792J1914328P285793q936499j5285380q40938J8439099K0938997N899206
36317A8283814r699463j3443047p742035j237987J836733K935070M314741N202950
36309D50776L029541j687573m085197j348056K077294N43011l482189l036256
36301g538649J208560J318321l792018m478438M525259J4019422J2683698K704505
36293B0650660n010430n852218l350416n41389J561625M10079m183017n861705
36285b176811p78214K993829l515894j3004720j0049103M167378J1394976L671190
36277g297369n307475k906276M111843M247925K68186L14442J466149k535928
$$ y = [3060759, 6703650, -2901057, -19519439, -27735510, -25106997, -22716128, -24481074, -21130792, -9216464, -1930671, -10867170, -26152550, -26993488, -8554389, 12384608, 18283814, 8584351, -4858696, -12600731, -13838718, -12001985, -9066915, -4752174, 450776, 3480317, 1792744, -2292453, -3640509, -1563215, -1020204, -4502393, -7538649, -6330089, -5011768, -8803786, -13282224, -8756965, 5262457, 17946155, 20650660, 15640230, 9788012, 6437596, 5896207, 7457832, 7867911, 3684894, -2176811, -2955025, 38804, -3477090, -16481810, -26530913, -22363535, -10968559, -7297369, -12604844, -15511120, -11399277, -7151352, -6883166, -6568724, -5102575, -7638503]
36269g638503n860520L83485R515107P299251m218774q761094j714104L891062
36261g104090K96469l627827n00405K173268l113579q528986l156622P997285
36253a5564487J0517652J833680o071588m287956K512348M649030l76363o838897
36245a3626581q250130l631763K629528O204632P102541P427538O664602K570575
36237G090942m189598j0130028j2744735j0496177j720261J0527977J5817791
36230e844089P484715n479433q330655j446411J517243l055884l153802O309386
36222a1998930J2285996N064183m064977p40518Q414363O196293p894519j7478526
36214a0216635j3185596j826729P049572J0475268Q014237L83081o595020o161089
$$ y = [-7638503, -13499023, -13115538, -3600431, 3698820, -519954, -9281048, -10995152, -7104090, -6807621, -10435448, -10935853, -8762585, -11876164, -20405150, -23561772, -15564487, -5046835, -3213155, -9284743, -13572699, -11060351, -6411321, -6787684, -13626581, -21876711, -25508474, -22878946, -16674314, -9571773, -2144235, 4520367, 7090942, 2901344, -7228684, -19973419, -30469596, -32189857, -21661880, -5844089, 1640626, -3838807, -12169462, -13615873, -12098630, -15154514, -18308316, -11998930, 287066, 5351249, 1286272, 545754, 8960117, 15156410, 7261891, -10216635, -23402231, -25228960, -18179388, -7704120, 310117, 693198, -5901822, -12062911]
36206a2062911K68390N388036O193045M710137J484659l243886n100902j437001
36198c800433J883721q47702m252824r03075L685130p99888r878774r192192J807603
36189b2298434Q148793L344147j546693K604823R628012J0378212N545323o4547
36181A5739636m846006o841166l575009O33212j658704p411714o165717J097370
36173a3028098K078591m338755m662896L485897L509929j0556249j7996114k612970
36165d4120665J8536133J9483111M005085m515677j449680k124326r486480q518122
36157b8190621M744328J3632631P536775k178222k276135K776134J909839m331043
36149f376314p385897m173393J784628O892231Q860262O486489K100045o40401
$$ y = [-12062911, -11794521, -6406485, -213440, 4496697, 5981356, 2737470, -2363432, -3800433, -1916712, -2764414, -7017238, -7920313, -4235183, -5035071, -14913845, -24106037, -22298434, -14149641, -10805494, -12352187, -9747364, -119352, 10258860, 15804183, 15739636, 10893630, 4052464, 477455, 1110667, -548037, -7959751, -14125468, -13028098, -10949507, -15288262, -19951158, -16465261, -12955332, -23511581, -41507695, -44120665, -25584532, -6101421, -2096336, -6612013, -8061693, -10186019, -19672499, -28190621, -23446293, -9813662, -2276887, -4455109, -6731244, -3955110, -2045271, -6376314, -13762211, -17935604, -16150976, -9258745, -398483, 6088006, 8188051, 7547650]
36141G547650l049772q833388j4342234j0703599J660426J0600761Q742187K789880
36133e588089Q97311O88242k398908l985919J510144Q263500N919452l517999
36125A787734o924579J114997J0079595P334225n988536j6717186j4143937l08829
36117b3766516J2438817J2934564J709983r449054r684494n01920O849683N011826
36109d457111j565705l594290J056476N692337M361906r80153m710465n513823
36101i710828n959281n800180j608751N701883Q972370M364885j780781j288928
36093g109611L664149L637501l534511q748835m480210M482139P714634L067834
36085a306910j543851K76254M977811M612801j999095p890844p985105n935307
$$ y = [7547650, 4497878, -4335510, -18677744, -29381343, -27720917, -17120156, -8377969, -5588089, -4690778, -4002536, -6401444, -10387363, -8877219, -613719, 5305733, 1787734, -5136845, -4021848, 6057747, 13391972, 7403436, -9313750, -23457687, -23766516, -11327699, 1606865, 3316848, -6132206, -15816700, -16318620, -9468937, -4457111, -6022816, -9617106, -8560630, -2868293, 1493613, 513460, -4197005, -9710828, -15670109, -21470289, -23079040, -17377157, -8404787, -4039902, -5820683, -7109611, -3445462, 192039, -3342472, -12091307, -16571517, -12089378, -4374744, -1306910, -2850761, -2574507, 2403304, 7016105, 5017010, -2873834, -10858939, -16794246]
36077a6794246p415063r926329n731531N263264J2737713R075144n18152n376968
36069a8686168k361384L330613O393120M978683o86807p173908p816489k50453
36061b2272793P864430P485782J043794j371464J712858N68794q928403j5700584
36053b9597586q352221O597487J1547398J654743q127877l415493R898364J3828267
36045e966918K847514r114587q042930K369275Q401511N635478J504183J170439
36037a196035J243025j215759k923905j341122K95659o28533j181856J063594
36029e884932L109344K385761J630227K957149L057372j53044k055870J215537
36021F261544N312376M291451k21594k935115l030188k129820M06314L606490
$$ y = [-16794246, -24209309, -34135638, -39867169, -34603905, -21866192, -12791048, -13309200, -18686168, -21047552, -17716939, -11323819, -6345136, -7031943, -14205851, -22022340, -22272793, -14408363, -6922581, -5878787, -7250251, -5537393, -4968599, -13897002, -29597586, -37949807, -31352320, -19804922, -18150179, -26278056, -29693549, -19795185, -5966918, -3119404, -12233991, -20276921, -17907646, -9506135, -3870657, -2366474, -1196035, 46990, -1168769, -4092674, -5433796, -5138137, -5766670, -6948526, -5884932, -2775588, -389827, 1240400, 4197549, 7254921, 7101877, 5046007, 6261544, 11573920, 15865371, 15643777, 12708662, 9678474, 7548654, 7954968, 11561458]
36013A1561458K388315l862758o822296j377895M908648L690121n61590J59209
36005A0083212K410236r43929m921956j15904Q572323P764908k247024q043235
35997A2558631m839341j004477q06916L81483K582177J62969l680994R32391J0943458
35988A7229381J1307888M896p233492l514569j665896r002594j1961510j11027
35980d946923J2804206R474489l562658p914472j927165J956955P65074K342360
35972H991866O826042N096742m101591j0477126p488946N0008N219368O689527
35964A0805890O048317M685026L864407K854076j398602q269172j1026286n997044
35956A566612M03330M49828l443696l226126K587669Q253239R253605N425191
$$ y = [11561458, 13949773, 10087015, 3264719, 1886824, 6795472, 10485593, 9924003, 10083212, 12493448, 11549519, 6627563, 6511659, 15083982, 22848890, 20601866, 12558631, 7719290, 6714813, 5907897, 6289380, 8871557, 9034526, 5353532, 6285923, 17229381, 28537269, 28542165, 21308673, 17794104, 16128208, 7125614, -4835896, -4946923, 7857283, 17331772, 13769114, 5854642, 3927477, 5884432, 6649506, 8991866, 15817908, 20914650, 16813059, 6335933, -1153013, -1103005, 4116363, 10805890, 16854207, 21539233, 25403640, 28257716, 26859114, 18589942, 7563656, 1566612, 1969942, 2419770, -1023926, -4250052, -1662383, 6590856, 15844461, 21269652]
35948B1269652j085113o118107n975846l429489n070710r035526m514957J0639650
35940c320446K2254541J8217414M453129p035770j5093882k2211667k1558987
35933b4295668p498954Q714314J1091692J936093l718491k140654j680507k781922
35925b0374097L043845J3742391J5545661N222153l698118k533045L24972l994870
35917G278892r805894p544552Q17189O138361M935526N38703l414969n173263
35909f230007m537014l638027m422024m518990n18031M962059N905855K360481
35901a0635698J18624J006834R68424j970971n063448o074673m513119O77874
35893b5486153P355955P647418j310639q484505l246630N665255J694327j1099248
$$ y = [21269652, 20184539, 14066432, 8090586, 4661097, -409613, -9445139, -13960096, -3320446, 18934095, 37151509, 41604638, 34568868, 19474986, -2736681, -24295668, -31794622, -23080308, -11988616, -10052523, -13771014, -15911668, -17592175, -20374097, -17330252, -3587861, 11957800, 17179953, 13481835, 10948790, 11273762, 7278892, -2527002, -10071554, -9254365, -3116004, 1819522, 2358225, -1056744, -6230007, -10767021, -14405048, -18827072, -23346062, -23864093, -18902034, -12996179, -10635698, -10517074, -9510240, -8541816, -10512787, -15576235, -21650908, -26164027, -25486153, -18130198, -10482780, -11793419, -20277924, -23524554, -17859299, -16164972, -27264220]
35885b7264220j0957484P339390K1792346J5086787j342287p300402k415869K19189
35877d842550k498207l160324m55972p67005n096266o824345k866416J931811
35869b4579274K493766m32207k520251o39692M133869O700018L368999k331083
35861a3805855l402294P55762L990896L336007J835455L10694m507984j0651908
35853b2139227r595354M56295Q928823P092103J74660j772717J737615M102175
35845a1015627L126220K115181K494347J820416j950461p427553r740290m015245
35837b4593012O953083J0941808M61677j3267346j2230542K642241J2017010O733571
35829a0341510p22578Q41981M572851J979497o24236L801205O757050j313901
$$ y = [-27264220, -38221704, -30882314, -9089968, 5996819, 4654532, -2645870, -5061739, -4842550, -7340757, -10501081, -10957053, -11724058, -16820324, -23644669, -26511085, -24579274, -22085508, -22517715, -25037966, -25677658, -21543789, -14843771, -11474772, -13805855, -17208149, -16452387, -12461491, -9125484, -7290029, -6979335, -11487319, -22139227, -31734581, -31278286, -22349463, -15257360, -15082700, -16855417, -15117802, -11015627, -7889407, -5774226, -3279879, -1459463, -3409924, -10837477, -20577767, -24593012, -17639929, -6698121, -6236444, -19503790, -31734332, -29092091, -17075081, -10341510, -11064088, -10222107, -5649256, -3669759, -4293995, -492790, 6264260, 4950359]
35821D950359j1452028q969817K275025O287959n3617n722370n290142l245013
35813b1219644j166080L508251P489074N182320N91423J492162M235008l12546
35805b00032q138104o695316K637368N185643k320196o438307n18092M860281
35797a1626755J535393l329853k471459q31676k703870j338007O727935J0132900
35789c905392l50183j3473232j1493048L903427J4488770J0941843J792210k177600
35781b73205n03138J382569J09696m124220q084168p013026l22479N489028M703597
35772h635346Q73661J082026M102587K587729l676073o259795j938648J337213
35764a0526646k436162o163874j91956J0484609J0352979m412073j7913235j4386716
$$ y = [4950359, -6501669, -15471486, -13196461, -6908502, -6962119, -12684489, -17974631, -21219644, -22385724, -18877473, -11388399, -6206079, -5614656, -4122494, 112514, -200032, -8338136, -15033452, -12396084, -7210441, -9530637, -15968944, -16487036, -11626755, -10091362, -13421215, -15892674, -16724350, -19428220, -20766227, -14038292, -3905392, -4255575, -17728807, -29221855, -25318428, -10829658, 112185, 1904395, -273205, -776343, 606226, 715922, -3408298, -11492466, -18505492, -18827971, -13338943, -8635346, -7761685, -6679659, -2577072, 10657, -3665416, -9925211, -11863859, -10526646, -12962808, -19126682, -19318638, -8834029, 1518950, -2893123, -20806358, -35193074]
35756c5193074R64663R709740N208884r35483J637692P456942O098174j419072
35748f471534o278968n883932l850150j16528P024593J0975305K714545j1663760
35740a3550429j3574540K083155J6623922J2421060l052501j0125858n299544
35733a4474735j565638m444622m311779N267734J5647496J5607052O076005m005190
35725A3796323r375962r899334o146816J4805M242335M477473L752074M191052
35717E051950K601937l043869p633184o095265k448421l627977p256247m980946
35709b7432022L103224P633000M775817J607839L321930M893101J215894l035573
35701c916790j368104L201765L355910m17868j677851O49943J346367j575077
$$ y = [-35193074, -34228411, -24518671, -19309787, -20245270, -18607578, -11150636, -5052462, -6471534, -12750502, -18634434, -22484584, -22601112, -15576519, -4601214, -1886669, -13550429, -27124969, -25041814, -8417892, 4003168, 950667, -9175191, -14474735, -16040373, -20484995, -24796774, -19529040, -3881544, 11725508, 17801513, 13796323, 4420361, -5478973, -11625789, -11610984, -7368649, -2891176, 860898, 5051950, 7653887, 4610018, -3023166, -9118431, -11566852, -15194829, -22451076, -27432022, -24328798, -16695798, -11919981, -10312142, -6990212, -2097111, -881217, -3916790, -5284894, -2083129, 1272781, 854913, -822938, -172995, 1173372, -401705]
35693d01705m002851k753562N76360L334682M638090M265844K362625l38038m340370
35684C341075j0500348j4719247r401892M392097J3158740P937046j329223M2483
35676g079269Q164465O347491p631159j6758802j0205646K083863O420714L488580
35668a5169763J176890N31876j313021k228374J094439N357071M666247q31217
35660f715852n778549o134786j645025M582980P455358N380560L846736O983394
35652G974816Q172423k17950j0323606p525361M303165N599002o699157j1727541
35644a0444209P81550J1302518K228797j1844030p893528P452445R935054k233671
35636g15074q251259j012889L878376k306345p348239n59096J0281120J3199139
$$ y = [-401705, -4404556, -7158118, -6581758, -3247076, 1391014, 5656858, 8019483, 7681445, 3341075, -7159273, -21878520, -31280412, -26888315, -13729575, -5792529, -7121752, -7079269, 1085196, 7432687, -198472, -16957274, -27162920, -25079057, -18658343, -15169763, -13992873, -13460997, -14774018, -17002392, -15907953, -10550882, -5884635, -6715852, -12494401, -18629187, -20274212, -15691232, -8235874, -2855314, 991422, 7974816, 16147239, 15929289, 5605683, -1919678, 2383487, 7982489, 1283332, -10444209, -9662659, 1639859, 3868656, -7975374, -15868902, -8416457, 1518597, -715074, -8966333, -9979222, -6100846, -8407191, -15755430, -16314526, -6033406, 7165733]
35628G165733Q439115K558160k184830n618917o156470m689122m297907l520902
35620h305140J862286R136204J0149236L884800j954993l197313l505221n371298
35612B698561o420006n668596m175960L66680R361400J4591745O532205q133021
35604I153008j1424804N42786J1040479O752438m617445q084555k098289L173741
35596D437359J415609l727515m910573O73131P423967N958093n024447j4593042
35588h347418j2922870l948379L007124P345459J1646613R852376k854938j4359200
35580a0581233r327765M793777P158789k591792m513198N678242Q506524l650641
$$ y = [7165733, 15604848, 18163008, 15978178, 10359261, 4202791, -486331, -4784238, -8305140, -6442854, 2693350, 12842586, 16727386, 14772393, 11575080, 8069859, 2698561, -3721445, -9390041, -13566001, -13199321, -3837921, 10753824, 17286029, 9153008, -2271796, -1729010, 9311469, 16063907, 11446462, 3361907, 1263618, 4437359, 5852968, 2125453, -2785120, -2111989, 5311978, 11270071, 6245624, -8347418, -21270288, -25218667, -22211543, -14866084, -3219471, 6632905, 3777967, -10581233, -19908998, -15115221, -7956432, -10548224, -15061422, -9383180, -876656, -4527297]
$$ [...]
##END NTUPLES=NMR SPECTRUM
##END=
