##TITLE=31Pdec_LR-759-K3M
 CCl4, 64 sc
 22.3.2023
##JCAMPDX= 6.0         $$ Bruker NMR JCAMP-DX V2.0
##DATA TYPE= NMR SPECTRUM
##DATA CLASS= NTUPLES
##ORIGIN= UXNMR, Bruker Analytische Messtechnik GmbH
##OWNER= root
$$ XWIN-NMR		Version 3.5
$$ Wed Mar 22 14:19:17 2023 Russian Standard Time (UT+4h)  she@DPX200
##.OBSERVE FREQUENCY= 81.013821
##.OBSERVE NUCLEUS= ^31P
##.ACQUISITION MODE= SIMULTANEOUS
##.ACQUISITION SCHEME= undefined
##.AVERAGES= 64
##.DIGITISER RES= 16
##SPECTROMETER/DATA SYSTEM= spect
##.PULSE SEQUENCE= zgpg30
##.SOLVENT NAME= CDCl3
##.SHIFT REFERENCE= (INTERNAL, CDCl3, 0, 248.564)
##AUDIT TRAIL= $$ (NUMBER, WHEN, WHO, WHERE, WHAT)
$$ ##TITLE= Audit trail, XWIN-NMR		Version 3.5
$$ ##JCAMPDX= 5.01
$$ ##ORIGIN= Bruker BioSpin GmbH
$$ ##OWNER= she
$$ F:/spectra/data/she/nmr/P31/1/pdata/1/auditp.txt
$$ ##AUDIT TRAIL=  $$ (NUMBER, WHEN, WHO, WHERE, WHAT)
(   1,<2023-03-22 14:17:54.51 +0400>,<she>,<DPX200>,
      <continue with go, POWCHK disabled, PULCHK disabled
       configuration hash MD5:
       00 E9 B6 7A A2 85 ED C7 34 08 36 98 17 FE 4E 26
       data hash MD5: 32K
       30 87 01 24 98 8D D7 F1 2C EF 0A 3E BA 75 99 09>)
(   2,<2023-03-22 14:18:14.95 +0400>,<she>,<DPX200>,
      <Start of raw data processing
       efp BC_mod = 2 LB = 1 FT_mod = 6 PKNL = 1 PHC0 = -10673.56 PHC1 = -6.315186 SI = 64K 
       data hash MD5: 64K
       68 28 3E 6B 6A 84 DC D7 77 DC C8 98 95 35 8F AC>)
(   3,<2023-03-22 14:18:33.82 +0400>,<she>,<DPX200>,
      <pk PHC0 = 66.42639 PHC1 = 110 
       data hash MD5: 64K
       AA 3B FA 39 15 25 65 7D B8 73 C0 87 52 26 2A 3A>)
(   4,<2023-03-22 14:18:37.14 +0400>,<she>,<DPX200>,
      <abs ABSG = 5 
       data hash MD5: 64K
       48 7C EC 56 CD 77 D7 F6 21 42 55 C2 BB 05 64 6B>)
$$ ##END=
$$ 
$$ hash MD5
$$ B3 5D 27 1A 53 8B D9 84 BD E9 82 1B 97 7D 47 D7
##$RELAX= 
##$RELAX= 
##$RELAX= 
##$RELAX= 
##$RELAX= 
##$RELAX= 
##$RELAX= 
##$RELAX= 
##$RELAX= 
$$ Bruker specific parameters
$$ --------------------------
##$DU= <F:/spectra>
##$EXPNO= 1
##$NAME= <P31>
##$PROCNO= 1
##$TYPE= <nmr>
##$USER= <she>
##$AMP= (0..31)
100 100 100 100 100 100 100 100 100 100 100 100 100 100 100 100 100 100 
100 100 100 100 100 100 100 100 100 100 100 100 100 100 
##$AQSEQ= 0
##$AQ_mod= 1
##$AUNM= <au_zg>
##$AUTOPOS= <>
##$BF1= 81.014009
##$BF2= 200.13
##$BF3= 200.13
##$BF4= 200.13
##$BF5= 200.13
##$BF6= 200.13
##$BF7= 200.13
##$BF8= 200.13
##$BYTORDA= 1
##$CFDGTYP= 0
##$CFRGTYP= 5
##$CHEMSTR= <none>
##$CNST= (0..31)
1 1 145 1 1 1 1 1 1 1 1 1 1 1 1 1 1 1 1 1 1 1 1 1 1 1 1 1 1 1 1 1 
##$CPDPRG= <waltz16>
##$CPDPRG1= <>
##$CPDPRG2= <waltz16>
##$CPDPRG3= <>
##$CPDPRG4= <mlev>
##$CPDPRG5= <mlev>
##$CPDPRG6= <mlev>
##$CPDPRG7= <mlev>
##$CPDPRG8= <mlev>
##$CPDPRGB= <>
##$CPDPRGT= <>
##$D= (0..31)
0 1 0 0 0 0 0 0 0 0 0 0.03 2e-05 3e-06 0 0 0 0 0 0 0 0 0 0 0 0 0 0 0 0 
0 0 
##$DATE= 1679480199
##$DBL= (0..7)
120 120 120 11 120 120 24 19 
##$DBP= (0..7)
150 150 150 150 150 150 150 150 
##$DBP07= 0
##$DBPNAM0= <>
##$DBPNAM1= <>
$$ [...]
##$SUBNAM3= <"">
##$SUBNAM4= <"">
##$SUBNAM5= <"">
##$SUBNAM6= <"">
##$SUBNAM7= <"">
##$SUBNAM8= <"">
##$SUBNAM9= <"">
##$SW= 501.771253377433
##$SWIBOX= (0..15)
0 1 3 0 0 0 0 0 0 0 0 0 0 0 0 0 
##$SW_h= 40650.406504065
##$TD= 32768
##$TD0= 1
##$TE= 0
##$TE2= 300
##$TE3= 300
##$TEG= 300
##$TL= (0..7)
0 120 53 12 22 120 120 120 
##$TP= (0..7)
150 150 150 150 150 150 150 150 
##$TP07= 0
##$TPNAME0= <>
##$TPNAME1= <>
##$TPNAME2= <>
##$TPNAME3= <>
##$TPNAME4= <>
##$TPNAME5= <>
##$TPNAME6= <>
##$TPNAME7= <>
##$TPOAL= (0..7)
0.5 0.5 0.5 0.5 0.5 0.5 0.5 0.5 
##$TPOFFS= (0..7)
0 0 0 0 0 0 0 0 
##$TUNHIN= 0
##$TUNHOUT= 0
##$TUNXOUT= 0
##$USERA1= <user>
##$USERA2= <user>
##$USERA3= <user>
##$USERA4= <user>
##$USERA5= <user>
##$V9= 5
##$VALIST= <valist>
##$VCLIST= <CCCCCCCCCCCCCCC>
##$VD= 0
##$VDLIST= <DDDDDDDDDDDDDDD>
##$VPLIST= <PPPPPPPPPPPPPPP>
##$VTLIST= <TTTTTTTTTTTTTTT>
##$WBST= 1024
##$WBSW= 4
##$XGAIN= (0..3)
0 0 0 0 
##$XL= 0
##$YL= 0
##$YMAX_a= 4449
##$YMIN_a= -6043
##$ZGOPTNS= <>
##$ZL1= 120
##$ZL2= 120
##$ZL3= 120
##$ZL4= 120
##$ABSF1= 248.5645
##$ABSF2= -253.2056
##$ABSG= 5
##$ABSL= 3
##$ALPHA= 0
##$AQORDER= 0
##$ASSFAC= 0
##$ASSFACI= 0
##$ASSFACX= 0
##$ASSWID= 0
##$AUNMP= <proc_1d>
##$AZFE= 0.1
##$AZFW= 0.5
##$BCFW= 0
##$BC_mod= 2
##$BYTORDP= 0
##$COROFFS= 0
##$CY= -3
##$DATMOD= 1
##$DC= 0
##$DFILT= <>
##$DTYPP= 0
##$F1P= 0
##$F2P= 0
##$FCOR= 1
##$FTSIZE= 65536
##$FT_mod= 6
##$GAMMA= 0
##$GB= 0
##$INTBC= 1
##$INTSCL= 6.047779e-11
##$ISEN= 30
##$LB= 1
##$LEV0= 0
##$LPBIN= 0
##$MAXI= 10000
##$MC2= 0
##$MEAN= 0
##$ME_mod= 0
##$MI= 50
##$NCOEF= 0
##$NC_proc= -8
##$NLEV= 6
##$NOISF1= 182.463
##$NOISF2= 159.3651
##$NSP= 0
##$NTH_PI= 0
##$NZP= 0
##$OFFSET= 248.5645
##$PC= 4
##$PHC0= -10607.13
##$PHC1= 103.6848
##$PH_mod= 1
##$PKNL= yes
##$PPARMOD= 0
##$PSCAL= 0
##$PSIGN= 0
##$REVERSE= no
##$SF= 81.0140089999694
##$SI= 65536
##$SIGF1= 159.3651
##$SIGF2= -187.1042
##$SINO= 113.3802
##$SIOLD= 16384
##$SREGLST= <1H.CDCl3>
##$SSB= 0
##$STSI= 65536
##$STSR= 0
##$SW_p= 40650.406504065
##$SYMM= 0
##$S_DEV= 0
##$TDeff= 32768
##$TDoff= 0
##$TI= <>
##$TILT= no
##$TM1= 0
##$TM2= 0
##$TOPLEV= 0
##$USERP1= <user>
##$USERP2= <user>
##$USERP3= <user>
##$USERP4= <user>
##$USERP5= <user>
##$WDW= 1
##$XDIM= 65536
##$YMAX_p= 106982141
##$YMIN_p= -371699693
$$ End of Bruker specific parameters
$$ ---------------------------------
##NTUPLES= NMR SPECTRUM
##VAR_NAME=  FREQUENCY,     SPECTRUM/REAL,   SPECTRUM/IMAG
##SYMBOL=    X,             R,               I
##VAR_TYPE=  INDEPENDENT,   DEPENDENT,       DEPENDENT
##VAR_FORM=  AFFN,          ASDF,            ASDF
##VAR_DIM=   65536,         65536,           65536
##UNITS=     HZ,            ARBITRARY UNITS, ARBITRARY UNITS
##FACTOR=    0.620285442955139, 1,           1
##FIRST=     20137.2065510682, 0,            0
##LAST=      -20513.1999529968, 0,           0
##MIN=       -20513.1999529968, -371699693,  0
##MAX=       20137.2065510682, 106982141,    0
$$ Real data points
##PAGE= N=1
##DATA TABLE= (X++(R..R)), XYDATA
$$ [...]
##PAGE= N=2
##DATA TABLE= (X++(I..I)), XYDATA
12992a094991K927948N48984l764484k974348K584459O198331N944864N025453
12984A5396216L042703k290565o536413l272352L480616L526181l068869o141485
12976D136032k493866J81240j789762k451259J009512K591424n36958k182004
12968a535641R18526K286732k315240o081928k238940M351024M893987m08087
12960a29567m753579m927266k395864J267194M181055L559268K53770n62915K445562
12951a062342L423857r96116m769306j645575M052559L665550k271463m900888
12943d503724l01790N382692M978872p58143n143744l849386N85445K251991p17872
12934b075659l799388k445324J664742M119748M815653N978170N368348q13472
$$ y = [-1094991, 1832957, 2381941, -1382543, -4356891, -1772432, 4425899, 10370763, 15396216, 18438919, 16148354, 9611941, 6339589, 9820205, 13346386, 10277517, 4136032, 1642166, 1823406, 33644, -2417615, -1408103, 1183321, 646363, -1535641, -617115, 1669617, -645623, -6727551, -8966491, -4615467, 278520, -129567, -4883146, -9810412, -12206276, -10939082, -6758027, -3198759, -2944989, -3507904, -1062342, 2361515, 1365399, -3403907, -5049482, -996923, 2668627, 397164, -4503724, -4805514, 577178, 5556050, 4797907, -345837, -4195223, -3609778, -1357787, -2075659, -5875047, -8320371, -6655629, -2535881, 2279772, 8257942, 13626290, 12812818]
12926A2812818q719945r383520j997498M038251L040873J90598Q56662J848689
12918B686928o80451k613574J119640O620016N999522j170875p939224q985190
12910d963208m583245J681312M995786K181339l987349o667827l710303L3467
12902a5020028J360242L205897P022800Q025245L351888j789911k290421j347496
12894B518216m014474q079279q000171l170218L400146R355056J1086147M717574
12886G812997n256951o861987K470078R229844L298245n910229m837048K248546
12878B193495J937691n096967p010479k273527J09824m23682M060503J0967832
12870D464690P999241l794140p647178J841525Q463664Q81993q565546m872358
$$ y = [12812818, 4092873, -5290647, -7288145, -3249894, -209021, -18423, 838239, 2686928, 2006477, -607097, 512543, 7132559, 13132081, 11961206, 4021982, -4963208, -9546453, -7865141, -2869355, -688016, -4675365, -11343192, -15053495, -15020028, -13659786, -10453889, -3431089, 4594156, 7946044, 6156133, 3865712, 2518216, -1496258, -9575537, -17575708, -20745926, -17345780, -7990724, 3095423, 7812997, 2556046, -4305941, -1835863, 7393981, 10692226, 4781997, -55051, 2193495, 4131186, -965781, -7976260, -10249787, -10139963, -10563645, -6503142, 4464690, 12463931, 8669791, 1022613, 2864138, 11327802, 12209795, 3644249, -1228109]
12862a228109M923728M470289n098782q717811j908805M961150M835075J608201
12854C844936o88391l512468o500211n249478L24694L946195K708349J593408
12846c532966M494009P121811L867229k745212n101030j049907L625264L329696
12838A0008894p06454l384766k608792n55584P84441K069108L917814M680285
12830A4204946K778023q31864m447875p550146q719191m876006L472124R137906
12822C167917N846329k749465p417052n483276k123330l36493K261811N495542
12814a338017M251409k067000n341134K23267Q488271R225637J782607n345001
12806I880039o152085k418331J290321K419746M34491l351345n401871k965278
$$ y = [-1228109, 3695619, 8165908, 3067126, -5650685, -7559490, -2598340, 2236735, 3844936, 3156545, -355923, -6856134, -12105612, -11780918, -7834723, -5126374, -3532966, 961043, 8082854, 11950083, 9204871, 4103841, 3053934, 6679198, 10008894, 9302440, 5917674, 3308882, 2753298, 3537739, 5606847, 9524661, 14204946, 16982969, 16151105, 11703230, 4153084, -4566107, -9442113, -5969989, 3167917, 9014246, 6264781, -1152271, -6635547, -8758877, -9095370, -6833559, -1338017, 2913392, 846392, -4494742, -4271475, 4216796, 13442433, 15225040, 9880039, 3727954, 1309623, 2599944, 5019690, 5454181, 2102836, -3299035, -6264313]
12798f264313J806899L564292M70337l140361k220696K453812N266243L085799
12790E022012o93703j063184J503027K324745K34349j011908j71639j235921n291850
12781c84072o176720j69450O049801N165853J443127K769356N092192j504604
12773A2285483j2806439j2597998K156779J4020641R950301p79821l452213j34495
12765H642238j826333p591670o906392J450823P353883N412091Q85756j188452
12757F231944k177739l366217k406105J068738L447102L101230K307643J676114
12749I882710j046951m764964m186178J630728N656045K216328m281967n092381
12741A3370O68047M913986J865251m182878n000451K95382M385818K209286k557356
$$ y = [-6264313, -4457414, -893122, -422785, -3563146, -5783842, -3330030, 1936213, 5022012, 4328309, 3265125, 4768152, 7092897, 7327246, 6315338, 6143699, 4907778, -384072, -6560792, -6730242, -680441, 4485412, 5928539, 8697895, 13790087, 12285483, -520956, -13118954, -10962175, 3058466, 13008767, 12228946, 8776733, 8642238, 6815905, -775765, -7682157, -6231334, 1122549, 6534640, 7420396, 6231944, 4054205, 687988, -1718117, -649379, 2797723, 5898953, 8206596, 9882710, 8835759, 4070795, -115383, 1515345, 7171390, 9387718, 5105751, 13370, 681417, 5595403, 7460654, 3277776, -1722675, -1427293, 2958525, 5167811, 2610455]
12732B610455m193777l528442m446118n234035j216692N105766N547484q25188
12724f180547n256394k788758Q34300K82388m48838L190055O886146N006846P20175
12715B245373j93098L71879j900324l739766q8995M450899J467389o567329q990092
12706a2944064l158503L189120N336996O081644O294353K501204l928268n901804
12698b529322k066197O61223o43575o0003N315084Q430934L545193l743254n046564
12689C863519j529245j46627k023596k214421J038675L301733K84402o492277
12681c917837j0634275o500505M707201J4309754J4323092O387574p65129k366583
12673A5543292j586128k583598n192355p462256q090175n265469J445691P293325
$$ y = [2610455, -1583322, -5111764, -9557882, -14791917, -16008609, -10902843, -5355359, -6180547, -11436941, -14225699, -13391399, -13109011, -13557849, -10367794, -3481648, 1525198, 2245373, 2052275, 2424154, 523830, -3215936, -3304931, 1145968, 2613357, -3953972, -12944064, -16102567, -12913447, -7576451, -1494807, 4799546, 7300750, 3372482, -2529322, -4595519, -3934296, -4577871, -4637874, 677210, 9108144, 12653337, 8910083, 3863519, 2334274, 2187647, 164051, -2050370, -1011695, 2290038, 2574440, -3917837, -14552112, -21052617, -16345416, -2035662, 12287430, 18675004, 17909875, 15543292, 13957164, 11373566, 6181211, -1281045, -9371220, -14636689, -13190998, -5897673]
12665e897673O568641J476156k24133K424168J932334m385328q661436m726216
12657a1493487K245180M456803K658199J795288J720465l48542k830411k318942
12649d115447M32516K802848M699981N692089K808939l268740n570384q51194
12641B630608L755866J510729k876293j916462J252568o92952m531237j433114
12633b300287O089717O444469j745520o783327k917107J317442j380766n608955
12625f884334m222717j98757O92784M41831L025571M931935J141109m108333k387109
12616g568020N316923R060789L890229l970196n993412j251114L928419L205514
12608F619132l338430q666770o169887J471021M612278l6850m006697L16679P387384
$$ y = [-5897673, 670968, 2147124, 1922991, 4347159, 6279493, 1894165, -6767271, -11493487, -9248307, -4791504, -2133305, -338017, 1382448, 1033906, -1796505, -4115447, -3682931, -880083, 3819898, 9511987, 12320926, 9052186, 3481802, 2630608, 6386474, 7897203, 5020910, 3104448, 4357016, 3664064, -867173, -2300287, 3789430, 10233899, 8488379, 1705052, -1212055, 105387, -1275379, -6884334, -11107051, -11305808, -10613024, -10171193, -7145622, -2213687, -1072578, -5180911, -7568020, -2251097, 6809692, 10699921, 6729725, 736313, -514801, 3413618, 6619132, 3280702, -5386068, -11555955, -10084934, -5472656, -5509506, -9516203, -9199524, -1812140]
12599a812140O419768k256798p899097m981840J022542L825188L503775J862936
12591c15666j079678l210973n61965N116151O149700K71570m826083k930119J678761
12582B91698K446270R67899J707222K141677k563517q699755p714478M12776O520762
12573d489446N212849N04153k188507k311487j232841K07684p3970l323646n303534
12564a2998745o45457P245393Q616453J732986l727175j227038L274576J918234
12556D189227l008865m689740k926663j558141J96147M781542P948707L020576
12548G952790p053830j0786630l035276Q007913J1308324N528356j677575l453545
12540F790527m405L294317K005283k968693o547394m825152J247129P033881P653402
$$ y = [-1812140, 4607628, 2350830, -5548267, -10530107, -9507565, -5682377, -2178602, -315666, -1395344, -4606317, -5168282, -52131, 6097569, 6369139, 1543056, -1387063, 291698, 2737968, 3705867, 5413089, 7554766, 4991249, -3708506, -11422984, -11010208, -4489446, 723403, 1227556, -960951, -3272438, -4505279, -4297595, -4371565, -7695211, -12998745, -13644202, -6398809, 2217644, 3950630, 223455, -1003583, 2270993, 4189227, 1180362, -3509378, -6436041, -7994182, -7798035, -3016493, 4932214, 7952790, 898960, -9887670, -12922946, -4915033, 6393291, 11921647, 10244072, 6790527, 6786122, 10080439, 12085722, 9117029, 2569635, -2255517, -1008388, 6025493, 13678895]
12531A3678895J261697q107710j1748105m784074O398660J0433139N220410n41790
12523A1811122j334807j870997o217212q787331l578348M413037N847826P45752
12515A029042l025219j938980N89661J700248J742234Q23364j037261j849867
12507a966778q23020q16074k856973k613793K086394N788361M256814K340811
12499E395742M594248N196194j913624r582727p379871L24269J076804m555317
12491f844282m791738K150075N576835J599694j724330n12254j63252j728378
12483f437630N44597M908628K364284m937364l903456N552024O877486m564853
12475D03716j0529124J90885J1586960O759574m349194l837054L372023J157049
$$ y = [13678895, 14940592, 6832882, -4915223, -9699297, -3300637, 7132502, 12352912, 11811122, 10476315, 8605318, 2388106, -6399225, -9977573, -5564536, 283290, 1029042, -1996177, -3935157, -3345496, -1645248, 96986, 920350, -116911, -1966778, -2789798, -3605872, -6462845, -9076638, -6990244, -1201883, 3054931, 5395742, 9989990, 15186184, 13272560, 3689833, -3690038, -3365769, -2288965, -6844282, -11636020, -9485945, -3909110, -2309416, -4033746, -4546000, -4709252, -6437630, -5893033, -984405, 1379879, -3557485, -7460941, -1908917, 4968569, 403716, -10125408, -9934523, 1652437, 8412011, 4062817, 225763, 3597786, 4754835]
12467D754835p105808n270087M722273N037570o166322j0100564J677031J3681916
12459A230844J1200869O42450l768108J88828N225321O474102L003401m533228
12451A9664479j1410547j0861785l514334J727194J45264k381979M27911N511726
12443f92071N993666J180482l890610n197116k270034K942386O858140O385145
12435A1309988K185428k049263l890517l508712j657910N16038R84856l25672
12427C564236k34691K231090K406041k447639o130113k017180M649771L150656
12419E172171n283500p906216J69792Q445401P035410P532l360821k177404j257630
12410H44735j116306J012171L563826J858505l956762q156157o907541k283421
$$ y = [4754835, -2350973, -7621060, -2898787, 2138783, -4027539, -14128103, -12451072, 1230844, 12431713, 13074163, 9306055, 9494883, 14720204, 21194306, 24197707, 19664479, 8253932, -2607853, -6122187, -4394993, -4249729, -6631708, -6203797, -692071, 5301595, 6482077, 2591467, -2605649, -4875683, -1933297, 4924843, 11309988, 13495416, 11446153, 7555636, 4046924, 2389014, 2905052, 3889908, 3564236, 3329545, 5560635, 7966676, 5519037, -611076, -2628256, 2021515, 5172171, -111329, -8017545, -7847753, 597648, 7633058, 7640590, 4279769, 2102365, 844735, -271571, 740600, 4304426, 6162931, 2206169, -5949988, -12857529, -15140950]
12402a5140950J665880L484813L864581L054159Q75576j164388k14542L704520
12394A29649N557996J043347n991302p095374j415920K119199j556813m830802
12386a2040020R65062J0814448J2191773L047440o101665p334875l299279O54352
12378a102764L359503M532213K357132k116243l933600q37603L345057M036538
12370I640233Q81088l606576o400739m709964J144089N590867L429102k628636
12362C339464n266141k828117j94648M3294J41183P66232k38538j560576J123931
12353d673916O408823O926102Q29183m305643k944833M56835j39493k650163j464704
12344a557809L253389O715437O429328L063583k429247p982906r446375m838175
$$ y = [-15140950, -13475070, -9990257, -6125676, -3071517, -2195941, -3360329, -3574871, 129649, 5687645, 6730992, 739690, -6355684, -7771604, -5652405, -7209218, -12040020, -11074958, -260510, 11931263, 14978703, 8877038, 1542163, -1757116, -1102764, 2256739, 6788952, 9146084, 7029841, 3096241, 2258638, 5603695, 9640233, 10521321, 6914745, 514006, -4195958, -3051869, 2538998, 5968100, 3339464, -1926677, -4754794, -4949442, -4906148, -4764965, -3998733, -4237271, -5797847, -4673916, 1734907, 8661009, 9490192, 5184549, 2239716, 2696551, 2557058, -93105, -1557809, 1695580, 8411017, 14840345, 17903928, 15474681, 7491775, -1954600, -6792775]
12336f792775K191074O355600O304779L757697k36512m974124p976939o552077
12328g923277j164959M423176O306965L665832m11134k024720j210432j437552
12320B23899k962299r67963N735203R140807K327758q181605r446923k94832P050223
12311B624268M232028l533037p170468m755955L58902N226684P512731N545390
12303A0040543R22124l048169n776824p485619n016778K815707Q208424L306714
12295C966122n250199l698812O546401R096922j541414j0573479o468329J904199
12287f018589K192624j638547J38671M390331K546373j840380P36409P317589
12279G824481O397030k124343o201738j105870M025290J366855n147928p782225
$$ y = [-6792775, -4601701, 1753899, 8058678, 11816375, 11579863, 6605739, -1371200, -7923277, -9088236, -4665060, 1641905, 5307737, 4896603, 2871883, 1661451, 223899, -2738400, -3706363, 2028840, 11169647, 13497405, 5315800, -4131123, -4425955, 2624268, 6856296, 3323259, -3847209, -8603164, -8244262, -3017578, 4495153, 10040543, 10962667, 7914498, 2137674, -5347945, -10364723, -7549016, 659408, 3966122, -1284077, -4982889, 1563512, 10660434, 9119020, -1454459, -7922788, -6018589, -3825965, -5464512, -5325841, -935510, 1610863, -229517, 506892, 7824481, 14221511, 12097168, 5895430, 4789560, 8814850, 10181705, 5033777, -2748448]
12271b748448m589213J855926Q075877R611456L615606o034735j0988250p459023
12263h660804M41554O394941P248752L551892j187828k541383K9689J869766k21491
12254F925088k921173j969390P08230O38248j726593k952084l040785l732458
12246h070917l187372R01201N051001L782137j643324m656526k560604J355451
12238i028953L565086L042523K30070j924441R14454P157420P864807n73832q048916
12229C198218m359650M237770M286400k997945m012060L806376P275984j57861
12221A1277232p215562l770226K455162p57298r772473j0763677n64542R951783
12213i159601J1606104O281165M89887k537393k933970k005165j723888l107600
$$ y = [-2748448, -7337661, -5481735, 2594142, 12205598, 15821204, 9786469, -1201781, -8660804, -8219250, -1824309, 5424443, 8976335, 7788507, 5247124, 5276813, 7146579, 6925088, 4003915, 2034525, 2742755, 3381003, 1654410, -1297674, -4338459, -8070917, -11258289, -10357088, -5306087, -1523950, -3167274, -7823800, -10384404, -9028953, -5463867, -2421344, -2191274, -4115715, -3201261, 3956159, 11820966, 11247134, 3198218, -1161432, 3076338, 7362738, 4364793, 352733, 4159109, 11435093, 11277232, 4061670, 291444, 2746606, 1989308, -7783165, -18546842, -19111384, -9159601, 2446503, 8727668, 9217555, 6680162, 3746192, 1741027, 17139, -3090461]
12205c090461m456652l514551o69488K447847N860076R287304R227493L088691
12197A8180259m369462m727944K447743P344492K647454o313697r233244m970059
12189A005542j119669j095667j80723L781346M443495k679847j0409227q328289
12181a4583039K469747J0962059J0662234M791308j774356p185437q995002m661466
12173h313952K289694M459057J253788l45349K033429K222827k301547l949577
12165b651630K535210R380479O230804m292725j0307726o679133M37099L219436
12157b128186K08689m105108l762990K659902Q551839O077743j974326m346070
12149A181493J834869N804521K81936o521305m628815J696246K800303J48486
$$ y = [-3090461, -7547113, -11061664, -11731152, -9283305, -3423229, 5864075, 15091568, 18180259, 13810797, 9082853, 11530596, 18875088, 21522542, 15208845, 5975601, 1005542, -114127, -1209794, -1390517, 2390829, 6834324, 4154477, -6254750, -14583039, -12113292, -1151233, 9511001, 14302309, 12527953, 5342516, -3652486, -8313952, -6024258, -1565201, -311413, -656762, 1376667, 3599494, 1297947, -2651630, -116420, 9264059, 15494863, 11202138, 894412, -5784721, -5347622, -2128186, -1919497, -6024605, -9787595, -7127693, 1424146, 7501889, 5527563, 1181493, 3016362, 8820883, 9102819, 2581514, -2047301, -351055, 2449248, 2597734]
12141B597734J016059L289586r1722n996693n267503N63442J596964k607997k694639
12132g594769K638010L884910j674596m671882n14264K509739j504085n289675
12124a2216612j135462N927542O829695K588167N81999K173547K697857O12972
12116H059705p82902L95486J961968J225813j501840k997736n70233L592086L450561
12107A2832908k569286p362131m519629J247385P07739n060880o051312N36092
12099a0239114N795995L058485k999339m760797j259671M220771Q842019R043935
12091A1702284J884629q577532j2806077p501579J94790L302041L185710L651989
12083d963745L787556J477652j452527k228335j040492J124068M008676N227200
$$ y = [2597734, 3613793, 6903379, 6811657, 814964, -4452539, -3889097, -2292133, -4900130, -7594769, -4956759, -1071849, -2746445, -7418327, -7932591, -5422852, -6926937, -12216612, -13352074, -7424532, -594837, 1993330, 2575329, 4748876, 7446733, 8059705, 7276803, 7672289, 9634257, 10860070, 9358230, 6360494, 5790261, 9382347, 12832908, 10263622, 2901491, -1618138, -370753, 336986, -4723894, -10775206, -10239114, -4443119, -1384634, -4383973, -9144770, -10404441, -6183670, 2658349, 11702284, 13586913, 5009381, -7796696, -15298275, -15103485, -11801444, -8615734, -4963745, -1176189, 301463, -1151064, -3379399, -4419891, -3295823, 712853, 5940053]
12075E940053J441373n089598o960221j419015N820226Q826978P501964L462660
12067A9524420k969815q925665r474299n283615k640420k785326N22000Q784222
12059c248498J3161833P218641k659162o662605m710467k965516l100371k672891
12051e639036j657900j439422q37051R58505J368305l66116K04143N029143P730363
12042E350934K629429n009138n894981n26309K509294K31261j499903J194842
12034a014571M027409J864382l102775m230835O53808O218418N983881L79743
12026A0779460l764625k429141L25095n51763k533792r5261M790085M788217q08794
12017A0499481m757933l148021N07155L425409O558611P824410K610708n897340
$$ y = [5940053, 7381426, 2291828, -4668393, -6087408, -267182, 8559796, 16061760, 19524420, 16554605, 7628940, -1845359, -7128974, -9769394, -12554720, -12032720, -3248498, 9913335, 17131976, 14472814, 7810209, 3099742, 134226, -2966145, -5639036, -7296936, -8736358, -9573409, -8614904, -7246599, -7612715, -7408572, -2379429, 5350934, 7980363, 2971225, -2923756, -3450065, -940771, -709510, -2209413, -1014571, 3012838, 4877220, 1774445, -2456390, -1802582, 4415836, 10399717, 10779460, 7014835, 4585694, 4910789, 4359026, 1825234, 1729973, 6520058, 11308275, 10499481, 5741548, 2593527, 3100682, 6526091, 13084702, 20909112, 23519820, 17622480]
12009A7622480p509498o16647L556674k041519r415983q685767k432722J198508
12001h324474J192949R97702O06106n69132L05297L433592L597822q4540m35256
11992G20066M664557N929673j517369p267410k154703N284839K993236l781936
11984D870953k295926M860665N048667j271975j794933N110980P799904J926043
11976B4254378l812660m615454n718787q343108n615398K481962N127997j866044
11968A892886p972316m493928K876067N599987N093191N486563L807010k876755
11960I412705q583043o664488r41993O89820j071596K82021N249497Q130444O604781
11951A3108148L567372N61307l278210o103841m373675n3907j64885o247341r711310
$$ y = [17622480, 10112982, 9496335, 13053009, 11011490, 1595507, -7090260, -9522982, -8324474, -7131525, -6133823, -5527717, -6096849, -5791552, -2357960, 1239862, 1155322, 720066, 5384623, 11314296, 9796927, 2529517, 374814, 5659653, 8652889, 4870953, 2575027, 7435692, 12484359, 11212384, 9417451, 14528431, 22328335, 24254378, 20441718, 15826264, 10107477, 1764369, -3851029, -1369067, 3758930, 1892886, -6079430, -10573358, -7697291, -2097304, 2995887, 8482450, 12289460, 9412705, 829662, -5834826, -6776819, -6086999, -7158595, -6876574, -1627077, 6503367, 13108148, 16675520, 17236827, 13958617, 7854776, 3481101, 3427194, 3262309, -2985032, -12696342]
11942a2696342k597547J0067346J4863689P046602l196128m690344J78169J331574
11934A0307019k512531l094001J707790K832932m672998j1644353q227857O61353
11926a4642646L455949j32833p22231M201778P202222M303929P40921J248767
11918E655856L360915L148684P45946k346504n768464q131716p130627l065580
11910a3531490J625956N893084Q866153P263556J81185n662756l287392L182590
11902D530886L239548m186889r123703n810936L08353L379896M926647O444589
11894C708391L758193m436876r947360n272966M316343P180606J350450l825405
11886c168624j958840J970145O00216l792240k439049N757155J0262733L123085
$$ y = [-12696342, -15293889, -5226543, 9637146, 16683748, 13487620, 8797276, 8975445, 10307019, 7794488, 4700487, 6408277, 9241209, 4568211, -7076142, -15303999, -14642646, -11186697, -11319530, -12041761, -7839983, -637761, 3666168, 4407089, 5655856, 9016771, 12165455, 12911401, 10564897, 4796433, -3335283, -10465910, -13531490, -11905534, -6012450, 2853703, 10117259, 10298444, 4635688, 1348296, 4530886, 7770434, 3583545, -5540158, -11351094, -11042741, -7662845, -2736198, 3708391, 7466584, 3029708, -6917652, -12190618, -7874275, -693669, 656781, -3168624, -5127464, -3157319, -2557103, -6349343, -8788392, -3031237, 7231496, 10354581]
11878A0354581q161322r644174m32991O697987M809692J429876L435871N240692
11870A3730212L69661n524559m123300J211888K305641M16354J121426J420039
11862A0927362m136818r907913o936676J07710L1606m366755q90324Q818218J0295002
11853C941412J253887m644933k034032j243880o195296n977074L138772P823462
11845c937682J085973l785019L549047J1141425N083622o197789o385273K142858
11837B697162N280107J493138R771J364315j470561o610817n454307R71621L622773
11828A903202J479545J156725K471389n39566n394197l272796M404306O331778
11820H540386k85345n759238m590773k426272k965665j125369N577534J0273648
$$ y = [10354581, 2193259, -7450915, -7883906, -1185919, 3623773, 5053649, 8489520, 13730212, 14099873, 8575314, 4452014, 5663902, 7969543, 8385897, 9507323, 10927362, 6790544, -3117369, -10054045, -9946335, -9914729, -14281484, -15171808, -6353590, 3941412, 5195299, 550366, -1483666, -2727546, -8922842, -14899916, -11761144, -3937682, -2851709, -6636728, -3087681, 8053744, 13137366, 6939577, 554304, 2697162, 7977269, 9470407, 9480178, 10844493, 9373932, 2763115, -2691192, -1719571, 1903202, 3382747, 4539472, 7010861, 6471295, 1077098, -2195698, 2208608, 8540386, 8255041, 2495803, -2094970, -4521242, -7486907, -8612276, -3034742, 7238906]
11812G238906P384087Q32031l575019n581637n730162j764826M889198O878902
11804A0571480J009280n943066o883336l669008j357554N30535M433010P555638
11796F246979N753645J588219J215077M321784L780206l785295j2178462j2806616
11788e864463n020876L334209N087221J223001j798603m86309K688667M345713
11780C508560M263919K950132o31382n732511p890442m526859M00464J782329
11772e875790N78828O48569J306385n39665k846209n27266N212220P117109K667794
11763G741975k162036k073587O81339J513161M92841N55117K202759L324979K360916
11754A4637464l01954k622795k155857J015401L086286J113896k180188k080615
$$ y = [7238906, 14622993, 15455024, 11880005, 6298368, 568206, -1196620, 3692578, 10571480, 11580760, 5637694, -1245642, -4914650, -6272204, -5741669, -1308659, 6246979, 12000624, 13588843, 14803920, 19125704, 22905910, 19120615, 6942153, -5864463, -10885339, -7551130, -2463909, -1240908, -3039511, -3525820, -837153, 3508560, 7772479, 10722611, 10091229, 4358718, -3531724, -8058583, -7658119, -5875790, -5296962, -4648393, -3342008, -3881673, -6727882, -7255148, -2042928, 5074181, 7741975, 5579939, 3506352, 4187691, 5700852, 6193693, 6748810, 8951569, 12276548, 14637464, 14335510, 11712715, 9556858, 10572259, 13658545, 14772441, 12592253, 10511638]
11746A0511638O54625J071102j651933l196277k131134k344434n212375n792164
11738h090952p82151M940637M635346r86140n527985n616295l337201j315457
11730a6080198M79594K859864M993187M721666J020940l572913m059253J252496
11722h384617O947306O071503p51860o124782n931476l130304n09759L441175
11714h372814Q192248P878489L59775o102899k988711N270060O737237r54867
11706A0018518p784920o181195l30362K007220n8847k388418k890754k203055
11698i811813o69645J338024K329440J830892J352096J140928p40236l623276
11690f853590k745926L440652Q480602N874527j198420m415227k467952j471921
$$ y = [10511638, 11166263, 12237365, 10585432, 7389155, 5258021, 2913587, -2298788, -8090952, -8873103, -3932466, 702880, -283260, -5811245, -11427540, -14764741, -16080198, -15600604, -12740740, -7747553, -3025887, -2004947, -5577860, -9637113, -8384617, -1437311, 4634192, 3882332, -2242450, -8173926, -11304230, -11813989, -8372814, -180566, 7697923, 8057698, 1954799, -1033912, 4236148, 10973385, 10018518, 2233598, -3947597, -4277959, -2270739, -2329586, -4718004, -7608758, -9811813, -10481458, -9143434, -6813994, -4983102, -3631006, -2490078, -3230314, -6853590, -9599516, -6158864, 2321738, 8196265, 6997845, 2582618, 114666, -1357255]
11682a357255l902297n006413j753747J845264J469895j089042j542137J277432
11674a0058300N883724R789385Q979573J366863p220708p440308L6743L368604
11666D705576l226467r822919n829039L688230O807901K990050M85709O38996
11658D38037j574018m207531l30800O876908O029451l247731p731001j536947
11650e283632M758090K431793j825620K22117L332496p61583p472197o681641
11642a1280177N53480M884621L751366K134942J658855K9074r63395K357521O552357
11633I678644M496114k425086n216969j093268K622379J96131m828578o357501
11625b928134l941019j200918j67142L94641K810801O826663P528310L58041r893600
$$ y = [-1357255, -5259552, -10265965, -12019712, -10174448, -8704553, -9793595, -11335732, -10058300, -4174576, 5614809, 14594382, 15961245, 8740537, 1300229, 1336972, 4705576, 1479109, -8343810, -14172849, -10484619, -3676718, -686668, -200959, 438037, -1135981, -5343512, -5674312, 1202596, 7232047, 3984316, -3746685, -5283632, -525542, 1906251, 80631, 302748, 3635244, 2873661, -4598536, -11280177, -10726697, -5842076, -2090710, 44232, 1703087, 1732161, 768766, 3126287, 9678644, 14174758, 11749672, 6532703, 5439435, 8061814, 8257945, 3429367, -2928134, -6869153, -8070071, -8237213, -7842572, -5031771, 1794892, 9323202, 9681243, -212357]
11616b12357j1279546p94196Q736512N815378k547068k053652N890251O934150
11608A0489472k318955r121372n639439O4173k15097j817482J579486N088202
11600a891012J436841n240126n147685K442142R511139J0931925P731689J795186
11592B1570099m839297p592835l721466K103749K961256p70913k969332j481637
11584E259624Q5318l53663o97321K84994Q79230L62849J92325L51241r54323k961365
11574B448909k245807J490665L697788J184253l361530n359730m051574j845090
11566h042116j91630J345105L162366M718327M875329K359996k684952o991445
11558a449020o318307p66416M273583M383053J215239q51318p57091k57219N16266
$$ y = [-212357, -11491903, -12286099, -3549587, 2265791, -281277, -2334929, 3555322, 10489472, 8170517, -950855, -6590294, -6526121, -6741218, -8558700, -6979214, -1891012, -454171, -5694297, -10841982, -8399840, 1111299, 12043224, 19774913, 21570099, 16730802, 9137967, 5416501, 7520250, 10481506, 9710593, 6741261, 5259624, 5344942, 4991279, 4293958, 4578952, 5458182, 5821031, 6013356, 6364597, 5410274, 2448909, 203102, 1693767, 5391555, 6575808, 3214278, -2145452, -6197026, -8042116, -8233746, -6888641, -3726275, 992052, 5867381, 8227377, 5542425, -1449020, -7767327, -8533743, -4260160, 122893, 1338132, 486814, -270277, -527496, -11230]
11549a1230K588034M223561K412615j576900l174287j924755k353666n391409
11541e208037n256692Q17176N720566K104113n363499n813827J581515O288431
11533e130254K094795m555521m968846L23671M870915N437937L046317p13952
11525D05062l523360j957040L793675P413320L526985m435067p950789m024143
11517f751357J889349L186997r59998o060702p325808m023237R4230J107163l14576
11508a9157939l08183K098324L575491K065481P5545O19149L184559N514432O125115
11499C791974L753018j613870n763732l417116L528996O554582K099825l560021
11491E373656m427747k679139j694646R25462O315862P778603N98562p455320
$$ y = [-11230, 2576804, 6800365, 9212980, 7636080, 4461793, 2537038, 183372, -5208037, -10464729, -9647553, -3926987, -1822874, -7186373, -13000200, -11418685, -5130254, -3035459, -7590980, -12559826, -12236155, -7365240, -1927303, 1119014, 405062, -3118298, -5075338, -1281663, 6131657, 9658642, 5223575, -2727214, -6751357, -4862008, -1675011, -2635009, -8695711, -16021519, -20044756, -19950526, -18843363, -19157939, -19466122, -17367798, -13792307, -11726826, -11651281, -11032132, -7847573, -2333141, 3791974, 7544992, 5931122, 167390, -3249726, 279270, 6833852, 8933677, 5373656, 945909, -1733230, -3427876, -2502414, 3813448, 11592051, 12190613, 4735293]
11483D735293o084643J301947K793198l123088o116960j289168M168371L802367
11475A87317P42675K1878Q56884P82373M39189N25095j2516M1535L823107R386285
11465A6793822R494734J693504p253821j0330101q267700n417134l039969m49528
11457f776193J691342K757309L331471K921593N99875r78799K021673O578089
11449A2146360M434349m857759j0288331m473461M590876M706296k695980n399654
11441a837304R39996O787621L126404n945818r377289l456802M931854P803379
11433B972041M499147r5364k453062k818564k216929q08066K94844o16579j934959
11424c177491P65699P190361R478198K015609r074075j2616664o703113N85304
$$ y = [4735293, -1349350, -47403, 2745795, -377293, -6494253, -7783421, -3615050, 187317, 929992, 951870, 1808754, 2591127, 3030316, 3555411, 3542895, 3584430, 7407537, 16793822, 26288556, 27982060, 20728239, 10398138, 2130438, -3286696, -6326665, -6776193, -5084851, -2327542, 1003929, 3925522, 4525397, 3546598, 5568271, 12146360, 16580709, 11722950, 1434619, -3038842, 1552034, 6258330, 3562350, -1837304, -897308, 5890313, 9016717, 3070899, -6306390, -9763192, -4831338, 2972041, 7471188, 7375824, 4922762, 2104198, -112731, -920797, -625953, -1242532, -3177491, -2411792, 4778569, 14256767, 16272376, 7198301, -5418363, -12121476, -11536172]
11416a1536172L759350N263597P369452O957235J871825l813418n099557k320673
11408B451639J137340L355330L305728k5447m789190o388946l614833j033917
11400e602296k104141l708345j426518L080414M600909K224362J0417N20168J724432
11391f80598Q26953j721712l180264k083854K27920J473957J145869O05748O55245
11382b730736O23087M57987J510364L685715M191831J490641j714672k289981
11374E224236j375398k046592m160185m981456l400896m25897K767133M590059
11366c808996L422232Q44896Q60328L076721J872630l842355o873995l507771
11358g956310j040748n062504p592951R1620J0049596Q323523j812061m706115
$$ y = [-11536172, -7776822, -2513225, 4856227, 11813462, 13685287, 9871869, 4772312, 2451639, 3588979, 6944309, 10250037, 10224590, 5435400, -953546, -4568379, -5602296, -7706437, -11414782, -12841300, -9760886, -5159977, -2935615, -2925198, -2405030, -680598, 146355, -1575357, -4755621, -6839475, -6611555, -5137598, -3991729, -3385981, -2730736, -2107649, -1649662, -139298, 3546417, 7738248, 9228889, 7514217, 5224236, 3848838, 1802246, -2357939, -7339395, -10740291, -11166188, -8399055, -3808996, -386764, 458132, 1318460, 4395181, 6267811, 2425456, -4448539, -7956310, -8997058, -14059562, -21652513, -21560893, -11511297, -3187774, -4999835, -9705950]
11350i705950J555938L153302l746683n565223M095643J1662547N863339l691525
11342C621388l351350K573348J698876m422110m301192K972328O466723J160374
11334F418385n499703n581794j58603M542304M492788N53473k785007j907154
11326G4689J303387K130547O51827J129258K979914L06084p012400j0671521o502763
11317a5610978n99448J982389M683822R232760Q670285l85747q139507n140082
11309e306506K506759L140818j774251j700253M573064P579066K829178l536550
11301H311325n161636k670599K91124J617821J074092M57899K057722M004623
11293I982371J224722n605867q147285k277326M779236M957569M0835m247063
$$ y = [-9705950, -8150012, -4996710, -8743393, -14308616, -10212973, 1449574, 7312913, 3621388, 270038, 2843386, 4542262, 120152, -4181040, -1208712, 5258011, 6418385, 918682, -4663112, -4821715, -279411, 4213377, 4766850, 1981843, 74689, 1378076, 3508623, 4160450, 5289708, 8269622, 8575706, 1563306, -9108215, -15610978, -16210426, -14228037, -9544215, -311455, 8358830, 7973083, -166424, -5306506, -2799747, 341071, -1433180, -3133433, 1439631, 9018697, 11847875, 8311325, 3149689, 479090, 770214, 2388035, 3462127, 3920026, 5977748, 9982371, 11207093, 5601226, -2546059, -4823385, -44149, 4913420, 4954255, 707192]
11285G07192o986519p946905l386738N679137R648933L847027k972956k913452
11277d324281j262546l618179k853674O491709J2677105L853951r183373q024627
11269f243915L335088O307483P3429Q02534J0100950J0924837j588432j0800875
11261A2911099p170356k389245n223319n562768M494151J3221690Q246855k671830
11253A5856277n351926j028108M62314j354184j048683r153j995345l308607J00481
11244B323066K703322j426277o398473l669402K977076M110729O43317K60491
11236A523849K569907J084776l196064l298697N26278J597971l62262N29541L685479
11227D660778K218662l267999l705227K659924N608549o39430p035807l301583
$$ y = [707192, -6279327, -14226232, -17612970, -11933833, -2284900, 1562127, -1410829, -4324281, -5586827, -9205006, -12058680, -5566971, 7110134, 10964085, 1780712, -6243915, -2908827, 3398656, 3472085, 4274619, 14375569, 25300406, 23711974, 12911099, 5740743, 3351498, -1871821, -7434589, -2940438, 10281252, 18528107, 15856277, 10504351, 9476243, 9938557, 8584373, 7535690, 7526537, 5531192, 2222585, 2323066, 5026388, 3600111, -2798362, -6467764, -3490688, 620041, 1263358, 1523849, 4093756, 5178532, 1982468, -1316229, -789951, 808020, 445758, 975299, 4660778, 6879440, 3611441, -93786, 2566138, 8174687, 7535257, 499450, -2802133]
11219b802133O150968Q940882K698964k921845j152359L051864J358263n992581
11211I332023j0770719p720922r01082K404813J370622J470868N093461P215760
11203G494824L019809m229633p489957n659401l405167k263681J374466P788580
11195c370160J0109292L673838n353643o943118n44399N149308N056950K836025
11187A0614093J843089o88183n964690p903587k475178L420648J833381k329440
11179a649867J017033Q556377P085677l951691r404266k490533M100127j84444
11171C078413o213540j897342O413715N168898l088303n096768L68957K763347
11163A497377m76580j791149J99390p43650l466808O5160P635378P234441j936409
$$ y = [-2802133, 3348835, 12289717, 14988681, 12066836, 10914477, 13966341, 15324604, 9332023, -1438696, -9159618, -10060700, -7655887, -6285265, -4814397, 279064, 7494824, 10514633, 6285000, -1204957, -6864358, -10269525, -12533206, -11158740, -3370160, 6739132, 10412970, 5059327, -1883791, -2428190, 2721118, 7778068, 10614093, 12457182, 11768999, 5804309, -2099278, -4574456, -1153808, 679573, -1649867, -632834, 7923543, 15009220, 11057529, 1653263, -837270, 3262857, 3078413, -3135127, -5032469, 1381246, 6550144, 3461841, -1634927, -1265970, 1497377, 1020797, -770352, -570962, -1314612, -4781420, -4716260, 2919118, 10153559, 8217150]
11154H217150n891146J281898P425451K779139m743131m276569J043904K274289
11146H110985r70679m371266p634939r939056n772223N134151J2289011Q440248
11138E286232J012766P4784L062009J801144k819982m293156k384704r15769O59546
11129A482870L226408J682058o374312j1652534n143846N919808P271562q50105
11121d438091n208178o49126M555290M555214L086000K485667j231607p755114
11113d599945q458653M97282R794750Q756948m69357o948731n053555J119081
11105e362180M807098L235764j658599n611499n155210l15981N235087O961193
11097B135673K983088l767826o905569k626940M894546P458405L331115p45043
$$ y = [8217150, 2326004, 3607902, 11033353, 13812492, 9069361, 4792792, 5836696, 8110985, 7140306, 2769040, -4865899, -14804955, -20577178, -15443027, -3154016, 5286232, 6298998, 6373782, 9435791, 11236935, 8416953, 4123797, 1739093, 823324, 1482870, 4709278, 6391336, 17024, -11635510, -16779356, -10859548, -3587986, -4438091, -9646269, -10295395, -5740105, -1184891, 1901109, 4386776, 3155169, -4599945, -13058598, -12561316, -2766566, 5990382, 5521025, -1427706, -6481261, -5362180, -555082, 2680682, 1022083, -4589416, -9744626, -10060607, -4825520, 2135673, 5118761, 1350935, -5554634, -8181574, -3287028, 4171377, 7502492, 6757449]
11089F757449k42915L44110l882823q376935n172896M466964J1079187R382243
11081A4354384K875270l145405o576725o594081l100783Q96166J467834o67119
11073d90459r63400K069646M915272M481151J669221j040640k264029j609098
11065F767664K11131J055994m87170l073983m649969n040788m411462j703512
11057a1332095K347874L585509l8624l891393k384412K762241M956664J913219
11049b081017k425001l862218j412692L612530P604971N924700j023188n661206
11041F76879k778744K009156N13883m417626l110065M306684O735147j59313o012911
11032b236910j299656P874199Q552264o64797q401486o000325K775826Q187874
$$ y = [6757449, 6514534, 6858644, 2975821, -5401114, -10574010, -6107046, 4972141, 14354384, 17229654, 14084249, 7507524, 913443, -2187340, -1291174, 176660, -490459, -1453859, 615787, 5531059, 10012210, 11681431, 10640791, 8376762, 6767664, 6978795, 8034789, 7547619, 4473636, -176333, -5217121, -9628583, -11332095, -8984221, -5398712, -5437336, -9328729, -11713141, -8950900, -3994236, -2081017, -4506018, -8368236, -9780928, -6168398, 1436573, 7361273, 6338085, 676879, -2101865, -92709, 421174, -3996452, -7106517, -2799833, 3935314, 3776001, -2236910, -3536566, 4337633, 12889897, 12225100, 3823614, -2176711, 599115, 8786989]
11024H786989N807728n17765m499368m028060j882002q29539M0769K648964N298552
11015A0826268M098538r75469m935466m062620o24580O35101j166082k570113
11007A225577r53638K015795K810502P51901j288802j111106k20379r13301j998910
10998C17639p20186J824255J682931r24256q07641L625240O226248J725741n705712
10989G244259p885174l894181k60983j230404m255759m960059j988583L295144
10981a3935740Q101234R030877N138101M23173j1030L326005M529640l702o735150
10972I863408r128781n092707R87777L321999J048627j399148n05178J848440
10964I44437K255376J653574K865106L986893O06690n514742p368065l757749
$$ y = [8786989, 14594717, 14076952, 9577584, 5549524, 3667522, 2837983, 2878752, 5527716, 10826268, 14924806, 13949337, 9013871, 4951251, 4326671, 4961772, 3795690, 1225577, 271939, 2287734, 5098236, 5850137, 4561335, 3450229, 3229850, 2316549, 317639, -402547, 1421708, 3104639, 2180383, 1372742, 4997982, 11224230, 12949971, 7244259, -640915, -4535096, -4796079, -6026483, -10282242, -15242301, -17230884, -13935740, -5834506, 3196371, 8334472, 8757645, 8746615, 12072620, 16602260, 16598558, 9863408, 734627, -4358080, -3370303, -48304, 1000323, -398825, -904003, 944437, 3199813, 4853387, 7718493, 11705386, 12312076, 6797334, -570731, -4328480]
10956d328480j532296l850620m582769P90503O729452O505648K483941L53490
10948B568869n71371l446815n935298m374772r93131R72788M013298R773074J1815441
10939A3822083N075127l166771l360446L68752k385577r045584p517260K588152
10931c621524Q341077M395780j93065O01556P40524l965451o845846k552732L550472
10922D50791N505719N513156N554362J377396p008134r726258j659845P053474
10914G060661N783649k21898o0167M141621K495638m133718n651198n89963J773165
10905A0597790k252533n201932k010143J784091k05281n473407p279887l456127
10897a3497429K736422O288105L606900l401125o393577K15518R319079Q377025
$$ y = [-4328480, -5860776, -9711396, -14294165, -13503662, -6774210, -268562, 2215379, 2568869, 1997498, -1449317, -7384615, -11759387, -12752518, -11779730, -7766432, 2006642, 13822083, 18897210, 15730439, 12369993, 12738745, 10353168, 1307584, -6209676, -3621524, 4719553, 9115333, 8922268, 9523824, 10264348, 6298897, -546949, -3099681, 450791, 5956510, 11469666, 17024028, 18401424, 11393290, 1667032, 7187, 7060661, 12844310, 12622412, 12562245, 16703866, 19199504, 15065786, 9414588, 8824625, 10597790, 8345257, 3143325, 1133182, 2917273, 2711992, -2761415, -10041302, -13497429, -10761007, -4472902, -866002, -4267127, -10660704, -10445186, -1126107, 7250918]
10889G250918k360070q566109k428162N706870L455214m736808n332065L316079
10881c694133R729291P162345R85398k719226n018534p310037o379869j505307
10873h750072J497849o09682k227557J543044N664322L689616k46929J792686
10865B353277O739307M478312m515607q298969k371093K877540j100037p639930
10857g477200o117240J658792N632199K934274k00622M89302K558656K713785
10849B191946R56875j468617l628603m159717k332849L42469J931971K541308
10841c625217L143883L636652L653575L150352J169371k761343n254017j870903
10833A242353N151185P675136K689976l447184m841769l408825k416509j05118
$$ y = [7250918, 4890848, -3675261, -6103423, -396553, 3058661, -1678147, -7010212, -3694133, 6035158, 13197503, 14182901, 11463675, 6445141, -864896, -7244765, -8750072, -7252223, -7861905, -10089462, -8546418, -2882096, 807520, 560591, 2353277, 9092584, 13570896, 9055289, 756320, -1614773, 1262767, 162730, -7477200, -13594440, -11935648, -6303449, -3369175, -3569797, -3080495, -521839, 2191946, 3148821, 1680204, -1948399, -6108116, -8440965, -8098496, -6166525, -3625217, -481334, 3155318, 6808893, 9959245, 11128616, 8367273, 3113256, 1242353, 6393538, 14068674, 16758650, 13311466, 8469697, 5060872, 2644363, 2539245]
10825B539245M551788O609931K430633l620653o091994n967070n111616p59466
10817e419202O717527Q648226N20966p895775o157357K03445l57698n146116k483037
10808a1369021O691914R495689K868758k040790M92820K460412j892900n718442
10800I88440j945667M875007O133186P40866o185199r763254p035200J333749
10792a0858072Q738120Q477423K930919o9183N72784l08583k318420K12358N182862
10783A2560208K910244p139587j2395856n498637M659619O753681K047568j427873
10775B469367j303632l10450K07928K19598m48249q0265K570823K730489m992845
10766A062764j4482680j2715857M69461R759403O548595N41555J906218N269640
$$ y = [2539245, 7091033, 13700964, 16131597, 12510944, 6418950, 451880, -4659736, -5419202, 1298325, 9946551, 10467517, 2571742, -3585615, -3382170, -3739868, -8885984, -11369021, -4677107, 4818582, 7687340, 5646550, 6139370, 8599782, 6706882, 988440, -957227, 3917780, 10050966, 10791832, 4606633, -5156621, -12191821, -10858072, -2119952, 6357471, 9288390, 9219207, 9791991, 9483408, 7164988, 7377346, 12560208, 15470452, 8330865, -4064991, -9563628, -4904009, 1849672, 3897240, 2469367, 1165735, 855285, 1063213, 1282811, 834562, 754297, 3325120, 6055609, 1062764, -13419916, -26135773, -25666312, -15906909, -9358314, -8816759, -6910541, -1640901]
10758a640901J975770l477854k127802L126082L290263p98337j350921J768617
10750G64917J775207k065599l665917j513799p13711l172931m218732n10182M769180
10741h551567O174863K021471l936598n138129J239515Q922869Q050461j675576
10733G107309q969770n697705K502158N390096K022210j090932j211406j435773
10725a383813l629394n388218l738403J301390O073206N605527m68086m779824
10717f407615l90405Q228721R818169K468286l952135l332951r74866k132014
10709C325190l717057k816084k904664m908969k373519O540756J1997570O451409
10701A1594632l042498n787761k436499O30477L494363Q096154Q808078J90702
$$ y = [-1640901, 334869, -3142985, -5270787, -2144705, 1145558, 347221, -1003700, 764917, 2540124, 474525, -3191392, -4705191, -5418902, -8591833, -12810565, -13320747, -8551567, -2376704, -355233, -4291831, -9429960, -8190445, 732424, 8782885, 7107309, -1862461, -7560166, -5058008, 332088, 2354298, 1263366, 51960, -1383813, -5013207, -10401425, -14139828, -12838438, -6765232, -1159705, -1627791, -6407615, -6798020, 1430701, 11248870, 13717156, 9765021, 6432070, 5457204, 3325190, -391867, -3207951, -6112615, -11021584, -13395103, -6854347, 5143223, 11594632, 8552134, 2764373, 327874, 958351, 4452714, 12548868, 21356946, 21547648]
10693B1547648j0724912j2097473m209557K092071J549083r39249m42393K125106
10685a099676L728853K471421j601133m819759k561909L044106M146314l85704
10677B922513k024283K767107N359382k1132n296961k668776J335652j589091
10669G84411n306947l61612P486709O336073r81670k425122J733058Q75056n250064
10660B889892n947929O59829M537779J654011r86912j64300r45849l707981j648470
10651c659930M927570O148363o55817n020848r0824O783511O842015K551993J45951
10642A7971984j205497m764388p807153n745993k66683K997072K135146q6864
10634C227624q31657k682L4529k986819p079700o174576J738764R165997P725100
$$ y = [21547648, 10822736, -1274737, -5484294, -3392223, -1843140, -2782389, -3224782, -1099676, 2629177, 5100598, 3499465, -1320294, -3882203, -838097, 3308217, 2922513, 898230, 3665337, 9024719, 9003587, 3706626, 1037850, 2373502, 784411, -4522536, -4884148, 2602561, 8938634, 7956964, 5531842, 7264900, 8139956, 2889892, -3058037, -2398208, 2139571, 3793582, 2806670, 2642370, 1696521, -2011460, -3659930, 1267640, 7416003, 6760186, 1739338, 1648514, 8432025, 15274040, 17826033, 17971984, 16766487, 12002099, 4194946, -1551047, -1817730, 1179342, 3314488, 3227624, 2395967, 2393285, 2427814, -559005, -7638705, -13813281, -12074517, -2908520, 4816580]
10625D816580L39513k452445K189572N748078J496567n928219p655943k558557
10617d004854K079515M04232m513094m663770J529294N563170Q01503n785517
10609h589521k742604O776872P745719k930332j0055906l809138N238109M813050
10601c553751M26146K638303P211244M273824k098936r80523N156679M554751
10593A7627737l591464r087108p908888m737667j524161K363116K314309m854497
10585i398623j0431038m735772N801254P942207L308111L626980Q354043N990777
10577A0457939l893673q921548m660855L13301J028116J467347K613054P57045
10569h39274k003068n12249J495439k337359n859419O09840R548503N274593q145094
$$ y = [4816580, 5156093, 2703648, 4893220, 10641298, 12137865, 6209646, -1446297, -4004854, -1925339, -1521107, -6034201, -10697971, -9168677, -3605507, -2804004, -8589521, -11332125, -4555253, 3190466, 260134, -9795772, -13604910, -8366801, -3553751, -3127605, -489302, 6721942, 10995766, 8896830, 7916307, 13072986, 17627737, 14036273, 4949165, -2959723, -7697390, -9221551, -6858435, -4544126, -9398623, -19829661, -24565433, -18764179, -10821972, -7513861, -3886881, 4467162, 10457939, 6564266, -2357282, -7018137, -6704836, -5676720, -4209373, -1596319, -839274, -2842342, -3354591, -1859152, -4196511, -10055930, -9446090, 102413, 5377006, -2768088]
10560b768088j0967187k83137N689050q49193n964724p39469M275317P41597k782701
10551a3648535R79278M062564n28082m969306j062806N254791N265621J795019
10543b851456J830183M134063L001957k360040p813600q646194k986318L969341
10535a1722064L072368m385145m163319Q139967J4664293K581319j0934372m877801
10527g624754Q634061M164895j1721525j1319177M762707R055675l319972q313071
10519a5681161R56136M049992m218720l795427Q282773Q648039o685233j0855488
10511a9299089M237103J0863201l674203j3381075k150226P933705O97140n176822
10503a9950266L233527O924409m350128r554075m83794n92967j3766319r260177
$$ y = [-2768088, -13735275, -14018412, -8329362, -9178555, -15143279, -15882748, -11607431, -10865834, -13648535, -12669257, -8606693, -9134775, -14104081, -15166887, -9912096, -4646475, -2851456, -1021273, 3112790, 6114747, 3754707, -4058893, -12705087, -15691405, -11722064, -8649696, -13034841, -17198160, -9058193, 5606100, 8187419, -2746953, -7624754, 1009307, 5174202, -6547323, -17866500, -13103793, -4048118, -7368090, -15681161, -14725025, -10675033, -14893753, -18689180, -10406407, -1758368, -8443601, -19299089, -15061986, -4198785, -7872988, -21254063, -23404289, -15470584, -14773444, -19950266, -16716739, -9792330, -14142458, -23696533, -24180327, -24773294, -38539613, -47799790]
10495d7799790J3293901Q841409k6680264l1958756O330117N757452o6247377
10488a38463308r1778200L1796810J95374567J98859970L8308619q7464918o3224619
10481H3408921R523324P730628l5790269l2342377N041015R308427j4221762j3216762
10473A9441145R067082R325035r548145r299574Q259770Q851662o614258p075012
10465B2407705O727712N040403j2474790j5701750Q78366J1027888M667009q78399
10457B1694144J288529j523142j0489876j0938804k063117J044971l003417k90522
10449d281234R116974R531935o21302n276842K27741K828710k140830l526023
10441E859129K432013M721045r35955m041157R81593N239408J765737l879628
$$ y = [-47799790, -34505889, -25664480, -52344744, -84303500, -77973383, -72215931, -138463308, -230241508, -198444698, -3070131, 195789839, 234098458, 146633540, 83408921, 92932245, 100662873, 64872604, 32530227, 37571242, 46879669, 32657907, 19441145, 28508227, 37833262, 28285117, 18985543, 27245313, 36096975, 29482717, 22407705, 29135417, 34175820, 21701030, 5999280, 6877646, 17905534, 22572543, 21694144, 22982673, 21459531, 10969655, 30851, -2032266, -987295, -3990712, -4281234, 4835740, 14367675, 13746373, 8469531, 8697272, 11525982, 9385152, 5859129, 8291142, 13012187, 12076232, 8035075, 9016668, 14256076, 16021813, 12142185]
10433A2142185m863111k340366K02589J376656m34709m311909l552598M744869
10425B963606J0977043N575397m915553p550436l175048j910148l741561n24646
10417b301346O144278O518405N74307k238538j18953J88509j290450K205311Q775627
10408A8457150Q436398J74561o332913o963135o776952o883823k618948L872391
10400A364729M239722o82967p32951N566514P556908J014852m218465r46971M031818
10391A7193189K412127k646982l722376q84690J021012O49012l58097j530941
10383A2132254k721925k746933j667863j111074j138427m02193N94591N01720
10375C440150N14719K029698K367914j543933o603907o779597j956482K466832
$$ y = [12142185, 7279074, 4938708, 5141297, 6517953, 6083244, 1771335, -1781263, 2963606, 13940649, 19516046, 14600493, 7050057, 3875009, 1964861, -1776700, -2301346, 3842932, 10361337, 10935644, 8697106, 8578153, 8766662, 7476212, 9681523, 18457150, 26893548, 27068109, 20735196, 13772061, 6995109, 111286, -2507662, 1364729, 5604451, 4921484, 4188533, 9755047, 17311955, 18326807, 14108342, 13161371, 17193189, 19605316, 16958334, 13235958, 12351268, 13372280, 14021292, 13663195, 12132254, 9410329, 6663396, 4995533, 3884459, 2746032, 2343839, 2938430, 3440150, 3954869, 5984567, 8352481, 6808548, 204641, -6574956, -8531438, -6064606]
10367f064606L863258M222382M554103L457530R45957j426821l630276n948972
10359b7445o147802k265436L225815N783033L621349j933510p337626o708510
10351a1790132K802404J3215687J1882464n50271q354653k748267N605886M458822
10343A4521940j640367k328836L06051j417387m758810k682928J377904L71942
10335C749509j587905K489287O079070p87232j0399766o481924Q178106J3981384
10327A5220529M555252n801834o895939m905330n483665l665176K586936N573810
10319A184583K192771K28965L039494K335351n726908j0925968m832581N290189
10311g214104P967318L373887r37606j864132n56343K256220M279700J965516
$$ y = [-6064606, -2201348, 2021034, 6575137, 10032667, 10978624, 9551803, 5921527, -27445, -6175247, -8440683, -5214868, 568165, 4189514, 2256004, -5081622, -11790132, -8987728, 4227959, 16110423, 15560152, 7205499, 4457232, 10063118, 14521940, 12881573, 10552737, 10858788, 9441401, 4682591, 1999663, 3377567, 3749509, 2161604, 4650891, 10729961, 9942729, -457037, -6938961, 1239145, 15220529, 19775781, 13973947, 7078008, 2172678, -3310987, -6976163, -4389227, 1184583, 3377354, 3606319, 6645813, 8981164, 3254256, -7671712, -12504293, -7214104, 753214, 4127101, 3189495, 1325363, 769020, 3025240, 7304940, 9270456]
10303I270456k379921j720219L478620L815172l464733q326851m014880J629262
10295a713094l88836n145348k620362N649683R541148N386018j498976o108249
10287C101984p264094m350779J901787O760471N745888O90034k913425l212392
10279D59474k705150l023396k758514l23899L121797M079417N90380l763970k485097
10270f808958M669706R032020M362304l327378m224603R07348L674971K198416
10262A0483826J630788K353290l85513n046178m324171J482435L810793O76257
10254A0681527l29974L177094L781978j128627l547279L16471K460442k098912
10246A3312720n513640j183499M036645K191007j689876L91693M159558O70196
$$ y = [9270456, 6890535, 5170316, 8648936, 12464108, 8999375, 672524, -3342356, -1713094, -2101930, -7247278, -9867640, -4217957, 5323191, 10709209, 9210233, 3101984, -4162110, -8512889, -6611102, 149369, 5895257, 6585291, 3671866, 459474, -2245676, -5269072, -8027586, -8351485, -5229688, -1150271, -559891, -4323861, -6808958, -2139252, 6892768, 11255072, 7927694, 3703091, 4610439, 8285410, 10483826, 12114614, 14467904, 14082391, 9036213, 4712042, 6194477, 10005270, 10681527, 10351553, 13528647, 17310625, 16181998, 12634719, 12951190, 15411632, 13312720, 7799080, 6615581, 10652226, 12843233, 11153357, 11545050, 15704608, 16374804]
10238A6374804p374020r788393n040143k08826K031859M726080O682062K649742
10230A0053165n939533j0064940n095690L349017P525390O102907K692606J36162
10222H759084j309195k174493k213324r39694O40234M62918j129337p72587K395576
10213C719182L933259J140422j358564M20382J294514m056319q356087j409876
10205d673087J0167155R262488m878190j3770259p910295K08429j014748m180558
10197a6789065P99659Q020517P490260L047475L185940M329432j012741p662724
10189A408753n404678K678598M835218n17693m676363m004875k265952o26465
10181h573457K195522K736041k169903o192800j521696O887769P563660M76747
$$ y = [16374804, 9000784, -787609, -5827752, -6036578, -4004719, 721361, 7403423, 10053165, 4113632, -5951308, -11046998, -7697981, -172591, 5930316, 8622922, 8759084, 7449889, 5275396, 3062072, 2122378, 2762612, 3225530, 2096193, 1323606, 3719182, 7652441, 8792863, 7434299, 7854681, 9149195, 5092876, -3263211, -4673087, 5494068, 14756556, 9878366, -3891893, -11802188, -11593759, -12608507, -16789065, -15989406, -7968889, -478629, 2568846, 5754786, 10084218, 9071477, 1408753, -3995925, -1317327, 3517891, 3000198, -1676165, -5681040, -7946992, -8573457, -6377935, -3641894, -5811797, -12004597, -13526293, -6638524, 925136, 1401883]
10173A401883l975965j938059R27692K114095M671017P066731L611517l894839
10165I984072o795926l245803k98827j283969j998640p42647j245011l734885
10157i361636l392957K88053K230263J395902K104672M609216M422650K153906
10149D450069L192770O072436K986823n271096p398416M17743O626285J698738
10141A2775352p012368o893931J178086N638198J473623m432580m133207J728192
10133C21365N971581L706743j736529k397106L545222P486826J510519r006131
10125I402490j1414481l489273L821792K683351j760457j635857J581204J273513
10117D62282l138520n541776j862810M796562P747394M058604j802378k827499
$$ y = [1401883, -2574082, -4512141, -3584449, -1470354, 3200663, 10267394, 13878911, 9984072, 3188146, -57657, -356484, -1640453, -3639093, -4381740, -5626751, -9361636, -12754593, -12466540, -10236277, -8840375, -6735703, -2126487, 2296163, 4450069, 7642839, 13715275, 16702098, 11431002, 4032586, 4450329, 11076614, 12775352, 5762984, -1130947, 47139, 5685337, 7158960, 2726380, -1406827, 321365, 6292946, 9999689, 8263160, 5866054, 9411276, 16898102, 18408621, 9402490, -2011991, -5501264, -1679472, 1003879, -756578, -2392435, -811231, 462282, -2676238, -8218014, -10080824, -5284262, 2463132, 6521736, 4719358, 1891859]
10109A891859J422490L960167O89020l681699m271577m027811o030711m756690
10101a4804952M524306J3358797J0242375m44493m201895P21773K305698l139237
10093H562372n493563r15419O85318m863583o460504K308749R625671M503778
10085G952819m496393m194599J446324R24610l027241J99584P052513L926896
10077I784513q269089j2881030l431098O504204N043198j427674j887313J471023
10069e093266J34702m348329l385525K946857N229700J22617m030970o77911M396117
10060d706008K624105l072701k708998M260273P393688K132562k516262P13305
10052D119964M167620k066800j1331968q344145O256112J4409683O238770o671637
$$ y = [1891859, 3314349, 7274516, 7963536, 4281837, 10260, -4017551, -10048262, -14804952, -10280646, 3078151, 13320526, 12876033, 8674138, 9395911, 11701609, 8562372, 3068809, 2153390, 2838708, -2024875, -8485379, -6176630, 3449041, 7952819, 3456426, -738173, 708151, 1632761, -1394480, -1194896, 5857617, 9784513, 1515424, -11365606, -14796704, -8292500, -3249302, -4676976, -6564289, -5093266, -4958564, -9306893, -12692418, -9745561, -4515861, -4393244, -8424214, -9102125, -4706008, -2081903, -5154604, -7863602, -3603329, 3790359, 5922921, 3406659, 4119964, 8287584, 6220784, -5111184, -13455329, -7199217, 7210466, 13449236, 6777599]
10044F777599r378375l022682J950238K234861J360181k43458m317882p555465
10036a2194983m762000K282036O665097O023030M034346L243480K387570O44195
10028H322771n74849n18778k29033o15894j732311l325353m347321l231486k09220
10019f461474K184742J955125o75453m254956o108047k684130N428736J0327059
10011b88398N444855l466292m758282J576198L802700j879828m692639J591158
10003b670528O340495m39076r613032o114331O742318J1798448L836948m427627
9995E453615k992077K250142J264231m985579p254831j119536P366541Q369373
9987H351879l31880r244928p443217K888888Q301222K655532m393935k683129
$$ y = [6777599, -2600776, -5623458, -3673220, -1438359, -78178, -321636, -4639518, -12194983, -16956983, -14674947, -8009850, -1986820, 2047526, 5291006, 7678576, 8322771, 7747922, 7229144, 7000111, 6384217, 4651906, 1326553, -3020768, -6252254, -6461474, -4276732, -2321607, -2997060, -7252016, -13360063, -16044193, -10615457, -288398, 5156457, 1690165, -3068117, -1491919, 2310781, 430953, -4261686, -2670528, 3669967, 3230891, -6382141, -12496472, -5754154, 6044294, 9881242, 5453615, 2461538, 4711680, 5975911, 990332, -6264499, -7384035, -17494, 8351879, 8019999, -1224929, -8668146, -5779258, 2521964, 5177496, 783561, -1899568]
9979a899568L583224M615558Q07159j037431j189506m526053q300751m873935
9971a2821303M605384J0387625P802765J458248l365933m896294k265988K564330
9963C468834K961673l295259p154214j043013O655530L362829n980705n540681
9955f565006N137146J0010364K982733l527376j036795K352072o91215l514451
9947E147472M07389M460550J090161m703945m969402j891222j019123o92457J723155
9938d47422J891836k911429n523197J00123O853939M428186m587466r074261n183381
9929a4453072J760182O919787Q742134N953905k38440m256269k745346Q35308
9921B518189K718868L798676L830015p60886p669693p286789K251419R095716
$$ y = [-1899568, 1683656, 6299214, 7106373, 6068942, 4879436, 353383, -7947368, -12821303, -8215919, 2171706, 9974471, 11432719, 8066786, 3170492, 904504, 3468834, 6430507, 3135248, -4018966, -5061979, 1593551, 4956380, -1024325, -6565006, -1427860, 8582504, 11565237, 8037861, 7001066, 9353138, 8661923, 5147472, 5554861, 10015411, 11105572, 6401627, 1432225, -458997, -1478120, -2170577, -447422, 1444414, -1467015, -6990212, -6890089, -36150, 4392036, -195430, -9269691, -14453072, -12692890, -5773103, 2969031, 8922936, 8684496, 4428227, 1682881, 2518189, 5237057, 9035733, 12865748, 12104862, 4435169, -2851620, -600201, 8495515]
9913H495515N260510j053284n84169J720411j310879m250906q86607J064206o012768
9904B442029j1946180m280066Q333024R193439J386362j83224L210006m92936
9896G662454o911835j790654Q873853O328604m580655j742324Q723612n559869
9888A1003186m3088914n3614602r757112M3681598M8084403J1092581j2787169
9881e386029l182303R671782K969160q707174p629348j94840K879278N386061
9873d193413J0418065Q719235l262139j1688338n884129M219025M908127Q2896
9865C319329J143127N562209J748081r556367j3833571l237304J2330451J7567739
9857A5043694Q993509l379368q753163o663712m465508n769471o105098j579911
$$ y = [8495515, 13756025, 12702741, 12118572, 13838983, 12528104, 8277198, 7390591, 8454797, 2442029, -9504151, -13784217, -5451193, 3742246, 5128608, 4945384, 8155390, 7662454, 750619, -1040035, 7833818, 14162422, 9581767, 7839443, 16563055, 11003186, -32085728, -85700330, -95457442, -51775844, -3691441, 7401140, -5386029, -8568332, 1103450, 4072610, -4634564, -12263912, -12458752, -9579474, -4193413, 6224652, 14943887, 11681748, -6590, -5890719, -1671694, 3236433, 3319329, 4462456, 10024665, 11772746, 2216379, -11617192, -14854496, -2524045, 15043694, 24037203, 20657835, 11904672, 5240960, 775452, -4994019, -11099117, -12679028]
9849a2679028M087822N790336M631686L186367n75848o467919o233436M050090
9841d209930J2158702N019145q897217r958349K228484Q807574K834913j726533
9833F256789K702548M177932m262093r028144n0015Q950057K800755q692924p636743
9824d781838J590894J780336o562321q092834o74211L329251J595545M195806
9816g619372J0792877Q542804l550509r929174m049378J716476q08128k530821
9808g435225K978288N577476k327995r413994l572191P149293Q137693J710923
9800B804268j75117K107919l86446n278374j942708P489245Q837361q93771q062961
9791D499416m409403R14647j733468o745968m114250L506599N591864M18014l416101
$$ y = [-12679028, -8591206, -2800870, 1830816, 5017183, 4441335, -2026584, -8260020, -4209930, 7948772, 12967917, 4070700, -5887649, -3659165, 5148409, 7983322, 6256789, 8959337, 13137269, 8875176, -152968, -202983, 8747074, 11547829, 2854905, -4781838, -3190944, -1410608, -7972929, -16065763, -16739974, -13410723, -11815178, -7619372, 3173505, 11716309, 8165800, -1763374, -5812752, -4096276, -4904404, -7435225, -4456937, 1120539, -1207456, -10621450, -14193641, -7044348, 1093345, 2804268, 2629151, 4737070, 4350624, -927750, -2870458, 4618787, 13456148, 12562377, 4499416, 90013, 1004660, -728808, -7474776, -11589026, -8082427, -2490563, -2072549, -5488650]
9782e488650n03588M875767O553573M448190K438668K097062J456762j165674
9774A4712110m325530n064430k659242L74675J352915L72529o40566o52535j2550
9765C457376O47892M75085j458016m221501m526207n56245M634481O207737L402038
9756H062640m09503k906145m692250n798995l965441J844674Q430642J0715577
9748A1281199O405760k042727q949717r241286l058860L042557J979118n556819
9740f140775j0712701o089845N594653J4183054J2673742L636343m520233o067295
9732B556943k322366J392810J817247J91958o91586k27797J58328k51090o65640
9723A958807n32625l24738j68552P03505K168961K221112n85754m173355m303384
$$ y = [-5488650, -5992238, -1116471, 5437102, 9885292, 12323960, 14421022, 15877784, 14712110, 10386580, 5322150, 2662908, 3037583, 4390498, 4763027, 4122461, 3469926, 3457376, 4105268, 4580353, 3122337, -1099164, -5625371, -6181616, -1547135, 4660602, 8062640, 7653137, 4746992, 54742, -5744253, -9709694, -7865020, 565622, 11281199, 17686959, 15644232, 6694515, -2546771, -5605631, -2563074, -583956, -6140775, -16853476, -22943321, -17348668, -3165614, 9508128, 13144471, 8624238, 2556943, 234577, 1627387, 3444634, 3636592, 2945006, 2717209, 2875537, 2624447, 1958807, 1426182, 1101444, 932892, 1636397, 3805358, 6026470, 5440716, 1267361, -3036023]
9714c036023M37477O268782P942592M187782j645456n660674o438960m413881
9706b358361q28279J874088J204887j958976l135001L33411N220048O196269K211363
9697H759449l269965o516537n273060R96802Q361131Q815149k78135r114031n947678
9688c466875N642327R742471O34939q381472m640825N413092P072694n75159n526802
9679E914390k400375J455225j76181l549172l094292K79058K924510L843097K694453
9670G890713j783662p747351r720869n668023j88115K354426L177316M409259
9662g276306M293171J354881j270905o06715R66042K64259p39433Q86906K486553
9653C58453J38786l234048j718717L083591L668774j082329l665406O4791M710150
$$ y = [-3036023, -2598546, 3670236, 11612828, 15800610, 14155154, 8494480, 2055520, -2358361, -3186640, -1312552, -107665, -2066641, -5201642, -4868231, 351817, 6548086, 8759449, 5489484, -1027053, -6300113, -5303311, 3057820, 11872969, 11594834, 2480803, -3466875, 2175452, 11917923, 12552862, 4171390, -469435, 4943657, 12016351, 11441192, 5914390, 3514015, 4969240, 4793059, 1243887, -1850405, -1571347, 1353163, 5196260, 7890713, 6107051, -1640300, -11361169, -17029192, -17217307, -14862881, -11685565, -7276306, -2983135, -1628254, -2899159, -3505874, -2539832, -2275573, -3015006, -2128100, 358453, 497239, -2736809, -4455526, -1371935, 2296839, 1214510, -2450896, -2386105, 2324045]
9644B324045M585629J820395N06032o20924l645986n208756j846138K635633K693500
9635C243430N37559J733229M005702M64011o635748o566766K912248J0026160
9627I719825N708927l382583n768975j523423R41024r28522k391423j428487j069143
9618a22780k214412j697341J833459N538070O188422K709566l497735p408915
9610A328334l330257O280599J0052611K394348o811634n996915P84195K087218
9602F788499j052310J096063O586126L666468o334606p824057K548065Q096999
9594A3571247m95267r253770m926506K851549k36306p831568n196347M191126
9586g325842N297591k075753m398626J498020N194947K612779P94123K097400
$$ y = [2324045, 6909674, 8730069, 9236101, 8615177, 4969191, -239565, -2085703, 549930, 3243430, 3780989, 5514218, 9519920, 9983931, 3348183, -3218583, -306335, 9719825, 15428752, 12046169, 6277194, 4753771, 5694795, 4766273, 2374850, 946363, -122780, -2337192, -4034533, -2201074, 3336996, 9525418, 12234984, 8737249, 1328334, -2001923, 4278676, 14331287, 16725635, 9914001, 3917086, 4701281, 6788499, 5736189, 6832252, 13418378, 17084846, 10750240, 2926183, 5474248, 13571247, 13075980, 3822210, -1104296, 1747253, 1510947, -6320621, -11516968, -7325842, -2028251, -4104004, -8502630, -7004610, -1809663, 803116, 1597239, 3694639]
9578C694639P23483l230953k304440L319018M529274k28702k054422J689878K757876
9569H895651j767849l522204J496199N433775K851425q36612j403474k929116
9561H217795o219280l992344M308128O837547j684750q796524l810306M096874
9553a042860J440791o532662m858062N906830J0574886L107621n924814o600537
9545c928807j736525J264735J245774J750003L960730M829495J087647n568160
9537B904892q339582l310895L700669M034590j065247k878679J15603J170530
9529c668119k53968K920095Q866031N462501p416478j2044225o54703Q876037
9521B087171J033935j0766813o447800O345169N574928p053724r538081K488896
$$ y = [3694639, 4418122, 1187169, -1117271, 2201747, 6731021, 6502319, 4447897, 6137775, 8895651, 7127802, 3605598, 5101797, 10535572, 13386997, 12550385, 11146911, 8217795, 1998515, -1993829, 2314299, 9151846, 7467096, -1329428, -5139734, -1042860, 397931, -6134731, -10992793, -5085963, 5488923, 8596544, 2671730, -3928807, -5665332, -4400597, -3154823, -1404820, 2555910, 7385405, 8473052, 2904892, -5434690, -8745585, -5044916, -1010326, -2075573, -4954252, -4838649, -3668119, -3922087, -1001992, 7864039, 13326540, 5910062, -6134163, -6788866, 2087171, 3121106, -7645707, -14093507, -7748338, -2173410, -9227134, -18765215, -16276319]
9513a6276319R860681L764827j717339K711383O412383J367342k312572L616204
9505G426590Q696083J770111q897244q886985r9870M693248J834661k054545l235667
9496A246382l357689k493617P23061M483303N993664N299939K702187k593226
9488A2004004p582156o162465Q88666M343660n6455m798022k822792K065662L503077
9479A383179K594708K417170J060979k066846j651346L371130L971404n005698
9471F074680j3729936j1174459j991061K289469J402100K454648M427715J302986
9463h943858l784382k561280K944818L657679J64816J147757O168066N896239
9455D689855J91080m26624N826447P468972k09397o285871k909949J571379k042021
$$ y = [-16276319, -6415638, -2650811, -4368150, -1656767, 4755616, 6122958, 3810386, 7426590, 16122673, 17892784, 8995540, 108555, 8685, 4701933, 6536594, 4482049, 1246382, -2111307, -4604924, -3881863, 601440, 6595104, 11895043, 14597230, 12004004, 4421848, -1740617, -851951, 3491709, 3435254, -1362768, -4185560, -2119898, 1383179, 3977887, 6395057, 7456036, 5389190, 3737844, 7108974, 11080378, 6074680, -7655256, -18829715, -20820776, -18531307, -17129207, -14674559, -10246844, -8943858, -12728240, -15289520, -12344702, -8687023, -8522207, -7374450, -1206384, 4689855, 4880935, 4454311, 10280758, 17749730, 17540333, 11254462, 8344513, 9915892, 7873871]
9446G873871p824411n697516J359361L435341Q6616j440845L77812J029228q8306
9437h88849K46434J198492l90222k121912P69137N467611M263310k816598p271521
9428a544118n093134j589695j111902n73169L060093O363999N439339K331431
9420G282844M36406j329054m412494n451910j585079K796241J831779j741094
9412b172361m60094M699048M238095m519286j0849710n066084O969059J1473964
9404D312631N387710j100838k36025L431941J891569l915820o085594j562648
9396B122926L622455K721789k771279n224625j000837M602169M445534m71858
9388H046274k440329J223028L483991j651009q669187p625506Q96144O158583
$$ y = [7873871, 49460, -5648056, -4288695, -853354, -766738, -2207583, -1829771, -800543, -888849, -642415, 556077, 165855, -1956057, -1186920, 4280691, 8544001, 5727403, -1544118, -6637252, -8226947, -9338849, -9912018, -6851925, -487926, 4951413, 7282844, 7719250, 6390196, 1977702, -3474208, -5059287, -2263046, -431267, -2172361, -2632455, 2066593, 6304688, 1785402, -9064308, -14130392, -7161333, 4312631, 9700341, 8599503, 8363478, 11795419, 13686988, 9771168, 3685574, 2122926, 5745381, 8467170, 5695891, 471266, -529571, 4072598, 8518132, 8046274, 5605945, 6828973, 10312964, 8661955, -7232, -7632738, -6736594, -578011]
9380e78011K744385k857022l691119k180100l419857n371870k899058K497334
9372a5755318M512936J898389l12343P53661K006806J18532l376354m461915j648386
9363a6263992K645138M771592L935789L510734O256628Q452775L613786o191945
9355A0730505r378272m76936R435889O502409n700781j0461200j734080P889819
9347F807353O116474k660611o428619l210569q79650l110358m401742M20115P989872
9338F42265J0331803M474201l929190o574313j749288L519251K093511l901788
9330D906452o031134j536325K967919J677695k133127k335759J73097J40913k081464
9321d251733q81019L986320M738433k828449j0886518q790431J985981Q975368
$$ y = [-578011, 2166374, -690648, -4381767, -6561867, -9981724, -15353594, -18252652, -15755318, -11242382, -9343993, -9656336, -8902675, -6895869, -6777337, -10153691, -14615606, -16263992, -13618854, -8847262, -4911473, -1400739, 4855889, 13308664, 16922450, 10730505, 1352233, 875297, 10311186, 16813595, 11112814, 651614, -1082466, 6807353, 12923827, 10263216, 3834597, 624028, -255622, -3365980, -7767722, -7347607, 642265, 10974068, 15448269, 11519079, 4944766, 3195478, 6714729, 8808240, 4906452, -1124682, -2661007, 306912, 1984607, -148520, -2484279, -2311182, -2170269, -4251733, -5132752, -1146432, 3592001, 763552, -10122966, -18913397, -16927416, -7952048]
9313g952048N128023k437969l333129J783810L816219m19881l959289q17885N389096
9304b803053P501542M501656N87826j839589l177994k976321n49602J902640J478372
9295D625477q13707j640204m40264J109052L013134N484890N428175M39678n054546
9286A2151685m666943l55607O8131m108648n157978l26206L213754P41890k379452
9277h19374j316170o58369m659802o943478l84058Q803375Q649038j86192n468231
9268b983261j831484L277328L079139K38341o26396n2372L53912J484691K480983
9259E420881k08628n708697p131985j287549N893129P825321N485704K855403
9251A3143579J49599l077645l712136l30255K048454p51196m197128j897542L352638
$$ y = [-7952048, -2824025, -5261994, -8595123, -6811313, -2995094, -3414975, -7374264, -8192149, -2803053, 4698489, 9200145, 9787971, 7948382, 4770388, 1794067, 1244465, 3147105, 4625477, 3811770, 2171566, 1731302, 2840354, 5853488, 11338378, 16766553, 17206231, 12151685, 7484742, 7129135, 7197266, 3088618, -2069360, -2395566, 818188, 1560078, -819374, -2135544, -2793913, -7453715, -14397193, -14781251, -5977876, 2671162, 2484970, -2983261, -4814745, -1537417, 1541722, 1780063, 1153667, 1101295, 1455207, 2939898, 5420881, 5212253, -496444, -7628429, -8915978, -3022849, 4802472, 10288176, 13143579, 13293178, 10215533, 6503397, 6173142, 8221596, 7470400, 3273272, 1375730, 4728368]
9242D728368L893122P1100o87295L024708M247849k70294m984935n406091m450523
9233A66009m960394l913696O43255M023682K436647j24134Q02094J934063p65099
9224B42427k511676K951858J0347718Q678599j361884p679696n153526j543110
9216C970710k264241j904162L160505N545052o81537p874777n994693J282736
9208d760407L329518r187n47225K090563K98701o071241p847929k151927K903146
9199a2765988K676976K850472O644225P274693P27565m712297j192625N288438
9191F791459M718112q86442k657478m31581p83212l265198j613373K868461K259774
9182G000522l096904l646274K734855N683488r00254q361334o933865n30083J155777
$$ y = [4728368, 8621490, 8692590, 8005295, 11030003, 15277852, 15007558, 10022623, 4616532, 166009, -4794385, -8708081, -8064826, -4041144, -1604497, -1728631, -926537, 1007526, 242427, -2269249, 682609, 11030327, 19708926, 18347042, 10667346, 5513820, 3970710, 1706469, -197693, 2962812, 8507864, 7826327, -48450, -6043143, -4760407, -1430889, -1440076, -1987301, 103262, 401963, -5669278, -13517207, -15669134, -12765988, -10089012, -7238540, -594315, 6680378, 7407943, 2695646, 1503021, 6791459, 11509571, 10623129, 7965651, 7534070, 6750858, 3485660, 1872287, 4740748, 7000522, 3903618, 257344, 2992199, 8675687, 7775433, -585901, -7519766, -8049849, -6894072]
9173f894072j636200j139071L725131N809856J748934l213447l789061j399262
9165f787192o6350m08358m67378N62564J934057K929274L040012J728278n36433
9156A928474j758351m13556K054688K126337j475666n323009n010621j061673
9148h933377J642712R29244P4339J406427J726792j445409l349664J363185Q258567
9139A672816Q104663J433656j711682J981053L705779k288434q398728n884148
9131a385025J025972K462639j702309l732891j291898J142914J768791K669270
9123I57463K704500j311635o340067n202073J906337O403977L624424j610661
9115A132265l715010l011501j152970K544451O619216O191524M90191m099240
$$ y = [-6894072, -8530272, -9669343, -5944212, -134356, 1614578, -1598869, -5387930, -6787192, -6853542, -7261900, -7729278, -7166714, -5232657, -2303383, 736629, 2464907, 1928474, 170123, -243433, 1811255, 3937592, 2461926, -2861083, -7871704, -8933377, -7290665, -6361421, -6287082, -4880655, -3153863, -4599272, -7948936, -6585751, 1672816, 9777479, 11211135, 9499453, 11480506, 15186285, 12897851, 4499123, -1385025, -359053, 2103586, 401277, -3331614, -4623512, -3480598, -1711807, 957463, 3661963, 2350328, -3989739, -9191812, -7285475, -881498, 2742926, 1132265, -2582745, -5594246, -6747216, -4202765, 2416451, 8607975, 9098166, 4998926]
9107D998926k809165P54375P60606k695456n739175o526020m662586Q87645Q619445
9098f411405J2660995Q789574K7529o956898q459620m715133J667128N840904
9090B443074M102514k00312K59646N067083N009097k712938p384809r62824P323002
9081A2943533M148962o462556q925732l23785O194289K866913k489769j585376
9073F366479K168981K695522J406622J113733q94603n924338q081156l580260
9065d729020J224891l29148l848495j677728L775760N027396L060394M106381
9057F610431O193466K110957n265036m909420L227423N694392k668881q713295
9049B280037j753755Q296969O352726l692674n792313K316838O777896R00284
$$ y = [4998926, 2189761, 2944136, 3704742, 1009286, -4729889, -11255909, -15918495, -15030850, -6411405, 6249590, 15039164, 15066693, 8109795, -349825, -5064958, -3397830, 2443074, 6545588, 6345276, 6604922, 11672005, 16681102, 13968164, 6583355, 5620531, 12943533, 17092495, 10629939, 1704207, 1380422, 7574711, 10441624, 7951855, 6366479, 8535460, 11230982, 12637604, 13751337, 12856734, 6932396, -1148760, -4729020, -3504129, -3833277, -7681772, -9359500, -5583740, -556344, 2504050, 6610431, 12803897, 14914854, 9649818, 4740398, 7967821, 13662213, 10993332, 2280037, 526282, 8823251, 15175977, 11483303, 5690990, 8007828, 14785724, 15686008]
9041A5686008n523563m141383p14583k513222n099811j584182L870708K970005
9033B949977k136372k512315K715868O100462M815813L220712K647969p77107
9025A7025007o402329p177470j196037L476350L87428n744684o320507m72972
9017f425214N506748O299206J220885o268713r481475l424707P743150J2748152
9009G918032O251806m627060r996365q047837k710983L178401P297899O421844
9001E685737J519267r46028J595349K899785j740311p058380o959913m737121
8993i741615n203693m255320K514715P952585L730877l339973j215943N551602
8985d006765K307204r006605j0326278K607686J1873091N956426l376260l353662
$$ y = [15686008, 10162445, 6021062, 5306479, 2793257, -2306554, -3890736, -20028, 2949977, 813605, -1698710, 1017158, 7117620, 11933433, 15154145, 17802114, 17025007, 10622678, 3445208, 2249171, 5725521, 6112949, 368265, -5952242, -6425214, -918466, 5380740, 6601625, 332912, -9148563, -12573270, -4830120, 7918032, 14169838, 9542778, -453587, -8501424, -11212407, -8034006, -736107, 5685737, 7205004, 6258976, 7854325, 10754110, 9013799, 1955419, -5004494, -9741615, -14945308, -19200628, -16685913, -8733328, -5002451, -8342424, -9558367, -4006765, -1699561, -10706166, -21032444, -18424758, -6551667, -595241, -3971501, -7325163]
8977g325163l69577l519105m965337M718388J4596821Q079750q304289j2808260
8969i896772j848914O210413J621608l467927J699966Q414657M387095n675721
8961A444405q144875j293502M154179J796943l605352n694409m557559l164211
8953a9064381j475456K184639O295201O575975J937828k688306k065051K062867
8945f236684L176660m29099l082427o74724K958536K484902n80298j321895J51692
8936c553337k140j644813q83745K412649L604783P11275k377288j772865J246147
8927b259334K743327J204583j294244j715072M58129K030854o2097l346941j844606
8918d085401M710405Q501839M322459k177470k624480J707744K823194j217425
$$ y = [-7325163, -7694740, -11213845, -16179182, -11460794, 3136027, 11215777, 2911488, -9896772, -11745686, -5535273, -3913665, -7381592, -5681626, 2733031, 7120126, 1444405, -6700470, -7993972, -3839793, -2042850, -5648202, -11342611, -15900170, -19064381, -20539837, -18355198, -12059997, -5484022, -3546194, -6234500, -8299551, -6236684, -3060024, -3489123, -6571550, -7246274, -4287738, -1802836, -2383134, -3705029, -3553337, -3555477, -5200290, -6084035, -3671386, -66603, 644672, -1732616, -3505481, -2259334, 483993, 1688576, 394332, -1320740, -862611, 1168243, 1106146, -2240795, -4085401, 625004, 9126843, 13449302, 11271832, 8647352, 10355096, 13178290, 11960865]
8910A1960865m362494k908854l60031q04335l242928m139477j731984K813884
8902b775354N750345L416937k425261m645119j24872M732351L353467p05989m45094
8893F131411J984676n20025o030196n715258M06061K416678k636428n295480J30064
8884i128497N464480K175724m224621k627920O361792J0873655L924538p693578
8876E125573j1442962k952565Q821019J0722568N96974r429438q275530j48744
8868f983105L430932J384426J916593N827999M780690k210320m978985J73815
8860C342045K908366l444169r335871m376849N372609P290612J283030l213848
8852a74075l258580l142944l196071J50418N039177N517022J520395j166592k88011
$$ y = [11960865, 7598371, 4689517, 4329486, 3525151, 282223, -3857254, -5589238, -2775354, 2974991, 6391928, 3966667, -678452, -803324, 3929027, 7282494, 6576505, 6131411, 8116087, 7596062, 1565866, -4149392, -3743331, -1326653, -3963081, -9258561, -9128497, -3664017, -1488293, -5712914, -8340834, -1979042, 8894613, 12819151, 5125573, -6317389, -9269954, -448935, 10273633, 10870607, 1441169, -6834361, -6983105, -3552173, -2167747, -251154, 5576845, 10357535, 8147215, 3168230, 3342045, 6250411, 2806242, -6529629, -10906478, -5533869, 1756743, 3039773, -174075, -3432655, -6575599, -9771670, -9621252, -4582075, 934947, 2455342, 1288750, 1000739]
8843A000739R44802L06420j410407l206344l386897N64423O353469O229358j418463
8834E977100o247819o11080O766581L435009o221075p452918J113224O202951
8826B961973K157307j961041l86713K87423m037458n825680j09450M924757J790220
8817a98662k681186O28582O287046L143415n771211o975119J754818Q024222M959346
8808I171251J100003M648017R357636N286810m118515o940124j490654J569992
8800A8584416l234588p512764k887656N180618N560814k017058p936000p573398
8792a835616n455547m785019k636186K230576N597769N256741M379546L939015
8784F691279J69036o009362o369628J280856O503747J827900l910085N69605R111819
$$ y = [1000739, 1945541, 2251961, 841554, -2364790, -5751687, -5187264, 1166205, 7395563, 5977100, -270719, -881799, 5884782, 9319791, 3098716, -4354202, -3240978, 2961973, 5119280, 3158239, 2771526, 3058949, -978509, -6804189, -6913639, -1988882, -198662, -2879848, -2251266, 4035780, 7179195, 1407984, -5567135, -3812317, 4211905, 9171251, 10271254, 14919271, 24276907, 29563717, 25445202, 18505078, 17014424, 18584416, 15349828, 7837064, 4949408, 10130026, 15690840, 13673782, 5737782, -1835616, -7291163, -12076182, -14712368, -12481792, -6884023, -1627282, 2752264, 6691279, 6860315, 850953, -5518675, -4237819, 2265928, 4093828, 183743, 753348, 9865167]
8775I865167O716572n768395j1538219l126767P171709O486268j633503o005420
8767B167412l924747p58278J59867j73055p07151j173794m97265J938153M749874
8758A781016O071871M978065J136486m172824o855723l618792K897597O362671
8750H580367M425048N01281j969266k963926l435106l392822k864799j877347
8742b996570m4210J502484K08350k848758k067688L878197P360386K587525m081055
8733C498661l349404K172353L018752q86705j448066K089833K276324j958902
8725E412846l493731j062795j288370m343823k053211N736052P691827j34306
8717F464489o407606l169132J502003j000130m619610n45482O537490O709270
$$ y = [9865167, 16581739, 10813344, -724875, -3851642, 3320067, 9806335, 8172832, 2167412, -1757335, -2515613, -2355746, -2528801, -3235952, -4409746, -4907011, -2968858, 1781016, 7852887, 12830952, 13967438, 9794614, 2938891, -679901, 2217696, 8580367, 13005415, 13506696, 11537430, 8573504, 5138398, 1745576, -1119223, -2996570, -3040780, -1538296, -1329946, -4178704, -6246392, -2368195, 4992191, 7579716, 3498661, 149257, 2321610, 5340362, 4453657, 3005591, 5095424, 7371748, 5412846, 1919115, 856320, -432050, -4775873, -6829084, -1093032, 6598795, 6464489, 56883, -3112249, -1610246, -2610376, -7229986, -7775468, -1237978, 5471292]
8709E471292J080322k245656j853135j684416k034990j892463m055083q322860
8701a5536989o649550M446418J3879823J0195148p29555m853548j165403J05859
8693c07797l647061m964447j183121K023660K225265L174189N228177L786140
8685F335005j219642l784407j351963J966096K361842j94305m597743q223403
8677h708520o309456J213479O001746K493076k168035O26211N566714K286514
8669A001729n327711m680340L026260L732753m793006p577336K865960J3177012
8661A425321R280561l329351r455407m775760K838161N788286K782804k718183
8653A836432m977436j421795K308554p41925o367512l518752P165733J1504223
$$ y = [5471292, 6551614, 4305958, 2452823, 768407, -1266583, -3159046, -7214129, -15536989, -22186539, -17740121, -3860298, 6334850, 5605295, 751747, -413656, -307797, -3954858, -8919305, -10102426, -8078766, -5853501, -2679312, 2548865, 6335005, 5115363, 1330956, -21007, 1945089, 4306931, 4112626, -485117, -8708520, -15017976, -13804497, -7802751, -5309675, -7477710, -6851499, -1284785, 1001729, -4325982, -9006322, -5980062, -2247309, -7040315, -14617651, -11751691, 1425321, 10705882, 7376531, -2078876, -6854636, -4016475, 1771811, 4554615, 1836432, -3141004, -4562799, -2254245, -2996170, -9363682, -12882434, -5716701, 5787522]
8645E787522L148379n970973m267031K228289J529174m887925o385005p52007
8637i569577M406981M878927M135702N226971O239210M195964j230894p496761
8629A0786523j0271039o995783q79308K319821K216102L017662M467487J647068
8621F308533m397563n431247Q02358N866028L915459j31272j163485j891844l521199
8612C55768r9555Q646563J0486402j422155j4105224j2037832k68580M826686
8604c617927R28598p52090L118627M647970J447233l1972J266319r20857n699459
8595C86442l804541N162610Q684922O77737p791355n141252L541410N219327k037379
8586D897921p971968n061892K744654O001148P88561o748895o896009J795796
$$ y = [5787522, 8935901, 2964928, -1302103, 926186, 2455360, -2432565, -8817570, -9569577, -5162596, -283669, 3852033, 9079004, 15318214, 19514178, 18283284, 10786523, 515484, -6480299, -7359607, -5039786, -2823684, 193978, 4661465, 6308533, 1910970, -3520277, -2717919, 3148109, 7063568, 6932296, 5768811, 3876967, 355768, 256213, 8902776, 19389178, 17967023, 3861799, -8176033, -8444613, -3617927, -2689329, -3441419, -322792, 4325178, 5772411, 5740439, 7006758, 6085901, 386442, -3418099, 1744511, 10429433, 11107170, 3315815, -1825437, 1715973, 6935300, 4897921, -3074047, -8135939, -5391285, 609863, 1398424, -5350471, -12246480, -10450684]
8578a0450684R609046P668117n55234m975331k709872R11951K384853K616760
8570D499606J118984l315910o678240l586251K870787M168576n30437l571715
8562e024600j478528J467449L017625N527281P070907J563546q780014j2284259
8554h920593m008475O725132R846882O223602J268842l253983n741521k835673
8546f95787L085332L798936j686795l795922J926201O763517L811196o66768k51077
8537A2288833r31509q496007j3976959o612681O387347R062026Q69016m325490
8529e735424q16399L316643K983698L031241N792594N392424p50346n713947l771902
8520C728582J181028K845675J245635k05367o16312n88003J65488R83853q0737
$$ y = [-10450684, -841638, 6826479, 6271245, 1295914, -1413958, -502007, 1882846, 4499606, 5618590, 2302680, -4375560, -7961811, -5091024, -922448, -1452885, -5024600, -6503128, -5035679, -2018054, 3509227, 10580134, 12143680, 3363666, -8920593, -12929068, -6203936, 3642946, 9866548, 11135390, 7881407, 2139886, -695787, 2389545, 6188481, 4501686, 705764, 2631965, 9395482, 13206678, 12539910, 12288833, 11357324, 2861317, -11115642, -17728323, -11340976, -2278950, -1409934, -5735424, -6551823, -3235180, -251482, 2779759, 8572353, 13964777, 13214431, 7500484, 3728582, 4909610, 7755285, 9000920, 8795553, 8179241, 7591238, 7756726, 8740579, 8659842]
8511H659842k434915k498277P97511L382176J161700m280797o780393k033504
8503d026657O827577J0627267L980068o374896q378456q93239M449460Q47432
8495G058556l826270j472442K091238j715035p467205m167324N142563P743618
8487C387699K511308O84974N356764O355237j370840q999408q464153l344461
8479c882880R5851J636022J920675r11193m626081l039956K883541M405529m62622
8470a981114k992189J226168N286108M351736L385279N050582L163655l821906
8462A3668319o378352n50226K774219l215259p119971J330337J1002096O406322
8454A7917485n547196o385661L264446N785644l309060r183804l337881M337353
$$ y = [8659842, 6224927, 3726650, 4524161, 7906337, 9068037, 4787240, -1993153, -4026657, 2800920, 13428187, 17408255, 11033359, 2654903, 1761664, 6211124, 7058556, 3232286, 1759844, 3851082, 2136047, -5331158, -9498482, -4355919, 3387699, 5899007, 6583981, 11940745, 18295982, 16925142, 7925734, -538419, -3882880, -3787029, -2151007, -230332, -1141525, -5767606, -8807562, -5924021, -1518492, -1981114, -4973303, -3747135, 1538973, 5890709, 9275988, 14326570, 17490225, 13668319, 7289967, 6739741, 9513960, 6298701, -821270, 509067, 11511163, 17917485, 12370289, 5984628, 9249074, 15034718, 11725658, 2541854, -796027, 3541326]
8446C541326M050176n9684r33944K14820J79972J73901O57136o44729k106546
8437E072428M67964L721187l27094q644662q088248L361547J0538983L648196
8429I750301o774940p230628j216999K10688k368319q09527M337275N657514K888296
8420D443661K113335L333939J047396l807758m147825N29111K455651j526587
8412D440923m971844k679371J593569K052427q24446k754921j836582Q74665L464430
8403f41150L764350J019009j970391j816852k9114j139231m871217n605250j288334
8394a2578180K755864J901179q89924j65215L906813O645271N205642K68624n713200
8385A336874q550373m160129N180494R903185M156183n067147o566561o19141
$$ y = [3541326, 7591502, 7531818, 6597874, 6812694, 6992666, 7166567, 7823703, 7178974, 5072428, 5540392, 9261579, 8934485, 289823, -7798425, -4436878, 6102105, 9750301, 2975361, -4255267, -5472266, -5261578, -7629897, -8439424, -4102149, 1555365, 4443661, 6556996, 9890935, 10938331, 7130573, 2982748, 3511859, 5967510, 4440923, -530921, -3210292, -1616723, 435704, -388742, -3143663, -4980245, -4105580, -641150, 3123200, 4142209, 2171818, 354966, 325852, -813379, -5684596, -11289846, -12578180, -9822316, -7921137, -8811061, -8976276, -5069463, 1575808, 6781450, 7050074, 1336874, -7213499, -11373628, -6193134, 3710051, 7866234, 2799087, -3767474, -4386615]
8377d386615K358258j505071m141511J42399M795486K143215l367305k284490
8369f245634M105523N507397j094521o786689m159797K746979N433274J895031
8361A401563l383181o294717o187058m412972k457745m04031L095596P561698
8353a1080847Q868619M522465q86020j172649J664348M99385m300887m421284
8345f306870K357454P521320N422850J794381K460379K830792k835297r390081
8337C854928q088974o50091L839906K336847q67278k862014l472981j273973L229637
8328c953993M103826j586536o166383j914833N451484N241770p13569k345760
8320a883994L65642j225313o230064m327815M462256P246020k66635o157623k482816
$$ y = [-4386615, -2028357, -3533428, -7674939, -7532540, -2737054, -593839, -3961144, -6245634, -2140111, 3367286, 2272765, -4513924, -8673721, -5926742, -493468, 1401563, -1981618, -8276335, -14463393, -18876365, -21334110, -21738141, -18642545, -11080847, -2212228, 2310237, 1424217, 251568, 1915916, 2415301, -1885586, -6306870, -3949416, 3571904, 8994754, 10789135, 13249514, 16080306, 13245009, 3854928, -4234046, -4884137, -1044231, 1292616, 425338, -2436676, -5909657, -7183630, -3953993, 149833, -1436703, -7603086, -9517919, -4066435, 1175335, 461766, -1883994, -1518352, -2743665, -8973729, -13301544, -8839288, -1593268, -1859903, -8017526, -10500342]
8311a0500342K570458J001932j112639L488952Q936738O467483q81993n083028
8303D887561o120279p345545n714936K076679J0084528J0416289M798088k70383
8295A2812002l859783p101721o293211L07163N330653K675834j222859K215493
8287D863571Q265587O398100j968413o621789n575111n219536o211589l235798
8279i304978K372442L417574J45678j02391L317377L666992M48383O42758M831812
8270I435647N073251p19996m638817k336574Q54746P67711Q2651j40105k986891
8261E391623o130735k083508P322332R574530R25486n733547q64065O136298K231695
8252A6770109q611649j2708564p364527j491036j323L18934J551634J871178J367955
$$ y = [-10500342, -7929884, -6927952, -8040591, -4551639, 4385099, 10852582, 9970589, 4887561, -1232718, -8578263, -14293199, -12216520, -2131992, 8284297, 13082385, 12812002, 8952219, 1850498, -4442713, -4135550, 1195103, 3870937, 2648078, 4863571, 13129158, 19527258, 17558845, 10937056, 5361945, 142409, -6069180, -9304978, -6932536, -3514962, -3369284, -3471675, -154298, 3512694, 3961077, 4603835, 9435647, 14508898, 13788902, 9150085, 6813511, 7668257, 8435968, 8518619, 8378514, 5391623, -739112, -2822620, 4499712, 14074242, 14999728, 9266181, 8402116, 14538414, 16770109, 8158460, -4550104, -11914631, -13405667, -13406990, -13088056, -11536422, -9665244, -8297289]
8243h297289K161849L307251K603198K040033M465674O607666L105346l566597
8235A2427131n354240j115361J210647k938470p321949m201697L780823O614652
8227C101536N15661o427031m326579N192653R981507K871902q134526r897313
8219g122190j694901M457713J284084m099739j792448O311715R786506M033486
8211A1164226m711814p900671l936390J498353K475732l56266r38519K993667
8203B88318M956552j244795j0239843j0690628j510554O639566P063839M151173
8195e86372K320854p32112m783247k969781N257371Q371615J63704p546711k304043
8186b808722P908906O505659m945666r265276q65753P142984M862383j463790
$$ y = [-8297289, -6135440, -2828189, -224991, 1815042, 6280716, 12888382, 15993728, 12427131, 7072891, 5957530, 7168177, 4229707, -3092242, -7293939, -3513116, 3101536, 3617197, -2809834, -7136413, -1943760, 8037747, 10909649, 2775123, -7122190, -8817091, -4359378, -3075294, -7175033, -8967481, -2655766, 7130740, 11164226, 6452412, -1448259, -5384649, -3886296, -1410564, -1766830, -2705349, 288318, 5244870, 4000075, -6239768, -16930396, -18440950, -11801384, -4737545, -586372, 1734482, 1002370, -3780877, -6750658, -1493287, 6878328, 7042032, -504679, -2808722, 5100184, 11605843, 6660177, -2605099, -3470852, 3672132, 8534515, 7070725]
8178G070725l213431k316993l621750n062440k791617J571715M796662O774358
8170C207229P043722L248108k989985n538731k920955q37387j872043j022679
8162a682721L638521M990662j173054o537226k123394O498111O667077k318354
8154G959622q713943n976240l83092O89467r17292L72481M257088N515994J906611
8145D710696k791208l282198J301593O168078N892456R19527k588156o26145L274956
8136A2979599L248644l72011j848704J128144L889486J604685l674769n610731
8128A1344343j937588K578568K164177k776244o345622m646707k51332J829597
8120A959192L32601k253831l788945l422795j98281N021900P280095K434659n499371
$$ y = [7070725, 3857294, 1540301, -2081449, -7143889, -9935506, -8363791, -3567129, 3207229, 10250951, 13499059, 10509074, 4970343, 2049388, 1212001, -660042, -1682721, 1955800, 6946462, 5773408, -763818, -2887212, 3610899, 10277976, 7959622, -754321, -6730561, -7113653, -6424186, -7341478, -6968997, -2711909, 2804085, 4710696, 1919488, -1362710, -61117, 6106961, 11999417, 12918944, 10330788, 9704643, 12979599, 16228243, 15856232, 14007528, 15135672, 19025158, 20629843, 16955074, 11344343, 9406755, 11985323, 14149500, 11373256, 5027634, 380927, 129595, 1959192, 2291793, 37962, -3750983, -7173778, -7372059, -2350159, 4929936, 7364595, 1865224]
8111A865224p533454j401210N670596P698263O911312O567139L771543m199307
8103A9350106j1467711r459474N83493Q071056O075644j481885o039422l604684
8095B027123K650105N994018K468694m464779p268452m102566j510338l954100
8087h160295n736184J84341R354364J0613170K258709n760819o434111l542727
8079g223552k596841k323767M32639L821166M138910J700330n80694j305370m40727
8070d377906J667621L013968J255619k133478l155347j620667q08616j95787L859673
8061b494920Q365302M475975p123618j2146040k513139R241754P108639m254415
8053F59538p097768J797841P771056L114892j767456K131931O749938J178878
$$ y = [1865224, -5668230, -7069440, -1398844, 6299419, 13210731, 19777870, 23549413, 19350106, 7882395, -1577079, -993586, 7077470, 13153114, 11671229, 5631807, 2027123, 4677228, 10671246, 13139940, 8675161, 1406709, -2695857, -4206195, -8160295, -13896479, -13712138, -4357774, 6255396, 8514105, 2753286, -3680825, -7223552, -9820393, -12144160, -11711521, -7890355, -3751445, -2051115, -2631809, -3937179, -4377906, -2710285, 303683, 1559302, -574176, -3729523, -5350190, -6158806, -6354593, -2494920, 5870382, 10346357, 3222739, -8923301, -11436440, -2194686, 4913953, 659538, -6438230, -4640389, 3130667, 6245559, 4478103, 6610034, 13359972, 14538850]
8045A4538850r150079j0321399j320828N223011K325617k813700j760427K916710
8037c62245L477270p16546l326167j556661j26417k876325n316546o80885Q337614
8028c146908J0764159K376336p026146o704342Q9044K291905j450405k048993
8020d855350L566281O965583K698861k685955k415140n76468k827988m341431
8012d471607J836777J0147490R058881l16600n330034j712981R58725l072795
8004G097856n700441L67436P806184N765769k502872m671190J498695N549325
7996A5210762R36370o020970o606648j177109L805567M280553J05436o852969
7988C680992j1752429q530529K000400R548235O093028k506008l920890L210245
$$ y = [14538850, 5388771, -4932628, -6253456, -1030445, 1295172, -1518528, -3278955, -362245, 3115025, 2398479, -927688, -2484349, -2610766, -5487091, -10803637, -11484522, -3146908, 7617251, 9993587, 2967441, -3736901, -3647857, -1355952, -2806357, -4855350, -1289069, 5676514, 8375375, 5689420, 3274280, 2697812, -130176, -4471607, -2634830, 7512660, 16571541, 16254941, 10924907, 9211926, 10170651, 7097856, 1397415, 1764851, 9571035, 15336804, 12833932, 8162742, 9661437, 15210762, 16147132, 10126162, 3519514, 2342405, 6147972, 10428525, 10533961, 3680992, -8071437, -16601966, -14601566, -5053331, 1039697, -1466311, -5387201, -2176956]
7980b176956Q004205M278408q17778O64581M959208L834960j935844n224298m880850
7971F705636n856665q362400o570977O97417O570298O136637K808775J517849
7963C646570J730683P60595j277151l254269n064098n067206o48862N866166P663614
$$ y = [-2176956, 5827249, 10105657, 9287879, 9952460, 14911668, 18746628, 16810784, 11586486, 6705636, 848971, -7513429, -14084406, -13386989, -6816691, -680054, 2128721, 3646570, 5377253, 6137848, 4860697, 1606428, -3457670, -8524876, -9173738, -3307572, 4356042]
$$ [...]
##END NTUPLES=NMR SPECTRUM
##END=
