##TITLE=31Pdec_LR-759-K3
 CD3CN+CCl4, 64 sc
 23.3.2023
##JCAMPDX= 6.0         $$ Bruker NMR JCAMP-DX V2.0
##DATA TYPE= NMR SPECTRUM
##DATA CLASS= NTUPLES
##ORIGIN= UXNMR, Bruker Analytische Messtechnik GmbH
##OWNER= root
$$ XWIN-NMR		Version 3.5
$$ Wed Mar 22 13:56:34 2023 Russian Standard Time (UT+4h)  she@DPX200
##.OBSERVE FREQUENCY= 81.013821
##.OBSERVE NUCLEUS= ^31P
##.ACQUISITION MODE= SIMULTANEOUS
##.ACQUISITION SCHEME= undefined
##.AVERAGES= 64
##.DIGITISER RES= 16
##SPECTROMETER/DATA SYSTEM= spect
##.PULSE SEQUENCE= zgpg30
##.SOLVENT NAME= CDCl3
##.SHIFT REFERENCE= (INTERNAL, CDCl3, 0, 248.564)
##AUDIT TRAIL= $$ (NUMBER, WHEN, WHO, WHERE, WHAT)
$$ ##TITLE= Audit trail, XWIN-NMR		Version 3.5
$$ ##JCAMPDX= 5.01
$$ ##ORIGIN= Bruker BioSpin GmbH
$$ ##OWNER= she
$$ F:/spectra/data/she/nmr/P31/1/pdata/1/auditp.txt
$$ ##AUDIT TRAIL=  $$ (NUMBER, WHEN, WHO, WHERE, WHAT)
(   1,<2023-03-22 13:55:40.96 +0400>,<she>,<DPX200>,
      <continue with go, POWCHK disabled, PULCHK disabled
       configuration hash MD5:
       00 E9 B6 7A A2 85 ED C7 34 08 36 98 17 FE 4E 26
       data hash MD5: 32K
       93 7B DE 91 D5 53 1E 32 8B 46 53 BD 45 9E 4E 79>)
(   2,<2023-03-22 13:55:44.90 +0400>,<she>,<DPX200>,
      <Start of raw data processing
       efp BC_mod = 2 LB = 1 FT_mod = 6 PKNL = 1 PHC0 = -9004.733 PHC1 = -3941.325 SI = 64K 
       data hash MD5: 64K
       92 D3 AA 58 24 B5 71 93 CE 00 A6 C0 8B C0 5F 91>)
(   3,<2023-03-22 13:56:00.10 +0400>,<she>,<DPX200>,
      <pk PHC0 = 83.86167 PHC1 = 0 
       data hash MD5: 64K
       98 B6 E7 E1 6E 0C BF AC 24 01 74 59 4E CD 40 64>)
(   4,<2023-03-22 13:56:08.00 +0400>,<she>,<DPX200>,
      <abs ABSG = 5 
       data hash MD5: 64K
       7F 9D 67 91 0E 16 33 9E 89 20 DB 59 E9 33 95 45>)
$$ ##END=
$$ 
$$ hash MD5
$$ F2 79 3B 35 D0 E6 CB 4B 16 FD D8 32 E2 04 FD 96
##$RELAX= 
##$RELAX= 
##$RELAX= 
##$RELAX= 
##$RELAX= 
##$RELAX= 
##$RELAX= 
##$RELAX= 
##$RELAX= 
$$ Bruker specific parameters
$$ --------------------------
##$DU= <F:/spectra>
##$EXPNO= 1
##$NAME= <P31>
##$PROCNO= 1
##$TYPE= <nmr>
##$USER= <she>
##$AMP= (0..31)
100 100 100 100 100 100 100 100 100 100 100 100 100 100 100 100 100 100 
100 100 100 100 100 100 100 100 100 100 100 100 100 100 
##$AQSEQ= 0
##$AQ_mod= 1
##$AUNM= <au_zg>
##$AUTOPOS= <>
##$BF1= 81.014009
##$BF2= 200.13
##$BF3= 200.13
##$BF4= 200.13
##$BF5= 200.13
##$BF6= 200.13
##$BF7= 200.13
##$BF8= 200.13
##$BYTORDA= 1
##$CFDGTYP= 0
##$CFRGTYP= 5
##$CHEMSTR= <none>
##$CNST= (0..31)
1 1 145 1 1 1 1 1 1 1 1 1 1 1 1 1 1 1 1 1 1 1 1 1 1 1 1 1 1 1 1 1 
##$CPDPRG= <waltz16>
##$CPDPRG1= <>
##$CPDPRG2= <waltz16>
##$CPDPRG3= <>
##$CPDPRG4= <mlev>
##$CPDPRG5= <mlev>
##$CPDPRG6= <mlev>
##$CPDPRG7= <mlev>
##$CPDPRG8= <mlev>
##$CPDPRGB= <>
##$CPDPRGT= <>
##$D= (0..31)
0 1 0 0 0 0 0 0 0 0 0 0.03 2e-05 3e-06 0 0 0 0 0 0 0 0 0 0 0 0 0 0 0 0 
0 0 
##$DATE= 1679478857
##$DBL= (0..7)
120 120 120 11 120 120 24 19 
##$DBP= (0..7)
150 150 150 150 150 150 150 150 
##$DBP07= 0
##$DBPNAM0= <>
##$DBPNAM1= <>
$$ [...]
##$SUBNAM3= <"">
##$SUBNAM4= <"">
##$SUBNAM5= <"">
##$SUBNAM6= <"">
##$SUBNAM7= <"">
##$SUBNAM8= <"">
##$SUBNAM9= <"">
##$SW= 501.771253377433
##$SWIBOX= (0..15)
0 1 3 0 0 0 0 0 0 0 0 0 0 0 0 0 
##$SW_h= 40650.406504065
##$TD= 32768
##$TD0= 1
##$TE= 0
##$TE2= 300
##$TE3= 300
##$TEG= 300
##$TL= (0..7)
0 120 53 12 22 120 120 120 
##$TP= (0..7)
150 150 150 150 150 150 150 150 
##$TP07= 0
##$TPNAME0= <>
##$TPNAME1= <>
##$TPNAME2= <>
##$TPNAME3= <>
##$TPNAME4= <>
##$TPNAME5= <>
##$TPNAME6= <>
##$TPNAME7= <>
##$TPOAL= (0..7)
0.5 0.5 0.5 0.5 0.5 0.5 0.5 0.5 
##$TPOFFS= (0..7)
0 0 0 0 0 0 0 0 
##$TUNHIN= 0
##$TUNHOUT= 0
##$TUNXOUT= 0
##$USERA1= <user>
##$USERA2= <user>
##$USERA3= <user>
##$USERA4= <user>
##$USERA5= <user>
##$V9= 5
##$VALIST= <valist>
##$VCLIST= <CCCCCCCCCCCCCCC>
##$VD= 0
##$VDLIST= <DDDDDDDDDDDDDDD>
##$VPLIST= <PPPPPPPPPPPPPPP>
##$VTLIST= <TTTTTTTTTTTTTTT>
##$WBST= 1024
##$WBSW= 4
##$XGAIN= (0..3)
0 0 0 0 
##$XL= 0
##$YL= 0
##$YMAX_a= 4662
##$YMIN_a= -1911
##$ZGOPTNS= <>
##$ZL1= 120
##$ZL2= 120
##$ZL3= 120
##$ZL4= 120
##$ABSF1= 248.5645
##$ABSF2= -253.2056
##$ABSG= 5
##$ABSL= 3
##$ALPHA= 0
##$AQORDER= 0
##$ASSFAC= 0
##$ASSFACI= 0
##$ASSFACX= 0
##$ASSWID= 0
##$AUNMP= <proc_1d>
##$AZFE= 0.1
##$AZFW= 0.5
##$BCFW= 0
##$BC_mod= 2
##$BYTORDP= 0
##$COROFFS= 0
##$CY= -3
##$DATMOD= 1
##$DC= 0
##$DFILT= <>
##$DTYPP= 0
##$F1P= 0
##$F2P= 0
##$FCOR= 1
##$FTSIZE= 65536
##$FT_mod= 6
##$GAMMA= 0
##$GB= 0
##$INTBC= 1
##$INTSCL= 6.047779e-11
##$ISEN= 30
##$LB= 1
##$LEV0= 0
##$LPBIN= 0
##$MAXI= 10000
##$MC2= 0
##$MEAN= 0
##$ME_mod= 0
##$MI= 50
##$NCOEF= 0
##$NC_proc= -9
##$NLEV= 6
##$NOISF1= 182.463
##$NOISF2= 159.3651
##$NSP= 0
##$NTH_PI= 0
##$NZP= 0
##$OFFSET= 248.5645
##$PC= 4
##$PHC0= -8920.872
##$PHC1= -3941.325
##$PH_mod= 1
##$PKNL= yes
##$PPARMOD= 0
##$PSCAL= 0
##$PSIGN= 0
##$REVERSE= no
##$SF= 81.0140089999694
##$SI= 65536
##$SIGF1= 159.3651
##$SIGF2= -187.1042
##$SINO= 113.3802
##$SIOLD= 16384
##$SREGLST= <1H.CDCl3>
##$SSB= 0
##$STSI= 65536
##$STSR= 0
##$SW_p= 40650.406504065
##$SYMM= 0
##$S_DEV= 0
##$TDeff= 32768
##$TDoff= 0
##$TI= <>
##$TILT= no
##$TM1= 0
##$TM2= 0
##$TOPLEV= 0
##$USERP1= <user>
##$USERP2= <user>
##$USERP3= <user>
##$USERP4= <user>
##$USERP5= <user>
##$WDW= 1
##$XDIM= 65536
##$YMAX_p= 212451646
##$YMIN_p= -461116170
$$ End of Bruker specific parameters
$$ ---------------------------------
##NTUPLES= NMR SPECTRUM
##VAR_NAME=  FREQUENCY,     SPECTRUM/REAL,   SPECTRUM/IMAG
##SYMBOL=    X,             R,               I
##VAR_TYPE=  INDEPENDENT,   DEPENDENT,       DEPENDENT
##VAR_FORM=  AFFN,          ASDF,            ASDF
##VAR_DIM=   65536,         65536,           65536
##UNITS=     HZ,            ARBITRARY UNITS, ARBITRARY UNITS
##FACTOR=    0.620285442955139, 1,           1
##FIRST=     20137.2065510682, 0,            0
##LAST=      -20513.1999529968, 0,           0
##MIN=       -20513.1999529968, -461116170,  0
##MAX=       20137.2065510682, 212451646,    0
$$ Real data points
##PAGE= N=1
##DATA TABLE= (X++(R..R)), XYDATA
$$ [...]
##PAGE= N=2
##DATA TABLE= (X++(I..I)), XYDATA
12854A385160K078455M227939M416035l567312p776746J140368J1771192P827574
$$ 1385160 3463615 7691554 12107589 8540277 763531 1903899 13675091 21502665
12846B1502665p360969j5538875q331097L860053P148045L67333n733233j777375
$$ 21502665 14141696 -1397179 -9728276 -5868223 1279822 1647155 -4086078 -5863453
12838e863453R412611J5293747P481741q223112j8052035j4751163k582732R380444
$$ -5863453 3549158 18842905 26324646 18101534 49499 -14701664 -17284396 -7903952
12830g903952J3766144P496895m785152j1159460m324146P037476P140518n814820
$$ -7903952 5862192 13359087 8573935 -2585525 -6909671 127805 7268323 1453503
12822A453503j6396033j2358037L27825P258740L276551m848655q094165k701910
$$ 1453503 -14942530 -27300567 -26972742 -19714002 -16437451 -21286106 -29380271 -32082181
12814c2082181P904337J4917355J1745904K650293j060953L615706O313732j035179
$$ -32082181 -24177844 -9260489 2485415 5135708 4074755 7690461 14004193 12969014
12806A2969014r821894n144262J1921067K2600053J3531439o087712j6044395
$$ 12969014 3147120 -1997142 9923925 32523978 46055417 39967705 23923310
12799B3923310r560850R17417K072899l566979l798169N010466J3360200J2150740
$$ 23923310 14362460 15279877 17352776 13785797 9987628 14998094 28358294 40509034
12791D0509034L597084m194747p815484r116557r035368o253785q30857M496120
$$ 40509034 44106118 39911371 32095887 22979330 13943962 7690177 6859320 11355440
12783A1355440O178081J757703p695347j5859205j5645894p333875J763684P019160
$$ 11355440 17533521 19291224 11595877 -4263328 -19909222 -27243097 -25479413 -18460253
12775a8460253J0038402J0979608O206843j819421k357612P532266J3846767L970080
$$ -18460253 -8421851 2557757 8764600 6945179 4587567 12119833 25966600 29936680
12767B9936680j3079164j8223537r133852m55390P0884q01884J255812O99856
$$ 29936680 16857516 -1366021 -10499873 -10955263 -10884379 -11686263 -10430451 -9730595
12759i730595l659193k552322P566555J5106319J0020582k19388k269073L106378
$$ -9730595 -13389788 -15942110 -8375555 6730764 16751346 16531958 14262885 17369263
12751A7369263M662524j37966k017428L915673R271715L818457r846195j8139723
$$ 17369263 22031787 21893821 19876393 23792066 33063781 36882238 27036043 8896320
12743H896320j2265806R61582O206563k787030j5866903j8694018q659145N384646
$$ 8896320 -3369486 -2407904 3798659 1011629 -14855274 -33549292 -42208437 -36823791
12735c6823791J5278488J8612575J4493488L709092o473440o862377J751299Q727469
$$ -36823791 -21545303 -2932728 11560760 15269852 8796412 1934035 3685334 12412803
12727A2412803P700356K843821q28815m108909p075738n904822j734791l023992
$$ 12412803 20113159 22956980 22128165 18019256 10943518 5038696 3303905 279913
12719B79913j1597161j5382628m635188J1912073J7848744J0571069R31484m001840
$$ 279913 -11317248 -26699876 -31335064 -19422991 -1574247 8996822 9928306 5926466
12711E926466n529814l626309L538497J0185041O676826m369562q468336o85049
$$ 5926466 396652 -3229657 308840 10493881 17170707 12801145 4332809 3647760
12703C647760N733610o2124q772735n496847O095435Q840168j473612r805149
$$ 3647760 9381370 9319246 546511 -4950336 1145099 9985267 8511655 -1293494
12695a293494m619950O004002P663608m06394p396350p188882l235207L01619
$$ -1293494 -5913444 90558 7754166 7347772 -48578 -7237460 -10472667 -10171048
12687a0171048L303948N343121M233401J029355M81075L686512N193049R83778
$$ -10171048 -6867100 -1523979 2709422 3738777 4219852 7906364 13099413 14083191
12679A4083191m429706l364853M210556R323356M060700r074669j9144888j8164558
$$ 14083191 9653485 6288632 10499188 19822544 23883244 14808575 -4336313 -22500871
12671b2500871r519010l026309j926765N06175Q867852J6262506J3820963M921376
$$ -22500871 -32019881 -35046190 -36972955 -36466780 -27598928 -11336422 2484541 7405917
12663G405917L52368J925069K303406J86210J799302N397797L85411j1832178
$$ 7405917 7758285 9683354 11986760 12172970 13972272 19370069 19755480 7923302
12655G923302j3087027L741231J7792020Q223285j2903637j7148783k372508N310611
$$ 7923302 -5163725 -1422494 16369526 24592811 11689174 -5459609 -7832117 -2521506
12647b521506p173547k0292378j2010883J0772623K3216059J3916754n903349
$$ -2521506 -9695053 -29987431 -41998314 -31225691 -8009632 5907122 3773
12640C773j8134412j4155074N22889J2389385J3229917Q379603P311390Q471912
$$ 3773 -18130639 -32285713 -31762824 -19373439 -6143522 2236081 9547471 18019383
12632A8019383L328855n775410o011421M554208J0748196K433148j0556100j4624718
$$ 18019383 21348238 15572828 9561407 14115615 24863811 27296959 16740859 2116141
12624B116141j1129721p942683l758936N609999J3966234J2315085L970769j398678
$$ 2116141 -9013580 -16956263 -20715199 -15105200 -1138966 11176119 15146888 13748210
12616A3748210l353138o233617m757632Q495110K3423374J9658812l190339k0387069
$$ 13748210 10395072 4161455 -596177 7898933 31322307 50981119 47790780 27403711
12608B7403711j4452933K569760R216748L790723k40682Q24808k719150j4099102
$$ 27403711 12950778 15520538 24737286 28528009 28287327 29112135 26392985 12293883
12600A2293883k1533560j4548272P36124R556322O882366J087279R25740N228726
$$ 12293883 -9239677 -23787949 -23051825 -13495503 -6613137 -5525858 -4600118 628608
12592F28608P151837M079494l73001k210598j136715Q00352J545047R8384k072749
$$ 628608 7780445 11859939 11486938 9276340 8139625 8939977 10485024 10583408 8510659
12583H510659j362650K905657M997719m88806q986628r944126j519867O362622
$$ 8510659 7148009 10053666 15051385 14562579 5575951 -4368175 -5888042 474580
12575D74580O158011J542763j746282m268999n676245L15228J3347549J8281284
$$ 474580 6632591 8175354 6429072 2160073 -3516172 -3200944 10146605 28427889
12567B8427889M004060j5904666j7983016j650311J0566795O105575l127667m135869
$$ 28427889 32431949 16527283 -1455733 -3106044 7460751 13566326 10438659 6302790
12559F302790j985570n416562q976636l566670N681891O522916j686926q943273
$$ 6302790 4317220 -1099342 -10075978 -13642648 -7960757 -1437841 -3124767 -12068040
12551a2068040r636095n657747J009098Q106210R765907L988956q37693K300966
$$ -12068040 -21704135 -27361882 -26352784 -18246574 -8480667 -4491711 -5329404 -3028438
12543c028438O021350J84601q581849n376844P426970J1940930L620305j585007
$$ -3028438 2992912 3177513 -5404336 -10781180 -3354210 8586720 12207025 10622018
12535A0622018M690445P781320n022716k0531386j7911460m69459R408311K451774
$$ 10622018 15312463 23093783 18071067 -2460319 -20371779 -20841238 -11432927 -8981153
12527h981153p943563q097390k27269P027189J1057419J2213550Q269804j43515
$$ -8981153 -16924716 -25022106 -25249375 -18222186 -7164767 5048783 13318587 13175072
12519A3175072m780782J041476J0795793J0192138m140307j7406035j3179348
$$ 13175072 8394290 9435766 20231559 30423697 26283390 8877355 -4301993
12512d301993N153416J6657401Q832248o195151q931062j74891J597816r782404
$$ -4301993 851423 17508824 26341072 20145921 11214859 11039968 12637784 2855380
12504B855380j6698052m073029J5927715J9160196K441876j3696396j3517891
$$ 2855380 -13842672 -17915701 -1987986 17172210 19614086 5917690 -7600201
12497g600201l423401J827840j172428m631445k686123K318992M916768L732536
$$ -7600201 -11023602 -9195762 -10368190 -14999635 -17685758 -15366766 -10449998 -6717462
12489f717462K564676M676863P489815N778568l00897n292015p186341r232157
$$ -6717462 -4152786 524077 8013892 13792460 13491563 8199548 1013207 -8218950
12481h218950j0767163n131898P842403J6214352J0998488o94757o639182o241925
$$ -8218950 -18986113 -24118011 -16275608 -61256 10937232 10242475 3603293 -2638632
12473b638632n947070n300740l51880M825030L935434J609842O508674J4610306
$$ -2638632 -8585702 -13886442 -14238322 -9413292 -5477858 -3868016 2640658 17250964
12465A7250964J4183441N070808j971225l138447l431278l139951N47905Q85653
$$ 17250964 31434405 36505213 34533988 31395541 27964263 24824312 25372217 26257870
12457B6257870r971399k1121098j3765307O933996J5183977L877322n569711m68011
$$ 26257870 16286471 -4834627 -18599934 -11665938 3518039 7395361 1825650 1357639
12449A357639L972046m000738r850975p90448P953413r16709j4551659j0399632
$$ 1357639 5329685 1328947 -8522028 -9312476 -1359063 -2275772 -16827431 -27227063
12441b7227063O562420J4612778J1205708R558897Q494151l705428j9570116j7828342
$$ -27227063 -20664643 -6051865 5153843 14712740 23206891 19501463 -68653 -17896995
12433a7896995J7884Q132398k583904r679620L351172J9211658J3362757q784765
$$ -17896995 -17879111 -9746713 -12330617 -22010237 -18659065 552593 13915350 5130585
12425E130585k0385114j0006057P226735J2901615O264495n59432N6230M212508
$$ 5130585 -15254529 -25260586 -18033851 -5132236 1132259 572827 629057 4841565
12417D841565M964720K238201M82620j66897k953234n722342l016805J908067
$$ 4841565 9806285 12044486 12527106 12360209 9406975 3684633 667828 2575895
12409B575895o17913q905261q924148K427734R380320K728300m212850O27250
$$ 2575895 1957982 -6947279 -15871427 -13443693 -4063373 -1335073 -5547923 -4920673
12401d920673O110987j066946r720195k635498J1048708Q999885p116496j5231165
$$ -4920673 1190314 123368 -9596827 -12232325 -1183617 7816268 699772 -14531393
12393a4531393q426398L95323N446731J1449478J2681158j230955j8268477j3856102
$$ -14531393 -22957791 -22562468 -17115737 -5666259 7014899 5783944 -12484533 -26340635
12385b6340635Q895596J9909876Q729734j529611M431520J1203582M418421n234395
$$ -26340635 -17445039 2464837 11194571 9664960 14096480 25300062 29718483 24484088
12377B4484088o277406o895171j3191930j2966765k24257Q538446K129062n045532
$$ 24484088 18206682 11311511 -1880419 -14847184 -15071441 -6532995 -4403933 -9449465
12369i449465o50077K244569p554856j3279878J375028J9403026J6025607q78498
$$ -9449465 -10099542 -7854973 -15409829 -28689707 -27314679 -7911653 8113954 7235456
12361G235456o722799j172923j210632o101868k574294M397612n19221j0595217
$$ 7235456 512657 -660266 -1870898 -7972766 -10547060 -6149448 -6668669 -17263886
12353a7263886n544542J1200443J6073951M676061m086291k886945l315860o974939
$$ -17263886 -22808428 -11607985 4465966 9142027 5055736 2168791 -1147069 -8122008
12345h122008j506671J0586969J1181440M61164n91038J0585334J0236652q323115
$$ -8122008 -9628679 958290 12139730 12600894 12009856 22595190 32831842 24508727
12337B4508727j7899490k334112J3837269M848366j4399279j4239881K923162
$$ 24508727 6609237 4275125 18112394 22960760 8561481 -5678400 -2755238
12330b755238J1878059O139270J48353j280583o900322j5519374j4152053j168575
$$ -2755238 9122821 15262091 15410444 14129861 7229539 -8289835 -22441888 -23610463
12322b3610463Q820408N890540m401222j1907398j0951103j73576J4135495J7724325
$$ -23610463 -14790055 -8899515 -13300737 -25208135 -36159238 -36332814 -22197319 -4472994
12314d472994M765842r487211p343026M666171N991387m110854n359946Q323296
$$ -4472994 292848 -9194363 -16537389 -11871218 -5879831 -9990685 -15350631 -7027335
12306g027335J5924319J860893j8312808j9941758l376972J0550320J0687045
$$ -7027335 8896984 10757877 -7554931 -27496689 -30873661 -20323341 -9636296
12299i636296M617832J493376J463918K766158O193509Q868679L636830r683631
$$ -9636296 -5018464 -3525088 -2061170 704988 6898497 15767176 19404006 9720375
12291I720375j9114075j3230740L721231J5287648J1550305J29649l924116L011648
$$ 9720375 -9393700 -22624440 -18903209 -3615561 7934744 8064393 4140277 7151925
12283G151925Q746184J299224j4489838k1357447r964088J0435832K2966454J9858878
$$ 7151925 15898109 17197333 2707495 -18649952 -28614040 -18178208 4788246 24647124
12275B4647124O029344q524713j5366286j1063660j22924P625303P584382N639540
$$ 24647124 30676468 22151755 6785469 -4278191 -4401115 3224188 10808570 16448110
12267A6448110P452552P044883m251892j9764714k1440967m655502J3492820J6937908
$$ 16448110 23900662 30945545 26693653 6928939 -14512028 -19167530 -5674710 11263198
12259A1263198R989506M756318P41818q565414j6649876j0373919N484200R052096
$$ 11263198 21252704 26009022 26750840 18185426 1535550 -8838369 -3354169 5697927
12251E697927p576660k3815126j6998586P798931K5672927K2459431O114925q333626
$$ 5697927 -1878733 -25693859 -42692445 -34893514 -9220587 13238844 19353769 11020143
12243A1020143j4054058j2931499r536337o867315m241387R20546P555648J0239524
$$ 11020143 -3033915 -15965414 -25501751 -32369066 -36610453 -35689907 -28134259 -17894735
12235a7894735O798968K165145M12882j610920o419732p446720J869940J4097433
$$ -17894735 -11095767 -8930622 -8517740 -10128660 -16548392 -23995112 -22125172 -8027739
12227h027739J4702038L071620n155864k27665Q016715N263117o575761j2744523
$$ -8027739 6674299 9745919 4590055 4362390 12379105 17642222 11066461 -1678062
12219a678062n783675O303988J1399190O130753l494510r348667p287977O11272
$$ -1678062 -7461737 -1157749 10241441 16372194 12877684 3529017 -3758960 -3147688
12211c147688P621135P599511K46630r015992j4193082j2739745n327455N387050
$$ -3147688 4473447 12072958 12319588 3303596 -10889486 -23629231 -28956686 -23569636
12203b3569636J4564063J6624352J0166315O73309m666575m652827l611426l752702
$$ -23569636 -9005573 7618779 17785094 18458403 13791828 9139001 5527575 1774873
12195A774873k858480p47780j752247o368897o268060M723826J7988137J7822614
$$ 1774873 -1083607 -1831387 -3583634 -9952531 -16220591 -11496765 6491372 24313986
12187B4313986J784420j5418251k0083156j3391087m445478K056435O093884P136019
$$ 24313986 26098406 10680155 -9403001 -22794088 -27239566 -25183131 -19089247 -11953228
12179a1953228N018845J852594j414368n901964r046557m831581N175555Q956669
$$ -11953228 -6934383 -5081789 -6496157 -12398121 -21444678 -26276259 -21100704 -12144035
12171a2144035K02898r737352o427167O561582J3413720R756464O447032R182658
$$ -12144035 -11941137 -21678489 -28105656 -21544074 -8130354 1626110 8073142 17255800
12163A7255800R028099j230384j3371531j5086983p108127J72363K184484K982469
$$ 17255800 26283899 25053515 11681984 -3404999 -10513126 -10340763 -8156279 -5173810
12155e173810M810322M130112m81981l729258j113681K972268K82574q532891
$$ -5173810 -363488 3766624 3284643 -444615 -1558296 1413972 1696546 -6836345
12147f836345j1996744k401876J1559933J3915717K720358o699689l411385L813959
$$ -6836345 -18833089 -21234965 -9675032 4240685 6961043 261354 -3150031 663928
12139F63928J462638o484718n018156O516272J1966878M022557m081820q60623
$$ 663928 2126566 -4358152 -9376308 -2860036 9106842 13129399 9047579 8186956
12131H186956L980633l762431j7024458j6397320q19294R823289M979517k134522
$$ 8186956 12167589 8405158 -8619300 -25016620 -25835914 -16012625 -11033108 -13167630
12123a3167630J568251P158986J30947j2335670r247782J2033566K9332171K4345365
$$ -13167630 -11599379 -4440393 -4309446 -16645116 -25892898 -13859332 15472839 39818204
12115C9818204L390498j5430126k2573100j7574391k348346J4765228J8443632
$$ 39818204 43208702 27778576 5205476 -12368915 -14717261 47967 18491599
12108A8491599L789583j2133747j0354862L333008P574941j865984p833826j898006
$$ 18491599 22281182 10147435 -207427 3125581 10700522 8834538 1000712 -897294
12100h97294K111677o549422j5224376p658969R017526J4662691O222845j27745
$$ -897294 1214383 -5335039 -20559415 -28218384 -19200858 -4538167 1684678 1556933
12092A556933N302511J3835266J3871702N282457n109569j2267723j3127005o322847
$$ 1556933 6859444 20694710 34566412 39848869 34739300 22471577 9344572 3021725
12084C021725L476938O903445L20840q595141r364970p88896P968678P733006
$$ 3021725 6498663 13402108 13722948 5127807 -4237163 -5026059 2942619 10675625
12076A0675625l01309n543276j278261M596083j276094j6411321k0469075k205853
$$ 10675625 10374316 4831040 3552779 8148862 6872768 -9538553 -30007628 -32213481
12068c2213481K0711180K2084941K492677j1889341n921681O351846O538287j117621
$$ -32213481 -11502301 10582640 13075317 1185976 -4735705 1616141 8154428 7036807
12060G036807q35523O784049N281338j0530272k3697375j7384141K170188J3914128
$$ 7036807 6201284 12985333 18266671 7736399 -15960976 -33345117 -31174929 -17260801
12052a7260801Q457170l104773o217504M85144Q874066J3481323J2765233M014202
$$ -17260801 -8803631 -11908404 -18125908 -17640764 -8766698 4714625 17479858 21494060
12044B1494060j2505471k5908276k2647958m721808R927505R473220J726239L97316
$$ 21494060 8988589 -16919687 -39567645 -44289453 -34361948 -24888728 -23162489 -22765173
12036b2765173O902234J3100849J4151689J0107021J541466p315932p365145L565637
$$ -22765173 -15862939 -2762090 11389599 21496620 23038086 15722154 8357009 11922646
12028A1922646J3287498R974642j171214p378885q634782j4067543k1432398j7117999
$$ 11922646 25210144 35184786 34013572 26634687 17999905 3932362 -17500036 -34618035
12020c4618035J506409J8631777J9905161Q836353j455835m152822j929251n01588
$$ -34618035 -33111626 -14479849 5425312 14261665 12805830 8653008 6723757 6222169
12012F222169k221000l202574J521057P353179K544482j1807540j6132852n91235
$$ 6222169 4001169 798595 2319652 9672831 12217313 409773 -15723079 -16314314
12004a6314314J3887637M226829j5709643j3634410Q656044J6384482j144850
$$ -16314314 -2426677 1800152 -13909491 -27543901 -18887857 -2503375 -3648225
11997c648225j2692644J926015J7842191P755842j2906363j3985193M27799M922929
$$ -3648225 -16340869 -14414854 3427337 11183179 -1723184 -15708377 -15280578 -10357649
11989a0357649k570806m225219P81422k079077r907686n048370J0999748J7792233
$$ -10357649 -12928455 -17153674 -16372252 -18451329 -28359015 -33407385 -22407637 -4615404
11981d615404J0606414M920796M958360j363171j2473063j0280889N092728R527216
$$ -4615404 5991010 10911806 15870166 14506995 2033932 -8246957 -3154229 6372987
11973F372987m597452j3009835k00283J4018988Q652260m292746l619412N478999
$$ 6372987 1775535 -11234300 -11434583 2584405 11236665 6943919 3324507 8803506
11965H803506O092974J814866O139680J2868863N741488j0612087j6649713j0079277
$$ 8803506 14896480 16711346 22851026 35719889 41461377 30849290 14199577 4120300
11957D120300o309777r072296n715433O650621J3098319M178177j0188198j5287759
$$ 4120300 -2189477 -11261773 -16977206 -10326585 2771734 6949911 -3238287 -18526046
11949a8526046p417790O875698J6461477J1948660k680228r462997Q8707R283574
$$ -18526046 -25943836 -19068138 -2606661 9341999 6661771 -2801226 -2712519 6571055
11941F571055P98196j3294526r554101O886924R818443l803913j0162277j614350
$$ 6571055 7369251 -5925275 -15479376 -8592452 1225991 -2577922 -12740199 -14354549
11933a4354549J905970o638791o065598J1438894J8948541m64239j9264892p242221
$$ -14354549 -12448579 -19087370 -25152968 -13714074 5234467 4770228 -14494664 -21736885
11925b1736885J7704454J7166336p090148j9177752o384968Q512673J0189596
$$ -21736885 -4032431 13133905 6043757 -13133995 -19518963 -11006290 -816694
11918h16694R060075J2226365R504893k043153p882964j987868R74120q173235
$$ -816694 8243381 20469746 29974639 27931486 20048522 18060654 19034774 10861539
11910A0861539j6189008j0400527J30381J540521k192232N96523Q267327J0603742
$$ 10861539 -5327469 -15727996 -15597615 -14057094 -16249326 -15652803 -7385476 3218266
11902C218266O270778J620414j954058p134195j1467059r945352m228753n08882
$$ 3218266 9489044 11109458 9155400 2021205 -9445854 -19391206 -23619959 -24128841
11894b4128841P2353J852719O611074J0472249Q830329J878193m653794m864345
$$ -24128841 -24056488 -22203769 -15592695 -5120446 3709883 5588076 934282 -3930063
11886c930063j89338J727078j055580l20680P679612J1343538M78532j2833753
$$ -3930063 -4119401 -2392323 -3447903 -3768583 3911029 15254567 15733099 2899346
11878B899346q374077R820538J6231968J338232j5205046j5487887o653663k801443
$$ 2899346 -5474731 4345807 20577775 21916007 6710961 -8776926 -15430589 -18232032
11870a8232032k593507J046565M197852L37574n516340m781830J283493O905245
$$ -18232032 -20825539 -19778974 -15581122 -15243548 -20759888 -25541718 -24258225 -17352980
11862a7352980J1105790J2562839O493503m037299o617881O80726K630953q327990
$$ -17352980 -6247190 6315649 12809152 8771853 2153972 2834698 5465651 -2862339
11854b862339j6915082r384020L566622O236957M231556R971980J6323534R332454
$$ -2862339 -19777421 -29161441 -25594819 -19357862 -15126306 -5154326 11169208 20501662
11846B0501662l938535o538226j937942n564995j2354816l028584J8698702K6134623
$$ 20501662 16563127 10024901 8086959 2521964 -9832852 -12861436 5837266 31971889
11838C1971889J0996833m028332k273558L582295l000498j5893718j9776404j3704139
$$ 31971889 42968722 38940390 36666832 40249127 37248629 21354911 1578507 -12125632
11830a2125632p381622n392038n815722n614545o68519J0585435K0126040J7837396
$$ -12125632 -19507254 -24899292 -30715014 -36329559 -36998078 -26412643 -6286603 11550793
11822A1550793P751618L355335N358168R92148j1109630j4676353k284663J0256990
$$ 11550793 19302411 22657746 28015914 29008062 17898432 3222079 937416 11194406
11814A1194406P305706m207646q284362l075902K267278L830219L476047O56331
$$ 11194406 18500112 14292466 6008104 2932202 5199480 9029699 12505746 13162077
11806A3162077n170336r214788p047415j271592L103053M966716N386270N693482
$$ 13162077 7991741 -1223047 -8270462 -9542054 -6439001 -1472285 3913985 9607467
11798I607467Q712719J3989964J2303339l592117k2954865k6435717j3024740
$$ 9607467 18320186 32310150 44613489 41021372 18066507 -8369210 -21393950
11791b1393950j167989j5612J353896R673702J2996788K102808j1322843j2119449
$$ -21393950 -22561939 -22577551 -21223655 -11549953 1446835 3549643 -7773200 -19892649
11783a9892649l390829K747848L997841M450753L256535r58595l767288k987886
$$ -19892649 -23283478 -20535630 -16537789 -12087036 -8830501 -9789096 -13556384 -16544270
11775a6544270l176151m659066r41970N885777L569014p584745r348478N196866
$$ -16544270 -19720421 -24379487 -25321457 -19435680 -15866666 -23451411 -32799889 -27603023
11767b7603023J7302258J2243852K309968K051589K440712p498254j4120711j810214
$$ -27603023 -10300765 1943087 4253055 6304644 8745356 1247102 -12873609 -14683823
11759a4683823J5417334J5285137N388211P105697J3819807K203074k1622938
$$ -14683823 733511 16018648 21406859 28512556 42332363 44535437 22912499
11752B2912499k6273814n710809J1368760P534703k420606l924295l094595m388064
$$ 22912499 -3361315 -9072124 2296636 9831339 7410733 3486438 391843 -3996221
11744c996221J397122J3723173J4775662m60335j1926496o563932J682152j170299
$$ -3996221 -2599099 11124074 25899736 25439401 13512905 6948973 8631125 7460826
11736G460826o135440j965226L608309J362914j333569J992653J780803o361861
$$ 7460826 1325386 -639840 2968469 4331383 2997814 4990467 6771270 409409
11728D09409o582449R267315J9661962N572717j4084021r628002J1084552J5220432
$$ 409409 -6173040 3094275 22756237 28328954 14244933 4616931 15701483 30921915
11720C0921915k586812j5433887j0021847k995351o676590r897069l225182L315842
$$ 30921915 28335103 12901216 2879369 -115982 -6792572 -16689641 -19914823 -16598981
11712a6598981Q95949j521726M717036J1207909P952377M35593k449305l785793
$$ -16598981 -15703032 -17224758 -12507722 -1299813 6652564 7088157 4638852 853059
11704H53059p804689o666207N556318J6143253R278497q209868j5130430o582418
$$ 853059 -6951630 -13617837 -8061519 8081734 17360231 9150363 -5980067 -12562485
11696a2562485K243335K539265K721521Q234012R180375j208515j0230565k661074
$$ -12562485 -10319150 -7779885 -5058364 3175648 12356023 11147508 916943 -1744131
11688a744131J4402244J9503140O543727q574619j1932844p979814o923197q060916
$$ -1744131 12658113 32161253 38704980 30130361 18197517 10217703 3294506 -4766410
11680d766410m910145R70114K158275j694598k665366L611740J1755627J3178339
$$ -4766410 -9676555 -8706441 -6548166 -8242764 -10908130 -7296390 4459237 17637576
11672A7637576M549392r728282j9727927j6753502k838421Q597809P101400k210792
$$ 17637576 22186968 12458686 -7269241 -24022743 -26861164 -18263355 -11161955 -13372747
11664a3372747o700121l551365j59236K96339J778752L494585j428843j0851888
$$ -13372747 -20072868 -23624233 -23783469 -23487130 -21708378 -18213793 -19642636 -30494524
11656c0494524j0310523O491269K4089569K2977808M125070j4716222k1580776
$$ -30494524 -40805047 -34313778 -10224209 12753599 16878669 2162447 -19418329
11649a9418329j7817417p510150O824149J7994253J6814701N173977l424864j293294
$$ -19418329 -37235746 -44745896 -37921747 -19927494 -3112793 2061184 -1363680 -2656974
11641b656974L753325J776355m113486m414593L25122O51209n032275o099221
$$ -2656974 1096351 2872706 -1240780 -5655373 -5330251 -4679042 -9711317 -15810538
11633a5810538L651706J4177371J2294697R77147n132748j662513M06457n711428
$$ -15810538 -12158832 2018539 14313236 15290383 10157635 8495122 8901579 3190151
11625C190151j0882709o007407J377432p33340p486341m074330Q778444J3805064
$$ 3190151 -7692558 -13699965 -12322533 -13055873 -20542214 -24616544 -15838100 -2033036
11617b033036M135863n673148k498301O307546P063421J073726p86862L317507
$$ -2033036 2102827 -3570321 -6068622 238924 7302345 8376071 7589209 10906716
11609A0906716N887572L606425l61997m380138q578138r959867o454280k716689
$$ 10906716 16794288 20400713 20038716 15658578 7080440 -2879427 -9333707 -12050396
11601a2050396l043249k657971L924894J0517758P666458k9744L54805P969949
$$ -12050396 -15093645 -17751616 -13826722 -3308964 4357494 4327750 4682555 12652504
11593A2652504P956748l887504j2286018n417765O871618P746615l443384j3208780
$$ 12652504 20609252 16721748 4435730 -982035 5889583 13636198 10192814 -3015966
11585c015966j2781546n159123K773018O721296N714250K626823K270903M998043
$$ -3015966 -15797512 -20956635 -18183617 -11462321 -5748071 -3121248 -850345 4147698
11577D147698N491546J426826j828165j16824J614566k610905q556394p425887
$$ 4147698 9639244 11066070 9237905 9121081 10735647 8124742 -431652 -7857539
11569g857539k69138K827934j680220n029979O93068J0490133J3198996P022667
$$ -7857539 -8126677 -5298743 -6978963 -12008942 -11315874 -825741 12373255 19395922
11561A9395922J911164N317871J0546768M798196j1677458k1831172j2604828
$$ 19395922 21307086 26624957 37171725 41969921 30292463 8461291 -4143537
11554d143537N928219J1872623M67600j0078582m855263P722572J0575849L396142
$$ -4143537 1784682 13657305 14124905 4046323 -808940 6913632 17489481 20885623
11546B0885623J049799J0081648J9001308J3826855m723519k2632973k7006010
$$ 20885623 21935422 32017070 51018378 64845233 60121714 37488741 10482731
11539A0482731j7478411n654288l391859j0491361j5662102j0235629L159982
$$ 10482731 -6995680 -12649968 -16041827 -26533188 -42195290 -52430919 -49270937
11532d9270937J6606866K4990063K5092742J4662940j611642j2275013j2037298
$$ -49270937 -32664071 -7674008 17418734 32081674 30470032 18195019 6157721
11525F157721p669017m665286J928183J3490201J6211758l99121k1516167k2788657
$$ 6157721 -1511296 -6176582 -4248399 9241802 25453560 25054439 3538272 -19250385
11517a9250385m440553J0032049Q127949J000377K02034K386066K222657J574930
$$ -19250385 -23690938 -13658889 -5530940 -4530563 -4328529 -1942463 280194 1855124
11509A855124n34837r207732j8581355j4043251L302768J3983531J0165109O656743
$$ 1855124 1320287 -7887445 -26468800 -40512051 -37209283 -23225752 -13060643 -6403900
11501f403900J1451498R858252n985275j6698839o848049O073867N86024j0883671
$$ -6403900 5047598 14905850 8920575 -7778264 -14626313 -8552446 -7966422 -18850093
11493a8850093m590648J0298680O631806j1441055j3504645N060387J5400327
$$ -18850093 -23440741 -13142061 -6510255 -17951310 -31455955 -26395568 -10995241
11486a0995241M247814o681756q18774P756242L882748l206330j360935K743611
$$ -10995241 -6747427 -13429183 -14247957 -6491715 -2608967 -5815297 -7176232 -4432621
11478d432621J081542J097789P341883P178426o619471j8039700j1583372L335702
$$ -4432621 -3351079 -2253290 5088593 12267019 5647548 -12392152 -23975524 -20639822
11470b0639822J0177010J0406824J1777265Q788067l586328j2121292m300656
$$ -20639822 -10462812 -55988 11721277 20509344 16923016 4801724 501068
11463E01068P988529O376584m820140j0251963j1148631j5710386j4635013L986675
$$ 501068 8489597 14866181 10046041 -205922 -11354553 -27064939 -41699952 -37713277
11455c7713277K4590677K1387590R80503n459052Q272015J5819070L961926q453343
$$ -37713277 -13122600 8264990 9245493 3786441 12058456 27877526 31839452 23386109
11447B3386109o862215l995320j1585907j7107106p375315P076105J0382039N880796
$$ 23386109 16523894 12528574 942667 -16164439 -23539754 -16463649 -6081610 -200814
11439b00814M016868J938642o222875j2615376q167652o11843j605272n389962
$$ -200814 3816054 5754696 -468179 -13083555 -21251207 -21863050 -23468322 -28858284
11431b8858284J007255J3679260J7139516R523849L802663M560148J128102j2403128
$$ -28858284 -27851029 -14171769 2967747 12491596 16294259 20854407 21982509 9579381
11423I579381k4259449j9363088O68223J8510779K0130859Q990315Q8837J026850
$$ 9579381 -14680068 -34043156 -33374933 -14864154 5266705 14257020 14345857 15372707
11415A5372707L612202k096760j1214527j0703618P20412J1160917J2977929R066909
$$ 15372707 18984909 16888149 5673622 -5029996 -4309584 6851333 19829262 28896171
11407B8896171K394191o130973r426325j234967P495682k34572j6903655j5894569
$$ 28896171 31290362 25159389 15733064 14498097 21993779 21759207 4855552 -11039017
11399a1039017N191096J5502937l91951j5440600m763800J2176504O538753p856882
$$ -11039017 -5847921 9655016 9263065 -6177535 -10941335 1235169 7773922 -82960
11391h2960R91937K3164990J9062582j2855221k9747817j2685210N638424j586273
$$ -82960 908977 24073967 43136549 30281328 533511 -12151699 -6513275 -8099548
11383h099548j2754983K28036K2002653K0108090j510097j1483584j562755N982781
$$ -8099548 -20854531 -20626495 1376158 21484248 19974151 8490567 6927812 12910593
11375A2910593j583008j0139669n805166M169756O403086J481099o76234L241599
$$ 12910593 11327585 1187916 -4617250 -447494 5955592 7436691 6760457 10002056
11367A0002056O756127L380444m616098p737386o37513Q814305P444638m970865
$$ 10002056 16758183 20138627 15522529 7785143 7147630 15961935 23406573 18435708
11359A8435708j3518500q193921K948575P068535L536307j202937o491922j3140835
$$ 18435708 4917208 -3276713 -328138 6740397 10276704 9073767 2581845 -10558990
11351a0558990j3677751j693247J2998745J4148939L330269j393652O398844J0816742
$$ -10558990 -24236741 -25929988 -12931243 1217696 4547965 3154313 9553157 20369899
11343B0369899j117105j7320174j6804885k18484J0998602M995555n614678m691807
$$ 20369899 19252794 1932620 -14872265 -15090749 -4092147 903408 -4711270 -9403077
11335i403077L691786M036295m604591p025939K714793J0147241K688183j0119533
$$ -9403077 -5711291 -1674996 -6279587 -13305526 -10590733 -443492 2244691 -7874842
11327g874842j1485390k735751K029805N8702M39773L722605J241108m750895
$$ -7874842 -19360232 -22095983 -20066178 -20007476 -19567703 -15845098 -14603990 -19354885
11319a9354885j516971R714488J1713453Q58758m073399O003281J2935755K277048
$$ -19354885 -20871856 -11157368 556085 1414843 -2658556 3344725 16280480 18557528
11311A8557528j0482388o396034L698389j000181j3328655j0385533N575120J0273428
$$ 18557528 8075140 1679106 5377495 4377314 -8951341 -19336874 -13761754 -3488326
11303c488326j846140j0942448p056822k583327m784705l689978M790597R106583
$$ -3488326 -5334466 -16276914 -23333736 -25917063 -30701768 -34391746 -29601149 -20494566
11295b0494566M792906L507515R500184J0035518L16605n068790J283846M181367
$$ -20494566 -15701660 -12194145 -2693961 7341557 7658162 2589372 3873218 8054585
11287H054585p386903j9293528j5738566m095413K394826P528570J6813211J8104262
$$ 8054585 667682 -18625846 -34364412 -38459825 -36064999 -28536429 -11723218 6381044
11279F381044K490424j1461811k226760J7875037J9413380Q10223j3177828j2180553
$$ 6381044 8871468 -2590343 -4817103 13057934 32471314 33281537 20103709 7923156
11271G923156q451223o763761J582501J2214853P355040j0501145j5040540K254620
$$ 7923156 -528067 -7291828 -5709327 6505526 13860566 3359421 -11681119 -9426499
11263i426499J5418288M221908j4852187j6949293n886850p50716l161602j925066
$$ -9426499 5991789 10213697 -4638490 -21587783 -27474633 -28225349 -31386951 -33312017
11255c3312017K082872k56252n154961r50582R861885J3639849Q222414M304216
$$ -33312017 -31229145 -31485397 -36640358 -37590940 -27729055 -14089206 -5866792 -1562576
11247a562576N816642O544180N618484Q532096J1480049K755260j5757174k5068206
$$ -1562576 4254066 10798246 16416730 24948826 36428875 39184135 23426961 -1641245
11239a641245j4540935K609181P898219P69779o143821o380829l852172k538033
$$ -1641245 -16182180 -13572999 -5674780 -4905001 -11048822 -17429651 -21281823 -23819856
11231b3819856j666706j3226J695023K923791M157476N513167O240600N185428
$$ -23819856 -25486562 -25499788 -23804765 -20880974 -16723498 -11210331 -4969731 215697
11223B15697J778126k073137k505743J218429M739196N938862J0090791J9861963
$$ 215697 1993823 -79314 -2585057 -1366628 3372568 9311430 19402221 39264184
11215C9264184K4209780R992068j5317442k7475593j7024676k276263j559702
$$ 39264184 63473964 73466032 58148590 30672997 13648321 11372058 9812356
11208I812356o679361Q66106J7254045J9734534Q91689j8940414j8361060r09575
$$ 9812356 3132995 3999101 21253146 40987680 41879369 22938955 4577895 3668320
11200C668320J2294044P588419r329541k1368267j6384663P59180J2090802O849409
$$ 3668320 15962364 23550783 14221242 -7147025 -23531688 -22772508 -10681706 -3832297
11192c832297m768858n966310K339048M629369k663394m791349N953801J5562855
$$ -3832297 -8601155 -14567465 -12228417 -7599048 -10262442 -15053791 -9099990 6462865
11184F462865R754510l944348r293809n408897k153445j13227P010916J4683644
$$ 6462865 16217375 12273027 2979218 -2429679 -4583124 -4696351 2314565 16998209
11176A6998209J0657252m432519j5880741j5870905j1117260p840766l739205
$$ 16998209 27655461 23222942 7342201 -8528704 -19645964 -27486730 -31225935
11169c1225935K018724N123972O609628J2969981K0956446J7122849m02346j4482943
$$ -31225935 -29207211 -24083239 -17473611 -4503630 16452816 33575665 33173319 18690376
11161A8690376j2703472m421826k598952k551010N508014J3910851P049396j1567165
$$ 18690376 5986904 1565078 -1033874 -3584884 1923130 15833981 22883377 11316212
11153A1316212k0862051j0953448N564398J3208075J0703542N015937L11285j881654
$$ 11316212 -9545839 -20499287 -14934889 -1726814 8976728 13992665 14303950 12422296
11145A2422296l99757K425913J362613m562498j0289497j1547538q353338j634777
$$ 12422296 12022539 14448452 15811065 11248567 959070 -10588468 -18941806 -20576583
11137b0576583P145647J2732022R852721J575363l080311j117344J979390K653009
$$ -20576583 -13430936 -698914 9153807 10729170 7648859 6531515 8510905 11163914
11129A1163914L513871M878454J552974p042364j1995320o996442J085505J403936
$$ 11163914 14677785 19556239 21109213 14066849 2071529 -4924913 -3839408 -2435472
11121b435472n270989p894468l53089J1091239J5514022Q493023m060892j0839769
$$ -2435472 -7706461 -15600929 -15954018 -4862779 10651243 19144266 15083374 4243605
11113D243605n583794N270242Q244907j072069j1184468q328524O014316J6885529
$$ 4243605 -1340189 3930053 12174960 11102891 -81577 -8410101 -2395785 14489744
11105A4489744J3886854J826653o991480o331823m47235J853769l750838j2225009
$$ 14489744 28376598 30203251 23211771 16879948 16432713 18286482 14535644 2310635
11097B310635j3652664m725721N871406P470077J079320l147262j498538q78027
$$ 2310635 -11342029 -16067750 -10196344 -2726267 -1646947 -4794209 -6292747 -7170774
11089g170774m653948m681130M653455J3258667Q559020l551337o220839J600713
$$ -7170774 -11824722 -16505852 -11852397 1406270 9965290 6413953 193114 1793827
11081A793827L695120n043475q462477K768311J1928547K133284j3669020j1210943
$$ 1793827 5488947 445472 -8017005 -5248694 6679853 8813137 -4855883 -16066826
11073a6066826N859508J1297434j701501j1015078k736199Q101306M928289m466135
$$ -16066826 -10207318 1090116 -611385 -11626463 -14362662 -6261356 -1333067 -5799202
11065e799202m952747L19674q96871p158280p395820l31523N633077O960276O666656
$$ -5799202 -10751949 -10432275 -11329146 -18487426 -25883246 -26214769 -20581692 -13621416 -6954760
11056f954760N895477M390539M535577O104363L513131l507944n529775Q44401
$$ -6954760 -1059283 3331256 7866833 13971196 17484327 13976383 8446608 9291009
11048I291009L795421m995545j3758601q083712M901437P342901j709548p593646
$$ 9291009 13086430 8090885 -5667716 -13751428 -8849991 -1507090 -3216638 -10810284
11040a0810284l797197L037195P802643J0065751O586229l222656r099754l363581
$$ -10810284 -14607481 -11570286 -3767643 6298108 12884337 9661681 561927 -2801654
11032b801654L578828j348148j0386912p204545M743283R420782P101468R557586
$$ -2801654 777174 -570974 -10957886 -18162431 -13419148 -3998366 3103102 12660688
11024A2660688J1966242M90241j4555035q343416J2651046J2712210j4760288
$$ 12660688 24626930 25117171 10562136 2218720 14869766 27581976 12821688
11017A2821688k9877889o835254K3667026K0428659p861471k0807751o123766
$$ 12821688 -17056201 -23891455 -224429 20204230 12342759 -8464992 -14588758
11010a4588758J1644478J2160730k45237j2899873j7602240r059253J0172559
$$ -14588758 -2944280 9216450 8971213 -3928660 -21530900 -30590153 -20417594
11003b0417594K4532267K0499710M468583o548004p028823l907341k069405j763727
$$ -20417594 4114673 24614383 29082966 22534962 15506139 11598798 9529393 7765666
10995G765666m511324r341031q967375q10837N068620L9995q688289q901501r19812
$$ 7765666 3254342 -6086689 -15054064 -15864901 -10796281 -10756286 -19444575 -28346076 -29265888
10986b9265888O430386R147987P337720Q68016m475876J398100J4268704J3443912
$$ -29265888 -22835502 -13687515 -6349795 -5481779 -9957655 -8559555 5709149 19153061
10978A9153061p589923k4303944j3506916J1754667K1311708R967618l092941
$$ 19153061 11563138 -12740806 -26247722 -14493055 6818653 16786271 13693330
10971A3693330p601510r610642j1071943o793445K36656K338719L789091J3201137
$$ 13693330 6091820 -3518822 -14590765 -21384210 -21147554 -18808835 -15019744 -1818607
10963a818607K2391852J4984234n688548j9358679j8289427j1894948l786657
$$ -1818607 20573245 35557479 29868931 10510252 -7779175 -19674123 -23460780
10956b3460780J0724903K3403441J6445239o937318k0232573j0642110M183581
$$ -23460780 -12735877 10667564 27112803 20175485 -57088 -10699198 -6515617
10949f515617O167272J474565K310769M132310k121815r671884n789694O210566
$$ -6515617 -348345 1126220 3436989 7569299 5447484 -4224400 -10014094 -3803528
10941c803528J0783452K680613o511389m631094N735262J0821354L062586q081958
$$ -3803528 6979924 9660537 3149148 -1481946 4253316 15074670 18137256 10055298
10933A0055298p895085J650848L277917p582012j2222837J454108J5534093Q947738
$$ 10055298 2160213 3811061 7088978 -493034 -12715871 -11261763 4272330 13220068
10925A3220068p086967p442214M033144K655298j1046232j0042480J1315896K4735640
$$ 13220068 6133101 -1309113 2724031 5379329 -5666903 -15709383 -4393487 20342153
10917B0342153J3440261l711032p782343p372927j2573575j1691806K990226J2595650
$$ 20342153 33782414 30071382 22289039 14916112 2342537 -9349269 -6359043 6236607
10909F236607J103483j4155285r047961P903147J1076251r17189q244256m527385
$$ 6236607 7340090 -6815195 -15863156 -7960009 3116242 2199053 -6045203 -10572588
10901a0572588l90126J392472P125638J1689804K696114j4559438j9502503o199158
$$ -10572588 -10962714 -9570242 -2444604 9245200 11941314 -2618124 -22120627 -28319785
10893b8319785Q781519J0934450K726025p766916j5679157j4349052J187618K1010129
$$ -28319785 -19538266 -8603816 -5877791 -13644707 -29323864 -43672916 -42485298 -21475169
10885b1475169K5791611J1128510o135144j0544620m712167J732899P231168J3665680
$$ -21475169 4316442 15444952 9309808 -1234812 -5946979 -4214080 3017088 16682768
10877A6682768J5680353N609234j2902442k4199757j6682987K422987J2711396
$$ 16682768 32363121 37972355 25069913 870156 -15812831 -13389844 -678448
10870f78448M122019r663928r748405n1694j107735j4797874j7180607K913475
$$ -678448 3443571 -6220357 -15968762 -16020456 -17128191 -31926065 -49106672 -46193197
10862d6193197K0996762J2996664n116799k016846J7895070K2211909M332572
$$ -46193197 -25196435 -12199771 -17316570 -19333416 -1438346 20773563 25106135
10855B5106135p705650n88769L461680j0689377k1833244q686214J2002254J2058580
$$ 25106135 17400485 16811716 20273396 9584019 -12249225 -20935439 -8933185 3125395
10847C125395l035839o652155M028330P958568l06489l409002M658173P310513
$$ 3125395 89556 -6562599 -2534269 5424299 5117810 1708808 6366981 13677494
10839A3677494l643665j2380252p164911j132833q089827j6398031p953873R944482
$$ 13677494 10033829 -2346423 -9511334 -10644167 -18733994 -35132025 -43085898 -33141416
10831c3141416J5071177N689412J395334R295233J3120173K216055r639494o503961
$$ -33141416 -18070239 -12380827 -10985493 -1690260 11429913 13645968 4006474 -2497487
10823b497487M588745O451342n94199j391838P988772J4118876P634744l752589
$$ -2497487 2091258 8542600 7948401 6556563 14545335 28664211 36298955 32546366
10815C2546366q950404q944856j0844455j4070760j1725992k800607N079348N574741
$$ 32546366 23595962 14651106 3806651 -10264109 -21990101 -24790708 -19711360 -14136619
10807a4136619R24411k237868r24884K452528M617999N169565N272509M284660
$$ -14136619 -13212208 -15450076 -16374960 -13922432 -9304433 -4134868 1137641 5422301
10799E422301K8414o990788j1797801r582143j478781O137739P969900M189290
$$ 5422301 5450715 -1540073 -13337874 -22920017 -24398798 -18261059 -10291159 -6101869
10791f101869q13242k519521L66415N036708P063532M639835Q1797l028227l028938
$$ -6101869 -6915111 -9434632 -9068217 -4031509 3032023 7671858 7753655 4725428 1696490
10782A696490n70093K019788J553886k906410p302608o623731k258586j70804
$$ 1696490 1126397 3146185 4700071 1793661 -5508947 -12132678 -14391264 -14562068
10774a4562068m77543L831825J3798129J8301104Q773279o350320j2047692p275829
$$ -14562068 -15039611 -11207786 2590343 20891447 29664726 23314406 11266714 3990885
10766C990885l432844m569698l070437L111174L503683p271422j6733446j0590071
$$ 3990885 558041 -4011657 -7082094 -3970920 -467237 -7738659 -24472105 -35062176
10758c5062176N672374J3819764Q406095K167062M648183Q392283L150012o275473
$$ -35062176 -29389802 -15570038 -7163943 -4996881 -348698 8043585 11193597 4918124
10750D918124p546435q72932J596255m031908p747295m215458k712676r078063
$$ 4918124 -2628311 -3501243 -1904988 -5936896 -13684191 -17899649 -20612325 -29690388
10742b9690388j0891301L876080K2406319K0800948q44424j7454403j4141548
$$ -29690388 -40581689 -36705609 -14299290 6501658 5657234 -11797169 -25938717
10735b5938717j835070O485343J3199913K0040211J5890923l675880k1081532
$$ -25938717 -27773787 -21288444 -8088531 11951680 27842603 24166723 3085191
10728C085191j8683923l935147M145254K282296q64051m820347j3085588j6737417
$$ 3085191 -15598732 -19533879 -15388625 -13106329 -13970380 -18790727 -31876315 -48613732
10720d8613732m340646J5288452K0882415Q384094n386796p948986k607884M760398
$$ -48613732 -52954378 -37665926 -16783511 -8399417 -13786213 -21735199 -24343083 -19582685
10712a9582685J2813518J7458651J3169273L190153m173464p769064r548617m249654
$$ -19582685 -6769167 10689484 23858757 27048910 22875446 15106382 5557765 1308111
10704A308111J0090638J8144645N414585j4596271j6290951k406376J55531j3483604
$$ 1308111 11398749 29543394 34957979 20361708 4070757 1664381 1819912 -11663692
10696a1663692j6065768O422468K9436253K5764106K301327j6250865j9985612
$$ -11663692 -27729460 -21306992 8129261 33893367 36194694 19943829 -41783
10689d1783j3220012N0972J2675562J2350090n23111p851025j075164L821747
$$ -41783 -13261795 -13210823 -535261 11814829 11291718 3440693 2365529 6187276
10681F187276n816425j5964791j0602930q19861m114781j0575179N56958K0982746
$$ 6187276 370851 -15593940 -26196870 -27016731 -31131512 -41706691 -41149733 -20166987
10673b0166987K2356462J887512j2715827o598248L592527K192422j625282M021023
$$ -20166987 2189475 4076987 -8638840 -15237088 -11644561 -9452139 -11077421 -7056398
10665g056398J0255149M006814p606245q431664P32643N310740P63089l827833
$$ -7056398 3198751 7205565 -400680 -8832344 -8099701 -2788961 -2025872 -5853705
10657e853705l968536m764752n943455J579483J7307286K3912483J0130331r831650
$$ -5853705 -9822241 -14586993 -20530448 -18950965 -1643679 22268804 32399135 22567485
10649B2567485j4543529n646094k224004q824281j0546254j943280K752174k965828
$$ 22567485 8023956 2377862 153858 -8670423 -19216677 -21159957 -18407783 -21373611
10641b1373611l720252R135815J6689990K256850j6412287j2372805O387798R939940
$$ -21373611 -25093863 -15958048 731942 2988792 -13423495 -25796300 -19408502 -9468562
10633i468562l941679q296469M854085J1177283k441114j4709146o295732Q786503
$$ -9468562 -13410241 -21706710 -16852625 -5675342 -8116456 -22825602 -29121334 -20334831
10625b0334831Q651057j559633l094203L470526K297196q501035j2846904j370331
$$ -20334831 -11683774 -13243407 -16337610 -12867084 -10569888 -19070923 -31917827 -33288158
10617c3288158J4486358J6458397J592826j2533360o829703J3937336K3099095
$$ -33288158 -18801800 -2343403 -750577 -13283937 -20113640 -6176304 16922791
10610A6922791P220350j2530526j0187125N877225Q141685m661374r288897k171706
$$ 16922791 24143141 11612615 1425490 7302715 15444400 10783026 1494129 -677577
10602f77577m536966j8043869j4747994J3915808L5077713K2860949l434758j4104034
$$ -677577 -5214543 -23258412 -38006406 -24090598 10987115 33848064 30413306 16309272
10594A6309272j2159547j3359233j0329593R295958K8833897K2452262k656687
$$ 16309272 4149725 -9209508 -19539101 -10243143 18590754 41043016 38386329
10587C8386329j6433650j0405915k526753l330739n171559k931282j218192j311445
$$ 38386329 21952679 11546764 9020011 5689272 517713 -2413569 -3631761 -4943206
10579d943206p3375K17342k943207k566619O343314J2973060N629608p307984
$$ -4943206 -5016581 -4799239 -7742446 -10309065 -3965751 9007309 14636917 7328933
10571G328933r620311k855621o30755m277495m229869n76852k178096q051422
$$ 7328933 -2291378 -5146999 -5777754 -10055249 -14285118 -14861970 -17040066 -25091488
10563b5091488p982726l72252O286125Q336813R602551J0887784Q935102M111054
$$ -25091488 -33074214 -33446466 -27160341 -18823528 -9220977 1666807 10601909 14712963
10555A4712963j53085k655644l019038j001429j359464r323518j7489453j1581001
$$ 14712963 14559878 11904234 8885196 7883767 6524303 -2799215 -20288668 -31869669
10547c1869669N661142J3948702N656813l435909k041820P43726j710120R4241
$$ -31869669 -26208527 -12259825 -6603012 -10038921 -12080741 -11337015 -13047135 -12952894
10539a2952894Q467050P603934p109194j5309956n871372K821309k465820m836665
$$ -12952894 -4485844 3118090 -3991104 -19301060 -25172432 -22351123 -24816943 -29653608
10531b9653608Q417429J7608486O093319o609577m08663O521564p906705k4704816
$$ -29653608 -21236179 -3627693 2465626 -4143951 -4552614 1968950 -5937755 -30642571
10523c0642571j5192729P312374J1608148K691860N476453J3691944L913988j4388238
$$ -30642571 -45835300 -38522926 -26914778 -24222918 -18746465 -5054521 -1140533 -15528771
10515a5528771j2451785M849094P776796m904605p834644K576974O337258J69914
$$ -15528771 -27980556 -23131462 -15354666 -20259271 -28093915 -25516941 -19179683 -19009769
10507a9009769k199250j984579p901176r220551L799231J0397763o993909k2912150
$$ -19009769 -21209019 -23193598 -31094774 -40315325 -36516094 -26118331 -33112240 -56024390
10499e6024390j0333375P424403J333583l459190J9705277K9286042j3631337
$$ -56024390 -66357765 -58933362 -57599779 -61058969 -41353692 -12067650 -25698987
10492b5698987m9347452j0533300K7097437o1188626k07308069j84694532N8945708
$$ -25698987 -75046439 -85579739 -58482302 -119670928 -326978997 -511673529 -452727821
10485d52727821K77296813K42233779M2889347p0241081k9627442K6215475Q304306
$$ -452727821 -175431008 66802771 109692118 39451037 9823595 36039070 44343376
10478D4343376k3264565r700618J2667194L975020r028433P61637Q787736n096255
$$ 44343376 21078811 11378193 24045387 28020407 18991974 19753611 28541347 23445092
10470B3445092j4521967J274513J6363591M251310j7133593j7987870j491437
$$ 23445092 8923125 10197638 26561229 30812539 13678946 -4308924 -5800361
10463e800361J0058215Q679694L71717q202896r206196K243362J5826232J5307681
$$ -5800361 4257854 12937548 13309265 5106369 -4099827 -1856465 13969767 29277448
10455B9277448K713023n283882m342257m968590r610197r420119l227489J129165
$$ 29277448 31990471 26706589 22364332 17395742 7785545 -1634574 -4862063 -3732898
10447c732898K951580O839844Q557236J991090n605704m617907q69848k456392
$$ -3732898 -781318 6058526 14615762 16606852 11001148 6383241 5513393 3057001
10439C057001j046618J0016031J3645676n182184k5020928j4841693J3818397
$$ 3057001 2010383 12026414 25672090 20489906 -4531022 -19372715 -5554318
10432e554318K0756195k58629j3734294j061015J3258133N661067j0963577j2959898
$$ -5554318 15201877 14943248 1208954 147939 13406072 19067139 8103562 -4856336
10424d856336o78554J0163155J2789453R522129J455323r329440j5990029j3121146
$$ -4856336 -5534890 4628265 17417718 26939847 28395170 19065730 3075701 -10045445
10416a0045445j551567J3288401K1629444J3882804m931554j3908208l106209
$$ -10045445 -11597012 1691389 23320833 37203637 32272083 18363875 15257666
10409A5257666Q767701J149001j5221663j4750228K295599J1828479M063813p001334
$$ 15257666 24025367 25174368 9952705 -4797523 -2501924 9326555 13390368 6389034
10401F389034j0640666j0046491n643103O719802J8324199J2750485o608879j6100470
$$ 6389034 -4251632 -14298123 -19941226 -13221424 5102775 17853260 11244381 -4856089
10393d856089m798924J1232211J3587370L695599n284970n111427K985023R944599
$$ -4856089 -9655013 1577198 15164568 18860167 13575197 8463770 11448793 21393392
10385B1393392N087702j0048557j8843343j0994754K062404O027534N347058Q538294
$$ 21393392 26481094 16432537 -2410806 -13405560 -11343156 -5315622 31436 8569730
10377H569730O854554q488464k1189642j0868570J0658603J5248562L175764j464606
$$ 8569730 15424284 6935820 -14253822 -25122392 -14463789 784773 3960537 2495931
10369B495931M796972J736008j2811908j5782106P6919J2913177R227551K606016
$$ 2495931 7292903 9028911 -3782997 -19565103 -19488184 -6575007 2652544 5258560
10361E258560L934693L395724m705799p498516J368805P542789J386991n819031
$$ 5258560 9193253 12588977 7883178 384662 1753467 9296256 10683247 4864216
10353D864216m780053m118806r364733r076830K404993J0059242K887158o251919
$$ 4864216 84163 -4034643 -13399376 -22476206 -20071213 -10011971 -7124813 -13376732
10345a3376732k879533M995140K884364n659092q085946l347511K313000P896098
$$ -13376732 -16256265 -11261125 -8376761 -14035853 -22121799 -25469310 -23156310 -15260212
10337a5260212J2181399Q530841j665832m179477N661391J0698425j726945j5777512
$$ -15260212 -3078813 5452028 3786196 -393281 5268110 15966535 14239590 -1537922
10329a537922r420972J0359753J6865701K515863j3224414j4014556n344971M11305
$$ -1537922 -10958894 -599141 16266560 18782423 5558009 -8456547 -13801518 -13390213
10321a3390213J446843J624345l97266o848159j0779100j366479J8684373K9789439
$$ -13390213 -11943370 -10319025 -10716291 -17564450 -28343550 -29710029 -11025656 18763783
10313A8763783J7403965p168402j9055872j1989472l602861n226585m990882P527057
$$ 18763783 36167748 28999346 9943474 -2045998 -5648859 -10875444 -15866326 -8339269
10305h339269J8236068R744412p817055j0872528Q46381O561700n82572o138972
$$ -8339269 9896799 19641211 11824156 951628 1798009 8359709 7777137 1638165
10297A638165j791704M033564N531437P229611Q901086L683288n246726o501878
$$ 1638165 -153539 3880025 9411462 16641073 25542159 29225447 23978721 17476843
10289A7476843k014265n582141j6563612j7599675l902932P772316O338811N96790
$$ 17476843 15462578 9880437 -6683175 -24282850 -28185782 -20413466 -14074655 -13477865
10281a3477865j344120m692449j0900077r680803J167529Q140172M965093L401370
$$ -13477865 -14821985 -19514434 -30414511 -40095314 -38927785 -30787613 -25822520 -22421150
10273b2421150J0358843J4656665Q802452L612324P144731Q675201n71756q901114
$$ -22421150 -12062307 2594358 11396810 15009134 22153865 30829066 30257310 21356196
10265B1356196l695207O224660N434985m064723j0147418r806842n831543L383457
$$ 21356196 17660989 23885649 29320634 25255911 15108493 5301651 -529892 2853565
10257B853565J5141138J5879274l6400j6047232j4980420m611345l498018j0194093
$$ 2853565 17994703 33873977 33837577 17790345 2809925 -1801420 -5299438 -15493531
10249a5493531p037327R740748K3658170K2202873J1036579J189468m869994r747255
$$ -15493531 -22530858 -12790110 10868060 33070933 44107512 45296980 40426986 30679731
10241C0679731j3038570j2708245j0241538r442634j0524552q876364k442444
$$ 30679731 17641161 4932916 -5308622 -14751256 -25275808 -34152172 -36594616
10234c6594616K056936k777842j0519285n785210J1455280K0436217Q969995o717549
$$ -36594616 -34537680 -37315522 -47834807 -53620017 -42164737 -21728520 -12758525 -19476074
10226a9476074p502166j384583n629836j2709115l352966J5326551J8293846N781506
$$ -19476074 -26978240 -28362823 -33992659 -46701774 -50054740 -34728189 -16434343 -10652837
10218a0652837K548012J2684087J2426602n201504j6271175q534806j570699p915783
$$ -10652837 -8104825 4579262 17005864 11804360 -4466815 -13001621 -14572320 -22488103
10210b2488103r399588O469590J9087854R112781p762900q235149J701496M535036
$$ -22488103 -31887691 -25418101 -6330247 2782534 -4980366 -13215515 -11514019 -6978983
10202f978983M135442J2261326K0019117J1472680o985991j5840881j0567777
$$ -6978983 -2843541 9417785 29436902 40909582 33923591 18082710 7514933
10195G514933p94617O372241N708432p350131k1707201j5046064R739298J8193742
$$ 7514933 6720316 13092557 18800989 11450858 -10256343 -25302407 -15563109 2630633
10187B630633l937117k1827855m107372K4546435K1839278m600575j2999029M238702
$$ 2630633 -1306484 -23134339 -27241711 -2695276 19144002 14543427 1544398 5783100
10179E783100J5041096M463428q196894r945221j0530627j3039967n134173J1708936
$$ 5783100 20824196 25287624 17090730 7145509 -3385118 -16425085 -21559258 -9850322
10171i850322J6421454K133198j1195169p646227L910261P985102J867209q576977
$$ -9850322 6571132 8704330 -2490839 -10137066 -6226805 1758297 3625506 -4951471
10163d951471j5341177r138633Q855211J8519760M027758j8400334j9080468K403849
$$ -4951471 -20292648 -29431281 -20576070 -2056310 1971448 -16428886 -35509354 -33105505
10155c3105505J8428802J4619386K711342o432256j3618655j4364220r64525J5428185
$$ -33105505 -14676703 -57317 2654025 -3778231 -17396886 -31761106 -32725631 -17297446
10147a7297446J4102280m03060l063730Q392677Q853739q188988j6306826j584203
$$ -17297446 -3195166 -3598226 -6661956 1730721 10584460 2395472 -13911354 -15495557
10139a5495557J2700231O340791m615675J151183J3141058R741602m915199j1501758
$$ -15495557 -2795326 3545465 -1070210 80973 13222031 22963633 18048434 6546676
10131F546676p116725k009613K092303Q014041R327689J301501n641806k853763
$$ 6546676 -570049 -2579662 -487359 7526682 16854371 18155872 12514066 9660303
10123I660303j266047j1481464j9278215n926167J6891309K0137904J185980j2875785
$$ 9660303 8394256 -3087208 -22365423 -28291590 -11400281 8737623 9923603 -2952182
10115b952182o633647M744953M003251l403945l817997K056868M068708J08447
$$ -2952182 -9585829 -4840876 -837625 -4241570 -8059567 -6002699 -1933991 -1825544
10107a825544l080095j793708P18804N92050j817721l257412j530567J851856
$$ -1825544 -4905639 -6699347 -5980543 -5388493 -7206214 -10463626 -11994193 -10142337
10099a0142337L343694K326326J912096K703901k08658r148762j6197626j1014456
$$ -10142337 -6798643 -4472317 -2560221 143680 -64978 -9213740 -25411366 -36425822
10091c6425822M322912J5755911J4301908O317481L399282P292420R975699N734121
$$ -36425822 -32102910 -16346999 -2045091 4272390 7671672 14964092 24939791 30673912
10083C0673912k708447r335884j0579270n591152L121877P623152M88128j2616578
$$ 30673912 27965465 18629581 8050311 2459159 5581036 13204188 13692316 1075738
10075A075738j4322704J992324J8420455J3927143n359116j3881034l596986O550331
$$ 1075738 -13246966 -11254642 7165813 21092956 15733840 1852806 -1744180 4806151
10067D806151K476531m790671j563225N174973L126559k298294K45604M849849
$$ 4806151 7282682 2492011 928786 6103759 9230318 6932024 7177628 12027477
10059A2027477k019852j6104112k0198932j0082391L163773J2591711J8447377
$$ 12027477 10007625 -6096487 -26295419 -36377810 -33214037 -20622326 -2174949
10052b174949J6143874J749186j2787102j0772724L499611J0501312O026436L859431
$$ -2174949 13968925 15718111 2931009 -7841715 -4342104 6159208 12185644 16045075
10044A6045075P694765N175838n954491j0666716l080005L445143J586651J822488
$$ 16045075 23739840 28915678 22961187 12294471 9214466 12659609 14246260 16068748
10036A6068748P799498M264722j4776411k8328004j8497302L04652L873910n143059
$$ 16068748 23868246 28132968 13356557 -14971447 -33468749 -33164097 -29290187 -34433246
10028c4433246o160751M850896J3266559J1598683N657313r76487q528269j0014914
$$ -34433246 -40593997 -35743101 -22476542 -10877859 -5220546 -6197033 -14725302 -24740216
10020b4740216J353044J4575757J0532023q586473j8355580n998889J1838815
$$ -24740216 -23387172 -8811415 1720608 -6865865 -25221445 -31220334 -19381519
10013a9381519J4005262L616632l39432Q187827J5528465R098767n926824j4833172
$$ -19381519 -5376257 -1759625 -2099057 6088770 21617235 30716002 24789178 9956006
10005I956006j2272031o407901n028050m643840J993045J2331178J6025858R479900
$$ 9956006 -2316025 -8723926 -13751976 -18395816 -16402771 -4071593 11954265 21434165
9997B1434165l5980n869805q907367j0286521o615267J779762O048352M27064
$$ 21434165 21398185 15528380 6621013 -3665508 -10280775 -8501013 -2452661 -2025597
9989b025597p001796m242422O923748J2403382N058833n561585o113832K925375
$$ -2025597 -9027393 -13269815 -6346067 6057315 11116148 5554563 -559269 2366106
9981B366106Q062875R04195r960234r897335J607647R939963N868216k774911
$$ 2366106 10428981 11333176 1372942 -8524393 -6916746 3023217 8891433 6116522
9973F116522n281268l419250l140307j237563N957491R366465J85917j0538927
$$ 6116522 835254 -2583996 -5724303 -6961866 -1004375 8362090 8548007 -1990920
9965a990920o308750N019190P85173j6923437j9811088J462556J9863404J3942022
$$ -1990920 -8299670 -3280480 -2495307 -19418744 -39229832 -37767276 -17903872 -3961850
9957c961850k72652m7141N654516m043052k1275877j9999830J309381J7665476
$$ -3961850 -4234502 -4281643 1372873 -2670179 -23946056 -43945886 -42636505 -24971029
9949b4971029J6076919Q701247N932387J961606o521677r247376j41227R793373
$$ -24971029 -8894110 -192863 5739524 7701130 1179453 -8067923 -8209150 1584223
9941A584223P737902l494437j1137609p714496M067528J4402055J2626330j118408
$$ 1584223 9322125 5827688 -5309921 -13024417 -8956889 5445166 18071496 16953088
9933A6953088j0776705k498919J2452563Q807527j5215545l0049248j4807315
$$ 16953088 6176383 3677464 16130027 24937554 9722009 -20327239 -35134554
9926c5134554J1622275J6550264p84106j1103557L50815J3994665P489931j1530312
$$ -35134554 -23512279 -6962015 -7746121 -18849678 -18498863 -4504198 2985733 -8544579
9918h544579j8868983q856156J965540K928593K057720O413386P094911m346008
$$ -8544579 -27413562 -36269718 -34304178 -31375585 -29317865 -22904479 -15809568 -20155576
9910b0155576j7149253j5074123j894935M079015k018013p014666l303618J715764
$$ -20155576 -37304829 -52378952 -54273887 -50194872 -52212885 -59227551 -62531169 -60815405
9902f0815405L616601R310776J9517763K0744549O186579j0616463j5438859j2578665
$$ -60815405 -57198804 -47888028 -28370265 -7625716 -1439137 -12055600 -27494459 -40073124
9894d0073124j1680856j0935997r318048j8670355m0638438m5106603j949447
$$ -40073124 -51753980 -62689977 -72008025 -90678380 -131316818 -176423421 -178372868
9887a78372868O8906543J08749133Q6752405L2003142p544547j5890850q847967
$$ -178372868 -109466325 -717192 86035213 118038355 110493808 94602958 85754991
9880H5754991l686078n464436j2158245j7762756j4350663r32035J2141272J3368144
$$ 85754991 82068913 76604477 64446232 46683476 32332813 31400778 43542050 56910194
9872E6910194K250486j1399281j6803528j0071423K582674R360878N159076k641938
$$ 56910194 59160680 47761399 30957871 20886448 23469122 32830000 37989076 35347138
9864C5347138n598412n817969p755810o190036L627345J0470187P45418j5589041
$$ 35347138 29748726 23930757 16174947 9984911 13612256 24082443 24827861 9238820
9856I238820j4872397L325082J3056875J847100j0710154n754838O165959N912099
$$ 9238820 -5633577 -2308495 10748380 12595480 1885326 -3869512 2296447 8208546
9848H208546l426929o193087r90218K119526J589313K690278L003594k736292
$$ 8208546 4781617 -1411470 -2401688 -282162 1307151 3997429 7001023 4264731
9840D264731q681511n030844N108194J0604011R611684Q282260P357156M074830
$$ 4264731 -4416780 -9447624 -4339430 6264581 15876265 24158525 31515681 35590511
9832C5590511K058519M841318N243918l393696j1389066n374726Q414951J2348808
$$ 35590511 37649030 42490348 47734266 44340570 32951504 27576778 35991729 48340537
9824D8340537M894191l89958n57749n344092j3493538j1312651R12842N029685
$$ 48340537 53234728 52844770 52287021 46942929 33449391 22136740 23049582 28079267
9816B8079267m776379j0996138k845383M922027j989268j2484948r622132Q16890
$$ 28079267 23302888 12306750 9461367 14383394 12394126 -90822 -9712954 -8896064
9808h896064K066817m634350m589121L351827N916736l2660k027000N754083J1311624
$$ -8896064 -6829247 -11463597 -16052718 -12700891 -6784155 -6816815 -8843815 -3089732 8221892
9799H221892K951912j2631530j8790053r866169L509340Q807239N977342M606922
$$ 8221892 11173804 -1457726 -20247779 -30113948 -26604608 -17797369 -11820027 -7213105
9791g213105Q581866R867054J737769p927929o251729M712771R961906L623129
$$ -7213105 1368761 11235815 12973584 5045655 -1206074 3506697 13468603 17091732
9783A7091732m388600o350917o857019r467268p727713J972577J1006512J0971973
$$ 17091732 12703132 6352215 -504804 -9972072 -17699785 -15727208 -4720696 6251277
9775F251277M538098l562468j3421126j9978634j1805320R160423K2415790J6197749
$$ 6251277 10789375 7226907 -6194219 -26172853 -37978173 -28817750 -6401960 9795789
9767I795789L801956r90465n274170j5540282j6370698L253335K0979992J0694337
$$ 9795789 13597745 12607280 7333110 -8207172 -24577870 -21324535 -344543 10349794
9759A0349794j2358766j1993679J1417452K2242877O351396j2414983j6012458
$$ 10349794 -2008972 -14002651 -2585199 19657678 26009074 13594091 -2418367
9752b418367j4014911j3461324m408488J1412637J2780354l830598j2045337J492876
$$ -2418367 -16433278 -29894602 -34303090 -22890453 -10110099 -13940697 -25986034 -24493158
9744b4493158J4389178R129844L229313J2790340J7897250k486162k7477729k3814919
$$ -24493158 -10103980 -974136 2255177 15045517 32942767 30456605 2978876 -20836043
9736b0836043O92682J1897011L989084O7871N891726L016454j2035521j8573469
$$ -20836043 -20143361 -8246350 -4257266 -4189395 1702331 4718785 -7316736 -25890205
9728b5890205p572852M367064M918693L094346P202470R159931J733424p148795
$$ -25890205 -33463057 -29095993 -24177300 -21082954 -13880484 -4720553 -2987129 -10135924
9720a0135924p776836k202384L367805P517808R315388O214007N30572j581698
$$ -10135924 -17912760 -20115144 -16747339 -9229531 85857 6299864 6830436 5248738
9712E248738M05551J742066J184685J943m181938j1353079j2330976j631478R070096
$$ 5248738 5654289 7396355 8581040 8582983 4401045 -6952034 -19283010 -20914488 -11844392
9703a1844392O349709k547338j410337O865777N814814m877641r061156k434363
$$ -11844392 -5494683 -8042021 -9452358 -2586581 3228233 -1649408 -10710564 -13144927
9695a3144927L038317L549870P402356J2406673N252738j1779653j8987661j0307433
$$ -13144927 -10106610 -6556740 845616 13252289 18505027 6725374 -12262287 -22569720
9687b2569720q89758K759436J2196147K6867615K4610211j233286k2448454j4805832
$$ -22569720 -23459478 -20700042 -8503895 18363720 42973931 41740645 19292191 4486359
9679D486359O094643J0554965k073698r884263m300071M016161O368914L106429
$$ 4486359 10581002 21135967 19062269 9178006 4877935 8894096 15263010 18369439
9671A8369439m032137j0677205q049018L914809J0223721O49442j3617572j5932646
$$ 18369439 14337302 3660097 -4388921 -474112 9749609 10399051 -3218521 -19151167
9663a9151167o708232K514004O349999M404938m532235j3685378p951504J2092877
$$ -19151167 -25859399 -23345395 -16995396 -12590458 -17122693 -30808071 -38759575 -26666698
9655b6666698K1282077L944560j8264445j5707642N031647J3373499K533729m950682
$$ -26666698 -5384621 -1440061 -19704506 -35412148 -30380501 -17007002 -14473273 -19423955
9647a9423955K403263R236358L839265j705030N777601J6365077J1058128r121027
$$ -19423955 -17020692 -7784334 -3945069 -5650099 127502 16492579 27550707 18429680
9639A8429680k1926671j1597819J0056093J6016192j746250j8548074q224359
$$ 18429680 -3496991 -15094810 -5038717 10977475 9231225 -9316849 -17541208
9632a7541208J8010981K4331046K596597j5169944p118763N266968l659876j8299082
$$ -17541208 469773 24800819 27397416 12227472 5108709 10375677 6715801 -11583281
9624a1583281q194079J8548590K6145532P085363j0338288r235715l263020m358493
$$ -11583281 -19777360 -1228770 24916762 32002125 21663837 12428122 9165102 4806609
9616D806609m417075J736688L776757k292270m044908M181426R777928M801906
$$ 4806609 389534 2126222 5902979 3610709 -434199 3747227 13525155 18327061
9608A8327061m3761L659681O258927j306527r480364n348671O183952R729795
$$ 18327061 18283300 21942981 28201908 26895381 17415017 12066346 18250298 27980093
9600B7980093j51383j5022386k2228109j3687669O752855K2551471K0737641Q658761
$$ 27980093 27828710 12806324 -9421785 -23109454 -16356599 6194872 26932513 35591274
9592C5591274K615418L137120j162160q376365n244840N149783M269528q090616
$$ 35591274 38206692 41343812 40181652 31805287 26560447 31710230 35979758 27889142
9584B7889142r240611P078789J5742359L98690j8608990j6970843k917042K713698
$$ 27889142 18648531 25727320 41469679 41868369 23259379 6288536 3371494 6085192
9576F085192J561342N755184Q387802l572226j8493420j3607628O165650J2934967
$$ 6085192 7646534 13401718 21789520 18217294 -276126 -13883754 -7718104 5216863
9568E216863j269599j4296864j0166730m3886J200274j953355J857819R944068
$$ 5216863 3947264 -10349600 -20516330 -20560216 -19359942 -21313297 -19455478 -9511410
9560i511410J0190783j83757j0082254p159628Q592653K3227462K1960769N750949
$$ -9511410 679373 495616 -9586638 -16746266 -8153613 15073849 37034618 42785567
9552D2785567r228454j1635015p519385p202371q416975k904466O715806R445391
$$ 42785567 33557113 21922098 14402713 7200342 -1216633 -4121099 2594707 12040098
9544A2040098K846521l761377k732442L719982Q339846N852489k826978r169370
$$ 12040098 14886619 11125242 8392800 12112782 20452628 26305117 23478139 14308769
9536A4308769m710904N744495O913215m867675j3185519n086817Q148365P689331
$$ 14308769 9597865 15342360 22255575 17387900 4202381 -884436 7263929 14953260
9528A4953260m608739j1158737n649467K168940N321779O379328O487155L029932
$$ 14953260 10344521 -814216 -6463683 -4294743 1027036 7406364 13893519 16923451
9520A6923451j611086k274932j359361m441039p642680k919788O295111R319249
$$ 16923451 15312365 13037433 11678072 7237033 -405647 -3325435 2969676 12288925
9512A2288925O084570N190514N785163j227166j3635218j7565792r104819P89747
$$ 12288925 18373495 23564009 29349172 28122006 14486788 -3079004 -12183823 -11394076
9504a1394076N764592J0772602J5368231R244057p993403j9681028j4363655j216681
$$ -11394076 -5629484 5143118 20511349 29755406 21762003 2080975 -12282680 -13499361
9496a3499361N658188N268549L498068J710311O55593L773831P832692K438142
$$ -13499361 -7841173 -2572624 925444 2635755 3291348 7065179 14897871 17336013
9488A7336013j1934374j8171053n975482J0427435J0850092l457614j3545119
$$ 17336013 5401639 -12769414 -18744896 -8317461 2532631 -924983 -14470102
9481a4470102p416819R821464K4709391K5320491Q751216j2928553k0809156j0521293
$$ -14470102 -21886921 -12065457 12643934 37964425 46715641 33787088 12977932 2456639
9473B456639K231414L898486J24400K068533P784905R113149O497819L832287
$$ 2456639 4688053 8586539 8710939 10779472 18564377 27677526 34175345 38007632
9465C8007632j799601j1486656j5204010o357117L472318J075940n666891q50335
$$ 38007632 36208031 24721375 9517365 3160248 6632566 7708506 2041615 1191280
9457A191280J0575445R020829p416440j9062576j4011019q98176R704899J6426721
$$ 1191280 11766725 20787554 13371114 -5691462 -19702481 -20600657 -10895758 5530963
9449E530963J6204097L238142j4483787j7372846k054546J0873444P067196j120357
$$ 5530963 21735060 24973202 10489415 -6883431 -8937977 1935467 9002663 7882306
9441G882306K655053J1671089Q549585o400329j6599087j2947239j541887Q453798
$$ 7882306 10537359 22208448 30758033 24357704 7758617 -5188622 -6730509 1723289
9433A723289J2523567R492653K586171j000226J055814K488768m49820k322697
$$ 1723289 14246856 23739509 26325680 25325454 26381268 28870036 28420216 26097519
9425B6097519l23693j790769r144942r776096L366421J2945480M03112k0273738
$$ 26097519 25773826 23983057 14838115 5062019 8428440 21373920 21777032 1503294
9417A503294j8152040P286227K2973651J1683002m259854k002330N735392m104186
$$ 1503294 -16648746 -9362519 13611132 25294134 21034280 19031950 24767342 20663156
9409B0663156k3016800k2764516o51017J5542213R173816l315586m37036J3281466
$$ 20663156 -2353644 -25118160 -25769177 -10226964 -1053148 -4368734 -4805770 8475696
9401H475696J7746856P786613j955982j66136N743785K056408j0145724j4998710
$$ 8475696 26222552 34009165 32053183 31887047 37630832 39687240 29541516 14542806
9393A4542806m266418Q529287N056651j0817414j6538257l505912R465915M591469
$$ 14542806 10276388 18805675 23862326 13044912 -3493345 -6999257 2466658 7058127
9385G058127p650535n896552P814881J2118209Q48286q860179n346638J940958
$$ 7058127 -592408 -6488960 1325921 13444130 14292416 5432237 85599 2026557
9377B026557K584621J663394N360772O887283M43803m484562J596020R315957
$$ 2026557 4611178 6274572 11635344 18522627 18966430 14481868 16077888 25393845
9369B5393845L926651r627808j2942558k051087P942312N986964k338109p345324
$$ 25393845 29320496 19692688 6750130 4699043 12641355 18628319 16290210 8944886
9361H944886p278437m572002o78366K073330J796222J802691N944900R372678
$$ 8944886 1666449 -2905553 -3583919 -1510589 285633 2088324 8033224 17405902
9353A7405902M016792o421297q865001n23923O287056L254634k730476m089053
$$ 17405902 21422694 15001397 6136396 5612473 11899529 15154163 12423687 8334634
9345H334634n294075j0626047j0719686L405623J9581837J5925132o583795k0488678
$$ 8334634 3040559 -7585488 -18305174 -14899551 4682286 20607418 14023623 -6465055
9337f465055q044200J3254524J4384752m902739j7302209q404827M193434J306353
$$ -6465055 -14509255 -1254731 13130021 8227282 -9074927 -17479754 -13286320 -11979967
9329a1979967o367854L247712K3710438K4769043j644606k5970325k2199918k421233
$$ -11979967 -18347821 -15100109 8610329 33379372 31734766 5764441 -16435477 -18856710
9321a8856710O233239R28178j836961K534964M495174K203706K288226K698592
$$ -18856710 -12623471 -11695293 -13532254 -10997290 -6502116 -4298410 -2010184 688408
9313F88408k900818o966440J929306J3199150N455234j4916635j6449058Q317795
$$ 688408 -2212410 -9178850 -7249544 5949606 11404840 -3511795 -19960853 -11643058
9305a1643058K6799173J4447931q662541j0729740M344637Q382884o022068j8325554
$$ -11643058 15156115 29604046 20941505 10211765 14556402 22939286 16917218 -1408336
9297a408336j2834567K901634J2580042R634799N89444k389532N527540J3801245
$$ -1408336 -14242903 -11341269 1238773 10873572 11463016 9073484 14601024 28402269
9289B8402269R386136k315794m885661n87890q939167k8244171k8293236R98537
$$ 28402269 37788405 35472611 30586950 29999060 21059893 -7184278 -35477514 -34478977
9281c4478977K4104788J0786713j4429926r898606J7009341K4771202O482220
$$ -34478977 -10374189 412524 -14017402 -23916008 -6906667 17864535 24346755
9274B4346755m038651O494620J1680295k811655j2718322M77851J5461988N977007
$$ 24346755 20308104 26802724 38483019 35671364 22953042 23430893 38892881 44869888
9266D4869888j7768171k7825428j8335396l562152P460597J2857481Q258982m344797
$$ 44869888 27101717 -723711 -19059107 -22621259 -15160662 -2303181 5955801 1611004
9258A611004r309376K265728J4893384R743911n864322r465707K300459J0331447
$$ 1611004 -7698372 -5432644 9460740 19204651 13340329 3874622 6175081 16506528
9250A6506528K497388j0995902j4174884m558061P909492J3210555R353773K059634
$$ 16506528 19003916 8008014 -6166870 -10724931 -2815439 10395116 19748889 21808523
9242B1808523k121669k609355k740110k649702n41545K20659m862071r911983
$$ 21808523 19686854 17077499 14337389 11687687 11146142 11366801 6504730 -3407253
9234c407253l681618J0861925J5997942M835174o447355j915713J0520192J1364465
$$ -3407253 -7088871 3773054 19770996 24606170 18158815 16243102 26763294 38127759
9226C8127759k949395j7585623j9658757j0411547J67056L167446k207136o751742
$$ 38127759 35178364 17592741 -2066016 -12477563 -12310507 -9143061 -11350197 -18101939
9218a8101939q44794J1204466J4150381L003975q651413p665485J490932O563918
$$ -18101939 -18946733 -7742267 6408114 9412089 760676 -6904809 -5413877 1150041
9210A150041N056490K426549P42262q11023k58841L056417L901199j228111p045486
$$ 1150041 6206531 8633080 9375342 8564319 8305478 11361895 15263094 14034983 6989497
9201F989497p266860l976967k303369j405708K279569P747449J1145758J0123267
$$ 6989497 -277363 -4254330 -6557699 -7963407 -5683838 2063611 13209369 23332636
9193B3332636L224501q114896j4719082p090771Q505347J3456989K176046q822206
$$ 23332636 26557137 18442241 3723159 -3367612 5137735 18594724 20770770 11948564
9185A1948564n225919M748694N088089m248530j0519888o881266L046802J2338926
$$ 11948564 6722645 11471339 16559428 12310898 1791010 -5090256 -2043454 10295472
9177A0295472J3706596K910848j2935459j8743384r891651K124983P815689J0674824
$$ 10295472 24002068 26912916 13977457 -4765927 -14657578 -12532595 -4716906 5957918
9169E957918J3474988R164823m248528j4403541j1929494l844326R55769M787231
$$ 5957918 19432906 28597729 24349201 9945660 -1983834 -5828160 -4872391 -85160
9161h5160Q854077M955223p089586j1340128m29704R388499M609872k923625R09928
$$ -85160 8768917 13724140 6634554 -4705574 -5135278 4253221 8863093 5939468 6849396
9152F849396O230984j068930j1266040q260051O84277l30150n679697r09735P815237
$$ 6849396 13080380 12011450 745410 -7514641 -6830364 -7160514 -12840211 -13749946 -5934709
9143e934709O447691K522308J0294523J8128138N344153j7323852k0884809o087067
$$ -5934709 512982 3035290 13329813 31457951 36802104 19478252 -1406557 -7493624
9135g493624k68254q454257o982894J0979335K1787473J1484920l821876p404304
$$ -7493624 -7761878 -16216135 -23199029 -12219694 9567779 21052699 17230823 9826519
9127I826519k805431K578479P906657P471525m316583j3762504k757194J5983765
$$ 9826519 7021088 9599567 17506224 24977749 20661166 6898662 4141468 20125233
9119B0125233J1976169j2079983k0025052J08750J7667126J0679862l420214m846544
$$ 20125233 32101402 20021419 -3633 105117 17772243 28452105 25031891 20185347
9111B0185347k049906n457489n026321M427683P131179l124679p369781K521193
$$ 20185347 18135441 12677952 7651631 12079314 19210493 16085814 8716033 11237226
9103A1237226M874480j0915779j8314530K509850K6097669K0240971l638047j3488297
$$ 11237226 16111706 5195927 -13118603 -10608753 15488916 35729887 32091840 18603543
9095A8603543p120638m019409n826301j027036N631355K421527l056620J703495
$$ 18603543 11482905 7463496 1637195 610159 6241514 8663041 5606421 7309916
9087G309916O213245m805805j7799124q466760J5913884K5481564J2708304k968111
$$ 7309916 13523161 8717356 -9081768 -17548528 -1634644 23846920 36555224 33587113
9079C3587113j0034157j3837153j4402248m971532Q452360J2061826P078320M818820
$$ 33587113 23552956 9715803 -4686445 -9657977 -1205617 10856209 17934529 22753349
9071B2753349L973842l641051j1370150p085359K328122J673153m843771l742132
$$ 22753349 26727191 23086140 11715990 4630631 6958753 8631906 3788135 46003
9063D6003j129471j0374019j9143524m610843K2467950K7267060N494662j0228698
$$ 46003 -1083468 -11457487 -30601011 -35211854 -12743904 14523156 20017818 9789120
9055I789120l798186L635352l350020r072585q83872N841659k120259r873082
$$ 9789120 5990934 9626286 6276266 -2796319 -3680191 2161468 41209 -9831873
9047i831873j662320J0228450P787841j515160j93002Q219906P650789k152498
$$ -9831873 -11494193 -1265743 6522098 5006938 4813936 13033842 20684631 18532133
9039A8532133q213912p630472p815500q466511k263610Q160114J0398062P93551
$$ 18532133 10318221 2687749 -5127751 -13594262 -15857872 -7697758 2700304 3493855
9031C493855r463024r215046J8726Q459223R521449M672042n38520l386775n647671
$$ 3493855 -5969169 -15184215 -15165489 -6706266 2815183 7487225 6948705 3561930 -2085741
9022b085741p802656n542203L255460J1508849J0143765O34986p151089q507739
$$ -2085741 -9888397 -15430600 -12175140 -666291 9477474 10112460 2961371 -5546368
9014e546368p501057p651445o946719k838052L836782R950422J1064048M196215
$$ -5546368 -13047425 -20698870 -27645589 -30483641 -26646859 -16696437 -5632389 -1436174
9006a436174o036673r349734l415986J614843p45016k024342O153424J5530164
$$ -1436174 -7472847 -16822581 -20238567 -18623724 -19368740 -21393082 -15239658 290506
8998B90506J3328272K757572l537221l550859l834556l900849O04813M815077
$$ 290506 13618778 16376350 12839129 9288270 5453714 1552865 2157678 6972755
8990F972755J783366k649483N71325N368385O58723p397341m519187N308747N537296
$$ 6972755 8756121 6106638 6677963 12046348 12705071 5307730 788543 6097290 11634586
8981A1634586m031008p793086k216750J015324o37533K310763Q985077P606586
$$ 11634586 7603578 -189508 -2406258 -1390934 -2028467 282296 9267373 16873959
8973A6873959p16870k183482L619306K847501n334705p052882j800396l902775
$$ 16873959 16157089 13973607 17592913 20440414 15105709 8052827 6252431 2349656
8965B349656j2272611r210404M876934Q071151l363196o271476O431209J0108458
$$ 2349656 -9922955 -19133359 -14256425 -6185274 -9548470 -15819946 -9388737 719721
8957G19721p163755k0373425j0333725L301082r33890p690641M428481K0374704
$$ 719721 -6444034 -26817459 -37151184 -33850102 -34783992 -42474633 -38046152 -17671448
8949a7671448J3586699o380529q844419Q047498J7971101R724216k131446n943398
$$ -17671448 -4084749 -10465278 -19309697 -11262199 6708902 16433118 14301672 8358274
8941H358274m592605j206468L372353K693115n504263q583519K152018J2218989
$$ 8358274 3765669 2559201 5931554 8624669 3120406 -5463113 -3311095 8907894
8933H907894N492077p064210n564460M030011K582947n426988j166580R703192
$$ 8907894 14399971 7335761 1771301 5801312 8384259 2957271 1790691 11493883
8925A1493883M175695j4104497j6297712K439044J3463550L501781m739418L918004
$$ 11493883 15669578 1565081 -14732631 -12293587 1169963 4671744 -67674 3850330
8917C850330R247892n766020j9760915o445311J9289453K1789009j701561j9942808
$$ 3850330 13098222 7332202 -12428713 -18874024 415429 22204438 20502877 560069
8909E60069j5091690j330524N069505O981023R739620O014837q346494j8537297
$$ 560069 -14531621 -15862145 -10792640 -3811617 5928003 11942840 3596346 -14940951
8901a4940951q196822J4205802K3121036R828814o089769m145740J0202005J5645555
$$ -14940951 -23137773 -8931971 14189065 24017879 17928110 13782370 23984375 39629930
8893C9629930M241369j1638729j8530641j5611351q692446k073739Q01616j366087
$$ 39629930 43871299 32232570 13701929 -1909422 -10601868 -12675607 -11873991 -13240078
8885a3240078k746603L522959J1863251Q759082n530209j3617418n901063N591213
$$ -13240078 -15986681 -12463722 -600471 8158611 2628402 -10989016 -16890079 -11298866
8877a1298866P413922L815692L195509L68449j0431703j6935612m248793J7887774
$$ -11298866 -3884944 -69252 3126257 3494706 -6936997 -23872609 -28121402 -10233628
8869a0233628K4575932J0127582o760955j1856314r906965p735545j930434R038928
$$ -10233628 14342304 24469886 17708931 5852617 -4054348 -11789893 -13720327 -4681399
8861d681399J5311620Q517066m465163r410148k048343Q337258J0311460J921978
$$ -4681399 10630221 19147287 14682124 5271976 3223633 11560891 21872351 23794329
8853B3794329q436524j1891443q590660m534514j151665M052185P132689M67548
$$ 23794329 15357805 3466362 -5124298 -9658812 -10810477 -6758292 374397 841945
8845H41945j1135593j1927649O75862R763667O177270L572483J2142444J7184368
$$ 841945 -10293648 -22221297 -21545435 -11781768 -5604498 -2032015 10110429 27294797
8837B7294797M417496j1691672j0979041l408036j0927064k5224904j9270045
$$ 27294797 31712293 20020621 9041580 5633544 -5293520 -30518424 -49788469
8830d9788469M572925J6038092P165411K077344J0169561R399366r509958k0229487
$$ -49788469 -45215544 -29177452 -22012041 -19934697 -9765136 -365770 -9875728 -30105215
8822c0105215m290330J5135482J0135018p184741o838917J1008282K0646626J1767427
$$ -30105215 -34395545 -19260063 -9125045 -16309786 -23148703 -12140421 8506205 20273632
8814B0273632j728051o891129k887780O949307J5003771Q840704j1150089k3090895
$$ 20273632 18545581 11654452 8766672 15715979 30719750 39560454 28410365 5319470
8806E319470j1578932O854541Q045689j919636n4045J1645160R890466p138924
$$ 5319470 -6259462 595079 8640768 6721132 6667087 18312247 28202713 21063789
8798B1063789j4952179n151112O78227r548600j6369522l828952J0662888N169582
$$ 21063789 6111610 960498 1638725 -7909875 -24279397 -28108349 -17445461 -12275879
8790a2275879q813126m929949J4123713K0208550L430532j4254496j2444153K024687
$$ -12275879 -21089005 -26018954 -11895241 8313309 11743841 -2510655 -14954808 -12930121
8782a2930121J0041769N096449n258181j1699928r231602P94317Q713733M241441
$$ -12930121 -2888352 2208097 -3050084 -14750012 -23981614 -23187297 -14473564 -10232123
8774a0232123q522771j2132408J445740J7524611J7401481L361840o762703n450196
$$ -10232123 -18754894 -30887302 -29441562 -11916951 5484530 8846370 2083667 -3366529
8766c366529j672851j737449L92338Q289810J2581395N585568l644930j854004
$$ -3366529 -5039380 -6776829 -6384491 1905319 14486714 20072282 16427352 14573348
8758A4573348P100317P992482j260037o765174k483176p25646j0945819k1743915
$$ 14573348 21673665 29666147 28406110 21640936 19157760 18432114 7486295 -14257620
8750a4257620j6870831l97776Q993155M825164j277172l52647K402792R66507
$$ -14257620 -31128451 -31526227 -22533072 -17707908 -18985080 -19337727 -16934935 -15968428
8742a5968428l45965L395156P703330P340010N947841P147052M632057o536951
$$ -15968428 -16314393 -12919237 -5215907 2124103 8071944 15218996 19851053 13314102
8734A3314102j6071528j1072033K134029N978004l62923k26310J1463717J9178866
$$ 13314102 -2757426 -13829459 -11695430 -5717426 -6080349 -6306659 5157058 24335924
8726B4335924J3227030M254303P98751o435793k2132497k8456576j1436540J1168707
$$ 24335924 37562954 41817257 42616008 36180215 14047718 -14408858 -25845398 -14676691
8718a4676691J4147419M326545O589484J9229867J6835247m108792j7433865j0377073
$$ -14676691 -529272 3797273 10386757 29616624 46451871 42343079 24909214 14532141
8710A4532141j187081l617233n639025K037314O386948n26556k601307R816816
$$ 14532141 13345060 9727827 4088802 6126116 12513064 11986508 9385201 19202017
8702A9202017J6365919m01551k0963168j6974889M325455J4210477O803409j394883
$$ 19202017 35567936 35166385 14203217 -2771672 1553783 15764260 22567669 21172786
8694B1172786m777220r955999j2541478m066189M726622j082461r186890K111805
$$ 21172786 16395566 6439567 -6101911 -10168100 -5441478 -6523939 -15710829 -13599024
8686a3599024K0494142J3526295j4500763k2846344Q34027J9411878O358533j3905856
$$ -13599024 6895118 20421413 5920650 -16925694 -16091667 3320211 9678744 -4227112
8678d227112r989580P368161J0441124J261431N5257O234850L884831n789675
$$ -4227112 -14216692 -6848531 3592593 4854024 4909281 11144131 15028962 9239287
8670I239287p583940p49819J868173j583467j318716L551109M261731m13874l700464
$$ 9239287 1655347 905528 2773701 1190234 -128482 3422627 7684358 7270484 3570020
8661C570020m011201l077299K918267J3808829J5170196k338569k0522047j4319550
$$ 3570020 -441181 -3518480 -600213 13208616 28378812 26040243 5518196 -8801354
8653h801354Q625319J5173586m756032k3206089j5849529N045873J3145349N301329
$$ -8801354 -176035 14997551 10241519 -12964570 -28814099 -23768226 -10622877 -5321548
8645e321548j243676J900052N800172K117406m734030n830195J81797P151574
$$ -5321548 -6565224 -4665172 1135000 3252406 -1481624 -7311819 -7130022 21552
8637B1552R831460Q315510M562818j304720p725420p992925K384131J4427532
$$ 21552 9853012 18168522 22731340 21426620 13701200 5708275 8092406 22519938
8629B2519938J1626652q515323k7704542k7658821r853941J1030428K3589420
$$ 22519938 34146590 25631267 -2073275 -29732096 -39586037 -28555609 -4966189
8622d966189K2558558P129777j2669119j9024700q535427j34009o527801j1736902
$$ -4966189 17592369 24722146 12053027 -6971673 -15507100 -15641109 -22168910 -33905812
8614c3905812K136419J9206705J0361195j6986988k4267490k68216K0367279R981781
$$ -33905812 -31769393 -12562688 -2201493 -19188481 -43455971 -43724187 -23356908 -13375127
8606a3375127j1837093j1732693P674556J7262841O085031q703876j0128704R14145
$$ -13375127 -25212220 -36944913 -29270357 -12007516 -5922485 -14626361 -24755065 -23840920
8598b3840920J3519459J7209079P329038q528401j4237628m875366N114615L628483
$$ -23840920 -10321461 6887618 14216656 5688255 -8549373 -13424739 -8310124 -4681641
8590d681641n35499N018784J2494351P070813m967447m490575P751950J0696765
$$ -4681641 -5217140 -198356 12295995 19366808 14399361 9908786 17660736 28357501
8582B8357501l244984j6605476j4660933m886618l74577o15278J210353M624229
$$ 28357501 25112517 8507041 -6153892 -11040510 -11415087 -12030365 -10820012 -6195783
8574f195783N206349K504249j985934o712561o866874P60607Q315072N093660
$$ -6195783 -989434 1514815 -471119 -7183680 -14050554 -13289947 -4974875 118785
8566A18785l540235j708556R822902J1939942q86750r221924j092876O690868
$$ 118785 -3421450 -5130006 4692896 16632838 15746088 6524164 5431288 12122156
8558A2122156k495667j5019195r126516Q221735J2721455R48388q931043q364122
$$ 12122156 9626489 -5392706 -14519222 -6297487 6423968 7372356 -1558687 -9922809
8550i922809m602534L44525J0718757J8010547P388181j4324463k2075363q616625
$$ -9922809 -14525343 -14180818 -3462061 14548486 21936667 7612204 -14463159 -23079784
8542b3079784O454277Q848370O325906N801400q03418j5396406k1420641q623145
$$ -23079784 -16625507 -7777137 -1451231 4350169 3546751 -11849655 -33270296 -41893441
8534d1893441Q455824J2622948Q422544Q768782J2256445J0225271L771689j865676
$$ -41893441 -33437617 -20814669 -12392125 -3623343 8633102 18858373 22630062 20764386
8526B0764386q481032j6343587j6362279m698881O934932Q859965P512423Q377264
$$ 20764386 12283354 -4060233 -20422512 -25121393 -18186461 -9326496 -1814073 6563191
8518F563191J943777j5604169k5370799j1962266Q632311J2528597N646866R693036
$$ 6563191 8506968 -7097201 -32468000 -44430266 -35797955 -23269358 -17622492 -7929456
8510g929456K1771823K0002249L238373p750849o942628q288408j3153616n901813
$$ -7929456 13842367 33844616 37082989 29332140 22389512 14101104 947488 -4954325
8502d954325J2341428J8109178L834442q456115m253668J379450n333262j0902297
$$ -4954325 7387103 25496281 29330723 20874608 16620940 18000390 12667128 1764831
8494A764831L63609J7249925J9373653P533266l702496r630745j2753117r377944
$$ 1764831 2128440 19378365 38752018 46285284 42582788 32952043 20198926 10820982
8486A0820982K033248R656708L564943o673776o318569J304408K552021l389041
$$ 10820982 12854230 22510938 26075881 19402105 13083536 14387944 16939965 13550924
8478A3550924o094652k735525P26603K717434O046371Q766222P695998O213736
$$ 13550924 7456272 4720747 5447350 8164784 14211155 22977377 30673375 36887111
8470C6887111O758698K313132j1339976k2012395j5438641J922221J0630860N552091
$$ 36887111 43645809 45958941 34618965 12606570 -2832071 -909850 9721010 15273101
8462A5273101o66075L38186L046290J107869m130806r615268j3133564r517439
$$ 15273101 14607026 14945212 17991502 19099371 14968565 5353297 -7780267 -17297706
8454a7297706L579447J5671912J1990032n725227j8452287j2947799M112441J7337886
$$ -17297706 -13718259 1953653 13943685 8218458 -10233829 -23181628 -19069187 -1731301
8446a731301J8576836R474243k564446p976770k610004N973146P058007K099409
$$ -1731301 16845535 26319778 23755332 15778562 13168558 19141704 26199711 28299120
8438B8299120J848268P081260M976669r492482k1081081j4560865R25897L021368
$$ 28299120 30147388 37228648 42205317 32712835 11631754 -2929111 -2003214 1018154
8430A018154j0354694j5520210K519688K4668045K1852631k697873j5560940m737
$$ 1018154 -9336540 -24856750 -22337062 2330983 24183614 21485741 5924801 5920064
8422E920064K0251156J6273476n217106j6469677j1530744q005102j1164552o369746
$$ 5920064 26171220 42444696 37227590 20757913 9227169 1222067 -9942485 -16312231
8414a6312231Q748500J4111256Q57924j0908274m336357P006451L773939p167319
$$ -16312231 -7563731 6547525 7405449 -3502825 -7839182 -832731 2941208 -4226111
8406d226111p879037j81891K778758K420664O855415Q318396m241010j8220991
$$ -4226111 -12105148 -12287039 -9508281 -7087617 -232202 8086194 3845184 -14375807
8398a4375807j2193480O599354R754910p104249j6915874m171974J3257275J5204238
$$ -14375807 -26569287 -19969933 -10215023 -17319272 -34235146 -38407120 -25149845 -9945607
8390i945607P079746L685155N732767O630603O545281O590492K223098o412957
$$ -9945607 -2865861 819294 6552061 13182664 19727945 26318437 28541535 22128578
8382B2128578r817682m444364k1486k138852j104565J0318998K0560120J4370294
$$ 22128578 12310896 7866532 7845046 5706194 4601629 14920627 35480747 49851041
8374D9851041m446560j8393332j8367080r665474j179652J958025p52858l994664
$$ 49851041 45404481 27011149 8644069 -1021405 -2201057 -243032 -995890 -4990554
8366d990554l78055R087300J3558097O197221o746131j4982086j5083594q397229
$$ -4990554 -5368609 3718691 17276788 23474009 16727878 1745792 -13337802 -21735031
8358b1735031K939749J2529548J1555604Q30571p159886m465955K432488M726978
$$ -21735031 -18795282 -6265734 5289870 6120441 -1039445 -5505400 -3072912 1654066
8350A654066L594147L375516K362712j104477k252185J685747M831992K536613
$$ 1654066 5248213 8623729 10986441 9881964 7629779 9315526 14147518 16684131
8342A6684131q07583j452136l341379o825001k835479R933413J5193708K210761
$$ 16684131 15876548 14424412 11083033 4258032 1422553 11355966 26549674 28760435
8334B8760435j3022861r373295N689590O999406q078415j5571646k990881J2839646
$$ 28760435 15737574 6364279 12053869 19053275 10974860 -4596786 -7587667 5251979
8326E251979J3631224M007009l302895q319216j4940096j5593131k894581J1921986
$$ 5251979 18883203 22890212 19587317 11268101 -3671995 -19265126 -22159707 -10237721
8318a0237721J1092175k371488p725998J868168Q910276K21099j0153080j829083
$$ -10237721 854454 -1517034 -9243032 -7374864 1535412 1756511 -8396569 -10225652
8310a0225652J7701496K0147267j871789k0845826j2397051R476934J3484654
$$ -10225652 7475844 27623111 25751322 4905496 -7491555 1985379 15470033
8303A5470033k567222j0489363L317495J6922856P549996j3451702j8320569k775594
$$ 15470033 12902811 2413448 5730943 22653799 30203795 16752093 -1568476 -4344070
8295d344070J1882842J0596920n33244r560471j1601371n209627Q361668J8782349
$$ -4344070 7538772 18135692 17602448 8041977 -3559394 -8769021 -407353 18374996
8287A8374996J3586122l588440j4136003r115158j94539P70122k97217O655524
$$ 18374996 31961118 28372678 14236675 5121517 4926978 5697100 5399883 12055407
8279A2055407J5355939J2051311o75712n842144J561120N830873n432641k0794391
$$ 12055407 27411346 39462657 38786945 32944801 34505921 40336794 34904153 14109762
8271A4109762j9675657j481644J2986836R830775m08971m75742P291319N366801
$$ 14109762 -5565895 -7047539 5939297 15770072 15361101 14885359 22176678 27543479
8263B7543479j0128481k0487107j1249131M897502N797493p126928j1590068M34609
$$ 27543479 17414998 -3072109 -14321240 -9423738 -3626245 -10753173 -22343241 -21908632
8255b1908632J0164712K035414j1611378j0416342K273588O679824q94475l942030
$$ -21908632 -11743920 -9708506 -21319884 -31736226 -29462638 -22782814 -23677289 -27619319
8247b7619319N571316J4843609J2624142O013641M722894L651925n320396j5649151
$$ -27619319 -22048003 -7204394 5419748 11433389 16156283 19808208 14487812 -1161339
8239a161339j5600894p508878j888165J581589J0052577J8453555J3936581l22846
$$ -1161339 -16762233 -24271111 -26159276 -24577687 -14525110 3928445 17865026 17542180
8231A7542180n889222J721934M420203q482390j9937351r741895J3566846K2887307
$$ 17542180 11652958 13374892 17795095 9312705 -10624646 -20366541 -6799695 16087612
8223A6087612Q218225j3442957k1307298j1253916N849178J5811347J0992182
$$ 16087612 24305837 10862880 -10444418 -21698334 -15849156 -37809 10954373
8216A0954373l746504j4615615j2599780j587499R088159J4037440J1185096J271636
$$ 10954373 7207869 -7407746 -20007526 -21595025 -12506866 1530574 12715670 13987306
8208A3987306p444992n346515K067304j460105j4171851j1650691J3983450L1964921
$$ 13987306 6542314 1195799 3263103 1802998 -12368853 -24019544 -10036094 21928827
8200B1928827J4773036j6261764k0138095J128642Q168972j0491968k1518502
$$ 21928827 36701863 20440099 302004 1430646 9599618 -892350 -22410852
8193b2410852l739594J8088276J5054496l262530j1120134n796158o9510M033251
$$ -22410852 -26150446 -8062170 6992326 3729796 -7390338 -13186496 -13256006 -9222755
8185i222755R522751Q418284n188500j8294468j5874778l575175M500200Q064872
$$ -9222755 299996 8718280 3529780 -14764688 -30639466 -34214641 -29714441 -21649569
8177b1649569J2440300J1790733Q08966r454276p956263l212322n712782n493819
$$ -21649569 -9209269 2581464 3390430 -6063846 -14020109 -17232431 -22945213 -28439032
8169b8439032Q344251K0550847J1531799n697968l382740J4046266J6463913j581443
$$ -28439032 -20094781 456066 11987865 6289897 2907157 16953423 33417336 31835893
8161C1835893j3838206p966584j671232o025162p679499Q36547N539748j69088
$$ 31835893 17997687 10031103 8359871 2334709 -5344790 -4508243 1031505 862417
8153H62417j462376P267520P411769r377922k0385485q248133Q048844M860111
$$ 862417 -599959 6667561 14079330 4701408 -15684077 -23932210 -15883366 -11023255
8145a1023255o532122j722803J4091414J7333445O742981L46647O01196m863461
$$ -11023255 -17555377 -19278180 -5186766 12146679 18889660 19236307 19837503 14974042
8137A4974042j2575585o298656R161982R437122q887889j9138759n566269J3274214
$$ 14974042 2398457 -3900199 5261783 14698905 5811016 -13327743 -18894012 -5619798
8129e619798J5340321O040162J971723K611002k720277j2251232j4763108q098544
$$ -5619798 9720523 15760685 17732408 20343410 17623133 5371901 -9391207 -17489751
8121a7489751O51171Q252259J5251514J7189422R005144l938212j0711544r483416
$$ -17489751 -16838580 -8586321 6665193 23854615 32859759 28921547 18210003 8726587
8113H726587p129399n666850m79225P188660P833367j504892r467047m761239
$$ 8726587 1597188 -4069662 -4548887 2639773 10473140 8968248 -498799 -5260038
8105e260038P390487J1313891J271498j1707338j4162751n278269N199939R466474
$$ -5260038 2130449 13444340 14715838 3008500 -11154251 -16432520 -11232581 -1766107
8097a766107P213273J067468o984300j3157417j1696767k021484O915809N482680
$$ -1766107 5447166 6514634 -469666 -13627083 -25323850 -27345334 -20429525 -14946845
8089a4946845l525583o623635L036549J5172181J4454830P63943r334459l130772
$$ -14946845 -18472428 -25096063 -22059514 -6887333 7567497 8331440 -1003019 -4133791
$$ [...]
##END NTUPLES=NMR SPECTRUM
##END=
