##TITLE=31Pdec_LR-759-C1-CH2Cl2
 CCl4, 64 sc
 24.3.2023
##JCAMPDX= 6.0         $$ Bruker NMR JCAMP-DX V2.0
##DATA TYPE= NMR SPECTRUM
##DATA CLASS= NTUPLES
##ORIGIN= UXNMR, Bruker Analytische Messtechnik GmbH
##OWNER= root
$$ XWIN-NMR		Version 3.5
$$ Fri Mar 24 14:36:31 2023 Russian Standard Time (UT+4h)  she@DPX200
##.OBSERVE FREQUENCY= 81.013821
##.OBSERVE NUCLEUS= ^31P
##.ACQUISITION MODE= SIMULTANEOUS
##.ACQUISITION SCHEME= undefined
##.AVERAGES= 64
##.DIGITISER RES= 16
##SPECTROMETER/DATA SYSTEM= spect
##.PULSE SEQUENCE= zgpg30
##.SOLVENT NAME= CDCl3
##.SHIFT REFERENCE= (INTERNAL, CDCl3, 0, 248.564)
##AUDIT TRAIL= $$ (NUMBER, WHEN, WHO, WHERE, WHAT)
$$ ##TITLE= Audit trail, XWIN-NMR		Version 3.5
$$ ##JCAMPDX= 5.01
$$ ##ORIGIN= Bruker BioSpin GmbH
$$ ##OWNER= she
$$ F:/spectra/data/she/nmr/P31/1/pdata/1/auditp.txt
$$ ##AUDIT TRAIL=  $$ (NUMBER, WHEN, WHO, WHERE, WHAT)
(   1,<2023-03-24 14:35:24.75 +0400>,<she>,<DPX200>,
      <continue with go, POWCHK disabled, PULCHK disabled
       configuration hash MD5:
       00 E9 B6 7A A2 85 ED C7 34 08 36 98 17 FE 4E 26
       data hash MD5: 32K
       3A 6F 95 89 E6 BA DD D0 09 92 63 C2 F4 BD C1 B8>)
(   2,<2023-03-24 14:35:28.54 +0400>,<she>,<DPX200>,
      <Start of raw data processing
       efp BC_mod = 2 LB = 1 FT_mod = 6 PKNL = 1 PHC0 = -10463.93 PHC1 = -343.5153 SI = 64K 
       data hash MD5: 64K
       94 48 A8 BF C4 34 77 65 2D 21 12 52 59 18 E9 AE>)
(   3,<2023-03-24 14:35:50.73 +0400>,<she>,<DPX200>,
      <pk PHC0 = 17.9972 PHC1 = 75.6 
       data hash MD5: 64K
       4C 02 CB EA 72 26 A1 37 44 D8 80 43 CA 75 9F 6F>)
(   4,<2023-03-24 14:35:54.95 +0400>,<she>,<DPX200>,
      <abs ABSG = 5 
       data hash MD5: 64K
       25 E1 D3 FB BA B7 38 3C 26 AB E8 1E 40 19 4E FB>)
$$ ##END=
$$ 
$$ hash MD5
$$ D1 17 84 19 72 85 A7 8F A1 45 30 02 86 DE 90 D1
##$RELAX= 
##$RELAX= 
##$RELAX= 
##$RELAX= 
##$RELAX= 
##$RELAX= 
##$RELAX= 
##$RELAX= 
##$RELAX= 
$$ Bruker specific parameters
$$ --------------------------
##$DU= <F:/spectra>
##$EXPNO= 1
##$NAME= <P31>
##$PROCNO= 1
##$TYPE= <nmr>
##$USER= <she>
##$AMP= (0..31)
100 100 100 100 100 100 100 100 100 100 100 100 100 100 100 100 100 100 
100 100 100 100 100 100 100 100 100 100 100 100 100 100 
##$AQSEQ= 0
##$AQ_mod= 1
##$AUNM= <au_zg>
##$AUTOPOS= <>
##$BF1= 81.014009
##$BF2= 200.13
##$BF3= 200.13
##$BF4= 200.13
##$BF5= 200.13
##$BF6= 200.13
##$BF7= 200.13
##$BF8= 200.13
##$BYTORDA= 1
##$CFDGTYP= 0
##$CFRGTYP= 5
##$CHEMSTR= <none>
##$CNST= (0..31)
1 1 145 1 1 1 1 1 1 1 1 1 1 1 1 1 1 1 1 1 1 1 1 1 1 1 1 1 1 1 1 1 
##$CPDPRG= <waltz16>
##$CPDPRG1= <>
##$CPDPRG2= <waltz16>
##$CPDPRG3= <>
##$CPDPRG4= <mlev>
##$CPDPRG5= <mlev>
##$CPDPRG6= <mlev>
##$CPDPRG7= <mlev>
##$CPDPRG8= <mlev>
##$CPDPRGB= <>
##$CPDPRGT= <>
##$D= (0..31)
0 1 0 0 0 0 0 0 0 0 0 0.03 2e-05 3e-06 0 0 0 0 0 0 0 0 0 0 0 0 0 0 0 0 
0 0 
##$DATE= 1679654039
##$DBL= (0..7)
120 120 120 11 120 120 24 19 
##$DBP= (0..7)
150 150 150 150 150 150 150 150 
##$DBP07= 0
##$DBPNAM0= <>
$$ [...]
##$SUBNAM3= <"">
##$SUBNAM4= <"">
##$SUBNAM5= <"">
##$SUBNAM6= <"">
##$SUBNAM7= <"">
##$SUBNAM8= <"">
##$SUBNAM9= <"">
##$SW= 501.771253377433
##$SWIBOX= (0..15)
0 1 3 0 0 0 0 0 0 0 0 0 0 0 0 0 
##$SW_h= 40650.406504065
##$TD= 32768
##$TD0= 1
##$TE= 0
##$TE2= 300
##$TE3= 300
##$TEG= 300
##$TL= (0..7)
0 120 53 12 22 120 120 120 
##$TP= (0..7)
150 150 150 150 150 150 150 150 
##$TP07= 0
##$TPNAME0= <>
##$TPNAME1= <>
##$TPNAME2= <>
##$TPNAME3= <>
##$TPNAME4= <>
##$TPNAME5= <>
##$TPNAME6= <>
##$TPNAME7= <>
##$TPOAL= (0..7)
0.5 0.5 0.5 0.5 0.5 0.5 0.5 0.5 
##$TPOFFS= (0..7)
0 0 0 0 0 0 0 0 
##$TUNHIN= 0
##$TUNHOUT= 0
##$TUNXOUT= 0
##$USERA1= <user>
##$USERA2= <user>
##$USERA3= <user>
##$USERA4= <user>
##$USERA5= <user>
##$V9= 5
##$VALIST= <valist>
##$VCLIST= <CCCCCCCCCCCCCCC>
##$VD= 0
##$VDLIST= <DDDDDDDDDDDDDDD>
##$VPLIST= <PPPPPPPPPPPPPPP>
##$VTLIST= <TTTTTTTTTTTTTTT>
##$WBST= 1024
##$WBSW= 4
##$XGAIN= (0..3)
0 0 0 0 
##$XL= 0
##$YL= 0
##$YMAX_a= 4334
##$YMIN_a= -5838
##$ZGOPTNS= <>
##$ZL1= 120
##$ZL2= 120
##$ZL3= 120
##$ZL4= 120
##$ABSF1= 248.5645
##$ABSF2= -253.2056
##$ABSG= 5
##$ABSL= 3
##$ALPHA= 0
##$AQORDER= 0
##$ASSFAC= 0
##$ASSFACI= 0
##$ASSFACX= 0
##$ASSWID= 0
##$AUNMP= <proc_1d>
##$AZFE= 0.1
##$AZFW= 0.5
##$BCFW= 0
##$BC_mod= 2
##$BYTORDP= 0
##$COROFFS= 0
##$CY= -3
##$DATMOD= 1
##$DC= 0
##$DFILT= <>
##$DTYPP= 0
##$F1P= 0
##$F2P= 0
##$FCOR= 1
##$FTSIZE= 65536
##$FT_mod= 6
##$GAMMA= 0
##$GB= 0
##$INTBC= 1
##$INTSCL= 6.047779e-11
##$ISEN= 30
##$LB= 1
##$LEV0= 0
##$LPBIN= 0
##$MAXI= 10000
##$MC2= 0
##$MEAN= 0
##$ME_mod= 0
##$MI= 50
##$NCOEF= 0
##$NC_proc= -9
##$NLEV= 6
##$NOISF1= 182.463
##$NOISF2= 159.3651
##$NSP= 0
##$NTH_PI= 0
##$NZP= 0
##$OFFSET= 248.5645
##$PC= 4
##$PHC0= -10445.93
##$PHC1= -267.9153
##$PH_mod= 1
##$PKNL= yes
##$PPARMOD= 0
##$PSCAL= 0
##$PSIGN= 0
##$REVERSE= no
##$SF= 81.0140089999694
##$SI= 65536
##$SIGF1= 159.3651
##$SIGF2= -187.1042
##$SINO= 113.3802
##$SIOLD= 16384
##$SREGLST= <1H.CDCl3>
##$SSB= 0
##$STSI= 65536
##$STSR= 0
##$SW_p= 40650.406504065
##$SYMM= 0
##$S_DEV= 0
##$TDeff= 32768
##$TDoff= 0
##$TI= <>
##$TILT= no
##$TM1= 0
##$TM2= 0
##$TOPLEV= 0
##$USERP1= <user>
##$USERP2= <user>
##$USERP3= <user>
##$USERP4= <user>
##$USERP5= <user>
##$WDW= 1
##$XDIM= 65536
##$YMAX_p= 469866886
##$YMIN_p= -193081069
$$ End of Bruker specific parameters
$$ ---------------------------------
##NTUPLES= NMR SPECTRUM
##VAR_NAME=  FREQUENCY,     SPECTRUM/REAL,   SPECTRUM/IMAG
##SYMBOL=    X,             R,               I
##VAR_TYPE=  INDEPENDENT,   DEPENDENT,       DEPENDENT
##VAR_FORM=  AFFN,          ASDF,            ASDF
##VAR_DIM=   65536,         65536,           65536
##UNITS=     HZ,            ARBITRARY UNITS, ARBITRARY UNITS
##FACTOR=    0.620285442955139, 1,           1
##FIRST=     20137.2065510682, 0,            0
##LAST=      -20513.1999529968, 0,           0
##MIN=       -20513.1999529968, -193081069,  0
##MAX=       20137.2065510682, 469866886,    0
$$ Real data points
##PAGE= N=1
##DATA TABLE= (X++(R..R)), XYDATA
$$ [...]
38922F4381049N256911J7803804O941861j5186167j8370847L008174K1231314
38915H5066099J4141011n679785j2200324k153493O610540N058086K276662N330759
38907I8449555P632701L121107k117410j441874k61859o104229j3542187j1375881
38899G4359923p88415O267205N539728M747349P998289Q479806J663220m935713
38891A03331392l062857K772157K167180n149785r224604m336857M463431R798584
38883A00758641J0092422P217308J942883m097251n768566L37292Q611853Q315053
38875A27409635k685319j2780457j0035557K366974J0497288P990968K023086
38868A24786618J82755L75597k076155n098152l846849J225106N600670N535515
$$ y = [64381049, 69637960, 87441764, 94383625, 79197458, 60826611, 63834785, 85066099, 99207110, 93527325, 81327001, 79173508, 85784048, 90842134, 93118796, 98449555, 106082256, 109203363, 107085953, 105644079, 105382220, 99277991, 85735804, 74359923, 73571508, 79838713, 85378441, 90125790, 98124079, 106603885, 108267105, 103331392, 100268535, 103040692, 105207872, 100058087, 90833483, 86496626, 90960057, 100758641, 110851063, 118068371, 120011254, 115914003, 110145437, 110482729, 119094582, 127409635, 124724316, 111943859, 101908302, 104275276, 114772564, 122763532, 124786618, 124969373, 125344970, 123268815, 118170663, 114323814, 115548920, 121149590, 126685105]
38860A26685105j462930j4005361k1548066j2316226P454295J4812464O63546
38853A00282827j4186828q044120R178956J1931542k142525j2699013j0796149
38846G3524690o951237n477401K779167J6833547J9479811M568526j0444598j0175104
38838H4137401j623027J751270p05033m292800r293907j2536202m638502J2027773
38830F4826973J7892461K151506j9180238k4075647j1019699O596960J8978222
38823E6170538K1227685J0778917l887256o517180K969130M658384q524582j5117100
38815F1758536m4583J6891009J1625088m959642p598118j0485m123219j6979272
38807E6559314j4850801L525409J3463400N651315k288942m58443j092328r622864
$$ y = [126685105, 125222175, 111216814, 89668748, 77352522, 84806817, 99619281, 100282827, 86095999, 78051879, 87230835, 99162377, 97019852, 84320839, 73524690, 66573453, 61096052, 63875219, 80708766, 100188577, 104757103, 94312505, 84137401, 82514374, 84265644, 83560611, 79267811, 69973904, 57437702, 52799200, 64826973, 82719434, 84870940, 65690702, 41615055, 30595356, 37192316, 56170538, 77398223, 88177140, 84289884, 77772704, 80741834, 85400218, 76875636, 61758536, 61713953, 78604962, 90230050, 85270408, 77672290, 77661805, 73538586, 56559314, 41708513, 45233922, 58697322, 64348637, 62059695, 61601252, 60508924, 50886060]
38799E0886060j0951959K574975J4712855J1348844J969479M56016K509983k438820
38791G1067433j1040473j2637992o378379j878J445834j646139n150740k369595
38783C3288071P856128J4069059N513409q300420p773847O495059J3316388M217701
38775F8681548m643191j305219L331369k468471j0478676q601010j402485P62854
38767D3876719o68732n92658l021790j0417352j2021381N93592J5478084J4397762
38759D7624244j052869j2126794p628549O018434J5695502J3212181M54410j0153022
38751E2043537p023981L361589J498835j5763700k5336530r541087J6353694K4719672
38743D0312029J2504600j120748n524837o028844m837118L353659J4779548J4875063
$$ y = [50886060, 39934101, 42509076, 57221931, 68570775, 70540254, 70996270, 73506253, 71067433, 60026960, 47388968, 41010589, 41008711, 42454545, 40808406, 35657666, 33288071, 41144199, 55213258, 60726667, 52426247, 44652400, 51147459, 64463847, 68681548, 64038357, 62733138, 66064507, 63596036, 53117360, 44516350, 43113865, 43876719, 43207987, 42615329, 39593539, 29176187, 17154806, 17748398, 33226482, 47624244, 46571375, 34444581, 26816032, 32834466, 48529968, 61742149, 62196559, 52043537, 45019556, 48381145, 49879980, 34116280, 8779750, -761337, 15592357, 40312029, 52816629, 51695881, 46171044, 40142200, 35305082, 38658741, 53438289, 68313352]
38735F8313352n16977j6145170j6839633o291806O66805j753753m769198J771630
38727B4435250J4773265J9222704O054276j3814917k0018763p405464Q622437
38720C1868788J3330060Q397316K167614l386379p935675o683398O00062M431299
38712D2789687L65566j237470P440880J4932120O629891j0427587j6461578p900456
38704C6131053J90245j239147n009171l060603K714593P568010J0148301R427705
38696E6870986M708843m71842k322610l261785o529620q014247l056053K968330
38688D0892002K194242j731895K76670O344539O766174N09331n334357r519367
38680D0397339j4907998j5670793l726791J2696330J5423806L295327n049153
$$ y = [68313352, 67796375, 51651205, 34811572, 28519766, 29186571, 27432818, 22663620, 24435250, 39208515, 58431219, 64485495, 50670578, 30651815, 23246351, 31868788, 45198848, 53596164, 55763778, 52377399, 44441724, 37758326, 38358388, 42789687, 43155253, 41917783, 49358663, 64290783, 70920674, 60493087, 44031509, 36131053, 36321298, 35082151, 30072980, 27012377, 29726970, 37294980, 47443281, 56870986, 61579829, 61107987, 58785377, 55523592, 48993972, 40979725, 37923672, 40892002, 43086244, 41354349, 41631019, 47975558, 54741732, 55251063, 49916706, 40397339, 25489341, 9818548, 6091757, 18788087, 34211893, 37507220, 32458067]
38673C2458067J083867J1155207J2639886O814768o52175q792311j4022628q986744
38665C1697937L595598J0045350N850544K066366M402726K540648r453730j8594652
38657C2150787j2744806j208913p9782p530872r245591p03366J0250718J6798221
38649B7686396J6476776P532184n918399j1514640l349103P492198Q510500L819331
38641E0735243L501243L883681m764840j7137008j7949866n482601P031127J1906056
38633C1723035J2285474Q500092k637155j4141306j2850952k85200P629619N153633
38625C5377240L099505N896561K415204j0925321j7311236m153442J4988640J9588981
38617D8976132J1153474N380715M796662q43517j1299602j3198083k180213Q858765
$$ y = [32458067, 33541934, 44697141, 57337027, 64151795, 63499620, 54707309, 40684681, 31697937, 35293535, 45338885, 51189429, 53255795, 57658521, 60199169, 50745439, 32150787, 19405981, 18197068, 18117286, 10586414, 1340823, 637457, 10888175, 27686396, 44163172, 51695356, 45776957, 34262317, 30913214, 38405412, 46915912, 50735243, 54236486, 58120167, 53355327, 36218319, 18268453, 12785852, 19816979, 31723035, 44008509, 52508601, 49871446, 35730140, 22879188, 22593988, 30223607, 35377240, 38476745, 44373306, 46788510, 35863189, 18551953, 14398511, 29387151, 48976132, 60129606, 65510321, 70306983, 69463466, 58163864, 44965781, 42785568, 51644333]
38609E1644333Q263589J2985n497059n611456m808759n974954o914014l303352
38601B7811313N355111J1064534L021518j6605505k8397956j6960582P449683
38594g261884K0292103J3423886J121433l672067l142896j679951L814791J2271522
38586C5166937J1607931m275855k1470684k1505729m718021J2374045J7819915
38579B4998539J2638368L470532l172424k894702J639393J470726n343041p220581
38571B5586810M158500J6794991J1732892r129685k2893408j4774952M669095
38564A6144243J4942343R095992k369075n429161K595802J0038923M340110r869805
38556C9489372j3311302J685366J7295751J3722150k534907r671466l282110J066232
$$ y = [51644333, 59907922, 59920907, 54423848, 48812392, 44003633, 38028679, 31114665, 27811313, 33166424, 44230958, 47252476, 30646971, 2249015, -14711567, -7261884, 13030219, 26454105, 27575538, 23903471, 20760575, 19080624, 22895415, 35166937, 46774868, 42499013, 21028329, -477400, -5195421, 7178624, 24998539, 37636907, 41107439, 37935015, 35040313, 36679706, 38150432, 32807391, 25586810, 29745310, 46540301, 58273193, 49143508, 26250100, 11475148, 16144243, 31086586, 40182578, 37813503, 32384342, 34980144, 45019067, 49359177, 39489372, 26178070, 27863436, 45159187, 58881337, 56346430, 46674964, 43392854, 44459086]
38548D4459086m476771r960263o932901P04703Q136850J4448802J3623168k03470
38540E9799204j5415189j2337410M899649R963412l809839j0225068O263253K1582879
38532F0720891R842159j3620280j6822225j780100K941730r087520j5567884o018378
38524A0608393L811288K944618J565933P174602R296538M74744p657963l303910
38516B4914243N926976O263557q64301l610553K156735J0242522J3802883R757673
38508F8589735q77220j1181661j2942152p534594m902669p955195p702664N75584
38500A6069164P341336L847692k443972J023029J1965009J6708825R995606m55427
38492F4051262p664427j2071873j3623504q442094K171069Q212922L274043n067607
$$ y = [44459086, 39982315, 30022052, 23089151, 23793854, 31930704, 46379506, 60002674, 59799204, 44384015, 32046605, 36946254, 46909666, 43099827, 32874759, 39138012, 60720891, 70563050, 56942770, 40120545, 38340445, 41282175, 32194655, 16626771, 10608393, 14419681, 17364299, 18930232, 26104834, 35401372, 35876116, 28218153, 24914243, 30841219, 37104776, 36240475, 32629922, 34786657, 45029179, 58832062, 68589735, 67712515, 56530854, 43588702, 36054108, 31151439, 23196244, 15493580, 16069164, 23410500, 27258192, 24814220, 25837249, 37802258, 54511083, 64506689, 64051262, 56386835, 44314962, 30691458, 22249364, 24420433, 32633355, 35907398, 30839791]
38484C0839791m806167L124885N626332l170165j1641714n875603R990270J7600571
38476D1688200Q124331o816879j1343707m907251O43989j207621m842150k759384
38468A8579528L966648P903186N003044n24199j736961J494806J792624m418841
38460C2059835r363595m353890N537176P344366q9526m534352l87935L435777
38452B9647856N64940k315177q8152J79686n488185o324350M623236J3170622
38444C3970476M107102j1234086r583535P283036J3667774j517122j9448115j9661233
38436b415703m955994R280144J5351622J4317513Q361354O45646m360327n746193
38428C0478062o119772n664771l008927r09911k113120j360975P280005J6564089
$$ y = [30839791, 26033624, 29158509, 34784841, 31614676, 19972962, 14097359, 24087629, 41688200, 49812531, 42995652, 31651945, 26744694, 27388683, 26181062, 21338912, 18579528, 22546176, 30449362, 35452406, 34928207, 33191246, 34686052, 36478676, 32059835, 22696240, 18342350, 23879526, 31223892, 31134366, 26600014, 26212079, 29647856, 30212796, 27897619, 27809467, 27989153, 22500968, 16176618, 20799854, 33970476, 38077578, 26843492, 17259957, 24542993, 38210767, 36693645, 17245530, -2415703, -7371697, 1908447, 17260069, 31577582, 39938936, 40584582, 36224255, 30478062, 24358290, 18693519, 15684592, 14774681, 12661561, 11300586, 18580591, 35144680]
38420C5144680J2841434k802908j3893877j1369971m033468k739590o006222n884464
38412A255614Q46126J0328573J3963162M730589j1240344j5450224r97217J2554352
38404A5990631N142744j1660550j1430745M799967J1851633M181863L060233J4795749
38396C6731525J6828433j280743j6069584q732440M011458R76994p655680k630690
38388B2179273Q139346N495044n421369o066382J285379N57612n643629j010488
38380A9514786J1644389J2076167l306989j5779661j4523847q277795l870499
38373b523449L734702J4527451J7150834O960788n712366j1354184j1217734p354078
38365D211964K432435J4166113J5967149L917004j0567292j5235063j0628678
$$ y = [35144680, 47986114, 45183206, 31289329, 19919358, 15885890, 13146300, 7140078, 1255614, 2101740, 12430313, 26393475, 31124064, 19883720, 4433496, 3436279, 15990631, 21133375, 9472825, -1957920, 2842047, 14693680, 18875543, 21935776, 36731525, 53559958, 52279215, 36209631, 27477191, 31488649, 32465643, 24809963, 22179273, 30318619, 35813663, 30392294, 24325912, 25611291, 26168903, 20525274, 19514786, 31159175, 43235342, 39928353, 24148692, 9624845, 1347050, -2523449, 1211253, 15738704, 32889538, 39850326, 34137960, 22783776, 11566042, 4211964, 6644399, 20810512, 36777661, 40694665, 30127373, 14892310, 4263632]
38358D263632m654094j106263J517511M521649O076871K917952m151799o934578
38350B450881J433860J3146025J2018970k560881j2161357p601576l258218r762372
38342f294668j1914993M842526K3349990J8435743o30300m034006R031169J0681253
38334D3466714n803798j4185228j680757Q903514n09702j2486687n593044Q698842
38326B0809854O413478r209470j4831928m010070O704374M737364m468179r776566
38318c631143p052890P05583P219839P641232L734363P43562k009285q596973
38310a245712j3231904l464471J7786486K8529231J5779131n914190j5071310
38303B3167261j0119914l613354j561065k537069p353945j4659717j4683321j900470
$$ y = [4263632, -390462, -1496725, 20786, 4542435, 10619306, 13537258, 9385459, 2450881, 3884741, 17030766, 29049736, 26488855, 14327498, 6725922, 3467704, -6294668, -18209661, -13367135, 9982855, 28418598, 27788298, 23754292, 32785461, 43466714, 37662916, 23477688, 21796931, 30700445, 30190743, 17704056, 12111012, 20809854, 27223332, 18013862, 3181934, -828136, 5876238, 10613602, 6145423, -3631143, -10684033, -9978450, -2758611, 4882621, 8616984, 9360546, 7351261, -1245712, -14477616, -17942087, -155601, 28373630, 44152761, 38238571, 23167261, 13047347, 9433993, 7872928, 5335859, -2018086, -16677803, -31361124, -33261594]
38295c3261594J2523656J4619396P573471M122577N593386L823226j020436q68555
38287A3105127M175232N432054R84818k003823m35927J418006J921463L910474
38279B8507424O076694L179290m273981r650446r544138n625501P96213P459061
38271A6924616P898778j41797o713830j837520P962740Q635172N54218m214959
38263B9067418l939562p563909j2751207n370128J3137817J9420103J100510k1658124
38255A1442918k2200521j624671J7762509K1852804J2477371l754791j7275165
38248A8680454j4634555N379300K0421377R534765j3828631j6239038P178034
38241A6491706K3301625Q552777j7414406k1689962l773067J0187494Q078726
$$ y = [-33261594, -20737938, -6118542, 1454929, 5577506, 11170892, 14994118, 13973682, 13105127, 17280359, 22712413, 23697231, 21693408, 21257481, 22675487, 24596950, 28507424, 34584118, 37763408, 33489427, 23838981, 14294843, 8669342, 9465555, 16924616, 24823394, 24681597, 17967767, 16130247, 24092987, 32728159, 33282377, 29067418, 25127856, 17563947, 4812740, -557388, 12580429, 32000532, 33101042, 11442918, -10757603, -12382274, 5380235, 27233039, 39710410, 35955619, 18680454, 4045899, 9425199, 29846576, 39381341, 25552710, 9313672, 16491706, 39793331, 48346108, 30931702, 9241740, 5468673, 15656167, 23734893]
38234B3734893K642140L788202L267962o696876j6997449j4540553j215954R970701
38226C953066J1494329O015492q47950n233461n447056l279420k738265m089773
38218a73038k955273J514779L257401j016688m737707q74180O650614Q807312
38210A0473220M709040O51701p04184j191790m2665M035403N605320j512185j1326509
38201A0697351j0632935J442399J0706151Q145820J264040j41203J625658l78187
38193B2729094n112434p299990p026346p154449o611439l850899j610111q47656
38185a6784230L930719J4631578K0949658J2622739l801710j2090984p958289
38178A1499481j591684O09277L482248R567724J1012494K062361r424479j1377445
$$ y = [23734893, 26377033, 30165235, 33433197, 26736321, 9738872, -4801681, -6017635, 3953066, 15447395, 21462887, 20614937, 15381476, 9934420, 6655000, 3916735, -173038, -3128311, -1613532, 1643869, 627181, -4110526, -4984706, 1665908, 10473220, 15182260, 15833961, 15129777, 13937987, 13895322, 17930725, 23536045, 22023860, 10697351, 64416, 1506815, 12212966, 20358786, 21622826, 21481623, 23107281, 22729094, 17616660, 10316670, 3290324, -3864125, -10475564, -14326463, -15936574, -16784230, -12853511, 1778067, 22727725, 35350464, 31548754, 19457770, 11499481, 9907797, 10517074, 13999322, 23567046, 34579540, 36641901, 27217422, 15839977]
38170A5839977l165686N594229Q271113O034729J539932m485656r324321p339844
38162A2964473L027301J4180881J5683753N868401o021837j0718602r032371p859421
38154A8092578q602457n913730J277458M989837m46478p709127m868788P669758
38146D489051J6517802J2156737k81805q911901q102807j114126N353110O011689
38138B6117750R0760p170264q649995l184266L330477N927233N519494M058631
38130B6039820O50403l233861r97033R020060J5510433O825327j0103387j6038039
38122B7673723o849440p13072r894249j8543344m384764K4297091L3605652Q985890
38114E4177487k2862380k7386379m676242J5566434J4051359L72269p548444o172872
$$ y = [15839977, 12674291, 18268520, 26539633, 32574362, 34114294, 29628638, 20304317, 12964473, 15991774, 30172655, 45856408, 51724809, 45702972, 34984370, 25951999, 18092578, 9490121, 3576391, 4853849, 9843686, 9397208, 1688081, -3180707, 4489051, 21006853, 33163590, 32881785, 23969884, 15867077, 14752951, 20106061, 26117750, 26208510, 19038246, 10388251, 7203985, 10534462, 16461695, 21981189, 26039820, 26690223, 23456362, 22459329, 31479389, 46989822, 53815149, 43711762, 27673723, 20824283, 20111211, 10216962, -8326382, -12711146, 11585945, 45191597, 54177487, 31315107, 3928728, -747514, 14818920, 28870279, 29242548, 21694104, 15521232]
38106A5521232k535938K24952L519190N531754K781816k305652l608434j128035
38098A8000885j041623m279226k958334O628052J4044044O861599r771980j6867973
38090A0615444p256006L732063N39917r449768p493449P377389J6507305R179491
38082B3752386l504872p220090l182086m80117j184984k619091n093775p732536
38074g265165n295867J285585J281652p510650q554117R106203K7143983K0368362
38066C0559986l836952j4184345k522187N976622m290370j4828713o096202R477895
38058B55734R053733l445919o280515M046020J0360783M797666j810700k029651
38050A4947151l001153r650886j3045293m534045R232666J4373668O737520n583249
$$ y = [15521232, 12985294, 13210246, 16729436, 22261190, 25043006, 22737354, 19128920, 18000885, 16959262, 12680036, 9721702, 16349754, 30393798, 37255397, 27483417, 10615444, 3359438, 7091501, 7631418, -1818350, -9311799, -1934410, 14572895, 23752386, 20247514, 13027424, 9845338, 9365221, 8180237, 5561146, 467371, -7265165, -12561032, -11275447, -9993795, -17504445, -26058562, -16952359, 10191624, 30559986, 26723034, 12538689, 10016502, 15993124, 11702754, -3125959, -9222161, 255734, 9309467, 5863548, -416967, 3629053, 13989836, 18787502, 16976802, 14947151, 11945998, 2295112, -10750181, -15284226, -6051560, 8322108, 15059628, 9476379]
38042I476379j2071162p541145N199024J5751782J3231724j805114j4936569j2398122
38034e093203K884897J4336344J1050121n14396o452651k888015J880957J224472
38026A6428526j158668J107040P447672J3200483J6198600J4383869L527297j3337182
38018E7797637k0493315p122390J2942437J5111159k130023j4986525r701386
38011C1417594o49819l731079j0699921o130971M395422L216330r897131j7034374
38003i113949q907303M545836J0842397Q481295K651065j175488J331283Q540070
37995A7195206J0358888N38494j0741811q529541M295981R900731J548449p672445
37987A6893952n492541L740179R476567R481936P078166L279823j253580l476590
$$ y = [9476379, -2594783, -10135928, -4936904, 10814878, 24046602, 22241488, 7304919, -5093203, -2208306, 12128038, 23178159, 22663763, 16211112, 13323097, 15204054, 16428526, 15269858, 16376898, 23824570, 37025053, 53223653, 67607522, 71134819, 57797637, 37304322, 30181932, 43124369, 58235528, 56105505, 41118980, 31417594, 30767775, 27036696, 16336775, 10205804, 14601226, 17817556, 7920425, -9113949, -18021252, -13475416, -2633019, 5848276, 8499341, 7323853, 8655136, 17195206, 27554094, 28092588, 17350777, 8821236, 13117217, 23017948, 24566397, 16893952, 11401411, 15141590, 24618157, 34100093, 41178259, 44458082, 43204502, 39727912]
37979C9727912k845572k760660l343722l97003M502346K123722r839741j8897350
37971H269932j2991742K572021J2188968R501709J255919n132750q571862r378269
37963b286074n833582J710010Q170537Q314012K726069k031233J86408P424367
37955A8380514R664112N50994j1456284j0684314M384377J5541067P691584r335087
37947B4736963j2742824K023081J4914801R099882o779517j2346734l294365N924139
37939B1535426M135609l579562o516627k103218M956233R524150P522130k130761
37931C3343380j1964045j0238374K465484R600571J057896r979186o297717N463055
37923A3451064N205912o803599r881610J648971Q273534r59471r200045j139024
$$ y = [39727912, 36882340, 34121680, 30777958, 30380955, 34883301, 37007023, 27167282, 8269932, -4721810, -2149789, 10039179, 19540888, 20796807, 15664057, 7092195, -2286074, -8119656, -6409646, 1760891, 10074903, 12800972, 10769739, 10956147, 18380514, 28044626, 28595620, 17139336, 6455022, 10839399, 26380466, 34072050, 24736963, 11994139, 14017220, 28932021, 38031903, 31252386, 18905652, 15611287, 21535426, 25671035, 22091473, 15574846, 13471628, 18427861, 27952011, 35474141, 33343380, 21379335, 11140961, 13606445, 23207016, 24264912, 14285726, 7988009, 13451064, 18656976, 11853377, 1971767, 3620738, 11894272, 10934801, 1734756, 595732]
37915E95732J0620402Q356613n40603J04567M251826l411543j4762249r486258
37907d271513O668007P988828o599877r509835P749956J7432246J953075j4227530
37899G183357l598348J8134553J5479482j1569420k7913779j4867343P866204
37892i285294J5105281O845096k287131n374237l484560L520186J3756154J7768928
37884C6564423P709428j0059567k0010524j5101717l437408L108906J555613k678796
37876b349642m183395j603574L832645Q865990Q375042N25398p900869p394863
37868a833268J322576O872431L031100k240939R46900R957601J4735442J1666811
37860D4458654M405897l737614r683774q588822j640735M38232o928067j0276189
$$ y = [595732, 11216134, 19572747, 19032144, 19136711, 23388537, 19976994, 5214745, -4271513, 2396494, 10385322, 3785445, -5724390, 2025566, 19457812, 21410887, 7183357, 3585009, 21719562, 37199044, 25629624, -2284155, -17151498, -9285294, 5819987, 12665083, 10377952, 5003715, 1519155, 5039341, 18795495, 36564423, 44273851, 34214284, 14203760, -897957, -4335365, -1226459, 329154, -2349642, -6533037, -8136611, -4303966, 4562024, 12937066, 13462464, 5561595, -1833268, -510692, 6361739, 9392839, 7151900, 8098800, 18056401, 32791843, 44458654, 48864551, 45126937, 35443163, 26854341, 25213606, 25651838, 18723771, 8447582]
37852H447582L012448K0516281J9113285L75035j1136431o365127l668152j4645062
37844A5649859k2831359j1516912P323035J1402149J698929k627254N312278J3921884
37836A8332609J3643688P172720j41079o996682j2386490j4252799j2437094p827753
37828a4892880j014296M619458M387274J108102L928446J2572119J3363432l14781
37820B3756874j4592142j3780479k466316M729642O330204J0415993J4349738
37813B8743514O935076j0290080k0882638j5077336q81017Q457301P757397o3452
37805D698765p685826o936588K758283J0590302P265107j450856l669508M69315
37797F038994J799918k89712K169957R084521J0467713L040862m492507n342062
$$ y = [8447582, 11460030, 31976311, 51089596, 51464631, 40328200, 33963073, 30294921, 15649859, -7181500, -18698412, -11375377, 26772, 1725701, -901553, 4410725, 18332609, 31976297, 39149017, 39007938, 32011256, 19624766, 5371967, -7065127, -14892880, -15907176, -11287718, -6900444, -5792342, -1863896, 10708223, 24071655, 23756874, 9164732, -4615747, -7082063, -2352421, 3977783, 14393776, 28743514, 35678590, 25388510, 4505872, -10571464, -11452481, -2995180, 4762217, 4698765, -2987061, -9923649, -7165366, 3424936, 10690043, 9239187, 5569679, 6038994, 7838912, 7549200, 9719157, 18803678, 29271391, 32312253, 27819746, 22477684]
37789B2477684k126669J678752O195838Q410909K247989j0820472k0246262j8374155
37781a0556386p021071P204889J5902932J0494653p404791k0259764j3303619
37774b4943157L656077R284117K743049K074833J0862971J1694714j099700q436402
37766E836502J218752J0883931M046156o916802l300226O821115M020211o722635
37758A5887004m463970R800150J3098640j125653j2180110n936214M795273M384787
37750B4259907j354786P05975P612316P194632p51348n684727m351909l826372
37742B3803688p391649r151148m938020L80836Q49350j069856J609347R164708
37734A3257256J3063880O433711o352725j3365264p848557M868111J3049103R151986
$$ y = [22477684, 20351015, 22029767, 28225605, 36636514, 38884503, 28064031, 7817769, -10556386, -17577457, -10372568, 5530364, 16025017, 8620226, -11639538, -24943157, -21287080, -12002963, -9259914, -7185081, 3677890, 15372604, 14272904, 5836502, 7055254, 17939185, 21985341, 15068539, 11768313, 18589428, 22609639, 15887004, 11423034, 21223184, 34321824, 33196171, 21016061, 15079847, 19875120, 24259907, 22905121, 23611096, 31223412, 38418044, 37666696, 31981969, 27630060, 23803688, 16412039, 7260891, 2322871, 2703707, 3553057, 2483201, 4092548, 13257256, 26321136, 32754847, 26402122, 13036858, 5188301, 10056412, 23105515, 32257501]
37726C2257501m622732j8035165j9897799p836199P320725J1112917J892738o634756
37718d442770k670044Q608483J2586016M218516p414468j2290332j0088913o285522
37710a7779034l314592N95633N898530Q801151N711539k29247r42879N312302
37702D053403Q809439J656645p271912l034567R574710P961850j2975410k5815537
37694a7041379p608942K2589986K7266670M229179j1379858k90943J4855816P780696
37686D0401225j2717110k1098841j3498365n458470k922781J434609Q297049R602589
37678D039905N448909M647590P519844M707351m859546j0173612n490148K160343
37670H000636N770861N868096L175416k627400n169783K124301R929358K039378
$$ y = [32257501, 27634769, 9599604, -10298195, -18134394, -10813669, 299248, 2191986, -4442770, -7112814, 1495669, 14081685, 18300201, 10885733, -1404599, -11493512, -17779034, -21093626, -20497993, -14599463, -5798312, -86773, -316020, -1258899, 4053403, 12862842, 14519487, 7247575, 4213008, 13787718, 21749568, 8774158, -17041379, -24650321, -2060335, 25206335, 29435514, 18055656, 17764713, 32620529, 40401225, 27684115, 6585274, -6913091, -12371561, -15294342, -13859733, -5562684, 4039905, 9488814, 14136404, 21656248, 26363599, 21504053, 11330441, 5840293, 8000636, 13771497, 19639593, 22815009, 20187609, 15017826, 17142127, 27071485, 29110863]
37662B9110863j5591721j7386145J399787J2099058k832476j7879023l247936
37655a4327593K4436624K4410842n726195k7091512j8548585j897396K44483k447140
37647b0946472N866420J5562076R100930p781685j5053757p485302M277923J2761048
37639c698819J6302342J0484246n451445j8733921j5752032j233081Q946264R629756
37631D93310P119755L198481n179432j2748084r375782K610272R362227N454345
37623I35092l95590j118474K85782L25576K68913j085527p576116j5085036j2704690
37614c6150070J163746J4783381J9052698J6350342R958923j783568j4427742
37607H947710j4662543P64968J4745593J1002033k976673p808419q01752K748679
$$ y = [29110863, 13519142, -3867003, -2467216, 9631842, 6799366, -11079657, -14327593, 10109031, 34519873, 28793678, 1702166, -16846419, -18743815, -18499332, -20946472, -15080052, 482024, 9582954, 1801269, -13252488, -20737790, -16459867, -3698819, 12603523, 23087769, 17636324, -1097597, -16849629, -18082710, -9136446, 493310, 7613065, 10811546, 5632114, -7115970, -16491752, -13881480, -4519253, 935092, 539502, -578972, -293190, 32386, 301299, -784228, -8360344, -23445380, -36150070, -34986324, -20202943, -1150245, 15200097, 25159020, 23375452, 8947710, -5714833, -4949865, 9795728, 20797761, 17821088, 10012669, 9210917, 11959596]
37599A1959596m952278j2721605p917113O174911J6403184J5648472O825966l530938
37591B7890195r397371o347562M518366J3972537J1955166n22722j1127631j0650770
37583B0290208l702536o56842k678703k055502L774649P473676L522874l238103
37575B2729721n237653k073378J758185L362933J623944k965435n205894N548
37567A3997971O252347N59525j4115696j6336418K260935J8706800J0066054j0749569
37559A0641949j4238202O82539R315994L986545K147850R461833Q016426q416379
37551B1598555j8270483p479993O009204K606988p431681m978266N683640R535594
37543G273558Q509601J1027820R039508o461961j9037606o725038J8635691K3501645
$$ y = [11959596, 7007318, -5714287, -13631400, -7456489, 8946695, 24595167, 31421133, 27890195, 18492824, 12145262, 16663628, 30636165, 42591331, 42068609, 30940978, 20290208, 16587672, 15930830, 13252127, 11196625, 14971274, 22444950, 25967824, 22729721, 17492068, 15418690, 17176875, 20539808, 22163752, 19198317, 13992423, 13997971, 20250318, 20809843, 6694147, -9642271, -7381336, 11325464, 21391518, 10641949, -3596253, -2913714, 6402280, 10388825, 12536675, 21998508, 30014934, 21598555, 3328072, -4151921, 1857283, 4464271, -2967410, -7945676, -2262036, 7273558, 15783159, 26810979, 35850487, 29388526, 10350920, 3625882, 22261573, 45763218]
37535D5763218J985253j7499090j6382490o599017k107510M81477L443187j718583
37527G366445j2115469p706977J5217507K8469428J1256518j4950878j6429870
37520A1106704K617521R122851o685841j8882967q242152J0330995J3462733J956823
37512A4786667p010540p128638o258571q702600q969948k962392N278300R926602
37504a1041120R560159N726350J170053K45782M838737Q833251M057208o034167
37496A7356253p805596K232101Q865396j63858j3382204j1485748K287241P153084
37488E056669j182100m267791N732929J0240159m278963j9870158j3037778P513125
37480a4093908J3647954M79833r205138j896550R302089Q720751m24102o128640
$$ y = [45763218, 47748471, 30249381, 13866891, 7267874, 5160364, 5641841, 9085028, 7366445, -4749024, -12456001, 2761506, 31230934, 42487452, 27536574, 11106704, 13724225, 22847076, 16161235, -2721732, -10963884, -632889, 12829844, 14786667, 7776127, 647489, -5611082, -14313682, -23283630, -26246022, -20967722, -11041120, -1480961, 4245389, 5415442, 5661224, 10499961, 19333212, 23390420, 17356253, 9550657, 11782758, 20648154, 20484296, 7102092, -4383656, -2096415, 5056669, 3874569, -393222, 5339707, 15579866, 11300903, -8569255, -21607033, -14093908, -445954, 33879, -9171259, -11067809, -1765720, 6955031, 6530929, 402289]
37472D02289m379774J290037O030768M857096k723718p651866j657945P771438
37464C938325O323072l946717p181846l35743K573288l237365m474486M586502
37456a754970R562372J513354n723348K57436P932953K750849o367013l628413
37448D543220M596775K164165o212299l840352N320969K050083j2010363j3730024
37440a7117826J998253J1397303K90390j3320998j0145096O3242j235966q553956
37432c6624654l180608J3268383J9501641O377796j1051352j4817153l118680
37425b9644627J3530531K3341741J8832651K235992j2468300j2410161k398004
37418A019823J091238n956486r077412J434359J3591023J0307020n488774j5059899
$$ y = [402289, -3977485, -2687448, 3343320, 8200416, 5476698, -2175168, -3833113, 3938325, 10261397, 6314680, -867166, -1202909, 1370379, -1866986, -6341472, -1754970, 7807402, 9320756, 3597408, 3854844, 11787797, 14538646, 8171633, 4543220, 9139995, 11304160, 5091861, 1251509, 6572478, 8622561, -3387802, -17117826, -15119573, -3722270, -3431880, -16752878, -26897974, -26834732, -28070698, -36624654, -39805262, -26536879, -7035238, -657442, -11708794, -26525947, -29644627, -16114096, 7227645, 26060296, 28296288, 15827988, 3417827, 1019823, 2111061, -3845425, -12922837, -11488478, 2102545, 12409565, 6920791, -8139108]
37410h139108r445005J732775O644120M523069K16171l574665l984873K244960
37402i782556J0395104Q503426m889444j2539755m21483J8430666J7990122m167161
37394B3518919k1733634j5486334K372079R515559N130906M923897J2527775J4099641
37386C4868808J906421j2167108j3133313l212878K868790j209949n528102J307741
37378E700410J4649014J7184465J373410j7356245j7455133N25866J3233839N300656
37370B3156282j0338434j1439089L194109J4859303J1754454O91563p550030j1057989
37362A3270169j1583137p981067r40502L750325K773889M15510J269176L408232
37354D382595L757430M544658Q085169R727882L604895o788916j1274581o272332
$$ y = [-8139108, -17584113, -15851338, -9207218, -4684149, -4467978, -8042643, -12027516, -9782556, 612548, 9115974, 4226530, -8313225, -8734708, 9695958, 27686080, 23518919, 1785285, -13701049, -11328970, -1813411, 3317495, 8241392, 20769167, 34868808, 36775229, 24608121, 11474808, 8261930, 11130720, 9920771, 4392669, 5700410, 20349424, 37533889, 38907299, 21551054, 4095921, 4621787, 17855626, 23156282, 12817848, 1378759, 4572868, 19432171, 31186625, 31878188, 24328158, 13270169, 1687032, -6294035, -7234537, -3484212, -710323, -294813, 974363, 4382595, 8140025, 12684683, 20769852, 30497734, 34102629, 27313713, 16039132, 9766800]
37346I766800J074702L474406K341463K713134L858103Q30823n750786q137832
37338A0170813k472832M119889L477562k54662L366319J1793015Q455345j2293774
37330B6361675k9867960j9970845J2140937L4982415K8122070L694571j2820630
37323D2642233j1880518l111244J975832R30453k526569m259159k474480R48539
37315B2245087J834291j487886n758812o588758l306884P18539J102231l577013
37307E180795q331038m458943R233624K0099458J4790333j285693p972838K666130
37299B9921828J4011949P135489j2974943k3995825j4993335K043081R200715
37292A0348959K649527o680788p247402J363839R762281J0627996P051559N721781
$$ y = [9766800, 10841502, 14315908, 16657371, 19370505, 23228608, 24059431, 18308645, 10170813, 7697981, 11817870, 15295432, 15040770, 18407089, 30200104, 38655449, 26361675, -3506285, -23477130, -11336193, 23646222, 51768292, 55462863, 42642233, 30761715, 27650471, 29626303, 30556756, 28030187, 23771028, 21296548, 22245087, 24079378, 22591492, 16832680, 10243922, 6937038, 7655577, 8757808, 5180795, -3150243, -7609186, 1624438, 21723896, 36514229, 35228536, 27255698, 29921828, 43933777, 51069266, 38094323, 14098498, -894837, 1148244, 10348959, 12998486, 6317698, -929704, 434135, 10196416, 20824412, 27875971, 33597752]
37284C3597752M619688l467326j4426255j2713512M834096J7475594O639430j4754565
37276B1804902j6963579M748513K2134522J2603091j1054919k0029140o716962
37269F526428J0676561J4653236O052226m108536q867882p709166k270267M527159
37261A9479759P765839L705827n796737j3883111j4233305n801458O716823J5368892
37253A3322529J3090398k92122j4306926j4549701J789621J9690079K1881206
37246D0625084R066503l260316p120677r437728j4143740j1269761N479647K1522996
37238C1462008J7661569j682931j3291079p486790J254885l63096n063154l52040
37230B2139372R277946R036209l001698j2621218r460702j39040K383955l567621
$$ y = [33597752, 38217440, 34750114, 20323859, 7610347, 12444443, 29920037, 36559467, 21804902, 4841323, 9589836, 31724358, 44327449, 33272530, 13243390, 6526428, 17202989, 31856225, 37908451, 33799915, 24932033, 17222867, 14952600, 19479759, 27245598, 30951425, 25154688, 11271577, -2961728, -8763186, -2046363, 13322529, 26412927, 26120805, 11813879, -2735822, -946201, 18743878, 40625084, 49691587, 46431271, 39310594, 29872866, 15729126, 4459365, 9939012, 31462008, 49123577, 47440646, 34149567, 26662777, 27917662, 27554566, 22491412, 22139372, 31417318, 40453527, 37451829, 24830611, 15369909, 15230869, 17614824, 14047203]
37222A4047203p428449k006711O144123O504698J070497J693965R465661Q912263
37214C8403250q235138k4155155j5632971J1408150K6668963J5444579m811350
37207C9090328j2724437r180567n721510l833331k9434J414861l069314m597211
37199A349385M913848J5012821R788173o030147j2334397l177468P320659R243801
37191B6086675Q192661Q219680K094946j2518479k2568431j6834654k487603O703925
37183c111280R193728J1146976J1694315O275996q54060j587016J264295k132068
37175C1890886j0711166j2553695m727727J007678k406629n373998K081725J2972631
37167A2179705J4235471P445805M668213P443549N369146l725862p962819j388209
$$ y = [14047203, 6618754, 4612043, 10756166, 17260864, 18331361, 20025326, 29490987, 38403250, 30168112, 6012957, -9620014, 1788136, 28457099, 43901678, 39090328, 26365891, 17185324, 11463814, 7630483, 7601049, 9015910, 5946596, 1349385, 6263233, 21276054, 31064227, 25034080, 12699683, 9522215, 16842874, 26086675, 34279336, 42499016, 44593962, 32075483, 9507052, -7327602, -9815205, -3111280, 6082448, 17229424, 28923739, 35199735, 34345675, 32758659, 34022954, 31890886, 21179720, 8626025, 3898298, 4905976, 2499347, -2874651, -792926, 12179705, 26415176, 33860981, 38529194, 45972743, 51341889, 47616027, 39653208, 38264999]
37159C8264999M390828j548460j0918318r245653L13329K135439n865095q465408
37151I061661K030381J2827633R848173k163854q366321m163042L396599Q635236
37143C1106466J0881389Q265056j223922j2256928j4917288p392553P49677J044022
37135A6255919l228838k848862M134032R995784Q113894J728529j212854M43971
37127C3381575L38158l944695n705837n1748O558341N681156P84353J182370N250766
37118D3474439K791905n988888q360702N48878R172529P534087J308462R4795
37110E0575505K755411K904152n92609o084478j2275071j2749927r728J7709659
37102D2232914J9093418j80082j6564728j1666031J317202K043769l970829m70081
$$ y = [38264999, 42655827, 41107367, 30189049, 20943396, 21256725, 23392164, 17527069, 9061661, 11092042, 23919675, 33767848, 31603994, 23237673, 19074631, 22471230, 31106466, 41987855, 50252911, 49028989, 36772061, 21854773, 14462220, 15211897, 16255919, 13027081, 10178219, 14312251, 24308035, 32421929, 34150458, 32937604, 33381575, 33719733, 29775038, 24069201, 24017453, 30575794, 36256950, 37041303, 38223673, 43474439, 46266344, 40277456, 31916754, 32465632, 41638161, 49172248, 50480710, 50575505, 53330916, 56235068, 55642459, 49557981, 37282910, 24532983, 24523255, 42232914, 61326332, 61146250, 44581522, 32915491, 34232693, 36276462, 32305633, 31835552]
37094C1835552P010776K576951p166388l584741P337754K967192j3577078j5217099
37086A2182919J740669R588995k071235p396859Q919588K1370934N116272k1203283
37078B8248000k3832504m052276J0639194J0698970R089373J0167153M009131
37071D4967041r141521j3935746l762198P981547N609443j0179565k3737246j9209974
37063b1408219L802324K5869479K5816265O387544q819200p282006n39649N72517
37055B4399055K735480J0008054Q983700p103981j9045073r137094Q627152J0478852
37047B9946145R4289k833730K155410J990069o3686P527915J4622610K237198
37039E5676220j8715010j8074197L562115J3127229p19722r821358M156773J8621410
$$ y = [31835552, 38846328, 41423279, 34256891, 30672150, 38009904, 40977096, 27400018, 12182919, 13923588, 23512583, 21441348, 14044489, 22964077, 44335011, 49451283, 28248000, 4415496, 363220, 11002414, 21701384, 30790757, 40957910, 44967041, 35825520, 21889774, 18127576, 26109123, 31718566, 21539001, -2198245, -21408219, -17605895, 8263584, 34079849, 40467393, 31648193, 24366187, 23826538, 24399055, 27134535, 37142589, 46126289, 39022308, 19977235, 10840141, 19467293, 29946145, 30040434, 27206704, 29362114, 31352183, 31288497, 38816412, 53439022, 55676220, 36961210, 18887013, 22449128, 35576357, 34856635, 25035277, 29192050, 47813460]
37031D7813460Q735739j2214522j5875021j381030R504349O185513k863458p360646
37023C2544384m591251J857376L023848o969110j7519442j0299381J1981490K2714942
37015C2742856P333873j5222845j9801635p666205L026748N292116N288966O340669
37007A7334543O481965N693643M497568J238520k690672l406977l824692r578773
36999A5745125j3322128j615426J8007667K0103923L52746j4169611p138059K217143
36991B0181380m507750j2061800j479979J2733164P871284n118374j369797J1755388
36983B8003516P508880j0677427j3271559M187507J3760012K573719r219952o004461
36975A6860235J033110K83331r34315L789802N948678P45483k135732K201697
$$ y = [47813460, 56549199, 44334677, 28459656, 27078626, 36582975, 42768488, 39905030, 32544384, 27953133, 29810509, 32834357, 25865247, 8345805, -1953576, 10027914, 32742856, 40076729, 24853884, 5052249, -2613956, 412792, 5704908, 10993874, 17334543, 23816508, 29510151, 34007719, 35246239, 32555567, 29148590, 25323898, 15745125, 2422997, 807571, 18815238, 38919161, 39271907, 25102296, 17964237, 20181380, 15673630, 3611830, 2131851, 14865015, 22736299, 17617925, 16248128, 28003516, 35512396, 24834969, 11563410, 15750917, 29510929, 32084648, 22864696, 16860235, 17893345, 18176676, 17242361, 21032163, 26980841, 27726324, 25590592, 27792289]
36967B7792289M100917j112715l769649P22863L227884L79280J663409Q134034
36959D1138312O758379l650198n137711P662532J3566727n16493j5382586j0798534
36951C3640428J488136N42593p401301l432763P905557P206822l784829m747663
36943C1416980P482687J3293297K243942j2509990j5611609o621170P440365J9959061
36935D7093563K2243925Q811966j1071939k0204931j4497935n466754q60937L841052
36927B9888010J2142088J7589131J2899088o69668j5508438k2166009j3172624
36920B1001578P734447K1813607J2896634j0723454k3672278j3998617M922144
36913A9974061J4280974R914750j61276p296765p176885j445552K884501J774462
$$ y = [27792289, 31893206, 30780491, 27010842, 27733705, 30961589, 31340869, 33004278, 41138312, 47896691, 44246493, 39108782, 46771314, 60338041, 59821548, 44438962, 33640428, 35128564, 35671157, 28269856, 24837093, 32742650, 39949472, 36164643, 31416980, 38899667, 52192964, 54436906, 41926916, 26315307, 19694137, 27134502, 47093563, 69337488, 78149454, 67077515, 46872584, 32374649, 26907895, 26046958, 29888010, 42030098, 59619229, 72518317, 71848649, 56340211, 34174202, 21001578, 28736025, 50549632, 63446266, 52722812, 29050534, 15051917, 19974061, 34255035, 44169785, 44008509, 36711744, 29534859, 28089307, 30973808, 32748270]
36905C2748270P11925N157675Q642330K564766o102823l295425P395367P735383
36897E5557468n094428j2216112l488708O425502L425717l658600q80567O747068
36889D6817340O382173J72147j233249J301319j62007l471358j522562J352523
36881D9636326l622347j0830801p491097K992493M859351l183114n583494L087131
36873B9864448R595254O245741L255206P559378Q290492l332828j5568371j3364662
36865C2544658j829989L861778K317504K582401M578180J392290l292571J010654
36857D3164905J1462452J3675550M683632l297648m245352n150432p298965r81017
36849E2013125J2310679J2970222o659581k3389102j4217835P794355J2622252
$$ y = [32748270, 33460195, 38617870, 47260200, 49824966, 43722143, 40426718, 47822085, 55557468, 50463040, 38246928, 34758220, 41183722, 44609439, 40950839, 40070272, 46817340, 53199513, 53371660, 52138411, 53439730, 53277723, 49806365, 48283803, 49636326, 46013979, 35183178, 27692081, 30684574, 35543925, 32360811, 26777317, 29864448, 39459702, 45705443, 48960649, 56520027, 64810519, 61477691, 45909320, 32544658, 30714669, 34576447, 36893951, 39476352, 44054532, 45446822, 42154251, 43164905, 54627357, 68302907, 72986539, 69688891, 65443539, 60293107, 52994142, 52013125, 64323804, 77294026, 70634445, 47245343, 33027508, 40821863, 53444115]
36842E3444115j000789o724863M745515J1835227p1988j4137245j0204115L631719
36834D1517576O501740k674959q095100l624500K762359O311433R640053J1442045
36826F3780647O644031k206194o806863o144928n965405o697178m267003r54502
36818C7382605j645091j333909P365485J5341298N612212j6169387k2065016k008034
36810B2480163J7506082J0220113j1661458j5935832M027096K3569611K2118840
36803G2324615M846355j1164727j6324169j1258281k184383K803466M51967l465785
36795C6029058k507754J89211k242901p211255n228500N153795J4344742J4111602
36787E2637998N588923m542579r112227l680476P824365J3143566N231720p340097
$$ y = [53444115, 52443326, 45718463, 50463978, 62299205, 62227217, 48089972, 37885857, 41517576, 48019316, 45344357, 37249257, 33624757, 36387116, 42698549, 52338602, 63780647, 70424678, 68218484, 61411621, 55266693, 49301288, 42604110, 38337107, 37382605, 35737514, 34403605, 41769090, 57110388, 62722600, 46553213, 24488197, 22480163, 39986245, 50206358, 38544900, 22609068, 26636164, 50205775, 72324615, 77170970, 66006243, 49682074, 38423793, 36239410, 39042876, 39494843, 36029058, 33521304, 33710515, 31467614, 24256359, 19027859, 24181654, 38526396, 52637998, 58226921, 53684342, 44572115, 40891639, 48716004, 61859570, 67091290, 59751193]
36779E9751193j1867508q874771p514504q433913m712276K888210O346734N364345
36771C2947510P191571J1116353Q311194j048582n737345j699656K155651j76665
36763E3060031m232529o341158p766529n352670N276800J4914590R039161n297232
36755E3300464m456462J2399234J6026125o522352k6078964j4454161J0999289
36748D1213173J5033076j698452r970568k041757J187067r242059j6062134p208518
36740A1209828O130612J1032811J0175191R242180N556099k337538q305952q121718
36732C4581513l664215L982825J2710252J2349581l545244k0264542j6481042
36725A9669128L323478J3073395L866769n942734m369750k623784q223672q116985
$$ y = [59751193, 47883685, 39008914, 31494410, 23060497, 18348221, 21236431, 27583165, 32947510, 40139081, 51255434, 59566628, 58518046, 52780701, 51081045, 53236696, 53060031, 48827502, 42486344, 34719815, 29367145, 34643945, 49558535, 58597696, 53300464, 48844002, 61243236, 77269361, 70747009, 44668045, 30213884, 41213173, 56246249, 54547797, 44577229, 42535472, 43722539, 34480480, 18418346, 11209828, 17340440, 28373251, 38548442, 47790622, 53346721, 51009183, 42703231, 34581513, 30917298, 34900123, 47610375, 59959956, 56414712, 36150170, 19669128, 22992606, 36066001, 39932770, 33990036, 29620286, 26996502, 18772830, 10655845]
36717A0655845N592668J6622467J0042341l006514n570763j750620k838654l900313
36709B5846457K801000O419619m631690j5914553o337732J4154017J6448552j639358
36701C7146312j2211808k611078O711560j094228j2171130p382710O193198Q852365
36693B3432481J64678l027236M912170J0251172J995423j1014687j1690409K548817
36685A7572409J6082114J4809353L742146j108897M021516N662093n449838j8911470
36677C6419426j9358173p913519K626180P339204J0033529R140165o94472j3195247
36669B4397093j3415491j8105J0096463N361939n199309p379465o03252P001313
36661B0241186J1375208J0401918p46623j9210399k7181666j0927915J6019413
$$ y = [10655845, 16248513, 32870980, 42913321, 39906807, 34336044, 32585424, 29746770, 25846457, 28647457, 35067076, 30435386, 14520833, 8183101, 22337118, 38785670, 37146312, 24934504, 22323426, 29034986, 27940758, 15769628, 8386918, 14580116, 23432481, 23597159, 20569923, 25482093, 35733265, 37728688, 26714001, 15023592, 17572409, 33654523, 48463876, 52206022, 51097125, 55118641, 60780734, 55330896, 36419426, 17061253, 9147734, 11773914, 19113118, 29146647, 38286812, 37592340, 24397093, 10981602, 10963497, 21059960, 26421899, 21222590, 13843125, 13239873, 20241186, 31616394, 42018312, 41271689, 22061290, -5120376, -16048291, -28878]
36654b8878K5317072J0849049l411274J093107J0823677L175204j5928807j8978799
36646A2910351P43009J6876204Q288853j0082965j0657744O490474J7692214J3005697
36638E5266093O244915P449304P962717k21784r209811r454628m597576k067502
36630E1371728j592059k204211p572218j4855449j2389509N34133O645669l206992
36622A6731092j2478328m015505J2158094J6005485R115248O324991O775954r44741
36614D9672290j2276068j2313258l664522j503736l496534O283303K3281268K3508384
36606F9491127L753437j0043592l741454N463693K720675q59246M847205O407253
36598G8039098o845361j7998880r370942N484008L818394p867838o707381N997530
$$ y = [-28878, 25288194, 36137243, 32725969, 33819076, 44642753, 47817957, 31889150, 12910351, 13653360, 30529564, 38818417, 28735452, 18077708, 24568182, 42260396, 55266093, 61511008, 68960312, 76923029, 76701245, 67491434, 58036806, 53439230, 51371728, 49779669, 47575458, 40003240, 25147791, 12758282, 13292415, 19938084, 16731092, 4252764, 237259, 12395353, 28400838, 37516086, 43841077, 50617031, 49672290, 37396222, 25082964, 21418442, 19914706, 16418172, 22701475, 45982743, 69491127, 73244564, 63200972, 59459518, 64923211, 67643886, 66784640, 71631845, 78039098, 71193737, 53194857, 43823915, 49307923, 53126317, 45258479, 38551098, 44548628]
36590D4548628Q066149l866270q121623N561581J9314523J4931898j338090j1533495
36582F7563301r565326k686707J578389K207342K870959P140976J3162803J4236963
36574I6508700Q312044K929113N015954J0997457J4678930J8951880K9521318
36567A86915396M2275874M8721951M9646750N0031424M3623536J8480311k1197733
36560D18497509n3729243o4306649n8588627m8666865l8318385k7917140k1865409
36553A05105191k1916545k1032073j3054510l464131k102824q274191j1200345
36546B4060572m873723M369528P091283K949457j52459K585316P080726P520475
36538E0631175M714292K518024m41520p336772j2870315p525118N492059R856133
$$ y = [44548628, 52614777, 48748507, 40626884, 46188465, 65502988, 80434886, 79096796, 67563301, 57997975, 55311268, 56889657, 59096999, 61967958, 69108934, 82271737, 96508700, 104820744, 107749857, 112765811, 123763268, 138442198, 157394078, 186915396, 229191270, 277913221, 327559971, 377591395, 421214931, 439695242, 418497509, 364768266, 300461617, 241872990, 193206125, 154887740, 126970600, 105105191, 83188646, 62156573, 49102063, 45637932, 43535108, 35260917, 24060572, 19186849, 23556377, 30647660, 33597117, 33444658, 36029974, 43110700, 50631175, 55345467, 57863491, 57421971, 50085199, 37214884, 29689766, 35181825, 45037958]
36530D5037958p55369j1225163p138676K815323J624546p082986m262097J2389284
36522C1402820K1933616J0795614p508045j2513089l596180M560538L991403j268835
36514D7797842o405465r990678q682496P07609J1962844J1934941k641283j7305483
36506B7377831j5684773P8162J2220819J0179658K115864M37680M069356L036629
36498D3831226m454885j0030572r130126o616547o846178p559527o599903o075938
36490a3482450o261621l518744K029251N011388M475927N773303R033531O853561
36482I914146j133441l873634L062889Q053295K520449l641031N77085O647856
36474B2127614L77769j2742266j4941937l234347R172169J4172304J3511755O632466
$$ y = [45037958, 44282589, 33057426, 25918750, 28734073, 30358619, 23275633, 19013536, 31402820, 53336436, 64132050, 56624005, 44110916, 40514736, 45075274, 49066677, 47797842, 41392377, 31401699, 22719203, 23426812, 35389656, 47324597, 44683314, 27377831, 11693058, 11771220, 23992039, 34171697, 36287561, 36725241, 40794597, 43831226, 39376341, 29345769, 20215643, 13599096, 6752918, -806609, -7406512, -13482450, -19744071, -23262815, -21233564, -16222176, -11746249, -5972946, 3060585, 9914146, 8780705, 4907071, 7969960, 16023255, 18543704, 14902673, 15479758, 22127614, 22505383, 9763117, -5178820, -8413167, 759002, 14931306, 28443061, 35075527]
36466C5075527o514519j3618363k660221J4215514J2419406p416242j7695075
36459A3806027n553378Q699343N897763k882122J474633J3600958J3928689j89798
36451D8782115j3269090j5002179q290605J192349Q767267P726073l805852j4975308
36443A1124770j2963060l31145Q424825N916230k185231q415258j0563677p841681
36435a6834227R9263Q553969R992843L519324l242502l494404J854353P889170
36427H337789J2021993J4342228J4274163R874350R93069q039013j1105963p050938
36419C3647678j805926j415873m839057o511234l589151K644813Q988121J0044966
36411C7164337J669243r206410o596730J1808801K2884046O110208k2757455k8415505
$$ y = [35075527, 28561008, 14942645, 12282424, 26497938, 38917344, 31501102, 13806027, 8252649, 16951992, 22849755, 19967633, 21442266, 35043224, 48971913, 48782115, 35513025, 20510846, 12220241, 13412590, 22179857, 29905930, 26100078, 11124770, -1838290, -2169435, 6255390, 12171620, 9986389, 1571131, -8992546, -16834227, -16734964, -8180995, 1811848, 5331172, 2088670, -1405734, 448619, 8337789, 20359782, 34702010, 48976173, 58850523, 59843592, 51804579, 40698616, 33647678, 31841752, 30425879, 25586822, 19075588, 15486437, 18131250, 27119371, 37164337, 38833580, 29627170, 23030440, 34839241, 57723287, 63833495, 41076040, 12660535]
36403A2660535n506701J4166416R326789k999333o09573Q426973M600760p984954
36395C2080912j0524799j696179L714300J639373J369588M984120M902251K62221
36387C6731787k514593l421530n864902l732076R203769K0446977J1727736r884173
36379E2692995j7790248n422132M901447r74232q740201m135025K265986l889845
36371A8908745j4309507j3057413l674710j54792j186675M842857J5540363J7031353
36363B3940221Q493891L306102M623911J50279j3261788j8624212l635468J7017757
36355B2010693J8620939p80051j8472355j7043557m085694K174155k142742n032388
36347d751000O99290O106416N25591j0409837j1367009L47878J0690180R645895
$$ y = [12660535, 7153834, 21320250, 30647039, 27647706, 27038133, 35465106, 40065866, 32080912, 21556113, 19859934, 23574234, 25213607, 26583195, 31567315, 36469566, 36731787, 34217194, 30795664, 24930762, 21198686, 30402455, 50849432, 62577168, 52692995, 34902747, 29480615, 34382062, 33407830, 24667629, 20532604, 22798590, 18908745, 4599238, -8458175, -12132885, -12287677, -13474352, -8631495, 6908868, 23940221, 32434112, 35740214, 40364125, 40514404, 27252616, 8628404, 4992936, 22010693, 40631632, 39851581, 21379226, 4335669, 249975, 2424130, 281388, -4751000, -4051710, 2054706, 2580297, -7829540, -19196549, -18848671, -8158491, 1487404]
36339A487404M653528O219396R809255L615418j0402660j6106065m850972J2190473
36331F615777J7185852N663592r820025j3529573k902203Q205360M808336r667291
36323F559825j5327907j890804J5185256J4551794j369597j0776168m152583M891583
36315G671399K974389n111187q604322o662394k825164L823183J1071069Q855168
36307A1192141m586852j2164812K75464J9323834J9774976R10620j3030537q524525
36299A3170309J819667L858497J539731K451941J761785n346581q745545K438150
36291A2947954J8868673K0926086N935992r559546j3747443j1769433j2141265
36284A1461018j3403669r765987j924206M007539M695874K472982J489981L062104
$$ y = [1487404, 6140932, 12360328, 22169583, 25785001, 15382341, -723724, -5574696, 6615777, 23801629, 29465221, 19645196, 6115623, 3213420, 11418780, 16227116, 6559825, -8768082, -10658886, 4526370, 19078164, 17708567, 6932399, 2779816, 7671399, 10645788, 5534601, -3069721, -9732115, -12557279, -8734096, 2336973, 11192141, 6605289, -5559523, -5284059, 14039775, 33814751, 34725371, 21694834, 13170309, 14989976, 18848473, 20388204, 22840145, 24601930, 19255349, 10509804, 12947954, 31816627, 52742713, 58678705, 49119159, 35371716, 23602283, 11461018, -1942651, -11708638, -13632844, -9625305, -4929431, -2456449, -966468, 2095636]
36276B095636M427742K160597k877997n718330l347482J716548M732518K600465
36268E789697n463579j5715694j8126050n288860J4056004K0199174O920736q983854
36260f612426j0321250j238199M257731M850906P757521R966344K413817j0018434
36252A056010j1654250l14220Q781289O280393l22898k789028k948008k081788
36244c992500L942808J1274378O370503j1401399k0826735p078893J3503970J4415822
36236F207954l243795j3385190l160546J0685097Q606718m087002p460033L005398
36228b831399J0201549R92030j2924687r814509J0190382K2101842R689870j1737779
36220A5867299j7696696p829733M89313L019218R733881J7704995R833319j3676275
$$ y = [2095636, 6523378, 8683975, 5805978, 87648, -3259834, -1543286, 3189232, 5789697, 326118, -15389576, -33515626, -38804486, -24748482, -4549308, 2371428, -6612426, -16933676, -18171875, -13914144, -9063238, -1305717, 8660627, 11074444, 1056010, -10598240, -10912460, -2131171, 4149222, 3826324, 1037296, -1910712, -3992500, -49692, 11224686, 17595189, 6193790, -14632945, -21711838, -8207868, 6207954, 2964159, -10421031, -13581577, -2896480, 5710238, 1623236, -5836797, -2831399, 7370150, 8362180, -4562507, -14377016, -4186634, 17915208, 27605078, 15867299, -1829397, -9659130, -9169817, -6150599, 3583282, 21288277, 31121596, 17445321]
36212A7445321k7951934j8534213j349527N318278O549651J2124112J3971244
36205G572932L549675o788528l534363K876326k065381p540852K610436J4119074
36197A0799319K075946k1263879j8594037J1425203K6282155L352997k6375439
36190a2297735k6418431l862258J2749293J6909460J8128828J3938137j568236
36183A7579058j4888007q891905O073410N006200j1454333j7043549j362690J4761378
36175a0220438J2312215K70855k600653M370947P783519K164352m873616n370889
36167C836292K58316N934942O270027J392121k499272l9518N072976L459206o741396
36158A6943694j5746540j4555664o324977n67529p0787J60037K715269L549053
$$ y = [17445321, -10506613, -29040826, -30390353, -25072075, -18522424, -6398312, 7572932, 11122607, 4334079, 799716, 3676042, 1610661, -5930191, -3319755, 10799319, 12875265, -8388614, -26982651, -15557448, 10724707, 14077704, -12297735, -38716166, -42578424, -29829131, -12919671, 5209157, 19147294, 17579058, 2691051, -6200854, -127444, 4878756, -6575577, -23619126, -24981816, -10220438, 2091777, 2362632, -238021, 4132926, 11916445, 14080797, 9207181, 3836292, 4094608, 10029550, 16299577, 17691698, 15192426, 15152908, 20225884, 23685090, 16943694, 1197154, -13358510, -19683487, -20251016, -20321803, -20161766, -17446497, -13897444]
36150a3897444l35376m402216k275931M293686O420698O5410p437838o359801
36142b3928812K622017R513364Q129087K609596l54541k29249k23100o46236M20481
36133b087393K309044K588289J598277J589832J719821j503610p962013j2105783
36125a3853536r250158j029868P118193J1547439J1482190O887453j106185q080058
36117C715470q696436l274826Q79199j642067n747837j514908J0723543J7381643
36109A1823781Q351085q202965j5152257q233479K44375J87543l374585r33374
36101a5289876N970280Q222748M168508J930484O396407J1381022P939033l661879
36093B7056727j3695967j3401120l908323M880349M203089m280706j0140280o228135
$$ y = [-13897444, -14232820, -18635036, -20910967, -16617281, -10196583, -10131173, -17569011, -23928812, -21306795, -11793431, -3664344, -1054748, -1409289, -1638538, -1861638, -2507874, -2087393, 221651, 2809940, 4408217, 5998049, 7717870, 6214260, -1747753, -13853536, -23103694, -24133562, -17015369, -5467930, 6014260, 12901713, 11795528, 3715470, -4980966, -8255792, -7376593, -9018660, -14766497, -16281405, -5557862, 11823781, 20174866, 11971901, -3180356, -11413835, -11169460, -10981917, -14356502, -15289876, -9319596, -1096848, 3071660, 5002144, 11398551, 22779573, 30718606, 27056727, 13360760, -40360, -3948683, 931666, 5134755, 854049, -9286231, -15514366]
36085a5514366K857634O924994K910431k677227l314366M77002M418623N742107
36077A824832K898176n043556j4521541j6749251o572496R236231J7779468J4096378
36069B948241N033171p41355j380114L55040K171279K146748j748849q006593
36061G77568j0713504o204927K123991R017120J3701190J6533519J3605392K022610
36053D0862959j1687124j7006876j3434542j0595533j2695749j2037747k818374
36046c9412986O954418N827828l320556n709696M866999J6358445J3493409k129022
36038c071161j3058283p175139P374548J2449458K560905r238776r222748L48638
36030a9032558P109745N059088k027996r121001j3047471r953732N90853J0284698
$$ y = [-15514366, -12656732, -5731738, -2821307, -5498534, -8812900, -8335898, -3917275, 1824832, 4723008, -320548, -14842089, -31591340, -38163836, -28927605, -11148137, 2948241, 7981412, 7240057, 5859943, 6214983, 8386262, 10533010, 8784161, 777568, -9935936, -16140863, -14016872, -4999752, 8701438, 25234957, 38840349, 40862959, 29175835, 12168959, -1265583, -11861116, -24556865, -36594612, -39412986, -32458568, -26630740, -29951296, -35660992, -30793993, -14435548, -942139, -3071161, -16129444, -23304583, -15930035, -3480577, -919672, -10158448, -19381196, -19032558, -11922813, -6863725, -8891721, -18012722, -31060193, -41013925, -40423072, -30138374]
36022c0138374J0754992O437854P835282J2902511R010379m930445j3835101r217595
36014a1180497j589315k182595o333719n061547m48339J833546L888833P873724
36006a3199909Q031189K237324n37641K946004K22601j3687892j8999303r5076
35998c3082703K1742999J4067629j5466862k6472141m749488J9320246J8458374
35991f181946L028223n280306n755714o138561j672531J1072772J7502094N509871
35983A2083902j0385936q535949N847526R526733j996072j0253204m989076K991897
35975e710179L481626J571190L563913M162530k350020r196273o185735M376864
35967f286084J0601411P467088K210535K516918N572273K857608o848431j4784661
$$ y = [-30138374, -19383382, -12945528, -5110246, 7792265, 16802644, 11872199, -1962902, -11180497, -12769812, -14952407, -21286126, -26347673, -26796012, -24962466, -21073633, -13199909, -5168720, -2931396, -3469037, -523033, -300432, -13988324, -32987627, -33082703, -11339704, 2727925, -12738937, -39211078, -43960566, -24640320, -6181946, -3153723, -8434029, -14189743, -20328304, -22000835, -10928063, 6574031, 12083902, 1697966, -6837983, -990457, 8536276, 6540204, -3713000, -8702076, -5710179, -2228553, -657363, 2906550, 7069080, 4719060, -4477213, -10662948, -6286084, 4315327, 11782415, 13992950, 16509868, 22082141, 24939749, 18091318, 3306657]
35959C306657j3733726o999049j805960J452659O308536J0016497O245663k324481
35951B466796m880953J424098O359935K089235n314945n649911J397242P783803
35943E675300P044248j356997j1860535j4658907m986687P926326J0442111L979894
35935B204753K393975Q074452P205547n476704j5668092j3147119p633678p563722
35927b9610588k748939J3031864K1316311O191560j3116835p523965J3813706
35920A353114J5245546q079358k1382178n243613J5624598J3642835j518333n237477
35912D405134K520108M444513k124126m654790O15735M783195L142008O5833r59943
35903A2237667k67339K050266L677079j108119j0907580j3168925j940156Q831215
$$ y = [3306657, -10427069, -17426118, -19232078, -17779419, -11470883, -1454386, 4791277, 2466796, -2414157, -990059, 5369876, 7459111, 2144166, -3505745, -2108503, 5675300, 12719548, 11362551, -497984, -15156891, -20143578, -12217252, -1775141, 2204753, 4598728, 12673180, 19878727, 14402023, -1266069, -14413188, -22046866, -29610588, -32359527, -19327663, 1988648, 8180208, -4936627, -12460592, 1353114, 16598660, 8519302, -12862876, -18106489, -2481891, 11160944, 9642611, 4405134, 6925242, 11369755, 9245629, 4590839, 5206574, 9989769, 13131777, 13197610, 12237667, 11970328, 14020594, 17697673, 16589554, 5681974, -7486951, -9427107, -595892]
35895e95892L991295q374225q435341M283840J0707315K464756p151857n966416
35887i076525J101537N022514O026743O338662L435561r88345J495693R999099
35879B3354939R057050q045820k2905264j5206429O586973J6344467O946861m379521
35871A1753256o391599p565967j4182778j5513692k926902J1987131J3392872
35864i447679M623018M05616L521066N156860L427169M625674P605705L567558
35856B3484987o954703j2180597p574792j971677p29990K598281J0808616J3589649
35848B1069774L839502q432453j0379253m904890k688712m175541l063108o91774
35840i426455k231258l746825J611295Q435793O294014o67918O63941P966957
$$ y = [-595892, 3395403, -4978822, -13414163, -9130323, 1576992, 4041748, -3110109, -9076525, -7974988, -2952474, 3074269, 9412931, 12848492, 11860147, 13355840, 23354939, 32411989, 24366169, 1460905, -13745524, -7158551, 9185916, 16132777, 11753256, 5361657, -2204310, -16387088, -31900780, -34827682, -22840551, -9447679, -4824661, -4419045, -897979, 4258881, 7686050, 12311724, 19917429, 23484987, 16530284, 4349687, -3225105, -5196782, -5926772, -3328491, 7480125, 21069774, 24909276, 16476823, 6097570, 1192680, -1496032, -5671573, -8734681, -9426455, -11657713, -15404538, -13793243, -5357450, 936564, 268646, 932587, 8899544]
35832H899544N006838r328292j5084981k738226R889661N484327o043942o283048
35824a0198119P24961k137641j3363233j3808781K189978J7596522J7438177N817968
35816D259832n568345j0839771p825456K787249J1239061O060058o617006o480985
35808a2985363J0447469K1520657R887633r042195j0983663P87540M542504k985984
35800A1188598m677655L680225N142945p285316j5849821o502081P987309R029282
35792B713486L90219k652561l55331m409886j3371608j2804174O18678J2754151
35784a7117026J2472140M734703k52562K51634L331095N989170N740167K315162
35776A7464483k53320M46747j137213j0384106k0102492j7553307l887658N418504
$$ y = [8899544, 13906382, 4578090, -10506891, -13245117, -3355456, 2128871, -3915071, -10198119, -9473158, -11610799, -24974032, -38782813, -36592835, -18996313, -1558136, 4259832, -1308513, -12148284, -19973740, -17186491, -5947430, 112628, -6504378, -12985363, -2537894, 18982763, 28870396, 19828201, 8844538, 9632078, 14174582, 11188598, 6510943, 10191168, 15334113, 8048797, -7801024, -14303105, -6315796, 2713486, 3103705, 451144, 95813, -4314073, -17685681, -30489855, -29871177, -17117026, -4644886, 89817, -162745, 88889, 3419984, 9409154, 15149321, 17464483, 17211163, 17657910, 16520697, 6136591, -13965901, -31519208, -35406866, -29988362]
35768b9988362J884778n282173l587928O872568J5878196J4607521K965039q671338
35760e321699o914359P535193J5178388K365530j5297417j2291414P919887J6787664
35752I961773M448653p220615k574198M592105k33999o562588j687817L471018
35744D194332m910115j5367369r626945N022857Q600323K474736L117766J0163993
35736C669578Q677947j824857p781262p531024j0293947j2347822k242146J1788406
35728a7885127R443161n493652p627678P237177J3892856N98973j2040136p830433
35720a9704859K33171j498757l053795M926993R482737Q22806m909137N952168
35712g748673J5674400L796081j4325162j0575537Q236580J1341345m789150j2449434
$$ y = [-29988362, -28103584, -33385757, -36973685, -30101117, -14222921, 384600, 3349639, -5321699, -12236058, -4700865, 10477523, 12843053, -2454364, -14745778, -6825891, 9961773, 14410426, 7189811, 4615613, 9207718, 8973719, 2411131, 723314, 4194332, -715783, -16083152, -25710097, -20687240, -12086917, -9612181, -6494415, 3669578, 12347525, 10522668, 2741406, -4789618, -15083565, -27431387, -29673533, -17885127, -8441966, -13935618, -21563296, -14326119, -433263, 165710, -11874426, -19704859, -19471688, -20970445, -24024240, -19097247, -9614510, -8791704, -13700841, -7748673, 7925727, 11721808, -2603354, -13178891, -4942311, 6399034, 1609884, -10839550]
35704a0839550M40029J3848052J1768860M122299K283322p47607j1723534j9587432
35696a0435561j2266941L127551J0510209N439561m166457r158558m277720Q373557
35688a2854359J6026134O596662j2070313j7675583l926220R996049R025640M014062
35680h67928R745385J6999134P329910j3595214k0823965o831557Q034816N951069
35672E941650n619185r442333k498347O076041J0937301J2394582P940481n465365
35664B0264825k0883037k3777679r144136R898409J5944949O976306l119326l209094
35656g048783K010744J128016o615140j0777904o028192L17627J476433L063454
35648b2473745J2129508K0253957J2038210r004277j8728889m236938J5556401
$$ y = [-10839550, -10399521, 3448531, 15217391, 19339690, 21623012, 20875405, 9151871, -10435561, -22702502, -19574951, -9064742, -3625181, -7791638, -16950196, -21227916, -12854359, 3171775, 9768437, -2301876, -19977459, -23903679, -13907630, -4881990, -867928, 8877457, 25876591, 33206501, 19611287, -1212678, -8044235, -9419, 5941650, 322465, -9119868, -11618215, -5542174, 5395127, 17789709, 25730190, 20264825, -618212, -24395891, -33540027, -23641618, -7696669, -720363, -3839689, -7048783, -5038039, -3910023, -10525163, -21303067, -27331259, -27013632, -25537199, -22473745, -10344237, 9909720, 21947930, 12943653, -5785236, -10022174, 5534227]
35641E534227J4272112n675978j7927777j0270372Q95099j601242j0714804q994470
35633c4483205M730392J6419627J8068991J4082145R197998L213001j922244j524920
35625B7781785K644559K329438m584922r670456o287203Q42395L032847j127035
35617A4961408o380220p915294m132660L116101P809662M371775l601792n060252
35609C168728L622407J1621441P737825l768275r253949m285224K362183K396195
35601A3601331k358758n532304n118883l658148k905476j514144K185596O204473
35593I03687N409265j607724p560238l961388N709599Q114367q07904p664171
35585a464507o40678J1301128J0856104o55632m722024N125717J2408116L346733
$$ y = [5534227, 19806339, 14130361, -3797416, -14067788, -13172689, -14773931, -25488735, -34483205, -29752813, -13333186, 4735805, 18817950, 28015948, 31228949, 29306705, 27781785, 30426344, 32755782, 28170860, 18500404, 12213201, 13055596, 16088443, 14961408, 8581188, 665894, -3466766, -350665, 7458997, 11830772, 8228980, 3168728, 6791135, 18412576, 26150401, 22382126, 13128177, 8842953, 11205136, 13601331, 11242573, 5710269, 591386, -3066762, -5972238, -7486382, -5300786, 903687, 6312952, 4705228, -2855010, -6816398, -1106799, 7007568, 6199664, -1464507, -2105185, 9195943, 20052047, 19396415, 14674391, 19800108, 32208224, 35554957]
35577C5554957j1094266j1657022M3046M606732n670201j5920020j0642197N568894
35569i210077J6023721J2757756J597048q734563j4128529j3196764n885553L916693
35561a6860268R514287Q113288L742840J652855K460792L798292M755957N326884
35553B2504927L480084k669934r755144j0604812k896895O437713Q273816J564553
35545A6334308n953128o898910j609232M152708O493810O328338N740982L914386
35537B8503262j618173j0004918j5196310j1025344J223023J1993496J2616167
35530A6491203N039765p38382J02106J061510m807013j2482345j1184605j064009
35522g581770O422855O210297O194907J0889745J0745698j682690j5019888j3137149
$$ y = [35554957, 24460691, 12803669, 12846715, 17453447, 11783246, -4136774, -14778971, -9210077, 6813644, 19571400, 21168448, 12433885, -1694644, -14891408, -20776961, -16860268, -7345981, 767307, 4510147, 6163002, 8623794, 12422086, 17178043, 22504927, 25985011, 23315077, 13559933, 2955121, 58226, 6495939, 14769755, 16334308, 10381180, 3482270, 1873038, 6025746, 12519556, 18847894, 24588876, 28503262, 26885089, 16880171, 1683861, -9341483, -8118460, 3875036, 16491203, 21530968, 20792586, 20894692, 21956202, 17149189, 4666844, -6517761, -7581770, -1158915, 5051382, 11246289, 22136034, 32881732, 31199042, 16179154, 3042005]
35514C042005L35867P796019M498080J877829M742630M565449j131909k273257
35506B3452713L979490N679995k148216o542975L58168N325056l063993j2146215
35498A4894023n481945Q091711Q083443m450676j0549571m427169J839115J693086
35490I692017N28966K3450l623566o513611j529381N351799L039383k727876K346550
35481F587731J2963309J0191908l754809n534476R203183J5621882M19767j5915318
35473B9783177j3147499j886207j190181p486887o774285m22867J787655N27548
35465A190454M86616k081339q936646j0335058j605726N214977K009349M45746
35457a3611627R709266J6200797O586932o013504l276994O027841J806739j1770305
$$ y = [3042005, 3377872, 11173891, 15671971, 17549800, 22292430, 26857879, 25725970, 23452713, 27432203, 33112198, 30963982, 24421007, 24779175, 30104231, 27040238, 14894023, 9412078, 17503789, 25587232, 21136556, 10586985, 6159816, 7998931, 9692017, 10220983, 10244433, 6620867, 107256, -1422125, 3929674, 6969057, 4241181, 6587731, 19551040, 29742948, 25988139, 20453663, 29656846, 45278728, 45698495, 29783177, 16635678, 14749471, 13559290, 6072403, -701882, -1124749, 662906, 1190454, 1677070, -404269, -9340915, -19675973, -21281699, -16066722, -14057373, -13611627, -3902361, 12298436, 18885368, 12871864, 9594870, 15622711, 17429450, 5659145]
35449E659145j4771426o088619r84910j501339K140772O734611J796394m910051
35441a1925423K351963J5180441J0882384p169582j2363280N86195Q352711J120547
35433G015956l200778M064105O101761n000865j0690301l21018P376788k269957
35425C075691j2789176o159955N325450K658173n432989M64061J4922217J7202199
35417A9265671N209544n813583r866593j1624954r105153J537156J0077189M300844
35409C980121o630433l925999Q958106J0219954m337631j3304615k952443J2256968
35401D264028J1788401l331539j5151747j1996037J001558R852617O058817m611135
35393b125037q389578j211118N252560J150423n848914l163013N353135N327234
$$ y = [5659145, -9112281, -15200900, -16185810, -17687149, -15546377, -8811766, -7015372, -11925423, -9573460, 5606981, 16489365, 9319783, -3043497, -2457302, 5895409, 7015956, 3815178, 7879283, 13981044, 8980179, -1710122, -2031140, 5345648, 3075691, -9713485, -15873440, -10547990, -7889817, -13322806, -12858745, 2063472, 19265671, 24475215, 18661632, 8795039, -2829915, -11935068, -10397912, -320723, 3980121, -2650312, -6576311, 2381795, 12601749, 8264118, -5040497, -7992940, 4264028, 16052429, 12720890, -2430857, -14426894, -13425336, -3572719, 2486098, -2125037, -10514615, -11725733, -6473173, -5322750, -11171664, -14334677, -8981542, -3654308]
35385c654308m386958r876221m197001L947100O078369M600447L431254O53998
35377c403320l644356l000706M902674J1633128R054736Q57541l595477k333647
35369A0470573j031215k607420l030061J224246N358601M77226j2552067j8001898
35361a9692015k272929K4070593L2691797J1896008j6121159k2672732p970287
35354g0724M788017L750326j119041k80818J695246p64136l527770k906580l875496
35345b310976r311224j1187725k343677J0293487J4054536P421096j22716j948140
35337D544661o0523J308296R79288j96636q24079N55627L230019L400325j431389
35328A1505589q014013j0234694o024906J070706O878286J0479736J2252953J0296211
$$ y = [-3654308, -8041266, -17917487, -22114488, -18167388, -12089019, -7488572, -4057318, -3403320, -7047676, -10048382, -5145708, 6487420, 15542156, 16399697, 12804220, 10470573, 9439358, 6831938, 3801877, 5026123, 10384724, 10861950, -1690117, -19692015, -21964944, 2105649, 34797446, 46693454, 30572295, 7899563, -70724, 4717293, 8467619, 7348578, 7067760, 8763006, 7998870, 4471100, 1564520, -2310976, -11622200, -22809925, -25153602, -14860115, -805579, 6615517, 6492801, 4544661, 4484138, 5792434, 6771722, 6575086, 5751007, 6306634, 9536653, 12936978, 11505589, 3491576, -6743118, -12768024, -11697318, -4819032, 5660704, 17913657, 28209868]
35320B8209868K070387r488310j5089641r057424J196215K624265n286800q473643
35312a3295083P84855J0433236O030325n888266o262358P241899J5627311O357462
35304B1029381r174819j3584922o738071k93102K185420O126650J0504139N715698
35296A5770374r923753k2162387j6725897J566111J3515570Q983832j756343l595017
35288a4327510K928926N142117m41755k490168N612509J2711724O473894n830964
35280I778773p388810J631340M218361n581877j1711331n31456J7162567K0239959
35272B7817526N627719r575187j1380747l379345K803944K796456J099035J824722
35264A7634123K993210O50458m365287p119210n750327l706352l311662k272199
$$ y = [28209868, 30280255, 20791945, 5702304, -3355120, -2158905, 465360, -4821440, -13295083, -12510228, -2076992, 3953333, -1934933, -8197291, -955392, 14671919, 21029381, 11854562, -1730360, -8468431, -8761533, -6576113, -449463, 10054676, 15770374, 5846621, -16315766, -33041663, -31475552, -17959982, -8976150, -10732493, -14327510, -11398584, -6256467, -6698222, -9188390, -3575881, 9135843, 15609737, 9778773, 2389963, 4021303, 8239664, 2657787, -9053544, -9585000, 7577567, 27817526, 33445245, 23870058, 12489311, 9109966, 11913910, 14710366, 15809401, 17634123, 20627333, 21277791, 16912504, 9793294, 4042967, 336615, -2975047, -5247246]
35256e247246J36201l12739m268101l891378M668441J0739477L584761p948786
35248b539370o343976O309525R733715k874305j4445541j1737045l894043k672756
35240b8463796k315645O010783J4848528J2984639N806325M857447O252089r11374
35232A9068996j1066766q244421O364752J3290029L418962r794829j1152088k311257
35224d26622N483970N660565j271119j0104600j2482908m207757P558212J2079820
35216B289561Q919641M861176J50811r161051j7162308j2470600J873895R055982
35208a1642893K670935n249030m844872r66313Q83795M287258R056699N422478
35200c81943p451906j2870161q87803J2545252P689036q510346j2963034p54483
$$ y = [-5247246, -5111045, -5423784, -9691885, -13583263, -8914822, 1824655, 5409416, -2539370, -8883346, -2573821, 7159894, 4285589, -10159952, -21896997, -25791040, -28463796, -30779441, -24768658, -9920130, 3064509, 8870834, 13728281, 19980370, 19068996, 8002230, -242191, 6122561, 19412590, 22831552, 13036723, 1884635, -426622, 5057348, 10717913, 9446794, -657806, -13140714, -17348471, -9790259, 2289561, 11209202, 16070378, 16221189, 7060138, -10102170, -22572770, -20698875, -11642893, -8971958, -14220988, -19065860, -20032173, -19148378, -14861120, -5804421, -381943, -7833849, -20704010, -21591813, -9046561, -1357525, -9867871, -22830905, -23585388]
35192b3585388J0467966Q321312J71715j955429L078786Q385557P752233l43294
35184A2293458j0146454j1025659m7005J0550506P571245m410933r182474j385649
35176e782965R055825J3768667J3894093J0285268j45444j3746566j8342545r422340
35168d36007J289141J310572n724994p018114N08127P189185N052308k448075
35160b77857o767710n165251j705227L36149K252274M857539M559704n53880m245190
35151f709449K55516P599717N723428m838776r231406l73021J0082201J0314606
35143A2822816M671947J172049l516708j2291373j3993864n29045J2765727O185208
35135G286757j1631957j4447469J215965J2453484P707459J161571L506838M632522
$$ y = [-23585388, -13117422, -4796110, -4624395, -6579824, -3501038, 4884519, 12636752, 12293458, 2147004, -8878655, -8925660, 1624846, 9196091, 4785158, -4397316, -5782965, 3272860, 17041527, 30935620, 41220888, 41075444, 27328878, 8986333, -436007, 853134, 2163706, -3561288, -10579402, -10071275, -2882090, 2170218, -277857, -7045567, -12210818, -13916045, -13579896, -11327622, -6470083, -1910379, -2464259, -6709449, -6453933, 1145784, 6869212, 2030436, -7200970, -7573991, 2508210, 12822816, 17494763, 18666812, 15150104, 2858731, -11135133, -11664178, 1101549, 7286757, -4345200, -18792669, -17576704, -5123220, 2584239, 3745810, 7252648, 11885170]
35127A1885170l496080r998080n333492R90978j974938p700180n573340J376641
35119a9823321O147539J0919543J6590649J3628018j519760j4587208j3468848
35112b113388o298032m043416r01237R114970J2568387k301317j8610795j2812195
35104b5397023O108162R640736l717637p639687O168608J4905870M995104n688429
35096f24296K66795J1770746J0644115O81697l492959j269678j175243k714194
35088A4086983j108997j620888j1155647k0681156j3921652O629963J8148991
35081i622403O582306j3671914j6867438K043931K0650571J6379098n147190j6965304
35073a6618343n665600J1874436J3310868J066432n736588j444776K445361Q13624
$$ y = [11885170, 8389090, -1608990, -6942482, -5951504, -7926442, -15626622, -21199962, -19823321, -13675782, -2756239, 13834410, 27462428, 25942668, 11355460, -2113388, -8411420, -12454836, -13356073, -4241103, 8327284, 6025967, -12584828, -25397023, -19288861, -9648125, -13365762, -21005449, -14836841, 69029, 5064133, -624296, -357501, 11413245, 22057360, 22739057, 19246098, 17976420, 16801177, 14086983, 12977986, 11357098, 201451, -20479705, -34401357, -27771394, -9622403, -3040097, -16712011, -33579449, -31535518, -10884947, 5494151, 346961, -16618343, -22283943, -10409507, 2901361, 3967793, -1768795, -3213571, -768210, 45414]
35065D5414J540511O206431M561839m985722q404921N51984P424741K4382j1272957
35056d308298j0925374k415165J509158J501932O039633J1155077N251361r499955
35048a691631j8331260j4987205o168977L226838J3310958J8727093J2076970
35041F162786p41497n055548L996l3131r759716j4725855n276796P165696Q870879
35032a3389186M227358L810186M868531K22708l628875L150623J1675291M473822
35024A5410458j3888764j9541235o431936L148603m732020j1906089O94160J7775345
35016a9471478J1914554j0436083j5883509M667285K2753822J7434197M340975
35009A5319763M293955Q333914k400557j9638967j9122064q39030R834887J321460
$$ y = [45414, 1585925, 7792356, 12354195, 7368473, -1036448, -484464, 6940277, 6964659, -4308298, -15233672, -17648837, -16139679, -14637747, -8598114, 2556963, 7808324, -1691631, -20022891, -35010096, -41179073, -37952235, -24641277, -5914184, 6162786, 5421289, 365741, 369737, 336606, -9423110, -24148965, -29425761, -22260065, -13389186, -9161828, -5351642, -483111, -260403, -3889278, -738655, 10936636, 15410458, 1521694, -18019541, -24451477, -21302874, -26034894, -37940983, -37246823, -19471478, -7556924, -17993007, -33876516, -29209231, -6455409, 10978788, 15319763, 19613718, 27947632, 25547075, 5908108, -13213956, -14052986, -4218099, -2896639]
35001b896639q834538l766539Q413466J0478036J370610o190692m685395J684371
34993d427320N132065K436368k964551m801117j997476p92243m177410m284132
34985a5875816N288122J4530268Q532916p926154j3793422j774982J1684280J1585636
34977A2250848L454573q21702j678342n575328j1003427j1906776p883969k749982
34969b5914105P25488k31054o159513q683019J941932J8305638K0044763L601858
34961C631988r368636l992175N695065J879211p752475o751783p98618n841440
34953b3298863j5105492p296634J4669439K2649603N866740j2020349q732637
34946b3268193O223631J1432286O288084N833103J3165267J5498491N649558o860862
$$ y = [-2896639, -11731177, -15497716, -7084250, 3393786, 4764396, -1426296, -6111691, -4427320, 704745, 3141113, 176562, -4624555, -6622031, -7414274, -11591684, -15875816, -10587694, 3942574, 12475490, 4549336, -9244086, -11019068, 665212, 12250848, 15705421, 14883719, 13205377, 7630049, -3373378, -15280154, -23164123, -25914105, -25188617, -25419671, -31579184, -40262203, -38320271, -20014633, 30130, 3631988, -5736648, -9728823, -4033758, -2154547, -9907022, -16658805, -17457423, -23298863, -38404355, -45700989, -31031550, -8381947, -2515207, -14535556, -23268193, -17044562, -5612276, 675808, 6508911, 19674178, 35172669, 40822227, 33961365]
34938C3961365r223020j835497K949241l631280j5365758j7447804m845551R899928
34930e538376J1916097L173600j943968J398996K551195n018993r985099M02875
34922c043673J6671577J4783731j0009295l0536326k0150903R802062K2151381
34915c31446M528131j2495485j73808K3992071K0850057j1048979l2101745j9916917
34907b6698121J631063M845100n51930P711663K1819510J7283457l855669j5278137
34899F906936p631353J670367M82006k993421j488548r72351m333021l216873
34891a1576258N375265J1549045R345301N301871L208859l381209j5072713j8943295
34883a4193134p434030Q314492J4205269J0315500K956824p378958j8562023j9332859
$$ y = [33961365, 24738345, 22902848, 25852089, 22220809, 6855051, -10592753, -15438304, -5538376, 6377721, 9551321, 7607353, 9006349, 11557544, 6538551, -3446548, -3043673, 13627904, 28411635, 18402340, -12133986, -32284889, -22482827, -331446, 4196685, -8298800, -8472608, 15519463, 36369520, 25320541, -6781204, -26698121, -25067058, -20221958, -20773888, -13062225, 8757285, 26040742, 22185073, 6906936, -724417, 945950, 1427956, -1565465, -3054013, -4026364, -8359385, -11576258, -6200993, 5348052, 14693353, 19995224, 23204083, 19822874, 4750161, -14193134, -21627164, -13312672, 892597, 11208097, 14164921, 6785963, -11776060, -31108919]
34875c1108919l677722J5245207J9511090R732987J520767K472991N168924K150921
34867B1016246l314891m039748M92574L872194Q66919n991603q746644l759869
34859C95178L290307N287313K867618r904m827226j3061191j6132518m924614
34851b7115037J1385683J2373688m336911j7310693j1657515R48508L200680j264984
34843c3776581L032184J7075162K5782816J9272799L352607j0155224j4726880
34836I856883j1261080m868171L68949M734405Q467984O521394l835086j2246867
34828b261589n693840R468205J2657015N04600o239569L895657J3691125O193436
34820C2215040o634890n197449L673502n90728j5536914j8843862m565558R557497
$$ y = [-31108919, -34786641, -19541434, -30344, 9702643, 11223410, 13696401, 18865325, 21016246, 17701355, 13661607, 14154181, 18026375, 18893294, 12901691, 4155047, 395178, 3685485, 8972798, 11840416, 11830512, 7003286, -6057905, -22190423, -27115037, -15729354, -3355666, -7692577, -25003270, -36660785, -35712277, -32511597, -33776581, -30744397, -13669235, 12113581, 31386380, 34738987, 24583763, 9856883, -1404197, -6272368, -5903419, -1169014, 7298970, 13820364, 9985278, -2261589, -7955429, 1512776, 14169791, 14674391, 8434822, 12330479, 26021604, 32215040, 25580150, 20382701, 24056203, 23465475, 7928561, -10915301, -15480859, -5923362]
34812e923362J1593698Q649499P448675L594365l884652o414116j524420J539125
34804A5078812j655748l802279j480601k068252p951580r463224k264691L365319
34796a0242244R64891Q12628J1165728J9600097R855862j0962340j9652553q217460
34788f675391P929006J3105118Q531749L096603j085199o634412j1060500p504412
34780b97438M553131J4586168J0961583m816321j7889388j6650763n806558J838658
34772a3520928K659420L162690N844203N043150j219713n844334l738618L82131
34764g231999M27482k539997n081102o825432o410404r56211N097438J565815
34756b1954410r550417j0501247N879459J9012567P540115j5747801j8411831
$$ y = [-5923362, 5670336, 14319835, 21768510, 25362875, 21478223, 15064107, 13539687, 15078812, 13423064, 9620785, 8140184, 6071932, -1879648, -11342872, -13607563, -10242244, -9277353, -8464725, 2701003, 22301100, 32156962, 21194622, 1542069, -6675391, 1253615, 14358733, 22890482, 25987085, 24901886, 18267474, 7206974, -297438, 4255693, 18841861, 29803444, 24987123, 7097735, -9553028, -15359586, -13520928, -10861508, -7698818, -1854615, 3188535, 1968822, -3875512, -7614130, -7231999, -6804517, -9344514, -14425616, -21251048, -27661452, -28617663, -23520225, -21954410, -31504827, -42006074, -36126615, -17114048, -9573933, -25321734, -43733565]
34749d3733565N049671K5051057J9287424O05224p344748k896553j18730l840858
34741g941078p657004q466152p350138j248627J1519661K0684929J3534002n442382
34733G633211j7451150j3080024j361188O511897J0216511J2491317R666826j344826
34725A3282574j2996126j3151926j35993J3858541J5352992L714571q121660q002217
34717C800756P74531L696430m060256r206988p57173R693231L342331j4109898
34709f827036j6245825M852351K3690001J6728736m878395j4231134p026489o92696
34701d630487k924314l605468K399553N524516N5399m449461J201654J0906689
34693D478081J2837948N457268l607023p960775n496818K459728R176001O202326
$$ y = [-43733565, -38683894, -13632837, 5654587, 6259811, -1084937, -3981490, -4100220, -7941078, -15598082, -24064234, -31414372, -32662999, -21143338, -458409, 13075593, 7633211, -9817939, -22897963, -24259151, -17747254, -7530743, 4960574, 14627400, 13282574, 286448, -12865478, -13001471, 857070, 16210062, 19924633, 11802973, 3800756, 4575287, 8271717, 4211461, -4995527, -5752700, 3940531, 7282862, -6827036, -23072861, -18220510, 5469491, 22198227, 17319832, 3088698, -3937791, -4630487, -7554801, -11160269, -8760716, -3236200, -3180801, -7630262, -6428608, 4478081, 17316029, 22773297, 19166274, 11205499, 5708681, 8168409, 17344410, 23546736]
34685B3546736m760730j0302367k825337O968630M528715o880179j1034957l416548
34677d176037K700757j897778p498984j471238J0163810J0371874l095644j3904855
34669h808095j1220881l655110k159893j896636O174589J5056272J0390526m181529
34661c00757r063003J997473J2571559R142106q55080n141560m918676n813179
34653b381117m875967p9434r4065r593808j6072715p516322O881065J0811357
34645b2921006O131350N445286Q280873N236206j381189k579617j758817o292387
34637i839301p409086N561167J7668142O030295j8362923k1360376N64675J4749869
34629a2397538O821947M38731R346927J1379203p234065k0423826n410597J5803579
$$ y = [23546736, 18786006, 8483639, 5658302, 12626932, 17155647, 10275468, -759489, -4176037, -1475280, -3373058, -10872042, -12343280, -2179470, 8192404, 5096760, -8808095, -20028976, -23684086, -25843979, -27740615, -21566026, -6509754, 3880772, -300757, -9363760, -7366287, 5205272, 14347378, 13492298, 8350738, 3432062, -2381117, -7257084, -7336518, -7430583, -17024391, -33097106, -40613428, -33732363, -22921006, -16789656, -11344370, -3063497, 2172709, 791520, -1788097, -3546914, -9839301, -17248387, -11687220, 5980922, 12011217, -6351706, -27712082, -27147407, -12397538, -5575591, -5136860, 4210067, 15589270, 8355205, -12068621, -17479218, -1675639]
34621a675639J2809029l104114l177395P447021L994279r134941p283338O673801
34613F548703O796207p533234r901284M796747J0602991l868362j6717208j0683370
34605a9958810K248337O854589P113726R202525O898783k328898p938412n056050
34597b964210l135746o240254m898623L339095O688007K050065K577561J1440135
34589H856030J1857593k998341j4056477p176756K826586j242100r496544n054616
34581a6484625M605034K150030p379584n582736O822160J2194745N812133J12850
34573B250007J486038L695970L295018K947550N07271p801484j4769439j0089335
34565a8478404N49322K217353l980915j698868J2376381K0494531J0411482o639256
$$ y = [-1675639, 11133390, 8029276, 4851881, 12298902, 16293181, 7158240, -125098, 6548703, 13344910, 5811676, -4089608, 707139, 11310130, 7441768, -9275440, -19958810, -17710473, -10855884, -3742158, 5460367, 12359150, 10030252, 2091840, -2964210, -6099956, -12340210, -17238833, -13899738, -7211731, -5161666, -2584105, 8856030, 20713623, 17715282, 3658805, -3517951, -691365, -1933465, -11430009, -16484625, -11879591, -9729561, -17109145, -22691881, -15869721, -3674976, 2137157, 2250007, 3736045, 7432015, 10727033, 13674583, 14181854, 6380370, -8389069, -18478404, -17929082, -15711729, -19692644, -21391512, -9015131, 11479400, 21890882, 15251626]
34557A5251626j3167547p699156r50385K55453l236337p845328q948450l460785
34549b9800909M337345N830321J021381N96836R227025J5083330N505853j2255353
34541d54171j8054875o477709M623380j095783j4672634j4022411M108951J8958238
34533b7087014J5682940N489599N336211J0429453M596319r450979j2485572r53330
34525h442373O448775j72731p105825l547773o16357q279802j3589588k574792
34517c7880466J2558907J1871996Q11939q74344N798096L301871p616524p288330
34509a9316855P129578J4098143K904303r379603o657103K921185N194727K306037
34501g99588K371334K321588l894020j1177127j0804330l926329K711482O880515
$$ y = [15251626, 2084079, -5615077, -6565462, -6310009, -9546346, -17391674, -26340124, -29800909, -25463564, -19633243, -18611862, -18015026, -8788001, 6295329, 11801182, -454171, -18509046, -24986755, -20363375, -21459158, -36131792, -50154203, -46045252, -27087014, -11404074, -5914475, -578264, 9851189, 14447508, 4996529, -7489043, -8442373, -1993598, -2166329, -9272154, -12819927, -13436284, -21716086, -35305674, -37880466, -25321559, -13449563, -12637624, -13511968, -7713872, -4412001, -12028525, -19316855, -12187277, 1910866, 4815169, -4564434, -11221537, -8300352, -3105625, -799588, 1571746, 3893334, -686, -11177813, -21982143, -25908472, -23196990, -16316475]
34493a6316475Q964858Q357170P694307J0827435J2257203J882274j4728611j7846884
34485A091277l729599N807508l150670j3206842m332113J1620982R635559p115756
34477c379654j2343467J374764J2798712O599545n694977o480488L845879J2207302
34469H927616J0452862O90965r244638j1875386p091103k769392l153662j609668
34461a5672406O771220J3061996P891526o77390L50086M809514l059055j8037149
34453d561658j7638703R96486J3251456M385831q859109o876724L377114M395197
34445a1530110k782373m590770O72467L031713n26345l327718j637099K081211
34437a8609024N300610N513973p02489r823425r587300M312751J6956914J2520187
$$ y = [-16316475, -7351617, 1005553, 8699860, 19527295, 31784498, 33666772, 18938161, 1091277, -2638322, 3169186, 18516, -13188326, -17520439, -5899457, 3736102, -3379654, -15723121, -14348357, -1549645, 5049900, -645077, -7125565, -3279686, 8927616, 19380478, 20071443, 10826805, -1048581, -8139684, -10909076, -14062738, -15672406, -8901186, 4160810, 12052336, 11374946, 11725032, 16534546, 13475491, -4561658, -22200361, -21203875, -7952419, -3566588, -12425697, -19302421, -15925307, -11530110, -14312483, -18903253, -18230786, -15199073, -15725418, -19053136, -20690235, -18609024, -13308414, -7794441, -8496930, -18320355, -27907655, -23594904, -6637990, 5882197]
34429E882197j804599n048395O910593J5638723P231985q634088j3380289m368909
34421B427218L791591L20466p492163n383561O429811J2218113M219527l985863
34413A2545139J627760J1059713M766987j2827086j7668147m504588N213923N07885
34405G21586k055942Q029952J2745513j841389j5576420n006174J5235172J3822229
34397B6074527p797791k0732186j5143479p482042n255030Q56386Q854418L609275
34389a7015922j1019043j0542497R824584K2917738J0805935q541047j1579873
34382a5150125k817822J81832l177536j010429Q460808J5290429J1893094j062543
34374A2607708j5644046j9034773n558343J1324928J2868619J728179l313992
$$ y = [5882197, 4077598, -970797, 5939796, 21578519, 28810504, 20176416, 6796127, 2427218, 6218809, 6539275, -952888, -6336449, 93362, 12311475, 16531002, 12545139, 14172899, 25232612, 29999599, 17172513, -495634, -5000222, 213701, 721586, -1334356, 6695596, 19441109, 17599720, 2023300, -2982874, 12252298, 26074527, 18276736, -2455450, -17598929, -25080971, -30336001, -29479615, -20625197, -17015922, -28034965, -38577462, -28752878, -5835140, 4970795, -3570252, -15150125, -17967947, -17786115, -20963651, -21974080, -13513272, 1777157, 13670251, 12607708, -3036338, -22071111, -27629454, -16304526, -3435907, -1707728, -5021720]
34367e021720R7236m926812j9731160k1136271j13725J7934759J0610746o968871
34359b9255818p389924P796188J5624544P375094n292009j0855691o901420L320944
34351b5578092J0262044M491046o471722l383006J2985781J7264951N34705j0501571
34343c95864L247137J8120564N706019j7714143j6625207N507864J3902549l19434
34335A1429485j0967253l640179N625930K982698m096586p120930r239365j1099232
34327b6125432o544854L155189J0074421J4463293J9350878J5474166m140314
34320B5707347k0809965j1145358J2670817J7092357N44091n108391R429915J4298259
34312D2679072o903968k6813321j8289784L219882P017247p092087j6207316j0603661
$$ y = [-5021720, -4924484, -9851296, -29582456, -50718727, -50832452, -32897693, -22286947, -29255818, -36645742, -28849554, -13225010, -5849916, -11141925, -21997616, -28899036, -25578092, -15316048, -10825002, -17296724, -20679730, -7693949, 9571002, 10105707, -395864, 2851273, 20971837, 26677856, 8963713, -7661494, -2153630, 11748919, 11429485, 462232, -3177947, 2447983, 5430681, 1334095, -5786835, -15026200, -26125432, -32670286, -29515097, -19440676, -4977383, 14373495, 29847661, 25707347, 4897382, -6247976, 6422841, 23515198, 24059289, 18950898, 28380813, 42679072, 35775104, 8961783, -9328001, -6108119, 909128, -6182959, -22390275, -32993936]
34304c2993936N69346Q354001J0402438O908214K274638J843763J077186q098427
34296i662777j7111769p896023J4277399K0762155K612310j3602994p805641L811039
34288a4616301J049406n370177K581542J4352491R098355n866722o092528R532659
34280D668725J7961349P570654r397622j7766614j3506392k3610J3075926J2162768
34272A4745184m383353j8402066j4159075R8498P033308N703012N413339N673978
34264A722825J918305R18336R153591J4720419L637612j3020454j2502966L715690
34256A0263358J2148543L812651n742264m428206R34090J324454j729456n109230
34248A1473940r653355j2762388r570437l606860k579753l272488L974800J5187698
$$ y = [-32993936, -32424590, -24070589, -13668151, -6759937, -4485299, -2641536, -1564350, -9662777, -26774546, -34670569, -20393170, 368985, 2981295, -10621699, -18427340, -14616301, -13566895, -18937072, -16355530, -2003039, 7095316, 1228594, -4863934, 4668725, 22630074, 30200728, 20803106, 3036492, -10469900, -10493510, 2582416, 14745184, 10361831, -8040235, -22199310, -22100812, -15067504, -9364492, -3951153, 1722825, 3641130, 4559466, 13713057, 28433476, 32071088, 19050634, 6547668, 10263358, 22411901, 26224552, 20482288, 16054082, 16988172, 18312626, 16583170, 11473940, 1820585, -10941803, -20512240, -24119100, -26698853, -29971341, -25996541, -10808843]
34240a0808843J4313912j802343j6058712j4086170j178933R110505J1512768
34233h997816Q665358L919143j17428k232904m199828o720853n544149J489278
34225a3739199P158933L882264l592383m915159P5767L568376L925743N043172
34217A407514N025767p15643p479925o591739j027555j156270n898377l634548
34209b0070776P168273J3522579P427837l132123o771429k166717M140336N495289
34201E613269l25650p833553p221086K222638P488690l99325j1196231r760791
34193b1412039J819117J0154622J1118787R002084K949871p738839j2004145j188035
34185g298577J1058601N387826j1062717j3366918K352848J4381786J0588470
$$ y = [-10808843, 3505069, 1702726, -14355986, -28442156, -29621089, -20510584, -8997816, -332458, 3586685, 3469257, 1236353, -2963475, -9684328, -15228477, -13739199, -6580266, -2698002, -6290385, -11205544, -11129777, -7561401, -3635658, 1407514, 6433281, 5717638, -1762287, -8354026, -9381581, -10537851, -16436228, -20070776, -12902503, 620076, 8047913, 4915790, -1855639, -4022356, 117980, 5613269, 5287619, -2545934, -9767020, -7544382, -55692, -455017, -11651248, -21412039, -19592922, -9438300, 1680487, 10682571, 13632442, 5893603, -6110542, -7298577, 3760024, 9147850, -1914867, -15281785, -12928937, 1452849, 12041319]
34178A2041319K377547k37948k530443p655827p917430p82080N557633P517922
34170H370693Q696171O030951n401613j4522799o773172O148160k19102j8399191
$$ y = [12041319, 14418866, 14180918, 11650475, 3994648, -3922782, -4704862, 852771, 8370693, 17066864, 23097815, 17696202, 3173403, -3599769, 2548391, 2329289, -16069902]
$$ [...]
##END NTUPLES=NMR SPECTRUM
##END=
