##TITLE=31Pdec_LR-758-R3-CR4
 CCl4, 24 sc
 7.6.2023
##JCAMPDX= 6.0         $$ Bruker NMR JCAMP-DX V2.0
##DATA TYPE= NMR SPECTRUM
##DATA CLASS= NTUPLES
##ORIGIN= UXNMR, Bruker Analytische Messtechnik GmbH
##OWNER= root
$$ XWIN-NMR		Version 3.5
$$ Wed Jun  7 14:30:58 2023 Russian Standard Time (UT+4h)  she@DPX200
##.OBSERVE FREQUENCY= 81.013821
##.OBSERVE NUCLEUS= ^31P
##.ACQUISITION MODE= SIMULTANEOUS
##.ACQUISITION SCHEME= undefined
##.AVERAGES= 24
##.DIGITISER RES= 16
##SPECTROMETER/DATA SYSTEM= spect
##.PULSE SEQUENCE= zgpg30
##.SOLVENT NAME= CDCl3
##.SHIFT REFERENCE= (INTERNAL, CDCl3, 0, 248.564)
##AUDIT TRAIL= $$ (NUMBER, WHEN, WHO, WHERE, WHAT)
$$ ##TITLE= Audit trail, XWIN-NMR		Version 3.5
$$ ##JCAMPDX= 5.01
$$ ##ORIGIN= Bruker BioSpin GmbH
$$ ##OWNER= she
$$ F:/spectra/data/she/nmr/P31/1/pdata/1/auditp.txt
$$ ##AUDIT TRAIL=  $$ (NUMBER, WHEN, WHO, WHERE, WHAT)
(   1,<2023-06-07 14:30:06.57 +0400>,<she>,<DPX200>,
      <created by zg, POWCHK disabled, PULCHK disabled
       configuration hash MD5:
       00 E9 B6 7A A2 85 ED C7 34 08 36 98 17 FE 4E 26
       data hash MD5: 32K
       1D FD 8D BF 05 CE DA D1 69 FD E0 30 4D B4 02 CF>)
(   2,<2023-06-07 14:30:09.21 +0400>,<she>,<DPX200>,
      <Start of raw data processing
       efp BC_mod = 2 LB = 1 FT_mod = 6 PKNL = 1 PHC0 = -10645.6 PHC1 = -22.31514 SI = 64K 
       data hash MD5: 64K
       A3 CB 5D A3 F3 CE 23 A8 4A 46 B2 63 93 B3 AF C1>)
(   3,<2023-06-07 14:30:20.76 +0400>,<she>,<DPX200>,
      <pk PHC0 = 18.36459 PHC1 = 0 
       data hash MD5: 64K
       76 F0 1B 76 CF 3C 47 31 81 D3 E3 CE 34 1F 5D AF>)
$$ ##END=
$$ 
$$ hash MD5
$$ B3 42 2C AE 7D 4F 58 DD 7C 3A C6 1A 3F 2D C2 05
##$RELAX= 
##$RELAX= 
##$RELAX= 
##$RELAX= 
##$RELAX= 
##$RELAX= 
##$RELAX= 
##$RELAX= 
##$RELAX= 
$$ Bruker specific parameters
$$ --------------------------
##$DU= <F:/spectra>
##$EXPNO= 1
##$NAME= <P31>
##$PROCNO= 1
##$TYPE= <nmr>
##$USER= <she>
##$AMP= (0..31)
100 100 100 100 100 100 100 100 100 100 100 100 100 100 100 100 100 100 
100 100 100 100 100 100 100 100 100 100 100 100 100 100 
##$AQSEQ= 0
##$AQ_mod= 1
##$AUNM= <au_zg>
##$AUTOPOS= <>
##$BF1= 81.014009
##$BF2= 200.13
##$BF3= 200.13
##$BF4= 200.13
##$BF5= 200.13
##$BF6= 200.13
##$BF7= 200.13
##$BF8= 200.13
##$BYTORDA= 1
##$CFDGTYP= 0
##$CFRGTYP= 5
##$CHEMSTR= <none>
##$CNST= (0..31)
1 1 145 1 1 1 1 1 1 1 1 1 1 1 1 1 1 1 1 1 1 1 1 1 1 1 1 1 1 1 1 1 
##$CPDPRG= <waltz16>
##$CPDPRG1= <>
##$CPDPRG2= <waltz16>
##$CPDPRG3= <>
##$CPDPRG4= <mlev>
##$CPDPRG5= <mlev>
##$CPDPRG6= <mlev>
##$CPDPRG7= <mlev>
##$CPDPRG8= <mlev>
##$CPDPRGB= <>
##$CPDPRGT= <>
##$D= (0..31)
0 1 0 0 0 0 0 0 0 0 0 0.03 2e-05 3e-06 0 0 0 0 0 0 0 0 0 0 0 0 0 0 0 0 
0 0 
##$DATE= 1686133806
##$DBL= (0..7)
120 120 120 11 120 120 24 19 
##$DBP= (0..7)
150 150 150 150 150 150 150 150 
##$DBP07= 0
##$DBPNAM0= <>
##$DBPNAM1= <>
##$DBPNAM2= <>
##$DBPNAM3= <>
##$DBPNAM4= <>
##$DBPNAM5= <>
##$DBPNAM6= <>
##$DBPNAM7= <>
##$DBPOAL= (0..7)
0.5 0.5 0.5 0.5 0.5 0.5 0.5 0.5 
##$DBPOFFS= (0..7)
$$ [...]
##$SUBNAM2= <"">
##$SUBNAM3= <"">
##$SUBNAM4= <"">
##$SUBNAM5= <"">
##$SUBNAM6= <"">
##$SUBNAM7= <"">
##$SUBNAM8= <"">
##$SUBNAM9= <"">
##$SW= 501.771253377433
##$SWIBOX= (0..15)
0 1 3 0 0 0 0 0 0 0 0 0 0 0 0 0 
##$SW_h= 40650.406504065
##$TD= 32768
##$TD0= 1
##$TE= 0
##$TE2= 300
##$TE3= 300
##$TEG= 300
##$TL= (0..7)
0 120 53 12 22 120 120 120 
##$TP= (0..7)
150 150 150 150 150 150 150 150 
##$TP07= 0
##$TPNAME0= <>
##$TPNAME1= <>
##$TPNAME2= <>
##$TPNAME3= <>
##$TPNAME4= <>
##$TPNAME5= <>
##$TPNAME6= <>
##$TPNAME7= <>
##$TPOAL= (0..7)
0.5 0.5 0.5 0.5 0.5 0.5 0.5 0.5 
##$TPOFFS= (0..7)
0 0 0 0 0 0 0 0 
##$TUNHIN= 0
##$TUNHOUT= 0
##$TUNXOUT= 0
##$USERA1= <user>
##$USERA2= <user>
##$USERA3= <user>
##$USERA4= <user>
##$USERA5= <user>
##$V9= 5
##$VALIST= <valist>
##$VCLIST= <CCCCCCCCCCCCCCC>
##$VD= 0
##$VDLIST= <DDDDDDDDDDDDDDD>
##$VPLIST= <PPPPPPPPPPPPPPP>
##$VTLIST= <TTTTTTTTTTTTTTT>
##$WBST= 1024
##$WBSW= 4
##$XGAIN= (0..3)
0 0 0 0 
##$XL= 0
##$YL= 0
##$YMAX_a= 16334
##$YMIN_a= -17040
##$ZGOPTNS= <>
##$ZL1= 120
##$ZL2= 120
##$ZL3= 120
##$ZL4= 120
##$ABSF1= 0
##$ABSF2= 0
##$ABSG= 0
##$ABSL= 0
##$ALPHA= 0
##$AQORDER= 0
##$ASSFAC= 0
##$ASSFACI= 0
##$ASSFACX= 0
##$ASSWID= 0
##$AUNMP= <proc_1d>
##$AZFE= 0.1
##$AZFW= 0.5
##$BCFW= 0
##$BC_mod= 2
##$BYTORDP= 0
##$COROFFS= 0
##$CY= -3
##$DATMOD= 1
##$DC= 0
##$DFILT= <>
##$DTYPP= 0
##$F1P= 0
##$F2P= 0
##$FCOR= 1
##$FTSIZE= 65536
##$FT_mod= 6
##$GAMMA= 0
##$GB= 0
##$INTBC= 1
##$INTSCL= 6.047779e-11
##$ISEN= 30
##$LB= 1
##$LEV0= 0
##$LPBIN= 0
##$MAXI= 10000
##$MC2= 0
##$MEAN= 0
##$ME_mod= 0
##$MI= 50
##$NCOEF= 0
##$NC_proc= -5
##$NLEV= 6
##$NOISF1= 182.463
##$NOISF2= 159.3651
##$NSP= 0
##$NTH_PI= 0
##$NZP= 0
##$OFFSET= 248.5645
##$PC= 4
##$PHC0= -10627.24
##$PHC1= -22.31514
##$PH_mod= 1
##$PKNL= yes
##$PPARMOD= 0
##$PSCAL= 0
##$PSIGN= 0
##$REVERSE= no
##$SF= 81.0140089999694
##$SI= 65536
##$SIGF1= 159.3651
##$SIGF2= -187.1042
##$SINO= 113.3802
##$SIOLD= 16384
##$SREGLST= <1H.CDCl3>
##$SSB= 0
##$STSI= 65536
##$STSR= 0
##$SW_p= 40650.406504065
##$SYMM= 0
##$S_DEV= 0
##$TDeff= 32768
##$TDoff= 0
##$TI= <>
##$TILT= no
##$TM1= 0
##$TM2= 0
##$TOPLEV= 0
##$USERP1= <user>
##$USERP2= <user>
##$USERP3= <user>
##$USERP4= <user>
##$USERP5= <user>
##$WDW= 1
##$XDIM= 65536
##$YMAX_p= 526213352
##$YMIN_p= -54604685
$$ End of Bruker specific parameters
$$ ---------------------------------
##NTUPLES= NMR SPECTRUM
##VAR_NAME=  FREQUENCY,     SPECTRUM/REAL,   SPECTRUM/IMAG
##SYMBOL=    X,             R,               I
##VAR_TYPE=  INDEPENDENT,   DEPENDENT,       DEPENDENT
##VAR_FORM=  AFFN,          ASDF,            ASDF
##VAR_DIM=   65536,         65536,           65536
##UNITS=     HZ,            ARBITRARY UNITS, ARBITRARY UNITS
##FACTOR=    0.620285442955139, 1,           1
##FIRST=     20137.2065510682, 0,            0
##LAST=      -20513.1999529968, 0,           0
##MIN=       -20513.1999529968, -54604685,   0
##MAX=       20137.2065510682, 526213352,    0
$$ Real data points
##PAGE= N=1
##DATA TABLE= (X++(R..R)), XYDATA
$$ [...]
$$ plain form
40171 -273651 -789501 -1154422 -1052635 -644849 -314673 -213252 -221098 -249044 -288936 -245987
40161 -245987 -92384 -125853 -594040 -1077947 -873841 -104591 273347 -140006 -572190 -351107
40151 -351107 -3372 -304005 -887039 -818334 -150569 209705 39518 67390 596119 919609
40141 919609 440811 -513514 -1375533 -2028987 -2388012 -2077517 -1138512 -414689 -551010 -1069300
40131 -1069300 -1105624 -675530 -477662 -695325 -780536 -416747 -4871 -8908 -304124 -428937
40121 -428937 -213263 62771 39960 -302444 -617646 -617733 -470151 -562743 -888289 -1012215 -759805
40110 -759805 -516254 -590821 -700424 -472573 -105220 -46349 -282882 -464335 -536196 -706013
40100 -706013 -910804 -879761 -662043 -536091 -429594 -23569 539118 683765 278398 -140579
$$ packed form
40171b73651n15850l64921J01787M07786L30176J01421p846k7946l9892M2949
40161b45987J53603l3469m68187m83907K04106P69250L77938m13353m32184K21083
40151c51107L47735l00633n83034O8705O67765L60274j70187K7872N28729L23490
40141I19609m78798r54325q62019o53454l59025L10495R39005P23823j36321n18290
40131a069300l6324M30094J97868k17663q5211L63789M11876m037k95216j24813
40121d28937K15674K76034k2811l42404l15202q7J47582r2592l25546j23926K52410
40110g59805K43551p4567j09603K27851L67353N8871k36533j81453p1861j69817
40100g06013k04791L1043K17718J25952J06497M06025N62687J44647m05367m18977
$$ plain form
40090 -140579 -242731 -398097 -953593 -1556356 -1657180 -1287379 -863015 -529262 -182994 85563
40080 85563 73300 -130145 -249827 -266793 -375180 -573132 -677176 -701318 -843800 -1099458
40070 -1099458 -1248820 -1257527 -1320903 -1438004 -1304412 -786029 -205415 38293 -77561 -299168
40060 -299168 -460872 -561964 -618612 -627166 -601900 -521846 -320233 -30760 157610 112700 -62159
40049 -62159 -174610 -173967 -118362 -26032 81707 93713 -27451 -60502 246078 747042 949437
40038 949437 585452 -50153 -451901 -440713 -215940 220 187559 422152 669430 712910
40028 712910 306503 -510143 -1258774 -1383530 -863955 -288514 -189017 -493889 -792633 -875267
40018 -875267 -729592 -275452 439746 916746 609853 -309086 -1066870 -1242520 -1129112 -1051300
$$ packed form
40090a40579j02152j55366n55496o02763j00824L69801M24364L33753L46268K68557
40080H5563j2263k03445j19682j6966j08387j97952j04044k4142j42482k55658
40070a099458j49362q707o3376j17101J33592N18383N80614K43708j15854k21607
40060b99168j61704j01092n6648q554K5266Q0054K01613K89473J88370m4910j74859
40049f2159j12451O43N5605R2330J07739J2006j21164l3051L06580N00964K02395
40038I49437l63985o35605m01748J1188K24773K16160J87339K34593K47278M3480
40028G12910m06407q16646p48631j24756N19575N75441R9497l04872k98744q2634
40018h75267J45675M54140P15198M77000l06893r18939p57784j75650J13408P7812
$$ plain form
40008 -1051300 -891643 -546427 -303737 -377450 -506185 -426972 -339920 -462680 -537152 -298653
39998 -298653 -46095 -141478 -290974 -19514 424367 424814 63560 -40007 129453 -46568
39988 -46568 -621830 -844386 -411126 -34250 -280979 -669357 -541587 -173686 -287694 -887074
39978 -887074 -1273935 -1018140 -404673 -67518 -471614 -1496752 -2347790 -2308002 -1753737 -1780610
39968 -1780610 -2548915 -2869774 -2017070 -1031605 -1262840 -2342111 -2820996 -2390613 -2129921
39959 -2129921 -2635193 -3190544 -3020036 -2301440 -1604459 -1182603 -1134812 -1503374 -1912075 -1795574
39949 -1795574 -1228054 -848455 -808662 -598794 -119270 13104 -380698 -532298 31830 584240
39939 584240 275118 -577460 -1088505 -1138750 -1243186 -1496863 -1536934 -1328208 -1174363 -1062033
$$ packed form
40008a051300J59657L45216K42690p3713j28735P9213Q7052j22760p4472K38499
39998b98653K52558r5383j49496K71460M43881M47l61254j03567J69460j76021
39988d6568n75262k22556M33260L76876k46729l88378J27770L67901j14008n99380
39978h87074l86861K55795O13467L37155m04096j025138q51038L9788N54265k6873
39968a780610p68305l20859Q52704R85465k31235j079271m78885M30383K60692
39959b129921n05272n55351J70508P18596O96981M21856M7791l68562m08701J16501
39949a795574N67520L79599L9793K09868M79524J32374l93802j51600N64128N52410
39939E84240l09122q52578n11045n0245j04436k53677m0071K08726J53845J12330
$$ plain form
39929 -1062033 -710216 -201646 85479 126469 227043 394285 323419 6960 -209835 -211123
39919 -211123 -224460 -322741 -321134 -203781 -132981 20891 601359 1476410 1961787 1672028
39909 1672028 1020789 648276 753454 1228839 2031035 3056897 3959533 4488199 4848785
39900 4848785 5382507 5981294 6137623 5572375 4585331 3750821 3412453 3508252 3789735 4137579
39890 4137579 4620381 5216280 5582581 5316864 4495250 3731400 3519450 3633067 3389964
39881 3389964 2492285 1389792 726030 601107 577175 335213 42442 -29821 18366 -102864
39871 -102864 -369578 -491988 -455732 -611793 -1083954 -1455187 -1317632 -865021 -602656 -639585
39861 -639585 -634637 -383596 -104299 -80432 -286181 -473617 -477016 -339913 -223728 -241678 -346178
$$ packed form
39929a062033L51817N08570K87125M0990J00574J67242p0866l16459k16795j288
39919b11123j3337r8281J607J17353P0800J53872N80468Q75051M85377k89759
39909A672028o51239l72513J05178M75385Q02196J025862R02636N28666L60586
39900D848785N33722N98787J56329n65248r87044q34510l38368R5799K81483L47844
39890D137579M82802N95899L66301k65717q21614p63850k11950J13617k43103
39881C389964q97679j102493o63762j24923k3932k41962k92771p2263M8187j21230
39871a02864k66714j22410L6256j56061m72161l71233J37555M52611K62365l6929
39861f39585M948K51041K79297K3867k05749j87436l399J37103J16185j7950j04500
$$ plain form
39850 -346178 -375661 -220598 97999 491425 827933 917477 676083 337393 246870 354499
39840 354499 208802 -364286 -884003 -816706 -332889 -106963 -467089 -1067715 -1373453 -1204174
39830 -1204174 -795336 -502582 -461978 -482902 -353165 -221948 -415808 -851616 -1050459 -890923
39820 -890923 -842994 -1132434 -1218716 -643483 69938 85668 -471414 -710016 -326347 42075
39810 42075 -118129 -506858 -590288 -309944 -17602 -126919 -886001 -2034454 -2715074 -2318950
39800 -2318950 -1424240 -1205434 -1838238 -2287039 -1884518 -1243935 -1151536 -1364112 -1180748 -606663
39790 -606663 -196629 -133585 -181471 -293478 -588209 -872881 -815338 -531782 -457983 -643442
39780 -643442 -657921 -249250 307274 599907 516711 206302 -173675 -564096 -934352 -1138261
$$ packed form
39850c46178k9483J55063L18597L93426L36508Q9544k41394l38690r0523J07629
39840C54499j45697n73088n19717O7297M83817K25926l60126o00626l05738J69279
39830a204174M08838K92754M0604k0924J29737J31217j93860m35808j98843J59536
39820h90923M7929k89440q6282N75233P13421J5730n57082k38602L83669L68422
39810D2075j60204l88729q3430K80344K92342j09317p59082j148453o80620L96124
39800b318950Q94710K18806o32804m48801M02521O40583R2399k12576J83364N74085
39790f06663M10034O3044m7886j12007k94731k84672N7543K83556P3799j85459
39780f43442j4479M08671N56524K92633q3196l10409l79977l90421l70256k03909
$$ plain form
39770 -1138261 -919351 -249723 382949 384763 -159682 -507885 -244314 167754 84336 -470289
39760 -470289 -993280 -1187665 -1080774 -760586 -368088 -99633 80351 413735 775853 596714
39750 596714 -262314 -1074171 -1204958 -988471 -1019295 -1118098 -826210 -473709 -744317 -1432654
39740 -1432654 -1701209 -1480159 -1510095 -1926847 -1936218 -1182773 -394912 -228031 -391158 -437008
39730 -437008 -562291 -999031 -1350073 -1228241 -970433 -1037452 -1217153 -1106926 -925642 -1114779
39720 -1114779 -1485270 -1487782 -1081787 -665676 -359555 -10706 271293 235679 13154 -86925
39710 -86925 -145696 -374739 -478389 -41657 529600 326072 -676690 -1372973 -968548 45586
39700 45586 732782 862286 731662 420839 -112647 -537747 -441624 -17456 115040 -210454
$$ packed form
39770a138261K18910O69628O32672J814n44445l48203K63571M12068q3418n54625
39760d70289n22991j94385J06891L20188L92498K68455J79984L33384L62118j79139
39750E96714q59028q11857j30787K16487l0824r8803K91888L52501k70608o88337
39740a432654k68555K21050k9936m16752r371P53445P87861J66881j63127m5850
39730d37008j25283m36740l51042J21832K57808o7019j79701J10227J81284j89137
39720a114779l70491k512M05995M16111L06121L48849K81999l5614k22525j00079
39710h6925n8771k29043j03650M36732N71257k03528j002762o96283M04425J014134
39700D5586O87196J29504j30624l10823n33486m25100R6123M24168J32496l25494
$$ plain form
39690 -210454 -490243 -301785 143084 366464 222245 -103874 -454624 -757762 -827979 -472094
39680 -472094 102888 282414 -266308 -1026853 -1122158 -409290 295348 269792 -217750 -431936
39670 -431936 -269219 -264037 -609641 -833591 -600843 -252019 -216380 -353192 -288961 -43582
39660 -43582 160036 431634 991013 1546564 1511791 892171 385812 411115 539317 211340
39650 211340 -387310 -598464 -202131 383369 709048 696138 452109 89336 -176118 -80092
39640 -80092 356610 773072 904666 882373 941438 1036975 972941 757943 563093 405593
39630 405593 150300 -190943 -431618 -518868 -611963 -763739 -769332 -496822 -176197 -127945
39620 -127945 -291670 -266762 147632 642352 753473 445742 165717 256957 496294 434529
$$ packed form
39690b10454k79789J88458M44869K23380j44219l26119l50750l03138p0217L55885
39680d72094N74982J79526n48722p60545r5305P12868P04638k5556m87542k14186
39670d31936J62717N182l45604k23950K32748L48824L5639j36812O4231K45379
39660d3582K03618K71598N59379N55551l4773o19620n06359K5303J28202l27977
39650B11340n98650k11154L96333N85500L25679j2910k44029l62773k65454R6026
39640h0092M36702M16462J31594k2293N9065R5537o4034k14998j94850j57500
39630D05593k55293l41243k40675q7250r3095j51776n593K72510L20625M8252
39620a27945j63725K4908M14394M94720J11121l07731k80025R1240K39337o1765
$$ plain form
39610 434529 108152 26686 344728 500278 25477 -692158 -1008339 -1044921 -1336761 -1641415
39600 -1641415 -1139775 13413 476899 -369847 -1346401 -1186965 -445580 -493362 -1272130
39591 -1272130 -1543222 -1117904 -1188303 -2189639 -2893528 -2303468 -1158119 -640559 -642709 -396879
39581 -396879 -36598 -290512 -1051587 -1447891 -1213395 -970137 -1130543 -1384391 -1369649 -1135583
39571 -1135583 -838047 -565901 -499324 -689438 -742236 -326593 114940 -111794 -794865 -1032526
39561 -1032526 -654646 -486839 -952549 -1357530 -1038068 -404906 -235287 -568551 -939882
39552 -939882 -1181258 -1340392 -1249509 -854595 -637327 -1037869 -1694792 -1880679 -1494430 -1022050
39542 -1022050 -707056 -414189 -201021 -332262 -697889 -840206 -653924 -494938 -475568 -236421
$$ packed form
39610D34529l26377q1466L18042J55550m74801p17635l16181l6582k91840l04654
39600a641415N01640J153188M63486q46746r76554J59436P41385m7782p78768
39591a272130k71092M25318p0399j001336p03889N90060J145349N17560k150K45830
39581c96879L60281k53914p61075l96304K34496K43258j60406k53848J4742K34066
39571a135583K97536K72146O6577j90114n2798M15643M41533k26734o83071k37661
39561a032526L77880J67807m65710m04981L19462O33162J69619l33264l71331
39552i39882k41376j59134R0883L94914K17268m00542o56923j85887L86249M72380
39542a022050L14994K92867K13168j31241l65627j42317J86282J58986J9370K39147
$$ plain form
39532 -236421 339825 719920 413194 -280914 -637031 -428190 -103018 -101318 -333334 -422146
39522 -422146 -237478 -10806 18113 -106476 -180859 -130398 -41354 2326 -62759 -330356 -741719
39511 -741719 -946018 -718455 -475635 -852039 -1660735 -1899407 -1112980 -138182 27632 -441480
39501 -441480 -684150 -526006 -496588 -696629 -622502 -188204 -13408 -402252 -790897 -621582
39491 -621582 -169958 -38704 -270289 -425047 -238074 198963 685162 1019131 1051548 863976
39481 863976 686308 481830 -53983 -861405 -1281654 -834713 56690 538415 330853 -131069
39471 -131069 -413309 -514098 -615330 -771582 -911647 -932989 -771644 -510714 -353175 -352714
39461 -352714 -298503 -40919 218373 185963 -101062 -349545 -388126 -224905 129427 569350
$$ packed form
39532b36421N76246L80095l06726o94108l56117K08841L25172J700k32016q8812
39522d22146J84668K26672K8919j24589p4383N0461Q9044M3680o5085k67597m11363
39511g41719k04299K27563K42820l76404q08696k38672P86427R74798J65814m69112
39501d41480k42670J58144K9418k00041P4127M34298J74796l88844l88645J69315
39491f21582M51624J31254k31585j54758J86973M37037M86199L33969L2417j87572
39481H63976j77668k04478n35813q07422m20249M46941Q91403M81725k07562m61922
39471a31069k82240j00789j01232j56252j40065k1342J61345K60930J57539M61
39461c52714N4211K57584K59292l2410k87025k48483l8581J63221L54332M39923
$$ plain form
39451 569350 715716 226816 -658139 -1223359 -1051470 -453886 -23763 4330 -182384 -323730
39441 -323730 -301210 -155616 -96058 -391863 -1039430 -1583742 -1504554 -819525 -107499 146119
39431 146119 39337 -38879 12077 -14312 -167001 -201723 15329 266726 314250 240129 252125
39420 252125 326819 274398 28297 -343956 -791572 -1220267 -1415550 -1283005 -1054502 -989591
39410 -989591 -980969 -745769 -301118 78810 293495 448261 520688 382117 130826 12243
39400 12243 -3831 -188744 -587936 -963860 -1191910 -1308560 -1210881 -800215 -399088 -442789
39390 -442789 -724256 -604247 -75442 132656 -260984 -609681 -441425 -217258 -391854 -488661
39380 -488661 60923 741733 587111 -332709 -996630 -871584 -400637 -90970 49280 65217
$$ packed form
39451E69350J46366m88900q84955n65220J71889N97584M30123K8093j86714j41346
39441c23730K2520J45594N9558k95805o47567n44312P9188O85029P12026K53618
39431A46119j06782p8216N0956k6389j52689l4722K17052K51397M7524p4121J1996
39420B52125P4694n2421k46101l72253m47616m28695j95283J32545K28503O4911
39410i89591Q622K35200M44651L79928K14685J54766P2427j38571k51291j18583
39400A2243j6074j84913l99192l75924k28050j16650R7679M10666M01127m3701
39390d42789k81467J20009N28805K08098l93640l48697J68256K24167j74596r6807
39380d88661N49584O80810j54622r19820o63921J25046M70947L09667J40250J5937
$$ plain form
39370 65217 -196700 -665471 -947698 -876716 -718023 -693530 -727676 -758772 -861941 -971885
39360 -971885 -924167 -848892 -1044039 -1352161 -1190694 -413874 338937 434270 -23961 -541960
39350 -541960 -923473 -1238518 -1402392 -1227315 -797237 -447590 -365171 -418162 -395137 -271717
39340 -271717 -204013 -309148 -489259 -526154 -368736 -209995 -195995 -210461 -91450 111745
39330 111745 294051 505336 736662 713469 278989 -189058 -203934 89909 112015 -252502
39320 -252502 -520810 -467161 -501942 -925985 -1330860 -1171394 -605839 -299617 -513166 -778823
39310 -778823 -539326 120423 530438 234936 -370955 -429391 292630 1042979 1083598 682474
39300 682474 597225 855446 794159 259767 -80628 141594 361739 40452 -383210 -154390
$$ packed form
39370F5217k61917m68771k82227P0982J58693K4493l4146l1096j03169j09944
39360i71885M7718P5275j95147l08122J61467P76820P52811R5333m58231n17999
39350e41960l81513l15045j63874J75077M30078L49647Q2419n2991K3025J23420
39340b71717O7704j05135j80111l6895J57418J58741J4000j4466J19011K03195
39330A11745J82306K11285K31326k3193m34480m68047j4876K93843K2106l64517
39320b52502k68308N3649l4781m24043m04875J59466N65555L06222k13549k65657
39310g78823K39497O59749M10015k95502o05891n8436P22021P50349M0619m01124
39300F82474q5249K58221o1287n34392l40395K22222K20145l21287m23662K28820
$$ plain form
39290 -154390 565449 838272 236347 -588261 -736929 -118874 506221 430084 -191859 -544186
39280 -544186 -200299 301682 238530 -215791 -291563 89940 139543 -485809 -1025841 -775950
39270 -775950 -202612 -204664 -771290 -1167374 -1128395 -1033883 -1034811 -850542 -494988 -442782 -844187
39259 -844187 -1182325 -1005051 -517203 -135468 126466 444895 671256 499476 45060 -180232
39249 -180232 42117 302301 130393 -306272 -400511 33048 479171 470980 236238 220385
39239 220385 272754 -108130 -845580 -1295528 -1253691 -1221037 -1430785 -1390084 -857473 -528431
39229 -528431 -1010907 -1677654 -1433952 -311763 616834 765062 536447 302946 -136502
39220 -136502 -792198 -1043256 -484707 356137 675182 391083 46100 3367 165200 296087
$$ packed form
39290a54390P19839K72823o01925q24608j48668O18055O25095p6137o21943l52327
39280e44186L43887N01981o3152m54321p5772L81503M9603o25352n40032K49891
39270g75950N73338k052n66626l96084L8979R4512r28J84269L55554N2206m01405
39259h44187l38138J77274M87848L81735K61934L18429K26361j71780m54416k25292
39249a80232K22349K60184j71908m36665r4239M33559M46123q191k34742j5853
39239B20385N2369l80884p37450m49948M1837L2654k09748M0701N32611L29042
39229e28431m82476o66747K43702J122189R28597J48228k28615k33501m39448
39220a36502o55696k51058N58549Q40844L19045k84099l44983m2733J61833J30887
$$ plain form
39210 296087 252918 -4176 -353883 -530872 -371893 35053 522012 995197 1358763 1528600
39200 1528600 1620130 1844592 2084597 1890311 1115040 260099 -92717 47614 270401 394063
39190 394063 539913 712501 706126 444952 123360 -51006 -74808 -98320 -290362 -708341
39180 -708341 -1169479 -1338149 -1098037 -726343 -513512 -358972 -17569 376502 402374 -38599
39170 -38599 -572598 -882685 -1042731 -1198220 -1262061 -1152468 -1043384 -1080463 -1051890 -679967
39160 -679967 -137173 67952 -275563 -830546 -1132625 -1050089 -792553 -656724 -800680 -1096347
39150 -1096347 -1184267 -851990 -357290 -156731 -308041 -420441 -253481 -40580 -73065 -280419
39140 -280419 -441434 -523648 -551582 -420266 -165947 -153125 -573405 -968647 -755339 -114248
$$ packed form
39210B96087m3169k57094l49707j76989J58979M06946M86959M73185L63566J69837
39200A528600R1530K24462K40005j94286p75271q54941l52816J40331K22787J23662
39190C94063J45850J72588o375k61174l21592j74366k3802k3512j92042m17979
39180g08341m61138j68670K40112L71694K12831J54540L41403L94071K5872m40973
39170c8599n33999l10087j60046j55489o3841J09593J09084l7079K8573L71923
39160f79967N42794K05125l43515n54983l02079Q2536K57536J35829j43956k95667
39150a096347q7920L32277M94700K00559j51310j12400J66960K12901l2485k07354
39140b80419j61015q2214k7934J31316K54319J2822m20280l95242K13308O41091
$$ plain form
39130 -114248 187650 -138872 -577974 -651457 -532003 -571942 -711299 -716054 -646238 -690651 -771625
39119 -771625 -687942 -498261 -425092 -471715 -434032 -250697 -92688 -100966 -198042 -168376 133800
39108 133800 590836 821296 541147 -24742 -309168 -73786 320300 429583 247148 32493
39098 32493 -99127 -166712 -127922 18476 76944 -137665 -513267 -730848 -564904 -40455
39088 -40455 519581 587061 -80999 -939421 -1074760 -340652 389845 398734 21604 -70428
39078 -70428 64982 -31366 -245095 -69612 422135 607888 293183 -98586 -355189 -738044
39068 -738044 -1263226 -1445174 -1042941 -461892 -107432 123987 392498 479719 215115 -78853
39058 -78853 -8509 306277 450240 293206 26669 -176445 -235042 -69254 276273 546371
$$ packed form
39130a14248L01898l26522m39102p3483J19454l9939j39357m755O9816m4413q0974
39119g71625Q3683J89681P3169m6623L7683J83335J58009q278r7076K9666L02176
39108A33800M57036K30460k80149n65889k84426K35382L94086J09283j82435k14655
39098C2493j31620o7585L8790J46398N8468k14609l75602k17581J65944N24449
39088d0455N60036O7480o68060q58422j35339P34108P30497Q889l77130r2032
39078g0428J35410r6348k13729J75483M91747J85753l14705l91769k56603l82855
39068g38044n25182j81948M02233N81049L54460K31419K68511Q7221k64604k93968
39058g8853P0344L14786J43963j57034k66537k03114n8597J65788L45527K70098
$$ plain form
39048 546371 543118 365668 220040 149535 109839 113143 99412 -152317 -743864 -1389774 -1633254
39037 -1633254 -1303914 -673625 -214933 -221643 -553220 -758186 -581168 -273160 -201219 -302802
39027 -302802 -286189 -240015 -510248 -966597 -1013623 -512588 -81040 -161571 -366032 -170626
39017 -170626 259490 471201 503775 640233 710923 356756 -170310 -183222 444339 1073390
39007 1073390 1195604 1002905 903742 936879 897721 703768 405860 81503 -111111 -1869
38997 -1869 302909 409273 101607 -325164 -383032 29396 503910 566444 177733 -216959
38987 -216959 -149524 357986 832689 951454 932966 1157757 1560014 1709705 1457683 1142472
38977 1142472 1070119 1135029 1162554 1315769 1801414 2348288 2438953 2078918 1864153 2084783
$$ packed form
39048E46371l253j77450j45628p0505l9696L304j3731k51729n91547o45910k43480
39037a633254L29340O30289M58692o710l31577k04966J77018L08008P1941j01583
39027c02802J6613M6174k70233m56349m7026N01035M31548q0531k04461J95406
39017a70626M30116K11711L2574J36458P0690l54167n27066j2912O27561O29051
39007A073390J22214j92699r9163L3137l9158j93953k97908l24357j92614J09242
38997a869L04778J06364l07666m26771n7868M12428M74514O2534l88711l94692
38987b16959O7435N07510M74703J18765j8488K24791M02257J49691k52022l15211
38977A142472p2353O4910K7525J53215M85645N46874R0665l60035k14765K20630
$$ plain form
38967 2084783 2220986 1753357 1111102 1150945 1820544 2140577 1673904 1172430 1310115 1579569
38957 1579569 1224500 626718 718254 1381613 1628513 1282726 1208609 1650989 1642671 634093
38947 634093 -424346 -440654 275267 708331 621409 395320 48273 -521799 -814974 -373100
38937 -373100 185603 -100921 -982990 -1300523 -727375 -81940 76661 -6835 -214727 -801709
38927 -801709 -1472896 -1454153 -882576 -896200 -1766337 -2174844 -1190247 141858 255353 -750449
38917 -750449 -1556755 -1616787 -1454080 -1368424 -1113688 -760926 -751589 -1023721 -1026786 -687255 -501408
38906 -501408 -588505 -500763 -103610 179028 160190 111992 6038 -581057 -1483368 -1775632
38896 -1775632 -1110797 -427638 -664445 -1426905 -1675069 -1204273 -638455 -342271 -189382
$$ packed form
38967B084783J36203m67629o42255L9843O69599L20033m66673n01474J37685K69454
38957A579569l55069n97782R1536O63359K46900l45787p4117M42380q318j008578
38947F34093j058439j6308P15921M33064q6922k26089l47047n70072k93175M41874
38937c73100N58703k86524q82069l17533N73148O45435J58601q3496k07892n86982
38927h01709o71187J8743N71577j3624q70137m08507R84597J332105J13495j005802
38917g50449q06306o0032J62707Q5656K54736L52762R337k72132l065L39531J85847
38906e01408q7097Q7742L97153K82638j8838m8198j05954n87095r02311k92264
38896a775632O64835O83159k36807p62460k48164M70796N65818K96184J52889
$$ plain form
38887 -189382 -181225 -446558 -697828 -479070 14246 90397 -382730 -786087 -751042 -618810
38877 -618810 -647646 -512544 -42507 209100 -236510 -883612 -864106 -162756 452843 576664
38867 576664 535974 629678 691183 566901 410392 231864 -287877 -1142220 -1627920 -1171283
38857 -1171283 -254399 69331 -483303 -1108682 -1017359 -364017 146455 189348 -11632 -234328
38847 -234328 -537267 -953074 -1246290 -1179998 -876359 -715233 -900123 -1249380 -1407007 -1157324
38837 -1157324 -544221 190845 746527 938088 808002 531522 224549 -70321 -243930
38828 -243930 -153486 150942 411295 460546 364936 191930 -107452 -419786 -375174 146099
38818 146099 638389 510606 -118111 -576734 -521692 -220194 100 80430 -26997 -397367
$$ packed form
38887a89382Q157k65333k51270K18758M93316P6151m73127m03357L5045J32232
38877f18810k8836J35102M70037K51607m45610o47102J9506P01350O15599J23821
38867E76664m0690R3704O1505j24282j56509j78528n19741q54343m85700M56637
38857a171283R16884L23730n52634o25379R1323O53342N10472M2893k00980k22696
38847b34328l02939m15807k93216O6292L03639J61126j84890l49257j57627K49683
38837a157324O13103P35066N55682J91561j30086k76480l06973k94870j73609
38828b43930R0444L04428K60353M9251r5610j73006k99382l12334M4612N21273
38818A46099M92290j27783o28717m58623N5042L01498K20294Q0330j07427l70370
$$ plain form
38808 -397367 -758041 -610844 14094 418670 174396 -256458 -229337 165004 361762 176326
38798 176326 -114712 -325502 -486028 -540321 -379622 -128926 -52844 -242937 -643503 -1187770
38788 -1187770 -1630371 -1549418 -916080 -362290 -410526 -742551 -781469 -661634 -892173 -1302999
38778 -1302999 -1208727 -584461 -191757 -412635 -788838 -918745 -989038 -1113445 -944873 -379152
38768 -379152 52153 -26524 -259124 -250163 -233789 -514011 -791696 -661528 -331872 -242681
38758 -242681 -348044 -357935 -324075 -400927 -393475 -167380 -156348 -772317 -1596765 -1872803 -1574151
38747 -1574151 -1264414 -1104320 -792651 -375425 -282345 -544495 -746930 -808725 -1044730 -1365821
38737 -1365821 -1230965 -610370 -220638 -475882 -895175 -932305 -765846 -818109 -1020169 -1037532
$$ packed form
38808c97367l60674J47197O24938M04576k44274m30854K7121L94341J96758j85436
38798A76326k91038k10790j60526n4293J60699K50696P6082j90093m00566n44267
38788a187770m42601Q0953O33338N53790m8236l32025l8918J19835k30539m10826
38778a302999R4272O24266L92704k20878l76203j29907p0293j24407J68572N65721
38768c79152M31305p8677k32600Q961J6374k80222k77685J30168L29656Q9191
38758b42681j05363r891L3860p6852P452K26095J1032o15969q24448k76038K98652
38747a574151L09737J60094L11669M17226R3080k62150k02435o1795k36005l21091
38737a365821J34856O20595L89732k55244m19293l7130J66459n2263k02060j7363
$$ plain form
38727 -1037532 -828073 -558769 -316002 -234280 -513340 -957883 -939655 -247246 428605 337720
38717 337720 -346107 -876966 -951314 -826795 -693741 -538737 -499564 -760069 -1104175 -1082302
38707 -1082302 -658755 -279773 -280394 -595749 -1041432 -1481510 -1709474 -1559687 -1193915 -948243
38697 -948243 -884361 -823941 -786053 -966512 -1270737 -1332676 -1082886 -834799 -691139 -382591
38687 -382591 89661 209749 -256349 -691196 -394758 385951 792305 558359 252140 303276
38677 303276 407142 121812 -419104 -739929 -688535 -520773 -451384 -409668 -210846 209287
38667 209287 696693 915888 612565 -3404 -289900 156491 937288 1238353 762554 -5875
38657 -5875 -481287 -584133 -555273 -508327 -427343 -382167 -447773 -524255 -477583 -348964 -202097
$$ packed form
38727a037532K09459K69304K42767Q1722k79060m44543J8228O92409O75851r0885
38717C37720o83827n30859p4348J24519J33054J55004L9173k60505l44106K1873
38707a082302M23547L78982o21l15355m45683m40078k27964J49787L65772K45672
38697i48243O3882O0420L7888j80459l04225o1939K49790K48087J43660L08548
38687c82591M72252J20088m66098m34847K96438P80709M06354k33946l06219N1136
38677C03276J03866k85330n40916l20825N1394J67762O9389M1716J98822M20133
38667B09287M87406K19195l03323o15969k86496M46391P80797L01065m75799p68429
38657e875m75412j02846K8860M6946Q0984M5176o5606p6482M6672J28619J46867
$$ plain form
38646 -202097 81320 551094 863807 606524 -57955 -454787 -197136 395117 775045 751131
38636 751131 451647 24586 -385644 -564284 -375794 80556 576845 938403 1106720 1184345
38626 1184345 1409557 1863583 2241800 2239928 2123687 2427499 3025724 3129530 2482689 1909414
38616 1909414 2158622 2753986 2687130 1872143 1116108 835406 632946 170093 -310132 -511852
38606 -511852 -510809 -420049 -151141 248045 448981 264955 -124725 -506063 -821291 -948795
38596 -948795 -732110 -347612 -203603 -366799 -552673 -731968 -1126302 -1490297 -1187611 -305128
38586 -305128 136450 -371868 -953326 -658045 54019 120838 -336121 -215537 720086 1386863
38576 1386863 976196 24692 -513426 -500400 -433844 -586735 -843207 -1062733 -1183430 -1146974
$$ packed form
38646b02097K83417M69774L12713k57283o64479l96832K57651N92253L79928k3914
38636G51131k99484m27061m10230j78640J88490M56350M96289L61558J68317P7625
38626A184345K25212M54026L78217j872j16241L03812N98225J03806o46841n73275
38616A909414K49208N95364o6856q14987p56035k80702k02460m62853m80225k01720
38606e11852J043R0760K68908L99186K00936j84026l89680l81338l15228j27504
38596i48795K16685L84498J44009j63196j85874j79295l94334l63995L02686Q82483
38586c05128M41578n08318n81458K95281P12064O6819m56959J20584R35623O66777
38576A386863m10667r51504n38118J3026O6556j52891k56472k19526j20697L6456
$$ plain form
38566 -1146974 -996739 -897522 -898451 -859987 -712887 -562629 -469194 -398764 -462783 -873154 -1518560
38555 -1518560 -1885162 -1588037 -794823 -27074 281269 35730 -442716 -602890 -211852
38546 -211852 327603 515595 446756 489361 480775 -10460 -666628 -598005 231796 706314
38536 706314 151459 -651398 -697163 -206595 -27937 -251734 -370260 -336002 -462558 -593063
38526 -593063 -365768 -98722 -410426 -1069318 -1215736 -704862 -246651 -189872 -194306 -208029
38516 -208029 -661759 -1422286 -1656354 -1167212 -824178 -1137516 -1448061 -1203661 -995465 -1408868
38506 -1408868 -1761551 -1131326 10481 415232 -95725 -605314 -693048 -832885 -1211320
38497 -1211320 -1329383 -1019681 -848701 -1132361 -1376370 -1123766 -692386 -620624 -883876 -1068530
$$ packed form
38566a146974J50235R9217r29L8464J47100J50258R3435P0430o4019m10371o45406
38555a518560l66602K97125P93214P67749L08343k45539m78446j60174L91038
38546b11852N39455J87992o8839M2605q586m91235o56168O8623Q29801M74518
38536G06314n54855q02857m5765M90568J78658k23797j18526L4258j26556j30505
38526e93063K27295K67046l11704o58892j46418N10874M58211N6779m434j3723
38516b08029m53730p60527k34068M89142L43034l13338l10545K44400K08196m13403
38506a408868l52683O30225J141807M04751n10957n09589q7734j39837l78435
38497a211320j18063L09702J70980k83660k44009K52604M31380P1762k63252j84654
$$ plain form
38487 -1068530 -954672 -626232 -319021 -341388 -791891 -1230932 -1052357 -316536 234153 130996
38477 130996 -327843 -680384 -842499 -827003 -514656 -56678 24591 -442669 -904838 -853458
38467 -853458 -555525 -567000 -902503 -1177251 -1249232 -1212633 -1013579 -579576 -145167 4629
38457 4629 -47952 -83014 -176915 -493559 -861608 -1004364 -1002377 -1092437 -1196487 -1084048 -793805
38446 -793805 -446497 105711 919085 1511582 1408346 936651 782502 895630 622324 -93545
38436 -93545 -499725 -208010 205594 97049 -394927 -755965 -812305 -678935 -459476 -338946
38426 -338946 -554764 -969163 -1089082 -793121 -571224 -720392 -819647 -447608 58768 120383
38416 120383 -185289 -361995 -367421 -570390 -934154 -924901 -351981 256149 370521 177909
$$ packed form
38487a068530J13858L28440L07211k2367m50503m39041J78575P35821N50689j03157
38477A30996m58839l52541j62115J5496L12347M57978Q1269m67260m62169N1380
38467h53458K97933j1475l35503k74748p1981L6599J99054M34003M34409J49796
38457D629n2581l5062r3901l16644l68049j42756J987r0060j04050J12439K90243
38446g93805L47308N52208Q13374N92497j03236m71695j54149J13128k73306p15869
38436i3545m06180K91715M13604j08545m91976l61038n6340J33370K19459J20530
38426c38946k15818m14399j19919K95961K21897j49168r9255L72039N06376O1615
38416A20383l05672j76706n426k02969l63764R253N72920O08130J14372j92612
$$ plain form
38406 177909 263517 771517 1207706 1094371 581987 229483 276781 433910 470965 634214
38396 634214 1125581 1477650 1035053 -26440 -808685 -911010 -889632 -1249157 -1606683 -1309478
38386 -1309478 -429055 359154 607977 398776 36362 -211175 -260092 -338691 -724919 -1204748
38376 -1204748 -1195421 -626352 -199530 -434544 -957328 -1155251 -1028106 -880669 -667909 -260808
38366 -260808 52488 -20616 -212817 -168417 -106012 -343411 -557451 -295092 118229 38002
38356 38002 -391642 -487021 -191343 -56005 -169436 -73847 260955 334959 44381 -208384
38346 -208384 -392211 -884462 -1535989 -1703313 -1392101 -1340454 -1703778 -1714153 -1021387 -322811
38336 -322811 -172771 -174141 75146 203500 -108112 -427219 -405160 -460986 -904349 -1229445
$$ packed form
38406A77909Q5608N08000M36189j13335n12384l52504M7298J57129L7055J63249
38396F34214M91367L52069m42597j061493p82245j02325K1378l59525l57526K97205
38386a309478Q80423P88209K48823k09201l62414k47537m8917p8599l86228m79829
38376a204748R327N69069M26822k35014n22784j97923J27145J47437K12760M07101
38366b60808L13296p3104j92201M4400O2405k37399k14040K62359M13321q0227
38356C8002m29644r5379K95678J35338j13431R5589L34802P4004k90578k52765
38346b08384j83827m92251o51527j67324L11212N1647l63324j0375O92766O98576
38336c22811J50040j370K49287J28354l11612l19107K2059n5826m43363l25096
$$ plain form
38326 -1229445 -1068226 -966835 -1308290 -1358623 -499535 393266 129874 -827124 -1024779 -307909
38316 -307909 61110 -489491 -1097293 -1069146 -880162 -1074105 -1274958 -954242 -380141 -134161
38306 -134161 -229067 -294957 -269465 -396401 -736036 -1031731 -993351 -591903 -155328 -91615
38296 -91615 -321437 -190853 685702 1715311 1981188 1469348 1044780 1248636 1740947 1982827
38286 1982827 1857378 1485748 995276 663638 819163 1398431 1961911 2246458 2356446
38277 2356446 2402941 2359925 2273787 2211173 2061343 1806624 1801809 2230974 2529969 2100946
38267 2100946 1409430 1439878 2130945 2431934 2023964 1791810 2214679 2488280 1906997 1068670
38257 1068670 862449 1109645 1119051 895477 852045 880271 651826 400779 494850 623214
$$ packed form
38326a229445J61219J01391l41455n0333Q59088Q92801k63392r56998j97655P16870
38316c07909L69019n50601o07802K8147J88984j93943k00853L20716N74101K45980
38306a34161r4906o5890K5492j26936l39635k95695L8380M01448M36575O3713
38296i1615k29822J30584Q76555J029609K65877n11840m24568K03856M92311K41880
38286A982827j25449l71630m90472l31638J55525N79268N63480K84547J09988
38277B356446M6495m3016q6138o2614j49830k54719m815M29165K98995m29023
38267B100946o91516L0448O91067L00989m07970k32154M22869K73601n81283q38327
38257A068670k06221K47196R406k23574m3432K8226k28445k51047R4071J28364
$$ plain form
38247 623214 320484 -65187 125293 707526 991748 1002975 1280981 1640751 1340519 519844
38237 519844 231692 771528 1150603 699684 115095 253199 812642 1014013 849570 777175
38227 777175 729277 356971 -109368 -181611 -92932 -519946 -1352772 -1658637 -1052661 -281563
38217 -281563 -95375 -247313 -111959 273514 433850 366793 501116 829910 779344 101161
38207 101161 -653919 -849755 -559666 -310880 -339166 -505668 -755789 -1166148 -1541461 -1434229
38197 -1434229 -740080 50470 403866 318933 157764 117279 121958 102469 93330 71402 -74829
38186 -74829 -366891 -661104 -786947 -682778 -400981 -58232 228943 426076 584296 722510
38176 722510 765218 666126 529932 515972 658954 865351 1032758 1071334 868042 393788
$$ packed form
38247F23214l02730l85671J90480N82233K84222J1227K78006L59770l00232q20675
38237E19844k88152N39836L79075m50919n84589J38104N59443K01371j64443p2395
38227G77175m7898l72306m66339p2243Q8679m27014q32826l05865O05976P71098
38217b81563J86188j51938J35354L85473J60336o7057J34323L28794n0566o78183
38207A01161p55080j95836K90089K48786k8286j66502k50121m10359l75313J07232
38197a434229O94149P90550L53396q4933j61169m0485M679j9489r139k1928j46231
38186g4829k92062k94213j25843J04169K81797L42749K87175J97133J58220J38214
38176G22510M2708r9092j36194j3960J42982K06397J67407L8576k03292m74254
$$ plain form
38166 393788 -138337 -382621 -223250 75645 209190 248468 508947 967750 1091185 512415
38156 512415 -280947 -369457 420602 1199227 1120162 415741 -75745 -95588 -98793 -336321
38146 -336321 -467387 -208320 206863 479087 709987 1094516 1483188 1584323 1377443 1052909
38136 1052909 733312 473792 334146 259212 114064 -9863 154850 500651 462410 -175178
38126 -175178 -801009 -782755 -393101 -342893 -665419 -787873 -599535 -629937 -1023288 -1118659
38116 -1118659 -448650 438305 673109 198717 -318482 -455722 -361146 -228353 -21189 185698
38106 185698 94583 -321663 -573340 -275706 184767 62794 -657216 -1045510 -354239 955053
38096 955053 1702212 1373969 592486 189059 268675 411670 422292 462537 585468 563138
$$ packed form
38166C93788n32125k44284J59371K98895J33545L9278K60479M58803J23435n78770
38156E12415p93362q8510P90059P78625p9065p04421m91486j9843l205k37528
38146c36321j31066K59067M15183K72224K30900L84529L88672J01135k06880l24534
38136A052909l19597k59520j39646p4934j45148j23927J64713L45801l8241o37588
38126a75178o25831J8254L89654N0208l22526j22454J88338l0402l93351r5371
38116a118659O70009Q86955K34804m74392n17199j37240R4576J32793K07164K06887
38106A85698r1115m16246k51677K97634M60473j21973p20010l88294O91271J309292
38096I55053P47159l28243p81483m03427P9616J42995J0622M0245J22931k2330
$$ plain form
38086 563138 267413 -50224 -28663 355597 733508 707748 202956 -517991 -1073106 -1145046
38076 -1145046 -596107 356195 1085822 1007590 250817 -404583 -499388 -459435 -811210 -1226137
38066 -1226137 -1010285 -311769 19338 -215693 -292498 99194 212797 -511361 -1410780 -1579040
38056 -1579040 -1207934 -1054800 -1080846 -652282 172257 623520 468954 298675 438404 479806
38046 479806 153931 -133155 -7328 292828 434960 527126 724565 786402 452019 -110074
38036 -110074 -586912 -908310 -1054319 -887784 -525374 -442636 -777613 -944382 -469072 162383
38026 162383 158654 -318777 -338254 375209 999689 844140 304412 131244 290317 192771
38016 192771 -235133 -427462 -101695 338964 478720 404670 299767 61232 -279867 -253760
$$ packed form
38086E63138k95725l17637K1561L84260L77911k5760n04792p20947n55115p1940
38076a145046N48939R52302P29627p8232p56773o55400r4805L9953l51775m14927
38066a226137K15852O98516L31107k35031p6805L91692J13603p24158q99419j68260
38056a579040L71106J53134k6046M28564Q24539M51263j54566j70279J39729M1402
38046D79806l25875k87086J25827L00156J42132R2166J97439O1837l34383n62093
38036a10074m76838l21398j46009J66535L62410Q2738l34977j66769M75310O31455
38026A62383l729m77431j9477P13463O24480j55549n39728j73168J59073r7546
38016A92771m27904j92329L25767M40659J39756p4050j04903k38535l41099K6107
$$ plain form
38006 -253760 367184 962313 823861 261519 149478 513999 518890 -68975 -439467 -124554
37996 -124554 172327 -245717 -902285 -935388 -394425 61589 208356 171724 -178758 -847452
37986 -847452 -1186478 -730250 -155251 -354199 -913999 -712858 214108 747531 566634 534101
37976 534101 1013303 1233526 781620 402021 677599 1084089 1075245 1038370 1362028 1514718
37966 1514718 946760 115976 -251275 -216521 -146984 77758 520616 597078 -4435 -489773
37956 -489773 -79318 655070 682273 185224 108417 449379 348344 -285171 -556629 -55993
37946 -55993 621326 964310 1112800 1169849 932936 529262 434558 658799 736003 645081
37936 645081 844187 1247635 1155449 467694 -16315 113867 242205 -158005 -676964 -796188
$$ packed form
38006b53760O20944N95129j38452n62342j12041L64521M891n87865l70492L14913
37996a24554K96881m18044o56568l3103N40963M56014J46767l6632l50482o68694
37986h47452l39026M56228N74999j98948n59800K01141R26966N33423j80897l2533
37976E34101M79202K20223m51906l79599K75578M06490q844l6875L23658J52690
37966A514718n67958q30784l67251L4754O9537K24742M42858P6462o01513m85338
37956d89773M10455P34388K7203m97049p6807L40962j01035o33515k71458N00636
37946e5993O77319L42984J48490N7049k36913m03674r4704K24241P7204r0922
37936F45081J99106M03448r2186o87755m84009J30182J28338m00210n18959j19224
$$ plain form
37926 -796188 -720207 -731124 -471848 377942 1311549 1632621 1419862 1186458 1029199 792964
37916 792964 659219 853288 1097326 1034924 886129 1000052 1084421 656086 12056 -97810
37906 -97810 335766 567947 312865 139506 464789 897551 922006 656649 548549 717296
37896 717296 939776 991290 752845 251158 -219357 -304763 -86569 -39161 -310321 -429562
37886 -429562 -21076 553199 657188 231566 -239031 -427707 -387527 -182248 213498 625230
37876 625230 754549 658352 726687 1006381 986145 381948 -228504 -28480 959777 1897416
37866 1897416 2166534 1908689 1504009 1042701 540235 237592 309469 516059 494298 246871
37856 246871 45599 -8977 -23060 -26032 14992 -16894 -216957 -300596 175678 1130780 1844843
$$ packed form
37926g96188P5981j0917K59276Q49790R33607L21072k12759k33404j57259k36235
37916G92964j33745J94069K44038o2402j48795J13923Q4369m28335o44030j09866
37906i7810M33576K32181k55082j73359L25283M32762K4455k65357j08100J68747
37896G17296K22480N1514k38445n01687m70515q5406K18194M7408k71160j19241
37886d29562M08486N74275J03989m25622m70597j88676M0180K05279L95746M11732
37876F25230J29319r6197O8335K79694k0236o04197o10452K00024R88257R37639
37866A897416K69118k57845m04680m61308n02466l02643P1877K06590k1761k47427
37856B46871k01272n4576j4083k972M1024l1886k00063q3639M76274R55102P14063
$$ plain form
37845 1844843 1727739 987785 357604 293524 580101 632740 117697 -645935 -912076 -295992
37835 -295992 676108 1046692 516970 -190020 -178440 637200 1575666 2021756 1960864 1755716
37825 1755716 1648398 1575801 1376099 1059375 816071 776376 861149 924344 935663 931056 913924
37814 913924 944261 1162305 1503623 1561354 1064959 389782 184053 508617 792194 705752
37804 705752 594808 841487 1253632 1426186 1372055 1404181 1603552 1777338 1824300 1823204
37794 1823204 1836772 1889572 2063205 2381380 2680493 2795036 2754284 2589983 2133984 1333346
37784 1333346 641579 672174 1411178 2134174 2249498 1936946 1738791 1742564 1516656 857370
37774 857370 254166 330562 940687 1214268 653387 -158288 -293392 306910 866761 944443
$$ packed form
37845A844843j17104p39954o30181o4080K86577N2639n15043p63632k66141O16084
37835b95992R72100L70584n29722p06990J1580Q15640R38466M46090o0892k05148
37825A755716j07318p2597j99702l16724k43304l9695Q4773O3195J1319m607j7132
37814I13924L0337K18044L41318N7731m96395o75177k05729L24564K83577q6442
37804G05752j10944K46679M12145J72554n4131L2126J99371J73786M6962j096
37794A823204J3568N2800J73633L18175K99113J14543m0752j64301m55999q00638
37784A333346o91767L0595P39004P22996J15324l12552j98155L773k25908o59286
37774H57370o03204P6396O10125K73581n60881q11675j35104O00302N59851P7682
$$ plain form
37764 944443 935708 1235690 1521644 1312816 815776 667222 1046788 1534609 1739640 1640794
37754 1640794 1372010 1064607 888404 928252 1038447 1063202 1088644 1204822 1203788 889011
37744 889011 515664 472378 652177 647319 481571 555008 845233 809043 247852 -330027
37734 -330027 -477564 -396262 -422724 -429235 -164003 212307 404658 506604 774676 1090131
37724 1090131 1108946 829365 599293 624805 809317 1004070 1105986 994584 678839 419007
37714 419007 413024 486307 407011 338084 558219 871537 820795 463230 355408 645989 761958
37703 761958 283191 -369743 -542317 -284954 -196228 -522502 -913502 -1038321 -984903 -939090
37693 -939090 -834390 -543221 -202752 -105170 -331543 -671847 -881451 -861603 -593622 -100208
$$ packed form
37764I44443q735K99982K85954k08828m97040j48554L79566M87821K05031r8846
37754A640794k68784l07403j76203L9848J10195K4755K5442J16178j034l14777
37744H89011l73347m3286J79799m858j65748P3437K90225l6190n61191n77879
37734c30027j47537Q1302k6462o511K65232L76310J92351J01946K68072L15455
37724A090131J8815k79581k30072K5512J84512J94753J01916j11402l15745k59832
37714D19007n983P3283p9296o8927K20135L13318n0742l57565j07822K90581J15969
37703G61958m78767o52934j72574K57363Q8726l26274l91000j24819N3418M5813
37693i39090J04700K91169L40469R7582k26373l40304k09604J9848K67981M93414
$$ plain form
37683 -100208 412870 548706 91909 -651629 -1128257 -1158123 -1010799 -824739 -362736 410225
37673 410225 919508 638212 -80186 -393192 -113992 126222 -102998 -479813 -599534 -601293
37663 -601293 -764779 -948741 -853341 -506420 -115483 251456 501260 407479 61254 20910
37653 20910 517250 918856 604935 -8406 -81985 284435 216260 -495097 -1091143 -1125466
37643 -1125466 -1100964 -1484140 -1908861 -1852047 -1456557 -1171234 -1081755 -1058941 -1113474 -1186802
37633 -1186802 -1045698 -776685 -891879 -1528842 -2072421 -2031992 -1733978 -1617564 -1454439 -936700
37623 -936700 -453470 -475374 -666301 -488474 -234459 -463188 -804990 -483404 214399 259970
37613 259970 -367226 -582833 -18262 416726 195454 63012 592171 1071995 755686 201511
$$ packed form
37683a00208N13078J35836m56797p43538m76628k9866J47324J86060M62003P72961
37673D10225N09283k81296p18398l13006K79200K40214k29220l76815j19721j759
37663f01293j63486j83962R5400L46921L90937L66939K49804r3781l46225m0344
37653B0910M96340M01606l13921o13341p3579L66420o8175p11357n96046l4323
37643a125466K4502l83176m24721N6814L95490K85323Q9479K2814n4533p3328
37633a186802J41104K69013j15194o36963n43579M0429K98014J16414J63125N17739
37623i36700M83230k1904j90927J77827K54015k28729l41802L21586O97803M5571
37613B59970o27196k15607N64571M34988k21272j32442N29159M79824l16309n54175
$$ plain form
37603 201511 291803 713050 605674 164126 309142 1033405 1341514 874925 462719 783772
37593 783772 1416585 1641421 1473527 1398926 1564789 1736385 1802575 1901264 2124935 2387258
37583 2387258 2592915 2784317 3048184 3289265 3192396 2571326 1742582 1294552 1397879 1631970
37573 1631970 1629185 1528526 1551013 1537145 1314455 1173524 1448847 1865076 1883231 1560767
37563 1560767 1451347 1674978 1719490 1290267 791452 716261 986957 1179609 1107051 922455
37553 922455 828400 865217 886110 702618 388493 366205 924850 1698634 1972744 1549833
37543 1549833 979389 845377 1142468 1470209 1549535 1391905 1176933 1095129 1159004 1131263
37533 1131263 817973 407649 269673 443760 634256 698683 785252 959536 1086126 1154279
$$ packed form
37603B01511R0292M21247j07376m41548J45016P24263L08109m66589m12206L21053
37593G83772O32813K24836j67894p4601J65863J71596O6190R8689K23671K62323
37583B387258K05657J91402K63867K41081r6869o21070q28744m48030J03327K34091
37573A631970k785j00659K2487j3868k22690j40931K75323M16229J8155l22464
37563A560767j09420K23631M4512m29223m98815p5191K70696J92652p2558j84596
37553I22455r4055L6817K0893j83492l14125k2288N58645P73784K74110m22911
37543A549833n70444j34012K97091L27741P9326j57630k14972q1804O3875k7741
37533A131263l13290m10324j37976J74087J90496O4427Q6569J74284J26590O8153
$$ plain form
37523 1154279 1311437 1460794 1270683 772474 492264 700038 954727 782082 440789
37514 440789 525189 1041151 1420154 1386114 1287350 1467330 1731557 1672635 1267223 882975
37504 882975 799502 970990 1268888 1714020 2293655 2690984 2499478 1757966 998800 625360
37494 625360 508558 400992 427530 788195 1230303 1330158 1186368 1286071 1694312 1944753
37484 1944753 1820588 1670694 1766967 1897549 1860435 1842240 1974983 1996096 1743148 1560783
37474 1560783 1782218 2186043 2428501 2647309 3090066 3439142 3134444 2232568 1373946
37465 1373946 972430 968232 1302167 2015757 2813685 3126667 2851931 2599865 2929626 3628940
37455 3628940 3998102 3666956 2954015 2529099 2791488 3457490 3759857 3217906 2182370
$$ packed form
37523A154279J57158J49357j90111m98209k80210K07774K54689j72645l41293
37514D40789Q4400N15962L79003l4040r8764J79980K64227n8922m05412l84248
37504H82975q3473J71488K97898M45132N79635L97329j91506p41512p59166l73440
37494F25360j16802j07566K6538L60665M42108R9855j43790R9703M08241K50441
37484A944753j24165j49894R6273J30582l7114j8195J32743K1113k52948j82365
37474A560783K21435M03825K42458K18808M42757L49076l04698r01876q58622
37465A373946m01516m198L33935P13590P97928L12982k74736k52066L29761O99314
37455C628940L69162l31146p12941m24916K62389O66002L02367n41951j035536
$$ plain form
37446 2182370 1430517 1308119 1551580 1858664 2191183 2457398 2385265 1979594 1748178 2117734
37436 2117734 2819873 3188035 2963265 2512254 2295058 2406548 2686801 3030638 3427911
37427 3427911 3817855 4092866 4269441 4521386 4935117 5297059 5292767 4946814 4682707 4818707
37417 4818707 5141325 5156534 4681505 4004095 3520950 3427359 3726527 4286682 4828865 5075637
37407 5075637 5031149 4982932 5136509 5359425 5367281 5066799 4636307 4335139 4285311 4377754
37397 4377754 4368095 4145827 3925622 4057984 4595391 5150486 5275633 4931149 4502963 4386119
37387 4386119 4616576 4914657 5039157 5041929 5148988 5447871 5794777 6016236 6050782 5857892
37377 5857892 5398395 4845744 4607340 4877269 5291383 5329071 5012181 4890452 5314150 6033745
$$ packed form
37446B182370p51853j22398K43461L07084L32519K66215p2133m05671k31416L69556
37436B117734P02139L68162k24770m51011k17196J11490K80253L43837L97273
37427C427911L89944K75011J76575K51945M13731L61942m292l45953k64107J36000
37417D818707L22618J5209m75029o77410m83145r3591K99168N60155N42183K46772
37407E075637m4488m8217J53577K22916P856l00482m30492l01168m9828R2443
37397D377754r659k22268k20205J32362N37407N55095J25147l44484m28186j16844
37387D386119K30457K98081J24500K772J07059K98883L46906K21459L4546j92890
37377E857892m59497n52651k38404K69929M14114L7688l16890j21729M23698P19595
$$ plain form
37367 6033745 6590388 6792413 6696922 6460924 6409179 6903640 7812812 8382091 8078467 7433588
37357 7433588 7549378 8736088 10125997 10807758 10885298 11071156 11589235 11999278 11994160 11836839
37347 11836839 11894273 12166962 12514103 13009090 13718903 14311326 14294650 13690634 13172568 13395296
37337 13395296 14334875 15389985 16022143 16196926 16286602 16686136 17540087 18728942 19992811
37328 19992811 21054876 21779052 22372463 23357066 25096782 27332780 29447208 31239601
37320 31239601 33093704 35214142 37127908 38328430 39062605 39930070 40910172 41430409 41361647
37311 41361647 41274118 41573361 42011501 42322138 42787271 43803004 45306293 47010295 48867756
37302 48867756 50960708 53273358 55936209 59360053 63722662 68627211 73710309 79315718
$$ packed form
37367F033745N56643K02025r5491k35998n1745M94461R09172N69279l03624o44879
37357G433588J15790J186710J389909O81761P7540J85858N18079M10043n118j57321
37347A1836839N7434K72689L47141M94987P09813N92423j6676o04016n18066K22728
37337A3395296R39579J055110O32158J74783Q9676L99534Q53951J188855J263869
37328A9992811J062065P24176N93411R84603J739716K235998K114428J792393
37320C1239601J854103K120438J913766J200522P34175Q67465R80102N20237o8762
37311D1361647q7529K99243M38140L10637M65133J015733J503289J704002J857461
37302D8867756K092952K312650K662851L423844M362609M904549N083098N605409
$$ plain form
37294 79315718 86086744 94139064 103199990 113417956 125420066 139560864 155685598
37287 155685598 173768986 194301438 217811701 244364818 273809511 306280166 342053370
37280 342053370 380721069 420471081 458200772 490397380 513940471 526213352 525132395
37273 525132395 510066445 483017998 448192212 409793886 370448371 331814749 295705875
37266 295705875 263584652 235399644 210047227 187029994 166853837 149801449 135209636
37259 135209636 122191497 110386736 99785716 90425626 82449308 75879892 70177398
37252 70177398 64606407 59153152 54403412 50406906 46519739 42646990 39663538 37996580
37244 37996580 36636227 34381551 31456545 28989609 27323441 25814336 24106505 22626332
$$ packed form
37294G9315718O771026Q052320R060926J0217966J2002110J4140798J6124734
37287A55685598J8083388K0532452K3510263K6553117K9444693L2470655L5773204
37280C42053370L8667699L9750012L7729691L2196608K3543091J2272881j080957
37273E25132395j5065950k7048447l4825786l8398326l9345515l8633622l6108874
37266B95705875l2121223k8185008k5352417k3017233k0176157j7052388j4591813
37259A35209636j3018139j1804761j0601020r360090p976318o569416n702494
37252G0177398n570991n453255m749740l996506l887167l872749k983452j666958
37244C7996580j360353k254676k925006k466936j666168j509105j707831j480173
$$ plain form
37236 22626332 21720089 21085281 20280704 19238678 18079284 16886374 15849610 15216452 14905456
37227 14905456 14499908 13797941 13067549 12587708 12234292 11748559 11181174 10786836 10589209
37218 10589209 10319824 9798414 9180027 8750084 8589366 8541461 8444434 8255599 7956311 7518604
37208 7518604 7058882 6852407 7023901 7350250 7558849 7683891 7884607 8060970 7997560 7802212
37198 7802212 7794020 7965775 7987116 7779663 7611514 7499333 7036788 6088589 5192449 4883205
37188 4883205 4956086 4823761 4379452 4081456 4276174 4779922 5109175 4902868 4167081 3285688
37178 3285688 2753850 2780801 3168439 3558294 3682442 3465564 3132336 3128492 3589368 3968417
37168 3968417 3645131 2840062 2352810 2414663 2540768 2608523 3137956 4114941 4519128 3749146
$$ packed form
37236B2626332r06243o34808q04577j042026j159394j192910j036764o33158l10996
37227A4905456m05548p01967p30392m79841l53416m85733n67385l94338j97627
37218A0589209k69385n21410o18387m29943j60718m7905r7027j88835k99288m37707
37208G518604m59722k06475J71494L26349K08599J25042K00716J76363o3410j95348
37198G802212q192J71755K1341k07453j68149j12181m62545r48199q96140l09244
37188D883205P2881j32325m44309k97996J94718N03748L29253k06307p35787q81393
37178C285688n31838K6951L87638L89855J24148k16878l33228l844M60876L79049
37168C968417l23286q05069m87252O1853J26105O7755N29433R76985M04187p69982
$$ plain form
37158 3749146 2699923 2502459 2848058 2660188 1981778 1917250 2766624 3457260 3128350
37149 3128350 2289156 1930621 2215562 2581786 2656231 2545651 2467289 2493002 2589704 2710127
37139 2710127 2848845 3001756 3020494 2680318 2072158 1691866 1834632 2120942 1994475 1483038
37129 1483038 1052116 914970 957516 1147716 1500569 1810394 1940163 2149183 2532190 2433133
37119 2433133 1259460 -282452 -769096 29963 808463 569406 -115060 -146153 600792
37110 600792 1398661 1684609 1380478 675211 21300 -39398 481098 889965 721404 379841
37100 379841 465155 874592 1085956 1007695 1000044 1230030 1469140 1443820 1088851 596064
37090 596064 404316 858131 1657511 2019012 1668315 1247346 1365802 1714841 1637629 1159082
$$ packed form
37158C749146j049223j97464L45599j87870o78410o4528Q49374O90636l28910
37149C128350q39194l58535K84941L66224P4445j10580p8362K5713R6702J20423
37139B710127J38718J52911J8738l40176o08160l80292J42766K86310j26467n11437
37129A483038m30922j37146M2546J90200L52853L09825J29769K09020L83007r9057
37119B433133j173673j541912m86644P99059P78500k39057o84466l1093P46945
37110F00792P97869K85948l04131p05267o53911o0698N20496M08867j68561l41563
37100C79841Q5314M09437K11364p8261p651K29986K39110k5320l54969m92787
37090E96064j91748M53815P99380L61501l50697m20969J18456L49039p7212m78547
$$ plain form
37080 1159082 796913 644737 369838 -15165 -115844 85541 107718 -250460 -581579 -517573
37070 -517573 -199473 144573 607844 1215059 1495213 968009 -45569 -596521 -230554
37061 -230554 421213 464893 -53588 -205619 528541 1502920 1747632 1200096 614314 476931
37051 476931 629937 901981 1394660 1964038 2087723 1607101 1079624 1018881 1261702 1465470
37041 1465470 1697618 2023752 2027957 1414281 699818 571417 830670 768126 396727 420163
37031 420163 978776 1356239 1158788 923486 1134336 1382567 1105032 596736 570181 1031573
37021 1031573 1339663 1276928 1328723 1761380 2069797 1728749 1075530 933555 1512686 2183476
37011 2183476 2369987 2180992 1951560 1620907 1009737 420689 369951 789808 1106592 1191007
$$ packed form
37080A159082l62169j52176k74899l85003j00679K01385K2177l58178l31119O4006
37070e17573L18100L44046M63271O07215K80154n27204j013578n50952L65967
37061b30554O51767M3680n18481j52031P34160R74379K44712n47536n85782j37383
37051D76931J53006K72044M92679N69378J23685m80622n27477o0743K42821K03768
37041A465470K32148L26134M205o13676p14463j28401K59253o2544l71399K3436
37031D20163N58613L77463j97451k35302K10850K48231k77535n08296k6555M61392
37021A031573L08090o2735N1795M32657L08417l41048o53219j41975N79131O70790
37011B183476J86511j88995k29432l30653o11170n89048n0738M19857L16784Q4415
$$ plain form
37001 1191007 1578055 2457543 3078802 2694296 1656265 953004 934812 1156570 1317180
36992 1317180 1616212 2128036 2522343 2658510 2906222 3527176 4134147 4143453 3525366 2787177
36982 2787177 2385321 2424570 2777222 3198897 3394950 3234121 2905217 2708670 2733278 2893388
36972 2893388 3218931 3870041 4808237 5646085 5977443 5809726 5574311 5729215 6415460
36963 6415460 7463893 8618037 9712057 10724059 11734077 12800641 13864752 14867194
36955 14867194 15985595 17581345 19782929 22285050 24740248 27147964 29535060 31404466
36947 31404466 31987588 31109925 29371569 27328821 24947568 22135551 19371912 17304489
36939 17304489 15900251 14478303 12600772 10580453 9035426 8205830 7820896 7451546
$$ packed form
37001A191007L87048Q79488O21259l84506j038031p03261j8192K21758J60610
36992A317180K99032N11824L94307J36167K47712O20954O06971R306o18087p38189
36982B787177m01856L9249L52652M21675J96053j60829l28904j96547K4608J60110
36972B893388L25543O51110R38196Q37848L31358j67717k35415J54904O86245
36963F415460J048433J154144J094020J012002J010018J066564J064111J002442
36955A4867194J118401J595750K201584K502121K455198K407716K387096J869406
36947C1404466N83122q77663j738356k042748k381253k812017k763639k067423
36939A7304489j404238j421948j877531k020319j545027q29596l84934l69350
$$ plain form
36931 7451546 6833173 5915183 4791545 3714410 3093729 3216161 3843552 4335784 4389498
36922 4389498 4390561 4708951 4974648 4632211 3984275 3879085 4349223 4444421 3665427 2689996
36912 2689996 2233707 2036741 1624023 1292526 1471596 1691597 1211049 345728 143093
36903 143093 826121 1503853 1487128 1062146 815208 912069 1232396 1597113 1673575 1197742
36893 1197742 457283 71326 179408 329166 234767 109655 142767 191281 145648 94563
36883 94563 -10961 -345567 -721349 -647198 -61113 509125 707304 751953 871591 884250
36873 884250 627956 315377 147276 21354 -76800 139650 727068 1192749 1103792 672764
36863 672764 375432 308923 287543 267315 289743 245108 56762 -77588 63073 367168
$$ packed form
36931G451546o18373r17990j123638j077135o20681J22432O27391M92232N3714
36922D389498J063L18390K65697l42437o47936j05190M70138R5198p78994r75431
36912B689996m56289j96966m12718l31497J79070K20001m80548q65321k02635
36903A43093O83028O77732j6725m24982k46938R6861L20327L64717P6462m75833
36893A197742p40459l85957J08082J49758r4399j25112L3112M8514m5633n1085
36883I4563j05524l34606l75782P4151N86085N70238J98179M4649J19638J2659
36873H84250k56294l12579j68101j25922r8154K16450N87418M65681q8957m31028
36863F72764k97332o6509k1380k0228K2428m4635j88346j34350J40661L04095
$$ plain form
36853 367168 505579 272134 -292049 -900884 -1114842 -761633 -291918 -270424 -484281 -183148
36843 -183148 647421 1040348 475901 -234579 -146040 423279 545493 220216 238682 757305
36833 757305 1077221 900043 817067 1245347 1684737 1502503 885498 492899 519199 605728
36823 605728 512175 424333 574178 855218 942902 691075 301562 80766 79344 62077 -157020
36812 -157020 -467614 -606765 -441071 -48768 355523 521089 338610 -7869 -219453 -260697
36802 -260697 -355144 -561104 -646269 -494622 -297070 -147328 182564 763636 1150344 910777
36792 910777 281013 -141804 -199064 -223683 -385355 -432298 -121702 427850 867621 888001
36782 888001 413737 -221971 -387791 249046 1257310 1839496 1666518 1077112 529016
$$ packed form
36853C67168J38411k33445n64183o08835k13958L53209M69715K1494k13857L01133
36843a83148Q30569L92927n64447p10480Q8539N69319J22214l25277J8466N18623
36833G57305L19916j77178q2976M28280M39390j82234o17005l92599K6300Q6529
36823F05728r3553q7842J49845K81040Q7684k51827l89513k20796j422j7267k19097
36812a57020l10594j39151J65694L92303M04291J65566j82479l46479k11584m1244
36802b60697r4447k05960q5165J51647J97552J49742L29892N81072L86708k39567
36792I10777o29764m22817n7260k4619j61672m6943L10596N49552M39771K0380
36782H88001m74264o35708j65820O36837J008264N82186j72978n89406n48096
$$ plain form
36773 529016 166315 -86877 -318314 -572665 -784841 -744530 -314948 321912 810533 971173
36763 971173 849090 533680 161271 -9109 185145 549476 744767 722198 687932 670865
36753 670865 428759 -150575 -785320 -1052577 -815585 -353542 -80252 -90390 -25435 439731
36743 439731 1030939 1134766 660839 185650 69530 -24750 -390694 -631491 -315962 198682
36733 198682 309559 189027 469235 1113951 1449214 1264836 1054461 1096150 1089794 855444
36723 855444 629787 451638 -19508 -794810 -1346944 -1411664 -1337466 -1324826 -1040563 -416267
36713 -416267 -85461 -408821 -706319 -224669 601547 704088 -58287 -733052 -629129 -102162
36703 -102162 133527 -106084 -486111 -655939 -521293 -232843 -51085 -133226 -425964 -782576
$$ packed form
36773E29016l62701k53192k31437k54351k12176M0311M29582O36860M88621J60640
36763I71173j22083l15410l72409j70380J94254L64331J95291k2569l4266j7067
36753F70865k42106n79334o34745k67257K36992M62043K73290j0138O4955M65166
36743D39731N91208J03827m73927m75189j16120r4280l65944k40797L15529N14644
36733A98682J10877j20532K80208O44716L35263j84378k10375M1689o356k34350
36723H55444k25657j78149m71146p75302n52134o4720P4198J2640K84263O24296
36713d16267L30806l23360k97498M81650Q26216J02541p62375o74765J03923N26967
36703a02162K35689k39611l80027j69828J34646K88450J81758q2141k92738l56612
$$ plain form
36693 -782576 -1055287 -1051049 -681854 -272974 -343510 -849634 -1077806 -658658 -229854 -532790
36683 -532790 -1239745 -1422874 -970836 -678152 -907706 -1044034 -564801 94417 219872 -172681
36673 -172681 -531339 -601913 -544432 -445198 -232572 -14868 -59799 -369709 -574888 -362450
36663 -362450 137115 465901 292359 -251369 -679509 -656579 -358884 -200603 -260446 -244654
36653 -244654 -27487 123641 -13380 -310809 -620105 -1019741 -1444588 -1485049 -1007807 -608257
36643 -608257 -837734 -1249881 -974176 -135932 176915 -476936 -1193033 -1042964 -327846 79602
36633 79602 5348 -155084 -355761 -824240 -1314765 -1301757 -848936 -490762 -269018 268691
36623 268691 1014880 1156493 415960 -372614 -416699 -28314 14925 -401600 -853005 -1154019
$$ packed form
36693g82576k72711M238L69195M08880p0536n06124k28172M19148M28804l02936
36683e32790p06955j83129M52038K92684k29554j36328M79233O59218J25455l92553
36673a72681l58658p0574N7481R9234K12626K17704m4931l09910k05179K12438
36663c62450M99565L28786j73542n43728m28140K2930K97695J58281n9843J5792
36653b44654K17167J51128j37021k97429l09296l99636m24847m0461M77242L99550
36643f08257k29477m12147K75705Q38244L12847o53851p16097J50069P15118M07448
36633G9602p4254j60432k00677m68479m90525J3008M52821L58174K21744N37709
36623B68691P46189J41613p40533p88574m4085L88385M3239m16525m51405l01014
$$ plain form
36613 -1154019 -1354586 -1325105 -1027173 -917536 -1375911 -1910569 -1649363 -565114 440498
36604 440498 673136 277228 -248633 -548160 -390457 200770 675147 399175 -473080 -1119583
36594 -1119583 -1170330 -1090381 -1234922 -1204120 -568843 298524 647680 283493 -357672 -802164
36584 -802164 -840336 -495711 -69782 -17964 -457324 -969895 -1125390 -946361 -636199 -214291
36574 -214291 240812 362809 -19905 -451962 -399180 -20377 116791 -74346 -143285 136255
36564 136255 488218 630690 565961 336523 -39320 -311078 -133176 399305 745753 603175
36554 603175 241276 15850 -83270 -213466 -367017 -527377 -834137 -1294740 -1556215 -1287810
36544 -1287810 -676959 -260967 -299972 -530025 -542605 -262743 -11647 -129659 -538067 -740073
$$ packed form
36613a154019k00567K9481K97932J09637m58375n34658K61206J084249J005612
36604D40498K32638l95908n25861k99527J57703N91227M74377k75972q72255o46503
36594a119583n0747P9949j44541L0802O35277Q67367L49156l64187o41165m44492
36584h02164l8172L44625M25929N1818m39360n12571j55495J79029L10162M21908
36574b14291M55103J21997l82714m32057N2782L78803J37168j91137o8939K79540
36564A36255L51963J42472o4729k29438l75843k71758J77902N32481L46448j42578
36554F03175l61899k25426r9120j30196j53551j60360l06760m60603k61475K68405
36544a287810O10851M15992l9005k30053j2580K79862K51096j18012m08408k02006
$$ plain form
36534 -740073 -377153 279970 612445 403464 16239 -219807 -419156 -723817 -831829 -347162
36524 -347162 538547 1105300 874879 83183 -625625 -790932 -448420 -45852 -34886 -385920
36514 -385920 -559826 -139881 594369 972084 754040 351526 215078 325564 389136 258410
36504 258410 16435 -154423 -89409 170506 272045 -70979 -536518 -446329 273105 860190
36494 860190 765397 425504 489189 748627 587220 163952 193891 596601 412418 -646090
36484 -646090 -1533624 -1316020 -468846 -32339 -146936 -282827 -391381 -786871 -1150988 -780147
36474 -780147 122319 446591 -242394 -1026529 -971044 -360869 -39308 -155538 -264156 -234037
36464 -234037 -308159 -458934 -368896 -24285 228422 247065 235741 258696 65368 -436830
$$ packed form
36534g40073L62920O57123L32475k08981l87225k36046j99349l04661j08012M84667
36524c47162Q85709N66753k30421p91696p08808j65307L42512M02568J0966l51034
36514c85920j73906M19945P34250L77715k18044m02514j36448J10486O3572j30726
36504B58410k41975j70858O5014K59915J01539l43024m65539R0189P19434N87085
36494H60190r4793l39893O3685K59438j61407m23268K9939M02710j84183j058508
36484f46090q87534K17604Q47174M36507j14597j35891j08554l95490l64117L70841
36474g80147R02466L24272o88985p84135N5485O10175L21561j16230j08618L0119
36464b34037p4122j50775R0038L44611K52707J8643j1324K2955j93328n02198
$$ plain form
36454 -436830 -891776 -901335 -509525 -96219 64374 -20106 -224502 -489252 -839676 -1279616
36444 -1279616 -1672302 -1761461 -1395653 -747381 -228167 -123707 -325224 -455725 -275299 60107
36434 60107 194823 27085 -152547 -62714 171016 223939 86987 79676 331075 557007
36424 557007 472715 164991 -101250 -213125 -169056 73736 494093 904583 1134919 1169428
36414 1169428 983963 511307 -25257 -66137 616908 1421010 1527427 926085 386977 427173
36404 427173 755971 836438 577933 258922 63439 -45536 -144553 -246281 -311595 -259276
36394 -259276 -31307 294594 532979 559011 378978 61158 -287225 -511545 -531379 -450072
36384 -450072 -395845 -307489 -71393 190387 238260 116257 129055 341021 395881 2967
$$ packed form
36454d36830m54946r559L91810M13306J60593q4480k04396k64750l50424m39940
36444a279616l92686q9159L65808O48272N19214J04460k01517j30501J80426L35406
36434F0107J34716j67738j79632Q9833K33730N2923j36952p311K51399K25932
36424E57007q4292l07724k66241j11875M4069K42792M20357M10490K30336L4509
36414A169428j85465m72656n36564m0880O83045Q04102J06417o01342n39108M0196
36404D27173L28798Q0467k58505l19011j95483j08975r9017j01728o5314N2319
36394b59276K27969L25901K38385K6032j80033l17820l48383k24320j9834Q1307
36384d50072N4227Q8356K36096K61780M7873j22003J2798K11966N4860l92914
$$ plain form
36374 2967 -613218 -936657 -709245 -137328 329070 340816 -80082 -526068 -592089 -329009
36364 -329009 -146001 -237500 -356558 -242649 7106 155598 156303 68921 -112119 -317651
36354 -317651 -329587 -114316 -6306 -246903 -544203 -454180 -23473 364833 638825 1019143
36344 1019143 1401953 1344799 791994 268747 112389 4576 -395773 -803380 -752659 -362425
36334 -362425 -117639 -80112 108894 485301 604216 260208 -125553 -99685 194203 290253
36324 290253 77577 -120208 -43090 216015 426066 501716 485362 371751 103873 -226975
36314 -226975 -318665 -980 378989 241220 -384045 -667980 -54445 784324 734804 -107247
36304 -107247 -431299 386968 1250286 847696 -462430 -1170322 -660067 250126 741754
$$ packed form
36374B967o16185l23439K27412N71917M66398J1746m20898m45986o6021K63080
36364c29009J83008r1499j19058J13909K49755J48492P05q7382j81040k05532
36354c17651j1936K15271J08010k40597k97300R0023M30707L88306K73992L80318
36344A019143L82810n7154n52805n23247j56358j07813m00349m07607N0721L90234
36334c62425K44786L7527J89006L76407J18915l44008l85761K5868K93888R6050
36324B90253k12676j97785P7118K59105K10051P5650j6354j13611k67878l30848
36314b26975r1690L17685L79969j37769o25265k83935O13535Q38769m9520q42051
36304a07247l24052Q18267Q63318m02590j310126p07892N10255R10193M91628
$$ plain form
36295 741754 943669 1173573 1147610 559931 -115029 -94549 661901 1425852 1642097 1467069
36285 1467069 1379739 1607575 2008019 2297751 2315445 2147749 2020701 2058419 2211328 2394653
36275 2394653 2528529 2439718 1976388 1308201 861852 832066 1002065 1174651 1463728 1928844
36265 1928844 2235481 2036021 1496840 1089390 976516 937257 808285 663823 592741 594008
36255 594008 682694 853442 967711 896237 704501 478285 103488 -476796 -930504 -880933
36245 -880933 -534102 -502805 -947641 -1342922 -1241190 -845839 -592648 -533138 -447794 -305523
36235 -305523 -265523 -364754 -496355 -616225 -738501 -798937 -729457 -607705 -553099 -540009 -483031
36224 -483031 -428061 -467130 -525643 -440996 -224520 -49814 -1671 -43203 -219290 -628965 -1116094
$$ packed form
36295G41754K01915K29904k5963n87679o74960K0480P56450P63951K16245j75028
36285A467069q7330K27836M00444K89732J7694j67696j27048L7718J52909J83325
36275B394653J33876q8811m63330o68187m46349k9786J69999J72586K89077M65116
36265A928844L06637j99460n39181m07450j12874l9259j28972j44462p1082J267
36255E94008Q8686J70748J14269p1474j91736k26216l74797n80284m53708M9571
36245h80933L46831L1297m44836l95281J01732L95351K53191N9510Q5344J42271
36235c05523M0000r9231j31601j19870j22276o0436O9480J21752N4606J3090N6978
36224d83031N4970l9069n8513Q4647K16476J74706M8143m1532j76087m09675m87129
$$ plain form
36213 -1116094 -1243300 -763515 30462 609055 743685 556164 168100 -384487 -897327
36204 -897327 -1029431 -769170 -584895 -832936 -1220708 -1217039 -868441 -736530 -988008 -1078547
36194 -1078547 -615085 -71469 -160761 -771729 -1122167 -900315 -627976 -744815 -925951 -681637
36184 -681637 -189428 -9584 -214106 -360096 -266584 -265084 -582880 -980952 -1220412 -1437561
36174 -1437561 -1727920 -1754259 -1241188 -600230 -502763 -920909 -1162068 -898478 -591847 -713739
36164 -713739 -1080072 -1270386 -1244702 -1142906 -868891 -374839 -68834 -368025 -986310 -1221141
36154 -1221141 -909550 -578232 -612561 -769382 -631104 -144067 418078 715897 524131 -39682
36144 -39682 -497431 -584960 -737967 -1483105 -2420537 -2524280 -1580188 -581177 -387578 -695710
$$ packed form
36213a116094j27206M79785P93977N78593J34630j87521l88064n52587n12840
36204h97327j32104K60261J84275k48041l87772L669L48598J31911k51478r0539
36194a078547M63462N43616q9292o10968l50438K21852K72339j16839j81136K44314
36184f81637M92209J79844k04522j45990R3512J500l17796l98072k39460k17149
36174a437561k90359k6339N13071O40958R7467m18146k41159K63590L06631j21892
36164g13739l66333j90314K5684J01796K74015M94052L06005k99191o18285k34831
36154a221141L11591L31318l4329j56821J38278M87037N62145K97819j91766n63813
36144c9682m57749q7529j53007p45138r37432j03743R44092R99011J93599l08132
$$ plain form
36134 -695710 -768424 -524427 -309883 -134092 159322 323050 27166 -449844 -504416 -84107
36124 -84107 282312 264470 34981 -158062 -261180 -280302 -268052 -404422 -748507 -1001983
36114 -1001983 -855476 -443933 -126730 6684 58701 -5807 -173245 -113429 370031 806137
36104 806137 546382 -316054 -1055304 -1241738 -1036026 -694054 -378674 -365802 -791124 -1220472
36094 -1220472 -1100153 -610612 -430063 -690500 -892097 -847847 -878523 -954562 -557262 281010
36084 281010 662257 68039 -772003 -857233 -254246 137883 -187756 -891641 -1342501 -1214998
36074 -1214998 -686278 -297002 -437990 -837249 -836779 -278691 268120 301894 -16431 -239737
36064 -239737 -193986 9951 117866 -225818 -1103303 -1905555 -1872384 -1176060 -796175 -1125881
$$ packed form
36134f95710p2714K43997K14544J75791K93414J63728k95884m77010n4572M20309
36124h4107L66419j7842k29489j93043j03118j9122J2250j36370l44085k53476
36114a001983J46507M11543L17203J33414N2017o4508j67438N9816M83460M36106
36104H06137k59755q62436p39250j86434K05712L41972L15380J2872m25322m29348
36094a220472J20319M89541J80549k60437k01597M4250l0676p6039L97300Q38272
36084B81010L81247n94218q40042q5230O02987L92129l25639p03885m50860J27503
36074a214998N28720L89276j40988l99259M70N58088N46811L3774l18325k23306
36064b39737M5751K03937J07915l43684q77485q02252L3171O96324L79885l29706
$$ plain form
36054 -1125881 -1462944 -1193185 -669741 -452519 -444724 -363173 -375006 -634673 -806173 -681420
36044 -681420 -680958 -1100631 -1467454 -1324038 -1037480 -1095498 -1221578 -987883 -676864 -654950
36034 -654950 -534549 40585 410951 -136379 -974999 -1005104 -458939 -405256 -780828 -544696
36024 -544696 270870 399201 -489997 -1128408 -730033 -211083 -531035 -1151371 -1133857 -689843
36014 -689843 -565993 -722591 -685984 -579850 -788845 -1073493 -958808 -629850 -577047 -668740
36004 -668740 -411838 100212 291306 9236 -367075 -611942 -818423 -980533 -986071 -944324
35994 -944324 -1009353 -986870 -622619 -172497 -166956 -663968 -1208850 -1490270 -1579349 -1531878 -1202859
35983 -1202859 -560911 93011 321751 -86758 -829001 -1132875 -446013 772540 1394909
$$ packed form
36054a125881l37063K69759N23444K17222P795Q1551j1833k59667j71500J24753
36044f81420M62m19673l66823J43416K86558n8018j26080K33695L11019K1914
36034f54950J20401N75134L70366n47330q38620l0105N46165N3683l75572K36132
36024e44696Q15566J28331q89198o38411L98375N18950l19952o20336J7514M44014
36014f89843J23850j56598L6607J06134k08995k84648J14685L28958N2803r1693
36004f68740K56902N12050J91094k82070l76311k44867k06481j62110n538M1747
35994i44324o5029K2483L64251M50122N541m97012n44882k81420q9079M7471L29019
35983a202859O41948O53922K28740m08509p42243l03874O86862J218553O22369
$$ plain form
35974 1394909 1017010 480700 608760 1026946 896506 287937 -59567 -45501 -302343 -1021020
35964 -1021020 -1584046 -1528100 -1143257 -915035 -968750 -1224715 -1544443 -1592668 -1113379 -464614
35954 -464614 -305796 -634313 -756780 -380830 -49574 -202834 -477089 -360300 26233 278255
35944 278255 370320 476954 532753 477866 611328 1172647 1806699 1952108 1612791 1296264
35934 1296264 1302303 1486035 1636901 1692174 1605935 1360150 1126893 1144059 1384546 1528105
35924 1528105 1295887 743253 258710 261162 739716 1123153 882617 249468 -66459 92190
35914 92190 130492 -281937 -624750 -363358 191064 396457 194996 -63513 -288216 -503717
35904 -503717 -448313 -40154 124088 -438242 -1119692 -987918 -304597 -184919 -784775 -1039925
$$ packed form
35974A394909l77899n36310J28060M18186j30440o08569l47504J4066k56842p18677
35964a021020n63026N5946L84843K28222n3715k55965l19728m8225M79289O48765
35954d64614J58818l28517j22467L75950L31256j53260k74255J16789L86533K52022
35944B78255R2065J06634N5799n4887J33462N61319O34052J45409l39317l16527
35934A296264O039J83732J50866N5273q6239k45785k33257J7166K40487J43559
35924A528105k32218n52634m84543K452M78554L83437k40536o33149l15927J58649
35914I2190L8302m12429l42813K61392N54422K05393k01461k58509k24703k15501
35904e03717N5404M08159J64242n62330o81450J31774O83321J19678n99856k55150
$$ plain form
35894 -1039925 -451319 66354 -346264 -1182264 -1415677 -893696 -213197 153394 -5564
35885 -5564 -753935 -1627783 -1747013 -967003 -335415 -713037 -1543366 -1772058 -1382385 -1087030
35875 -1087030 -1025774 -851646 -742582 -1160607 -1767615 -1714340 -975990 -335075 -57005 288372
35865 288372 636196 311625 -616846 -1103082 -724526 -372478 -723577 -1114143 -748815 -68145
35855 -68145 71654 -169995 -68702 325973 382745 76770 -60298 849 -228537 -740275
35845 -740275 -910843 -512001 -70570 -40335 -250940 -375273 -403397 -428990 -377654 -152698
35835 -152698 207426 581293 756690 466433 -256549 -890435 -966628 -672582 -518414 -577719
35825 -577719 -544005 -376047 -308087 -315593 -192407 -116442 -465482 -1024265 -1073260 -434102 213993
$$ packed form
35894a039925N88606N17673m12618q36000k33413N21981O80499L66591j58958
35885e564p48371q73848j19230P80010O31588l77622q30329k28692L89673K95355
35875a087030O1256J74128J09064m18025o07008N3275P38350O40915K78070L45377
35865B88372L47824l24571r28471m86236L78556L52048l51099l90566L65328O80670
35855f8145J39799k41649J01293L94675N6772l05975j37068O1147k29386n11738
35845g40275j70568L98842M41431L0235k10605j24333k8124k5593N1336K24956
35835a52698L60124L73867J75397k90257p22982o33886p6193K94046J54168n9305
35825e77719L3714J67958O7960p506J23186P5965l49040n58783m8995O39158O48095
$$ plain form
35814 213993 281331 -57456 -369387 -563768 -703138 -751461 -816159 -1145758 -1599695 -1631579
35804 -1631579 -1097126 -533478 -305008 -89833 321704 352670 -553526 -1892681 -2599769
35795 -2599769 -2343651 -1685796 -1167372 -888658 -853250 -1065140 -1271415 -1133418 -688718 -263979
35785 -263979 -12579 85680 -50719 -422147 -698313 -677341 -751654 -1268313 -1675991 -1173780
35775 -1173780 -108256 301052 -228167 -590888 -66421 537948 254889 -455433 -521287
35766 -521287 -35290 -2629 -574898 -786325 -180876 422451 222672 -404562 -654955 -525531
35756 -525531 -543745 -683110 -385065 418420 1047495 1008124 630334 495782 633458 651611
35746 651611 428523 253614 316655 411916 261453 -98850 -415956 -567403 -633910 -667281
$$ packed form
35814B13993O7338l38787l11931j94381j39370m8323o4698l29599m53937l1884
35804a631579N34453N63648K28470K15175M11537L0966r06196j339155p07088
35795b599769K56118O57855N18424K78714L5408k11890k06275J37997M44700M24739
35785b63979K51400R8259j36399l71428k76166K0972p4313n16659m07678N02211
35775a173780J065524M09308n29219l62721N24467O04369k83059p10322o5854
35766e21287M85997L2661n72269k11427O05449O03327j99779o27234k50393J29424
35756e25531j8214j39365K98045Q03485O29075l9371l77790j34552J37676J8153
35746F51611k23088j74909O3041R5261j50463l60303l17106j51447o6507l3371
$$ plain form
35736 -667281 -554465 -179411 333343 596338 240215 -691202 -1614686 -1834617 -1242472 -494936
35726 -494936 -307424 -639482 -836655 -557079 -188760 -199141 -450013 -513778 -412592 -544105
35716 -544105 -922856 -1020344 -525743 150674 401009 139717 -297744 -716110 -1138859 -1471976
35706 -1471976 -1506895 -1268290 -1032633 -959974 -976472 -1031206 -1154083 -1208088 -942994 -450611
35696 -450611 -231652 -553124 -987303 -893652 -217479 470521 650358 338330 -25701 35116
35686 35116 671167 1498452 1829303 1355574 547787 129382 215206 262663 -149327 -829633
35676 -829633 -1315035 -1377146 -1072104 -572945 -125025 46810 -44272 -174247 -244429 -384277
35666 -384277 -622644 -724537 -535534 -249306 -121139 -135990 -181525 -298697 -465516 -380432
$$ packed form
35736f67281J12816L75054N12754K62995l56123r31417r23484k19931N92145P47536
35726d94936J87512l32058j97173K79576L68319j0381k50872o3765J01186j31513
35716e44105l78751r7488M94601O76417K50335k61292m37461m18366m22749l33117
35706a471976l4919K38605K35657P2659j6498n4734j22877n4005K65094M92383
35696d50611K18959l21472m34179R3651O76173O88000J79837l12028l64031O0817
35686C5116O36051Q27285L30851m73729q07787m18405Q5824M7457m11990o80306
35676h29633m85402o2111L05042M99159M47920J71835r1082j29975p0182j39848
35666c84277k38367j01893J89003K86228J28167j4851m5535j17172j66819Q5084
$$ plain form
35656 -380432 136167 692588 738537 348037 94450 140080 8210 -569537 -1124617 -1128295
35646 -1128295 -780308 -649141 -778387 -682399 -177517 278711 210513 -259089 -613232 -566459
35636 -566459 -300120 -165872 -298740 -519944 -570193 -417066 -279596 -322839 -445240 -483230
35626 -483230 -504167 -690397 -999629 -1190094 -1177293 -1101955 -1004677 -724624 -239961 167292
35616 167292 269124 178332 74962 -104678 -420445 -588905 -278108 366083 893449 1211110
35606 1211110 1627372 2173681 2369922 1914968 1217270 868568 845714 655993 157746 -196006
35596 -196006 23250 690729 1328087 1594859 1473478 1164351 925259 873890 847730 594226
35586 594226 184053 49632 447783 1045521 1283438 1066373 813774 835821 986219 1049561
$$ packed form
35656c80432N16599N56421M5949l90500k53587M5630j31870n77747n55080l678
35646a128295L47987J31167j29246R5988N04882M56228o8198m69602l54143M6773
35636e66459K66339J34248j32868k21204n0249J53127J37470m3243j22401l7990
35626d83230k0937j86230l09232j90465J2801P5338R7278K80053M84663M07253
35616A67292J01832r0792j03370j79640l15767j68460L10797O44191N27366L17661
35606A211110M16262N46309J96241m54954o97698l48702k2854j89721m98247l53752
35596a96006K19256O67479O37358K66772j21381l09127k39092n1369k6160k53504
35586E94226m10173j34421L98151N97738K37917k17065k52599K2047J50398O3342
$$ plain form
35576 1049561 1140808 1423227 1644843 1380096 724755 335101 612772 1179333 1412422 1236365
35566 1236365 1028722 918803 646192 138524 -232636 -191566 -11288 -104263 -370715 -336276
35556 -336276 122147 573710 642743 486606 454333 516440 360360 -41647 -327459 -282250
35546 -282250 -160955 -284567 -570514 -737839 -782349 -890057 -999426 -887851 -673762 -726217
35536 -726217 -964912 -809284 -115406 379639 27721 -761201 -1128660 -1005656 -1002630 -1252810
35526 -1252810 -1219478 -712474 -265004 -237581 -275953 -38481 174415 -11556 -374808 -515314
35516 -515314 -514480 -644404 -778658 -648883 -391874 -269534 -100354 405090 923711 824185
35506 824185 159715 -309544 -179516 124208 129921 18379 199779 593275 743787 479976
$$ packed form
35576A049561R1247K82419K21616k64747o55341l89654K77671N66561K33089j76057
35566A236365k07643j09919k72611n07668l71160M1070J80278r2975k66452L4439
35556c36276M58423M51563O9033j56137l2273O2107j56080m02007k85812M5209
35546b82250J21295j23612k85947j67325m4510j07708j09369J11575K14089n2455
35536g26217k38695J55628O93878M95045l51918p88922l67459J23004L026k50180
35526a252810L3332N07004M47470K7423l8372K37472K12896j85971l63252j40506
35516e15314Q34j29924j34254J29775K57009J22340J69180N05444N18621r9526
35506H24185o64470m69259J30028L03724N713j11542J81400L93496J50512k63811
$$ plain form
35496 479976 103451 -56761 -32446 -66411 -182034 -89051 357727 749471 508234 -286430
35486 -286430 -864465 -748424 -343137 -227327 -311860 -209194 -48069 -234609 -625954 -691033
35476 -691033 -421776 -332588 -529753 -560893 -327781 -343140 -780891 -1035966 -675219 -155545
35466 -155545 -57089 -193627 -124910 -61392 -501546 -1269613 -1687631 -1579959 -1386599 -1300077
35456 -1300077 -999654 -371628 144603 188195 -53134 -301795 -664932 -1245868 -1631194 -1315989
35446 -1315989 -552737 -241563 -805168 -1550140 -1470493 -515396 318323 192985 -612869 -1170919
35436 -1170919 -1084510 -825691 -923226 -1236400 -1276709 -992659 -849500 -1125382 -1467029 -1357913
35426 -1357913 -855116 -547057 -747492 -1043465 -873041 -332876 -29440 -181511 -322505
$$ packed form
35496D79976l76525j60212K4315l3965j15623R2983M46778L91744k41237p94664
35486b86430n78035J16041M05287J15810q4533J02666J61125j86540l91345o5079
35476f91033K69257Q9188j97165l1140K33112j5359m37751k55075L60747N19674
35466a55545R8456j36538O8717O3518m40154p68067m18018J07672J93360Q6522
35456a300077L00423O28026N16231M3592k41329k48661l63137n80936l85326L15205
35446a315989P63252L11174n63605p44972P9647R55097Q33719j25338q05854n58050
35436a170919Q6409K58819r7535l13174m0309K84050J43159k75882l41647J09116
35426a357913N02797L08059k00435k95973J70424N40165L03436j52071j40994
$$ plain form
35417 -322505 -35922 428799 566296 331768 85754 7374 -89979 -442299 -1068184 -1696992
35407 -1696992 -1827490 -1163304 -212771 -14674 -848781 -1678816 -1489189 -749669 -718175 -1573145
35397 -1573145 -2251427 -2083698 -1497615 -924933 -147749 804693 1158895 525645 -279480
35388 -279480 -337439 97697 237490 92716 218420 519164 335975 -385931 -926628 -829066
35378 -829066 -360740 102658 447473 503586 67243 -572784 -758237 -348266 58099 19943
35368 19943 -169084 -114075 -8064 -226457 -595836 -600777 -168957 232031 279081 171990
35358 171990 214839 331576 232055 -93355 -330484 -318856 -319893 -628579 -1074484 -1186837
35348 -1186837 -833454 -411405 -332490 -579143 -893512 -1159025 -1402197 -1597182 -1673329 -1609487
$$ packed form
35417c22505K86583M64721J37497k34528k46014p8380r7353l52320o25885o28808
35407a696992j30498O64186R50533J98097q34107q30035J89627P39520L1494q54970
35397a573145o78282J67729N86083N72682P77184R52442L54202o33250q05125
35388b79480n7959M35136J39793j44774J25704L00744j83189p21906n40697R7562
35378h29066M68326M63398L44815N6113m36343o40027j85453M09971M06365l8156
35368A9943j89027N5009J06011k18393l69379m941M31820M00988M7050j07091
35358A71990M2849J16737r9521l25410k37129J1628j037l08686m45905j12353
35348a186837L53383M22049P8915k46653l14369k65513k43172j94985p6147O3842
$$ plain form
35338 -1609487 -1387584 -987456 -541638 -318021 -402311 -563871 -576740 -494538 -464041 -466478
35328 -466478 -418454 -354814 -352059 -431821 -637142 -973751 -1194889 -983262 -497697 -336117
35318 -336117 -699335 -1007026 -711969 -118776 68555 -277552 -684453 -825714 -793995 -758791
35308 -758791 -809527 -1037786 -1349717 -1303325 -576504 462546 1065444 947396 462188 13672
35298 13672 -314974 -578514 -776119 -853712 -690515 -216960 258771 160317 -566791 -1132546
35288 -1132546 -871936 -207691 -28111 -393043 -614138 -449277 -356164 -537999 -588618 -286381
35278 -286381 -9822 -100437 -425479 -799310 -1239016 -1586119 -1506199 -1130413 -1067143 -1470178
35268 -1470178 -1741700 -1525468 -1299595 -1463247 -1513004 -874269 -57051 -82839 -951405 -1558254
$$ packed form
35338a609487K21903M00128M45818K23617q4290j61560j2869Q2202L0497k437
35328d66478M8024O3640K755p9762k05321l36609k21138K11627M85565J61580
35318c36117l63218l07691K95057N93193J87331l46107m06901j41261L1719L5204
35308g58791n0736k28259l11931M6392P26821J039050O02898j18048m85208m48516
35298A3672l28646k63540j97605p7593J63197M73555M75731r8454p27108n65755
35288a132546K60610O64245J79580l64932k21095J64861R3113j81835n0619L02237
35278b86381K76559r0615l25042l73831m39706l47103P9920L75786O3270m03035
35268a470178k71522K16232K25873j63652m9757O38735Q17218k5788q68566o06849
$$ plain form
35258 -1558254 -1219784 -522680 -353631 -657419 -661653 -85634 418027 140363 -728232 -1341411
35248 -1341411 -1268643 -925565 -866318 -1083819 -1288437 -1465055 -1665598 -1553040 -808068 109079
35238 109079 291423 -428412 -1219815 -1328704 -865865 -361311 -86636 -52307 -172237 -177588
35228 -177588 172815 584927 438862 -266457 -740874 -476319 78675 274947 101955 -161790
35218 -161790 -520074 -914055 -888133 -312487 32487 -589620 -1647950 -1923261 -1137603 -165667
35208 -165667 307993 455593 518716 237405 -530141 -1253975 -1322961 -867451 -574731 -844673
35198 -844673 -1419437 -1761066 -1596467 -1114682 -710191 -538850 -398925 -110205 175165 241689
35188 241689 199143 276888 354204 93947 -478967 -933295 -1015947 -909799 -830062 -744770 -635854
$$ packed form
35258a558254L38470O97104J69049l03788m234N76019N03661k77664q68595o13179
35248a341411P2768L43078N9247k17501k04618j76618k00543J12558P44972R17147
35238A09079J82344p19835p91403j08889M62839N04554K74675L4329j19930n351
35228a77588L50403M12112j46065p05319m74417K64555N54994J96272j72992k63745
35218a61790l58284l93981K5922N75646L44974o22107j058330k75311P85658R71936
35208a65667M73660J47600O3123k81311p67546p23834o8986M55510K92720k69942
35198h44673n74764l41629J64599M81785M04491J71341J39925K88720K85370O6524
35188B41689m2546P7745P7316k60257n72914m54328q2652J06148P9737Q5292J08916
$$ plain form
35177 -635854 -658955 -814893 -788787 -414945 -54089 -161176 -626564 -909568 -779824 -569591
35167 -569591 -624986 -816217 -762687 -343785 208376 602439 683356 419511 -90417 -608063
35157 -608063 -928281 -1058820 -1088891 -977327 -734313 -704918 -1204885 -1821137 -1660827 -594441
35147 -594441 322576 181139 -528353 -698091 -251358 -93154 -558195 -934690 -704056 -295153
35137 -295153 -215536 -270111 -171819 -209770 -662608 -1100129 -952830 -389240 -14640 -38431
35127 -38431 -304428 -771741 -1339206 -1540410 -1110562 -593719 -684611 -1192190 -1380263 -1119593
35117 -1119593 -881668 -732771 -270528 404067 611268 215236 -71215 136670 250415
35108 250415 -252246 -883220 -908248 -504460 -406197 -727867 -882021 -542956 -38021 233989
$$ packed form
35177f35854k3101j55938K6106L73842L60856j07087m65388k83004J29744K10233
35167e69591n5395j91231N3530M18902N52161L94063Q0917k63845n09928n17646
35157f08063l20218j30539l0071J11564K43014K9395m99967o16252J60310J066386
35147e94441R17017j41437p09492j69738M46733J58204m65041l76495K30634M08903
35137b95153P9617n4575R8292l7951m52838m37521J47299N63590L74600k3791
35127c8431k65997m67313n67465k01204M29848N16843r0892n07579j88073K60670
35117a119593K37925J48897M62243O74595K07201l96032k86451K07885J13745
35108B50415n02661o30974k5028M03788R8263l21670j54154L39065N04935K72010
$$ plain form
35098 233989 236786 55986 -343020 -943859 -1528493 -1848162 -1833667 -1620246 -1463477 -1548857
35088 -1548857 -1734810 -1613514 -1049267 -517298 -585514 -1132147 -1454631 -1166342 -586677 -161360
35078 -161360 54352 124216 -87639 -555547 -776177 -367825 214454 184550 -408456 -696231
35068 -696231 -277997 231434 249984 100530 270508 420753 -47472 -808323 -935010 -320471
35058 -320471 140142 -95116 -533274 -602669 -511874 -710913 -1121332 -1410833 -1549069 -1592814
35048 -1592814 -1344488 -752548 -307014 -489860 -1061580 -1373148 -1190627 -785708 -424796
35039 -424796 -209198 -237826 -499737 -747095 -822866 -911651 -1134898 -1197479 -856038 -431281
35029 -431281 -368489 -580234 -748165 -957343 -1394649 -1690223 -1301610 -414248 256485 447399
$$ packed form
35098B33989K797j80800l99006o00839n84634l19669J4495K13421J56769q5380
35088a548857j85953J21296N64247N31969o8216n46633l22484K88289N79665M25317
35078a61360K15712O9864k11855m67908k20630M08352N82279k9904n93006k87775
35068f96231M18234N09431J8550j49454J69978J50245m68225p60851j26687O14539
35058c20471M60613k35258m38158o9395R0795j99039m10419k89501j38236m3745
35048a592814K48326N91940M45534j82846n71720l11568J82521M04919L60912
35039d24796K15598k8628k61911k47358p5771q8785k23247o2581L41441M24757
35029d31281O2792k11745j67931k09178m37306k95574L88613Q87362O70733J90914
$$ plain form
35019 447399 405119 105343 -703549 -1676008 -2030002 -1709140 -1492536 -1693362 -1671575 -1047222
35009 -1047222 -478820 -604617 -973660 -791094 -167042 153469 -97300 -604961 -1152838
35000 -1152838 -1661200 -1782497 -1224625 -389996 6623 -65363 -2020 373535 517312 122650
34990 122650 -299507 -194429 164292 71692 -589813 -1206824 -1256634 -885677 -586886 -570664
34980 -570664 -629911 -509969 -222360 29559 104925 11728 -193774 -466079 -727183 -879647
34970 -879647 -904044 -864489 -789307 -633824 -404084 -234845 -275375 -522876 -793630 -854262
34960 -854262 -633498 -360873 -411219 -883129 -1401517 -1523225 -1305382 -1237126 -1565785 -1939081
34950 -1939081 -1868086 -1375178 -968019 -1002449 -1246417 -1163817 -583338 40713 143790 -238948
$$ packed form
35019D47399m2280k99776q08892r72459l53994L20862K16604k00826K1787O24353
35009a047222N68402j25797l69043J82566O24052L20511k50769n07661n47877
35000a152838n08362j21297N57872Q34629L96619p1986O3343L75555J43777l94662
34990A22650m22157J05078L58721r2600o61505o17011m9810L70957K98791J6222
34980e70664n9247J19942K87609K51919P5366r3197k05502k72305k61104j52464
34970h79647k4397L9555P5182J55483K29740J69239m0530k47501k70754o0632
34960h54262K20764K72625n0346m71910n18388j21708K17843O8256l28659l73296
34950a939081P0995M92908M07159l4430k43968Q2600N80479O24051J03077l82738
$$ plain form
34940 -238948 -515519 -362013 -204922 -604523 -1376273 -1754386 -1400057 -809073 -581644 -659386
34930 -659386 -564572 -179294 55712 -269168 -966174 -1406836 -1204267 -617266 -198166 -138226
34920 -138226 -159842 -28232 131308 128299 6227 -143569 -353206 -508039 -256819 420188
34910 420188 878472 573715 -58090 -93348 592418 1164341 1008384 475415 265410 545981
34900 545981 911686 900839 411876 -157060 -206518 336125 746211 406010 -230111 -227937
34890 -227937 416358 803669 579538 366271 500940 388811 -326899 -883995 -487385 424776
34880 424776 876826 796863 836453 1093236 983680 312038 -376517 -592477 -406232 -74065
34870 -74065 287980 559915 611940 541766 552706 562477 293717 -221392 -588766 -581662 -439996
$$ packed form
34940b38948k76571J53506J57091l99601p71750l78113L54329N90984K27429p7742
34930f59386R4814L85278K35006l24880o97006m40662K02569N87001M19100N9940
34920a38226k1616J31610J59540l009j22072j49796k09637j54833K51220O77007
34910D20188M58284l04757o31805l5258O85766N71923j55957n32969k10005K80571
34900E45981L65705j0847m88963n68936m9458N42643M10086l40201o36121K174
34890b27937O44295L87311k24131k13267J34669j12129p15710n57096L96610R12161
34880D24776M52050p9963L9590K56783j09556o71642o88555k15960J86245L32167
34870g4065L62045K71935N2025p0174J0940R771k68760n15109l67374P104J41666
$$ plain form
34859 -439996 -551314 -1000670 -1466600 -1487290 -922102 -212342 14863 -310378 -629528 -535337
34849 -535337 -250184 -151428 -263490 -485137 -838564 -1144311 -958921 -273113 244625 198064
34839 198064 90661 399590 649528 231525 -413141 -438398 -12866 28057 -308736 -226262
34829 -226262 371711 686274 435844 246245 376265 262494 -249261 -394169 191299 699703
34819 699703 423009 -144079 -261974 -152793 -354911 -613760 -425191 -125227 -381538 -965412
34809 -965412 -1068229 -635746 -394176 -618812 -824577 -755541 -805592 -1212360 -1541872 -1316296
34799 -1316296 -669684 -75412 237030 339304 310102 107919 -303540 -745143 -793351 -198813
34789 -198813 601470 774597 116980 -638621 -859466 -832397 -1043350 -1208937 -819082 -216800
$$ packed form
34859d39996j11318m49356m65930k0690N65188P09760K27205l25241l19150R4191
34849e35337K85153R8756j12062k21647l53427l05747J85390O85808N17738m6561
34839A98064j07403L08929K49938m18003o44666k5257M25532M0923l36793Q2474
34829b26262N97973L14563k50430j89599J30020j13771n11755j44908N85468N08404
34819F99703k76694n67088j17895J09181k02118k58849J88569K99964k56311n83874
34809i65412j02817M32483K41570k24636k05765O9036n0051m06768l29512K25576
34799a316296O46612N94272L12442J02274k9202k02183m11459m41603m8208N94538
34789a98813Q00283J73127o57617p55601k20845K7069k10953j65587L89855O02282
$$ plain form
34779 -216800 -146573 -441874 -258555 382619 463608 -331221 -925998 -457089 394842 466335
34769 466335 -228065 -786205 -854447 -827319 -889555 -793622 -565566 -625910 -1066310 -1418470
34759 -1418470 -1315371 -914710 -541466 -342273 -405762 -777764 -1171089 -1059797 -328646 436698
34749 436698 544220 -96832 -1009016 -1668564 -1814500 -1444884 -775650 -166670 85305 -71945
34739 -71945 -461809 -811723 -903689 -733989 -530352 -479374 -464743 -252560 108841 333447
34729 333447 340795 344337 437092 430022 229176 12319 -166110 -558906 -1208702 -1616224 -1358083
34718 -1358083 -756433 -438398 -440735 -316577 4226 117294 -89296 -252484 -258687 -461824
34708 -461824 -901662 -1000883 -507997 -115099 -488271 -1172019 -1241410 -720106 -459700 -731363
$$ packed form
34779b16800P0227k95301J83319O41174Q0989p94829n94777M68909Q51931P1493
34769D66335o94400n58140o8242K7128o2236R5933K28056o0344m40400l52160
34759a418470J03099M00661L73244J99193o3489l72002l93325J11292P31151P65344
34749D36698J07522o41052r12184o59548j45936L69616O69234O08980K51975j57250
34739g1945l89864l49914r1966J69700K03637N0978J4631K12183L61401K24606
34729C33447P348L542R2755p070k00846k16857j78429l92796o49796m07522K58141
34718a358083O01650L18035k337J24158L20803J13068k06590j63188o203k03137
34708d61824m39838r9221M92886L92898l73172o83748o9391N21304K60406k71663
$$ plain form
34698 -731363 -904344 -668324 -622849 -1208007 -1831258 -1703036 -1003529 -517627 -466839 -439960
34688 -439960 -293188 -349026 -673035 -853422 -693904 -546871 -683814 -836575 -728193 -641140
34678 -641140 -980611 -1528033 -1642193 -1124583 -431975 -16474 126950 152170 -13475 -493233
34668 -493233 -1122716 -1520531 -1424421 -871222 -183083 155718 -159708 -854709 -1211458 -842074
34658 -842074 -171687 122054 10398 79576 622074 1185801 1188825 660135 122575 -66567
34648 -66567 -14439 -36937 -307902 -716087 -933561 -677225 -19903 586348 663511 73669
34638 73669 -905857 -1729257 -1880980 -1325996 -694687 -683439 -1184437 -1411885 -1039999 -677168
34628 -677168 -849051 -1092980 -734749 -143580 -302049 -1230830 -1794674 -1281838 -349785 -17248
$$ packed form
34698g31363j72981K36020M5475n85158o23251J28222O99507M85902N0788K6879
34688d39960J46772n5838l24009j80387J59518J47033j36943j52761J08382Q7053
34678f41140l39471n47422j14160N17610O92608M15501J43424K5220j65645m79758
34668d93233o29483l97815R6110N53199O88139L38801l15426o95001l56749L69384
34658h42074O70387K93741j11656O9178N42498N63727L024n28690n37560j89142
34648f6567N2128k2498k70965m08185k17474K56336O57322O06251P7163n89842
34638G3669r79526q23400j51723N54984O31309J1248n00998k27448L71886L62831
34628f77168j71883k43929L58231N91169j58469r28781n63844N12836R32053L32537
$$ plain form
34618 -17248 -397351 -912597 -1212629 -1317010 -1241725 -1054176 -1057619 -1429349 -1847571 -1876246
34608 -1876246 -1538436 -1170323 -962999 -1010427 -1480884 -2260375 -2730467 -2471976 -1944488 -1842139
34598 -1842139 -2000101 -1700621 -957834 -618707 -1061484 -1650017 -1803050 -1830515 -2213175 -2685863
34588 -2685863 -2669953 -2214665 -1882632 -1919876 -2080423 -2142955 -2117682 -1990991 -1676511 -1241647
34578 -1241647 -894829 -736141 -709639 -744560 -777495 -735900 -647463 -612760 -535231 -138054 522802
34567 522802 860165 432094 -403983 -923268 -958468 -945548 -1144613 -1311973 -1181560 -830391
34557 -830391 -463088 -198985 -167905 -455239 -824280 -842056 -452188 -104736 -117164 -217955
34547 -217955 -3904 403063 522486 228140 -79228 -61507 91230 -38088 -480218 -802580
$$ packed form
34618a7248l80103n15246l00032j04381P5285J87549l443l71730m18222k8675
34608a876246L37810L68113K07324m7428m70457p79491m70092K58491N27488J02349
34598a842139j57962K99480P42787L39127m42777n88533j53033k7465l82660m72688
34588b685863J5910M55288L32033l7244j60547o2532K5273J26691L14480M34864
34578a241647L46818J58688K6502l4921l2935M1595Q8437L4703P7529L97177O60856
34567E22802L37363m28071q36077n19285l5200J2920j99065j67360J30413L51169
34557h30391L67303K64103L1080k87334l69041j7776L89868L47452j2428j00791
34547b17955K14051M06967J19423k94346l07368J7721J52737j29318m42130l22362
$$ plain form
34537 -802580 -667578 -270374 -58140 -122714 -138569 67235 191993 -94899 -612228 -881068
34527 -881068 -781933 -693478 -965767 -1485590 -1807592 -1583322 -892329 -272734 -309653 -998222
34517 -998222 -1644767 -1653709 -1268993 -1187804 -1553913 -1803339 -1528689 -987305 -566699 -212684
34507 -212684 257893 591899 310361 -552619 -1267267 -1117126 -205436 568538 430766 -386715
34497 -386715 -876936 -464993 289680 462779 -49411 -582669 -758756 -851326 -1065815 -1117451
34487 -1117451 -790022 -387451 -285149 -424180 -559513 -641178 -640254 -374711 124766 411032
34477 411032 185465 -206579 -247309 23082 157552 -7240 -220556 -249927 -92705 120683
34467 120683 136629 -325334 -1157124 -1744054 -1639562 -1184029 -1058422 -1386877 -1706800 -1683405
$$ packed form
34537h02580J35002L97204K12234o4574j5855K05804J24758k86892n17329k68840
34527h81068R9135Q8455k72289n19823l22002K24270O90993O19595l6919o88569
34517i98222o46545q942L84716Q1189l66109k49426K74650N41384M20606L54015
34507b12684M70577L34006k81538q62980p14648J50141R11690P73974j37772q17481
34497c86715m90221M11943P54673J73099n12190n33258j76087r2570k14489n1636
34487a117451L27429M02571J02302j39031j35333q1665R24K65543M99477K86266
34477D11032k25567l92044m0730K70391J34470j64792k13316k9371J57222K13388
34467A20683J5946m61963q31790n86930J04492M55533J25607l28455l19923K3395
$$ plain form
34457 -1683405 -1383641 -938825 -446805 -204242 -534230 -1280448 -1869270 -1973700 -1778313
34448 -1778313 -1537918 -1267573 -993895 -935065 -1193596 -1497989 -1467807 -1031272 -458340 -47240
34438 -47240 167104 421509 899703 1377010 1367784 756138 59784 -175234 -54276 -104514
34428 -104514 -510152 -935756 -1066391 -987929 -981163 -1150783 -1300121 -1104438 -507465 32675
34418 32675 -15390 -467087 -517869 98221 556231 32775 -1106151 -1852653 -1928234 -1848152
34408 -1848152 -1868784 -1740304 -1437399 -1249849 -1054646 -354893 722061 1258486 752928
34399 752928 -146181 -524303 -309666 -103947 -320942 -870956 -1399737 -1551556 -1234787 -786412
$$ packed form
34457a683405K99764M44816M92020K42563l29988p46218n88822j04430J95387
34448a778313K40395K70345K73678N8830k58531l04393L0182M36535N72932M11100
34438d7240K14344K54405M78194M77307r226o11646o96354k35018J20958n0238
34428a04514m05638m25604j30635P8462O766j69620j49338J95683N96973N40140
34418C2675m8065m51697n0782O16090M58010n23456j138926p46502p5581Q0082
34408a848152k0632J28480L02905J87550J95203O99753J076954N36425n05558
34399G52928q99109l78122K14637K05719k16995n50014n28781j51819L16769M48375
$$ [...]
##END NTUPLES=NMR SPECTRUM
##END=
