##TITLE=31Pdec_LR-758-R3-CR3
 CCl4, 24 sc
 7.6.2023
##JCAMPDX= 6.0         $$ Bruker NMR JCAMP-DX V2.0
##DATA TYPE= NMR SPECTRUM
##DATA CLASS= NTUPLES
##ORIGIN= UXNMR, Bruker Analytische Messtechnik GmbH
##OWNER= root
$$ XWIN-NMR		Version 3.5
$$ Wed Jun  7 14:38:01 2023 Russian Standard Time (UT+4h)  she@DPX200
##.OBSERVE FREQUENCY= 81.013821
##.OBSERVE NUCLEUS= ^31P
##.ACQUISITION MODE= SIMULTANEOUS
##.ACQUISITION SCHEME= undefined
##.AVERAGES= 24
##.DIGITISER RES= 16
##SPECTROMETER/DATA SYSTEM= spect
##.PULSE SEQUENCE= zgpg30
##.SOLVENT NAME= CDCl3
##.SHIFT REFERENCE= (INTERNAL, CDCl3, 0, 248.564)
##AUDIT TRAIL= $$ (NUMBER, WHEN, WHO, WHERE, WHAT)
$$ ##TITLE= Audit trail, XWIN-NMR		Version 3.5
$$ ##JCAMPDX= 5.01
$$ ##ORIGIN= Bruker BioSpin GmbH
$$ ##OWNER= she
$$ F:/spectra/data/she/nmr/P31/1/pdata/1/auditp.txt
$$ ##AUDIT TRAIL=  $$ (NUMBER, WHEN, WHO, WHERE, WHAT)
(   1,<2023-06-07 14:37:16.90 +0400>,<she>,<DPX200>,
      <created by zg, POWCHK disabled, PULCHK disabled
       configuration hash MD5:
       00 E9 B6 7A A2 85 ED C7 34 08 36 98 17 FE 4E 26
       data hash MD5: 32K
       F6 18 EB D0 86 93 61 A0 BD 8A 67 65 7B D3 3C 77>)
(   2,<2023-06-07 14:37:19.03 +0400>,<she>,<DPX200>,
      <Start of raw data processing
       efp BC_mod = 2 LB = 1 FT_mod = 6 PKNL = 1 PHC0 = -10627.24 PHC1 = -22.31514 SI = 64K 
       data hash MD5: 64K
       B4 09 3F 84 49 EF 0C 1F 51 22 2B B5 32 25 AC 59>)
(   3,<2023-06-07 14:37:30.76 +0400>,<she>,<DPX200>,
      <pk PHC0 = 2.242531 PHC1 = 0 
       data hash MD5: 64K
       90 27 71 65 48 29 1D 37 90 01 20 21 AF B3 1B 33>)
(   4,<2023-06-07 14:37:37.62 +0400>,<she>,<DPX200>,
      <abs ABSG = 5 
       data hash MD5: 64K
       AE 31 BE 50 05 AF 73 B9 3F E2 46 31 32 7C 0C 5D>)
$$ ##END=
$$ 
$$ hash MD5
$$ FD 8B C3 F7 BB DD BB 68 49 9C 74 5C 65 17 CE 68
##$RELAX= 
##$RELAX= 
##$RELAX= 
##$RELAX= 
##$RELAX= 
##$RELAX= 
##$RELAX= 
##$RELAX= 
##$RELAX= 
$$ Bruker specific parameters
$$ --------------------------
##$DU= <F:/spectra>
##$EXPNO= 1
##$NAME= <P31>
##$PROCNO= 1
##$TYPE= <nmr>
##$USER= <she>
##$AMP= (0..31)
100 100 100 100 100 100 100 100 100 100 100 100 100 100 100 100 100 100 
100 100 100 100 100 100 100 100 100 100 100 100 100 100 
##$AQSEQ= 0
##$AQ_mod= 1
##$AUNM= <au_zg>
##$AUTOPOS= <>
##$BF1= 81.014009
##$BF2= 200.13
##$BF3= 200.13
##$BF4= 200.13
##$BF5= 200.13
##$BF6= 200.13
##$BF7= 200.13
##$BF8= 200.13
##$BYTORDA= 1
##$CFDGTYP= 0
##$CFRGTYP= 5
##$CHEMSTR= <none>
##$CNST= (0..31)
1 1 145 1 1 1 1 1 1 1 1 1 1 1 1 1 1 1 1 1 1 1 1 1 1 1 1 1 1 1 1 1 
##$CPDPRG= <waltz16>
##$CPDPRG1= <>
##$CPDPRG2= <waltz16>
##$CPDPRG3= <>
##$CPDPRG4= <mlev>
##$CPDPRG5= <mlev>
##$CPDPRG6= <mlev>
##$CPDPRG7= <mlev>
##$CPDPRG8= <mlev>
##$CPDPRGB= <>
##$CPDPRGT= <>
##$D= (0..31)
0 1 0 0 0 0 0 0 0 0 0 0.03 2e-05 3e-06 0 0 0 0 0 0 0 0 0 0 0 0 0 0 0 0 
0 0 
##$DATE= 1686134236
##$DBL= (0..7)
120 120 120 11 120 120 24 19 
##$DBP= (0..7)
150 150 150 150 150 150 150 150 
##$DBP07= 0
##$DBPNAM0= <>
##$DBPNAM1= <>
$$ [...]
##$SUBNAM3= <"">
##$SUBNAM4= <"">
##$SUBNAM5= <"">
##$SUBNAM6= <"">
##$SUBNAM7= <"">
##$SUBNAM8= <"">
##$SUBNAM9= <"">
##$SW= 501.771253377433
##$SWIBOX= (0..15)
0 1 3 0 0 0 0 0 0 0 0 0 0 0 0 0 
##$SW_h= 40650.406504065
##$TD= 32768
##$TD0= 1
##$TE= 0
##$TE2= 300
##$TE3= 300
##$TEG= 300
##$TL= (0..7)
0 120 53 12 22 120 120 120 
##$TP= (0..7)
150 150 150 150 150 150 150 150 
##$TP07= 0
##$TPNAME0= <>
##$TPNAME1= <>
##$TPNAME2= <>
##$TPNAME3= <>
##$TPNAME4= <>
##$TPNAME5= <>
##$TPNAME6= <>
##$TPNAME7= <>
##$TPOAL= (0..7)
0.5 0.5 0.5 0.5 0.5 0.5 0.5 0.5 
##$TPOFFS= (0..7)
0 0 0 0 0 0 0 0 
##$TUNHIN= 0
##$TUNHOUT= 0
##$TUNXOUT= 0
##$USERA1= <user>
##$USERA2= <user>
##$USERA3= <user>
##$USERA4= <user>
##$USERA5= <user>
##$V9= 5
##$VALIST= <valist>
##$VCLIST= <CCCCCCCCCCCCCCC>
##$VD= 0
##$VDLIST= <DDDDDDDDDDDDDDD>
##$VPLIST= <PPPPPPPPPPPPPPP>
##$VTLIST= <TTTTTTTTTTTTTTT>
##$WBST= 1024
##$WBSW= 4
##$XGAIN= (0..3)
0 0 0 0 
##$XL= 0
##$YL= 0
##$YMAX_a= 8180
##$YMIN_a= -7924
##$ZGOPTNS= <>
##$ZL1= 120
##$ZL2= 120
##$ZL3= 120
##$ZL4= 120
##$ABSF1= 248.5645
##$ABSF2= -253.2056
##$ABSG= 5
##$ABSL= 3
##$ALPHA= 0
##$AQORDER= 0
##$ASSFAC= 0
##$ASSFACI= 0
##$ASSFACX= 0
##$ASSWID= 0
##$AUNMP= <proc_1d>
##$AZFE= 0.1
##$AZFW= 0.5
##$BCFW= 0
##$BC_mod= 2
##$BYTORDP= 0
##$COROFFS= 0
##$CY= -3
##$DATMOD= 1
##$DC= 0
##$DFILT= <>
##$DTYPP= 0
##$F1P= 0
##$F2P= 0
##$FCOR= 1
##$FTSIZE= 65536
##$FT_mod= 6
##$GAMMA= 0
##$GB= 0
##$INTBC= 1
##$INTSCL= 6.047779e-11
##$ISEN= 30
##$LB= 1
##$LEV0= 0
##$LPBIN= 0
##$MAXI= 10000
##$MC2= 0
##$MEAN= 0
##$ME_mod= 0
##$MI= 50
##$NCOEF= 0
##$NC_proc= -6
##$NLEV= 6
##$NOISF1= 182.463
##$NOISF2= 159.3651
##$NSP= 0
##$NTH_PI= 0
##$NZP= 0
##$OFFSET= 248.5645
##$PC= 4
##$PHC0= -10625
##$PHC1= -22.31514
##$PH_mod= 1
##$PKNL= yes
##$PPARMOD= 0
##$PSCAL= 0
##$PSIGN= 0
##$REVERSE= no
##$SF= 81.0140089999694
##$SI= 65536
##$SIGF1= 159.3651
##$SIGF2= -187.1042
##$SINO= 113.3802
##$SIOLD= 16384
##$SREGLST= <1H.CDCl3>
##$SSB= 0
##$STSI= 65536
##$STSR= 0
##$SW_p= 40650.406504065
##$SYMM= 0
##$S_DEV= 0
##$TDeff= 32768
##$TDoff= 0
##$TI= <>
##$TILT= no
##$TM1= 0
##$TM2= 0
##$TOPLEV= 0
##$USERP1= <user>
##$USERP2= <user>
##$USERP3= <user>
##$USERP4= <user>
##$USERP5= <user>
##$WDW= 1
##$XDIM= 65536
##$YMAX_p= 234270435
##$YMIN_p= -364798836
$$ End of Bruker specific parameters
$$ ---------------------------------
##NTUPLES= NMR SPECTRUM
##VAR_NAME=  FREQUENCY,     SPECTRUM/REAL,   SPECTRUM/IMAG
##SYMBOL=    X,             R,               I
##VAR_TYPE=  INDEPENDENT,   DEPENDENT,       DEPENDENT
##VAR_FORM=  AFFN,          ASDF,            ASDF
##VAR_DIM=   65536,         65536,           65536
##UNITS=     HZ,            ARBITRARY UNITS, ARBITRARY UNITS
##FACTOR=    0.620285442955139, 1,           1
##FIRST=     20137.2065510682, 0,            0
##LAST=      -20513.1999529968, 0,           0
##MIN=       -20513.1999529968, -364798836,  0
##MAX=       20137.2065510682, 234270435,    0
$$ Real data points
##PAGE= N=1
##DATA TABLE= (X++(R..R)), XYDATA
$$ [...]
40143E60876K59924R95030N07057j88210M7736M95779O0718o81180o54396l33790
40133A069544p06645j137838m02370P95371O28607p77716j378566m00377P26142
40124a583848R55650R41492J122809O41412p92875j784037j246485q2227L33376
40115a494733R6274M9589K47753L17257L93442O08112N09706l6536k82138J34339
40105E43065L59032k11003p02995k17655N23305L83190k26881j65339L41830J30561
40095G57110p42834r87386j92262N91536N76766K06501O4606l7071m08757p53398
40085i25189n73339J55158R53630J202826O15130l15813o17878l2572N15088K07639
40075A184680m48553m97242o7179L4305j49627J19248P33661P11489j19390o69342
$$ plain form
40143 560876 820800 1815830 2322887 2134677 2182413 2678192 2738910 2057730 1403334 1069544
40133 1069544 362899 -774939 -1177309 -381938 246669 -531047 -1909613 -2309990 -1583848
40124 -1583848 -628198 313294 1436103 2077515 1284640 -499397 -1745882 -1828109 -1494733
40115 -1494733 -1398459 -1348870 -1101117 -783860 -390418 217694 727400 690864 408726 543065
40105 543065 902097 691094 -11901 -229556 293749 676939 450058 284719 626549 757110
40095 757110 14276 -973110 -1165372 -573836 2930 209431 274037 236966 -171791 -925189
40085 -925189 -1498528 -1343370 -389740 813086 1428216 1112403 494525 461953 977041 1184680
40075 1184680 736127 238885 171706 206011 56384 175632 909293 1620782 1501392 832050
40065H32050k34755M81875N40963M5269l71618n77661p51014p11262k02729M39450
40055e09432N75629J35097k84550j80244L47366Q35237Q94736L89494m86474j149829
40045E67030r45448J15280J052583Q29810l48746j169219q71857j59363K9069
40036i00861p9019K10653N89988K58757m26082l15363N23399P68348P5823l52954
40026C52689K7357J47052n47401q43768N4620Q44928L02914m37972J67145J198912
40016A266476P69164n87329p53265K24854J70925j310482j913221m38162J151895
40007a419145Q71186k84661k17063J003579J637398J058449K63654P1360K69829
39998C254586M03866L35142O3183l06452n25068n57355o63002q09403n48396J38327
$$ plain form
40065 832050 597295 1079170 1620133 1665402 1293784 716123 -34891 -746153 -948882 -509432
40055 -509432 66197 201294 -83256 -263500 83866 919103 1813839 2203333 1716859 567030
40045 567030 -378418 -263138 789445 1619255 1270509 101290 -770567 -929930 -900861
40036 -900861 -979880 -769227 -179239 79518 -346564 -661927 -138528 629820 705643 352689
40026 352689 380046 527098 -20303 -864071 -809451 35477 338391 -99581 67564 1266476
40016 1266476 2035640 1448311 695046 919900 1090825 -219657 -2132878 -2571040 -1419145
40007 -1419145 -547959 -832620 -1049683 -46104 1591294 2649743 2913397 2984757 3254586
39998 3254586 3658452 3993594 4056777 3750325 3225257 2667902 2004900 1195497 647101 785428
39988G85428N55718L90059L65110J077585J814283J460668K37828m03141M03716
39979F687254J915816K669952J988968N48113l60291j57911M26094L35853l52301
39970A3701547n42991K41598J108136J032640J61428o35609r41550r62486r74026
39961A2188687j135700j496578j763039j475821p82115m73872q24848j072362
39953C164352o52471j88646l92680p08009k24104N71815L98315o08052q43486
39944E17034K81627J290187Q22518l49685n87798J79556N82068j8615p83235q67269
39934A066388n00130k42320p2872K28631M22756J61656l58147o32918n12638k00700
39924f40294J63055M97077N98459M14467K71451L93371M64086J69252j63552j15787
$$ plain form
39988 785428 1341146 1731205 2096315 3173900 4988183 6448851 6686679 6283538 6687254
39979 6687254 8603070 11273022 13261990 13810103 13449812 13291901 13717995 14053848 13701547
39970 13701547 13158556 13400154 14508290 15540930 15702358 15066749 14125199 13162713 12188687
39961 12188687 11052987 9556409 7793370 6317549 5535434 5061562 4236714 3164352
39953 3164352 2511881 2323235 1930555 1222546 998442 1570257 1968572 1360520 517034
39944 517034 798661 2088848 2911366 2561681 1973883 2153439 2735507 2716892 1933657 1066388
39934 1066388 566258 323938 251066 479697 902453 1064109 705962 73044 -439594 -640294
39924 -640294 -477239 19838 618297 1032764 1304215 1697586 2161672 2330924 2167372 2051585
39914B051585j8734l89046q04174m32794L95246M28699m71988q86688k660J017765
39904H87211P33047n04780j213347q00800R9203P75103R52381N70880q2202l53147
39894A063549l8213K13611o7839l84654k43600j25156n16197p74395j63032O66154
39884c69772N95675p9766j60671M41004O97593K60473k18884m17722n34696l17344
39874a04110N40156J151357L26416j247890j557644k34522R16364P85455L57147
39865I32729N13904M74636m07809j081453m92828N59673P67814L41097K05188
39856A812951K11492k75454q23586n79261R7074J62826l48362n25454k02307J2272
39846d57809O1632L78270O39182N9976r86215j098125M6094J011908O24148m21287
$$ plain form
39914 2051585 2032851 1643805 839631 406837 802083 1230782 758794 -127894 -130554 887211
39904 887211 1620258 1115478 -97869 -898669 -799466 -24363 928018 1498898 1416696 1063549
39894 1063549 1025336 1238947 1171108 786454 542854 417698 -98499 -872894 -1035926 -369772
39884 -369772 225903 146137 -14534 426470 1124063 1384536 1165652 747930 213234 -104110
39874 -104110 436046 1587403 1913819 665929 -891715 -1126237 -209873 575582 932729
39865 932729 1446633 1921269 1513460 432007 -60821 498852 1266666 1607763 1812951
39856 1812951 2024443 1748989 925403 346142 443216 606042 257680 -267774 -470081 -457809
39846 -457809 -396177 -17907 621275 681251 -304964 -1403089 -1356995 -345087 279061 -142226
39836a42226p14188q2369M80156L46082j57194n21040o36600n05249j3582O57891
39826a288319Q50484K05130n62311l50383P61348J393815P30240k79634l53781
39817A106589J69312r767r34609j305205o43634J255m1763K9610Q42624J456009
39807F70421Q19252l85429p34633k27752m0033m91317o98517k14313L12284L59222
39797f30815L08485N72569Q05215N23073o3735l82145l35623l54878p12630j098160
39787a368644r51001j64564O41466P45715K49655L5420N71781J139740P39292
39778A638860m28329j023395k54487J015680J255854J39683j044502r68503J41020
39769D71881Q80600M73342l97427p13899m61623l31711n10985m85392L5092O13911
$$ plain form
39836 -142226 -856414 -938783 -458627 -112545 -269739 -790779 -1427379 -1932628 -1946210 -1288319
39826 -1288319 -437835 -232705 -795016 -1145399 -384051 1009764 1740004 1460370 1106589
39817 1106589 1275901 1266134 331525 -973680 -1617314 -1616059 -1657822 -1628212 -785588 670421
39807 670421 1489673 1104244 369611 141859 101826 -389491 -1088008 -1302321 -990037 -630815
39797 -630815 -322330 250239 1055454 1578527 1514792 1132647 797024 442146 -270484 -1368644
39787 -1368644 -2319645 -2484209 -1842743 -1097028 -847373 -811953 -240172 899568 1638860
39778 1638860 1210531 187136 -67351 948329 2204183 2343866 1299364 330861 471881
39769 471881 1352481 1825823 1428396 714497 252874 -78837 -589822 -1075214 -1040122 -426211
39759d26211O24160m8681q49957r45331m7724R42038O99703o65180j304398p0602
39749b092183J505183J061059j180269k506315j330236Q95385J881809J234041
39741e31526K23313j00958K65468O65975L90450n77764j187084m30035J047696
39732b34465J476695L54451q70712r45078l92790k68678n03192m10196O6444N35029
39722a192492Q83104J050436P33044j7183n36627m35196o4317K55277N80234O20301
39712A876581j32885j111611r36313L54515R34391J1000p19090J57007J264334
39703A697929O67802q08023r03880K90811N32512p75724j572946m40684J277687
39694c4516J614083N89076m19045p41176o92225n03509j10934K18026n3594q65120
$$ plain form
39759 -426211 197949 149268 -700689 -1646020 -1693744 -751706 -52003 -717183 -2021581 -2092183
39749 -2092183 -587000 474059 -706210 -3212525 -4542761 -3647376 -1765567 -531526
39741 -531526 -308213 -409171 -143703 522272 912722 334958 -852126 -1282161 -234465
39732 -234465 1242230 1596681 725969 -219109 -611899 -880577 -1383769 -1793965 -1727521 -1192492
39722 -1192492 -309388 741048 1474092 1456909 920282 485086 420769 676046 1256280 1876581
39712 1876581 1743696 632085 -304228 50287 984678 995678 276588 433595 1697929
39703 1697929 2365731 1557708 653828 944639 1477151 701427 -871519 -1312203 -34516
39694 -34516 1579567 2168643 1749598 1008422 316197 -187312 -298246 -80220 -133814 -998934
39684i98934j265411l95138J297790K254209J536430L3838o51399k74775j4535
39675A522075n08314r66614n94238K00527O25402O27707N57479M79327L75926
39666B319277L12123L2312p24193j290505o87626N41033O94403l61845p12508
39657A22471M60952J317515L57570j049351j048857l66612o45742j256056m90972
39648b599082J072069J276089l3579q63369l62469K97718L83979M81270O62344
39639C14970J39113p86324o38257O81740J269537K2163j628363j747121l40957
39630b713499J093644J434895O55516n09961j128798q71552l43899j17864J30354
39621b371164P10334Q97306R3833p30586l62376N38274M62583l72846n22604P6873
$$ plain form
39684 -998934 -2264345 -2659483 -1361693 892516 2428946 2462784 1811385 1536610 1522075
39675 1522075 1013761 47147 -547091 -346564 278838 906545 1464024 1943351 2319277
39666 2319277 2631400 2663712 1939519 649014 -38612 502421 1196824 834979 122471
39657 122471 583423 1900938 2258508 1209157 160300 -206312 -852054 -2108110 -2599082
39648 -2599082 -1527013 -250924 -284503 -1147872 -1510341 -1212623 -828644 -347374 314970
39639 314970 454083 -332241 -970498 -288758 980779 1002942 -625421 -2372542 -2713499
39630 -2713499 -1619855 -184960 470556 -39405 -1168203 -2039755 -2383654 -2501518 -2371164
39621 -2371164 -1660830 -763524 -669691 -1400277 -1762653 -1224379 -761796 -1134642 -1657246 -1580373
39611a580373K63393J02404O67823J443950O99078j219695j780386j89646J290864
39602c02588R81310J18010K11454N45491K4730n96043k39468M06716J91211m55910
39592H84913m96448j48800k01945m81539m13151j61134J2109M62767J095283Q16907
39582A368962o52972j711624j066332K29383N13769Q8229K35165P22923L98658
39573A26161l99973k54350P17594Q14712m18999j270868m63609Q86378R62829
39564F99875j33322p01594J4959Q33419M99371l72331j97050J030315J423286
39555C096928m0867j740225j592328n8969O94048Q1231m17424L2742M93621K43803
39545G92560k9779K36416M30733R9221j31794J82376M51534K45368M7770J14072
$$ plain form
39611 -1580373 -1316980 -1214576 -546753 897197 1596275 376580 -1403806 -1593452 -302588
39602 -302588 678722 796732 1008186 1553677 1578407 982364 742896 1149612 1340823 884913
39592 884913 388465 239665 37720 -443819 -856970 -1018104 -1005995 -543228 552055 1368962
39582 1368962 715990 -995634 -2061966 -1832583 -1318814 -1230585 -995420 -272497 126161
39573 126161 -273812 -528162 189432 1004144 585145 -685723 -1149332 -262954 699875
39564 699875 566553 -135041 -120082 713337 1212708 840377 643327 1673642 3096928
39555 3096928 3056061 1315836 -276492 -335461 358587 439818 22394 55136 548757 792560
39545 792560 762781 999197 1429930 1529151 1397357 1579733 2031267 2276635 2324405 2438477
39535B438477o5683m96933l76220K31316R0689r40439j172757J87862J378324
39526A274636O87989q54503j156706j32468P11099P26724L90524q0896o89257
39517H77142q39276q2230Q04003P50462p5559p20626p94810m52827J80473O92005
39507C38757M17525l93729n78681J4585O5017q59065j266237l00027O27012L37358
39497a597485k6153O26303R99076r1082r31607L45971J984121J091891j321013
39488A080022j703443K55681J303103J75211o39120M25297J414586N43960p89342
39479B065955p32699j00476n04250j324814q67628P23588J768172J498917N74465
39470C101230k86103q24523q08724j85880N39691P81711M95225j5698m74024o01687
$$ plain form
39535 2438477 2372794 1875861 1499641 1730957 1821646 881207 -291550 -103688 1274636
39526 1274636 1962625 1108122 -48584 -181052 530047 1256771 1647295 1566399 877142
39517 877142 37866 -44364 759639 1510101 1434542 713916 -80894 -533721 -353248 338757
39507 338757 756282 362553 -216128 -201543 -136526 -995591 -2261828 -2561855 -1934843 -1597485
39497 -1597485 -1623638 -997335 1741 -89341 -1020948 -674977 1309144 2401035 1080022
39488 1080022 -623421 -367740 935363 1110574 471454 896751 2311337 2855297 2065955
39479 2065955 1333256 1232780 728530 -596284 -1463912 -740324 1027848 2526765 3101230
39470 3101230 2815127 1990604 1181880 996000 1535691 2317402 2812627 2796929 2322905 1721218
39460A721218k87301O9944j5658l66738n16143n97766q98746q57938J46585J238057
39450c64486R34367l73292p14471L40337Q83648j98581j291337n78553J125420
39441b36948J726778Q94178K6221j21556r8720l16190m20929k20522j19261l46239
39431G66812m84048r1009N98816Q68183L36967n19020q38175m64562k08045o13746
39421f47827r34105j50396J253392J639549M50313r53967j057425L9186J012859
39412F51579Q39192l94171j644145j707501l91865J085287J422282P50467R1800
39403G02925k67853o92907q64096j43669P85927N17482n46055l16253J541396
39394G16897K442750O02310j968688k194115l17825P82818m0786j002025n63717
$$ plain form
39460 1721218 1433917 1503861 1488203 1121465 605322 7556 -891190 -1749128 -1602543 -364486
39450 -364486 569881 196589 -517882 -177545 706103 507522 -783815 -1362368 -236948
39441 -236948 1489830 2384008 2410229 2288673 2189953 1873763 1452834 1232312 1113051 766812
39431 766812 282764 191755 790571 1658754 1995721 1476701 638526 173964 -34081 -647827
39421 -647827 -1581932 -1732328 -478936 1160613 1610926 656959 -400466 -361280 651579
39412 651579 1490771 1096600 -547545 -2255046 -2646911 -1561624 -139342 611125 702925
39403 702925 435072 -257835 -1121931 -1265600 -479673 37809 -508246 -824499 716897
39394 716897 3159647 3761957 1793269 -400846 -718671 64147 23361 -978664 -1542381
39385a542381M60660P02639L46477L17821N36959K45567m77015o77675L1816Q35306
39375G80174P57129j36418r22966r99935o86387n91178p24165n58040J51180R80521
39365a950085J329089J009946K94000l67108n84626k69909K39007M62873K60632
39356D23819j14204l72873l64132J2610O72881J115134P63926k90163j228497
39347F18501j363908p96260o9914M94349Q51850Q78657M11362l16672o55325k40083
39337a87443M56497O48916K71566j0937P1286l8138o01525q40896j72306N24680
39327A21700J09463q64863r35022j43217J89070L0314P26352K121055K136593
39318C491445K82201j001263j76242P13212m89614k176772j565896N56863J140336
$$ plain form
39385 -1542381 -1081721 -379082 -32605 285216 822175 1067742 590727 -86948 -55132 780174
39375 780174 1537303 1400885 477919 -522016 -1208403 -1799581 -2523746 -3081786 -2930606 -1950085
39365 -1950085 -620996 388950 682950 315842 -268784 -538693 -299686 163187 423819
39356 423819 309615 -63258 -427390 -414780 258101 1373235 2137161 1846998 618501
39347 618501 -745407 -1541667 -1611581 -1117232 -265382 613275 1024637 707965 52640 -187443
39337 -187443 269054 917970 1189536 1178599 1249885 1211747 610222 -230674 -402980 121700
39327 121700 231163 -633700 -1568722 -1711939 -1522869 -1492555 -766203 1354852 3491445
39318 3491445 3773646 2772383 2596141 3309353 2819739 642967 -922929 -366066 774270
39309G74270j35984q09018j19932J76633l74708n0550J350787J515166l18172
39300B008492j562157m05566J136206N52066j141692j275276K71928J353514J000580
39291A938095J87775k90552o29923q90298p16206j82805K40137M71597P12781
39282H40601Q39889O43089L08210M8632k80317o99314q33556n69411k90954j12530
39272a05661K47837N22193k1902j077992j195127J09472J409116J374170M89409
39263A751515j04566k16244q6750M37178J119843R66981k03746j021079n45102
39254B098030K63625K64314p1100M492j47233j129944j774063q34311O54065Q31522
39244A59397n3071l36453J83464L63434J46646M57655R59366L89439q70293j021705
$$ plain form
39309 774270 638286 -170732 -290664 -114031 -488739 -539289 811498 2326664 2008492
39300 2008492 446335 40769 1176975 1729041 587349 -687927 -415999 937515 1938095
39291 1938095 2125870 1835318 1205395 315097 -401109 -583914 -343777 127820 840601
39282 840601 1680490 2323579 2631789 2680421 2400104 1700790 867234 297823 6869 -105661
39272 -105661 142176 664369 642467 -435525 -1630652 -1521180 -112064 1262106 1751515
39263 1751515 1646949 1430705 1343955 1781133 2900976 3867957 3664211 2643132 2098030
39254 2098030 2361655 2625969 2554869 2559361 2412128 1282184 -491879 -1326190 -672125 159397
39244 159397 106326 -230127 -46663 316771 463417 921072 1880438 2269877 1399584 377879
39234C77879J05647O73007p664l80742M09296Q43708l16448j671309j220654N95601
39224e91679J640607J011133l23081j233362j381385q00376J96461P87734L82105
39215c11843l87197k92220P60705J457996Q53553k68482m29263M63690Q98594
39206B745533j24333j501819j392813J46101J086665K55388j020661r40859J57962
39197e88836N57701j10055n20835K2658N63004K62021j84449J97141R51133Q55227
39187B004710j77505r63865p84603k76487k44660l68536J39648R56581P95926
39178A081209o07014j690260j081430L34965O14238l68167p93400K18965J284587
39169a006307J024903J68232J99679J007678J277806N87582k60964o94822r37532
$$ plain form
39234 377879 483526 1156533 1148869 768127 1177423 2021131 1704683 33374 -1187280 -591679
39224 -591679 1048928 2060061 1736980 503618 -877767 -1678143 -1481682 -693948 -311843
39215 -311843 -699040 -991260 -230555 1227441 2080994 1812512 1383249 1846939 2745533
39206 2745533 2621200 1119381 -273432 -127331 959334 1214722 194061 -746798 -588836
39197 -588836 -31135 -141190 -662025 -639367 -76363 185658 1209 198350 1149483 2004710
39187 2004710 1827205 863340 78737 -197750 -442410 -810946 -671298 285283 1081209
39178 1081209 474195 -1216065 -2297495 -1962530 -1348292 -1716459 -2509859 -2290894 -1006307
39169 -1006307 18596 186828 386507 1394185 2671991 3259573 2998609 2303787 1366255
39160A366255j178644j147691o27492J71804P32323N02086n14638j243126m61285
39151b400408J333249K071843Q76236n47821l96282N87996N41088m47167o68760
39142I49974K73057R26308M24773l53771m05345Q5951M43922L46875k80520j182019
39132A229205j479227n36812Q47843J230269M85843j85118j77253p0158k22574
39123A122018k02210R2828R0901k73846k83874K15885L75469k51230r31927r09678
39113i55664l59873K72400R32121J459012J341543N25669k49558l85376j03227
39104B477047Q6180J5662j84469k30760J47003O34276L27821q94826j637387q18681
39094g8134M44953M09518m82047m43750M10413K50436r49236r47939R26351K298697
$$ plain form
39160 1366255 187611 -960080 -1587572 -1415768 -683445 -181359 -695997 -1939123 -2400408
39151 -2400408 -1067159 1004684 1880920 1333099 936817 1524813 2065901 1618734 949974
39142 949974 1223031 2149339 2574112 2220341 1814996 1900947 2344869 2691744 2411224 1229205
39132 1229205 -250022 -786834 61009 1291278 1777121 1592003 1414750 1344592 1122018
39123 1122018 919808 1012636 1103537 829691 545817 761702 1137171 885941 -45986 -955664
39113 -955664 -1315537 -1043137 -111016 1347996 2689539 3215208 2965650 2580274 2477047
39104 2477047 2563227 2578889 2394420 2163660 2310663 2944939 3272760 2377934 740547 -78134
39094 -78134 366819 776337 294290 -149460 260953 511389 -437847 -1385786 -459435 1839262
39084A839262J445776j14047m58069k96775j015302j739383r32382N48850O67065
39075e5005m42385q43859M0484R51837J101460Q30765K62614o65489j070743q1162
39065B8517J228669R49948o21169j214757p8133R64842N14657m40890n04147K769
39055H30306Q9475j25801K3759L99485M31320J63572j8891j41900l39657l40385
39045I71283L8437L65835K13984j21251r2519K56745M05459L5908p04601j321392
39035D7888j223089l03804O66527Q27089M13179L70326P66308O74110j22968n93143
39025A522423k03903J04106l85757p37847P9796J224975J137838L126o30177l39358
39015A775222j86582o14397p41891j06977M86685M44249K88791M08253K29812
$$ plain form
39084 1839262 3285038 3170991 2712922 2416147 1400845 -338538 -1270920 -722070 -55005
39075 -55005 -497390 -1341249 -1300765 -348928 752532 1583297 1845911 1180422 109679 28517
39065 28517 1257186 2207134 1585965 371208 293075 1257917 1772574 1331684 827537 830306
39055 830306 919781 793980 817739 1217224 1648544 1812116 1793225 1651325 1311668 971283
39045 971283 1009720 1375555 1589539 1468288 1375769 1632514 2037973 2073881 1369280 47888
39035 47888 -1175201 -1479005 -812478 14611 427790 798116 1564424 2238534 2115566 1522423
39025 1522423 1318520 1422626 1036869 299022 378818 1603793 2741631 2744757 2114580 1775222
39015 1775222 1588640 974243 232352 125375 612060 1056309 1345100 1753353 1983165
39006A983165n06264r00623l48550K96208J83991K0068P25869J485291Q93584
38997C832739n19411q89737j6927K78602q37725j803782j137362L01805P61782
38988c0016J48166k32778K25180Q65499R71043M89758k78859r35088j054890o06373
38978d38358j02163Q3627J78365L88013L76642p4465m80461l90811j38518j49190
38968g47319j35826K03568L66404q4629m84724o9825N60014L29440m11264m06820
38958h80981L22277M86491k39876o81937j93591L80913L25514J43368L09248K96926
38948B68352k73595p21781m96498k02937m11666m43655M48038J480971J288341
38939I35570K6171p65059k83158O53871R10796L38015m01584o76505l60477J68547
$$ plain form
39006 1983165 1476901 576278 227728 523936 707927 727995 1453864 2939155 3832739
38997 3832739 3313328 2423591 2406664 2685266 1847541 43759 -1093603 -791798 -30016
38988 -30016 118150 -114628 110552 976051 1947094 2436852 2157993 1222905 168015 -438358
38978 -438358 -540521 -456894 -278529 109484 486126 411661 -68800 -459611 -598129 -747319
38968 -747319 -883145 -679577 -313173 -397802 -882526 -952351 -392337 -62897 -474161 -880981
38958 -880981 -558704 -72213 -312089 -994026 -1187617 -806704 -481190 -337822 -28574 268352
38948 268352 -5243 -727024 -1223522 -1426459 -1838125 -2281780 -1833742 -352771 935570
38939 935570 961741 196682 -86476 567395 1478191 1816206 1414622 738117 377640 546187
38929E46187M02065K28618j5863r3412j28478k09705k04920j70299l65085n83251
38919e94143j75693Q11398J276960N25519n75796p47251q2896K84627k0715k21673
38909D80337K19941P65851O30834j82106r86805j204218q44299l66402j20548
38900a607415P6561N91538J187632J110489K32725m95997k98926K50506P4757
38891A121870p19134r34777q3652Q01021N39812n52477r68858J07412J639213
38882I50430J797561J79150j516426j466359M297R43478M14114m88901n10194
38873C07150P6313L44291K38183K02373M3921o65628j479518j488061o48880K31046
38863b838810O57349P27987M95404n215k61996K04738R16521R49288L01782j90281
$$ plain form
38929 546187 948252 1176870 1161007 1067595 939117 729412 524492 354193 -10892 -594143
38919 -594143 -769836 41562 1318522 1844041 1268245 520994 438098 722725 702010 480337
38909 480337 700278 1466129 2096963 1914857 928052 -276166 -1120465 -1486867 -1607415
38900 -1607415 -1530854 -939316 248316 1358805 1591530 1095533 796607 1047113 1121870
38891 1121870 402736 -532041 -615693 185328 725140 172663 -796195 -688783 950430
38882 950430 2747991 2927141 1410715 -55644 -51347 892131 1306245 817344 307150
38873 307150 383463 727754 965937 1168310 1212231 546603 -932915 -2420976 -3069856 -2838810
38863 -2838810 -2181461 -1453474 -958070 -963285 -1225281 -1020543 -104022 845266 1147048 956767
38853I56767k29009k98699n22931l99782J41635N08307N32423P09912J016989
38844B415612O53283m89421j244961q32918q3924p0668m22346j58832M86650M34442
38834F86917l70207q04410l06511M33677P17908O64192M50656j71979j016305
38825B83938j090153K1066J123326Q23607m59558j040281l52559M42975M02717
38816A55078Q2789K87702O39678L69239k09755j62681M78916P10576R1327o70562
38806A772307p81609k52947L82502O14572K13291m63764n78419R4254N41336l5938
38796A505585o10877L05395J894812J647597q21601k719651j937702J0098N51553
38787a74791j39472p8348R56114J302235M46714k78288j92960k59104r88904j268473
$$ plain form
38853 956767 727758 429059 -93872 -493654 -352019 156288 688711 1398623 2415612
38844 2415612 3068895 2579474 1334513 501595 417671 347003 -75343 -234175 252475 686917
38834 686917 316710 -487700 -794211 -360534 357374 1021566 1472222 1300243 283938
38825 283938 -806215 -785149 338177 1161784 702226 -338055 -690614 -247639 155078
38816 155078 237867 525569 1165247 1534486 1324731 1162050 1640966 2351542 2442869 1772307
38806 1772307 990698 737751 1120253 1734825 1948116 1484352 905933 1000187 1541523 1505585
38796 1505585 894708 1200103 3094915 4742512 3920911 1201260 -736442 -726344 -174791
38787 -174791 -314263 -392611 563503 1865738 2312452 2034164 1841204 1582100 593196 -675277
38777f75277k18562J194224J469432N54018m11923o70076l82439k8541J17734
38768I48590R0553P3640K0818l86934j042206j109765j76407P47415M56519n55955
38758i33732p72324l4590L51654n18R8385J106774J582607M05696j277273j641015
38748a114336o58117L02988N24135L24823N9158q0451K28539Q68802R49077M7931
38738A452549q17413n60938K73808M43090K6549K7808L74644L9813q92494j048154
38728f80738j1053Q51514M57390m63985p19389l48109j6354L00530R03700J318762
38718A592268Q49371j54740o70348n06602m36070p99653r60779m25069L41236
38709a170386O94001P52724R16580R06857J49272r80239j208450m2834J286634
$$ plain form
38777 -675277 -893839 300385 1769817 2323835 1911912 1241836 859397 830856 948590
38768 948590 1039143 1112783 1133601 746667 -295539 -1405304 -1581711 -834296 -377777 -933732
38758 -933732 -1706056 -1740646 -1388992 -1389510 -1291125 -184351 1398256 1803952 526679 -1114336
38748 -1114336 -1772453 -1469465 -945330 -620507 -561349 -641800 -413261 455541 1404618 1452549
38738 1452549 635136 74198 348006 791096 817645 845453 1220097 1259910 367416 -680738
38728 -680738 -691791 159723 617113 153128 -566261 -914370 -930724 -630194 273506 1592268
38718 1592268 2441639 2286899 1616551 1109949 673879 -125774 -1086553 -1511622 -1170386
38709 -1170386 -476385 276339 1192919 2099776 2249048 1268809 60359 17525 1304159
38700A304159J234749p5815j074039q55135j81337j00931m47197m23782r1619
38691g10947k54317r57403j109442J9292J604392K148527J237327j03984o92166
38682A181279l72645J20876J36775k75766n90326m42557K0421L72577L80666J72383
38672G03683j617l6222N328P81j39081l48504l30797J82337R43824J207600N61532
38661B748864m15971q06658o17918p35672j392985j499353k12463J462211J771987
38652C02042O66660j81435N9443K95293l63469r11518k12436P37351J80224j344882
38642g72727j450805M46485J989236J191878q19134j617022p78175J04033j1840
38633a718071n34920n52871q036N70995P38446M41914J41449M61044J269625J487227
$$ plain form
38700 1304159 2538908 2463093 1389054 533919 352582 251651 -195546 -619328 -710947
38691 -710947 -965264 -1922667 -3032109 -3012817 -1408425 740102 1977429 1873445 1181279
38682 1181279 808634 929510 1066285 790519 200193 -242364 -221943 150634 531300 703683
38672 703683 702066 665844 671172 671953 532872 184368 -146429 35908 979732 2187332 2748864
38661 2748864 2332893 1526235 908317 172645 -1220340 -2719693 -2932156 -1469945 302042
38652 302042 968702 787267 846710 1142003 778534 -132984 -345420 391931 572155 -772727
38642 -772727 -2223532 -1777047 212189 1404067 584933 -1032089 -1810264 -1706231 -1718071
38633 -1718071 -2252991 -2805862 -2813898 -2242903 -1504457 -1062543 -921094 -460050 809575 2296802
38623B296802M50558r26073j196086l17668M05425K26443k09480r8017L59197
38614I91101M13684j98701j024801j319895o01805P99658J751897J405803K59840
38605B476781m54461l90737l04115o02099o73978p4929N32603L32537l69396o12770
38595a40564j73322K65665J92729j49621l16228k76440k65853k95394r1208M36403
38585h13833Q39820N40351l55182j033056j007879o87553m59979J15980J305256
38576a556075J994777R41807r69214j453901j08333Q95235J72532p54521j36805
38567i74498R82546N70624q15275q82709M60883Q61919m80648j326560k2176J741644
38557A15750J570877N9045l20122R08378J669473N65611j225824j773576q30919
$$ plain form
38623 2296802 2747360 1821287 625201 307533 712958 939401 729921 631904 991101
38614 991101 1404785 1206084 181283 -1138612 -1740417 -940759 811138 2216941 2476781
38605 2476781 2022320 1631583 1327468 725369 51391 -23538 509065 841602 472206 -140564
38595 -140564 -313886 -48221 144508 -5113 -321341 -597781 -863634 -1159028 -1250236 -813833
38585 -813833 25987 566338 211156 -821900 -1829779 -2517332 -2977311 -2861331 -1556075
38576 -1556075 438702 1380509 411295 -1042606 -1150939 -255704 -83172 -837693 -974498
38567 -974498 8048 578672 -236603 -1119312 -658429 203490 -277158 -1603718 -1625894 115750
38557 115750 1686627 1745672 1425550 2333928 4003401 4569012 3343188 1569612 738693
38548G38693K37549K69808n46844j092652n96980M62961Q77333K44240m45475
38539A48633k10373M36029K41990p81919j184717j28723J305516J464930K29263
38530A520629r17985p63954K69163P89622J59010p66822o96944M93109J547653
38521A633481J288111n1521j193409j265079n49157O3513K9476m11667n65078
38512a021330j02753M30301K54572m54509o40462N2842N59726k0343q44770m89642
38502b276368P40545J101426K8362j020482q01461L741J48565k34561j72599M21617
38492b061215P75132O13747L71398K29700j7375k07269Q0907N99516N88030M0140
38482A012711j54917L11822N34432j31985q32624m19954O52996Q32427k48122
$$ plain form
38548 738693 976242 1246050 699206 -393446 -990426 -527465 349868 594108 148633
38539 148633 -61740 374289 616279 -165640 -1350357 -1479080 -173564 1291366 1520629
38530 1520629 602644 -161310 107853 897475 1056485 289663 -407281 85828 1633481
38521 1633481 2921592 2870071 1676662 411583 -137574 -74061 -44585 -456252 -1021330
38512 -1021330 -1124083 -693782 -439210 -893719 -1534181 -1481339 -921613 -941956 -1786726 -2276368
38502 -2276368 -1535823 -434397 -406035 -1426517 -2227978 -2224237 -2075672 -2310233 -2482832 -2061215
38492 -2061215 -1286083 -672336 -300938 -71238 -88613 -295882 -214975 384541 972571 1012711
38482 1012711 857794 1169616 1704048 1572063 739439 319485 972481 1804908 1556786
38473A556786j190452q92654j03300j17062o94941m74479P69487J574534Q85431
38464A313350l89429p34327j76800M5236l83260m00095N09465J191165M51554
38455A426859j019133j471574n14261M73055M62330J67780O72893J530098J330218
38446C058265r5491j221332q83720J70806M55505k45568r40522j061601r30040
38437a693698o97223k9470Q69333J061675K93462l63192l4529O41607O08180J5769
38427F71914k94296k76840m50425o72587m40026n7961j58167l30420K79089J177007
38417e52712J006239j36404o70516j06338K65592j75324k75809N53059R00626
38408H08413k65507j528684j136120K14681O71264J92412J14668N82082O08416
$$ plain form
38473 1556786 366334 -526320 -629620 -746682 -1441623 -1916102 -1146615 427919 1313350
38464 1313350 923921 189594 12794 58030 -325230 -725325 -215860 975305 1426859
38455 1426859 407726 -1063848 -1578109 -1105054 -642724 -474944 197949 1728047 3058265
38446 3058265 2962774 1741442 857722 1028528 1484033 1238465 297943 -763658 -1693698
38437 -1693698 -2390921 -2420391 -1551058 -489383 -195921 -559113 -593642 47965 656145 671914
38427 671914 377618 100778 -349647 -1022234 -1462260 -1520221 -1678388 -2008808 -1729719 -552712
38417 -552712 453527 317123 -353393 -459731 -194139 -369463 -645272 -92213 808413
38408 808413 542906 -985778 -2121898 -1907217 -1235953 -1043541 -928873 -346791 261625
38399B61625J84867J25160J15036q35802k080602j808935o6311J025679O01679
38390b477604K83504J171963J859776Q60870q47916j405270p56284l3570N68289
38381g76242J407979J729195M39320j697219k517385j297974L58252Q00232K21035
38372a332807k07120k7988L73517O81136R26623J052007P49534r4764r72626j064729
38362H2783k14622O13528L75191n99645r40511k01702M55824Q8458n24382k00347
38352a065425O09898M96451n31664q62430L19815J773199J894971O95337n91711
38343B738441j144085j079292q21020o32114n66009l98422K08305J115228J560639
38334I81671J043670J18931k19669J48065L40300k35506r88218r10698M1535Q41249
$$ plain form
38399 261625 446492 571652 686688 -149114 -2229716 -4038651 -4104962 -3079283 -2477604
38390 -2477604 -2194100 -1022137 837639 1698509 850593 -554677 -1310961 -1344531 -776242
38381 -776242 631737 2360932 2800252 1103033 -1414352 -2712326 -2354074 -1553842 -1332807
38372 -1332807 -1539927 -1567915 -1194398 -513262 413361 1465368 2214902 2120138 1147512 82783
38362 82783 -131839 481689 856880 257235 -683276 -884978 -429154 -340696 -865078 -1065425
38352 -1065425 -455527 40924 -490740 -1353170 -1033355 739844 2634815 3330152 2738441
38343 2738441 1594356 515064 -305956 -938070 -1504079 -1902501 -1694196 -578968 981671
38334 981671 2025341 2144272 1924603 2072668 2412968 2177462 1189244 278546 320081 1161330
38324A161330O99527K7940k31115P6069K40439r1591l42019j6415L32186j18562
38314A737789j053365j273797l55325P88907J188487Q72106L38961k05154n69308
38305A469301l29209L81825N08039n30593j598370j197460K38437Q28678P5819
38296a53533l88696N27462J514432Q52842q69160j572645o34399N50926P78998
38287F06227L18761j38294m27083m15685K21482J157307J334501L67220q03660
38278B220776j218204j014928o65049p1679P32111R25430N9824q34849n52749
38269d19317L93279N23551k90374p37380k62083J80951r6548l99466K7922P07332
38259c72133P89199L60925M5961m9784j55312j26811K13195M09351o8740q08113
$$ plain form
38324 1161330 1860857 1888797 1657682 1733751 1974190 1882599 1540580 1524165 1856351 1737789
38314 1737789 684424 -589373 -944698 -155791 1032696 1904802 2243763 2038609 1469301
38305 1469301 1140092 1521917 2029956 1499363 -99007 -1296467 -1058030 -229352 -153533
38296 -153533 -542229 -14767 1499665 2352507 1483347 -89298 -723697 -172771 606227
38287 606227 924988 786694 359611 -56074 165408 1322715 2657216 3024436 2220776
38278 2220776 1002572 -12356 -677405 -749084 -16973 908457 968281 133432 -419317
38269 -419317 -26038 497513 207139 -530241 -792324 -611373 -707921 -1107387 -1079465 -372133
38259 -372133 417066 777991 823952 774168 618856 492045 705240 1114591 1045851 237738
38249B37738q54851r7361N61268N26422K50838L46009N91837L53623l72563r16997
38239F25963q69857n41796l44751j41525L94724R79890Q47592j48317j042744
38230b40821q43587J26197N77278j0089o42781k04399Q94896J179767J50086r43261
38220D3286p70998K45222N71102k29495r54813o52101M2302J75287J33408P94508
38210f02292J611718J145099n19494j532509r00061K07207N12772M85040R73056
38201A380536J342284N66627p27549j045929l42366J40116L6315J30763N23688
38192B004485K97087o99129j337941r91070m08439k58323j06107M62025Q86611
38183a50801O18655R3715n6953M2472L2998J4443Q2133n9909m12201l95296J36743
$$ plain form
38249 237738 -617113 -714474 -153206 373216 624054 970063 1561900 1915523 1542960 625963
38239 625963 -243894 -785690 -1130441 -1271966 -877242 102648 950240 801923 -240821
38230 -240821 -1084408 -958211 -380933 -391022 -1033803 -1238202 -343306 836461 986547 43286
38220 43286 -727712 -482490 88612 -140883 -1095696 -1747797 -1705495 -1530208 -1396800 -602292
38210 -602292 1009426 2154525 1635031 102522 -797539 -590332 -77560 407480 1380536
38201 1380536 2722820 3289447 2561898 1515969 1173603 1313719 1350034 1480797 2004485
38192 2004485 2301572 1602443 264502 -726568 -1135007 -1393330 -1499437 -1037412 -150801
38183 -150801 467854 561569 504616 547088 580086 594529 676662 616753 204552 -190744 -54001
38172e4001M31776N3598l09362k1403L81654J70065k71737j72771K21185J13141
38162E42145m05494n20267p1227K89552K43134J75711L69736N91086N65158K78082
38152B057616k23024q42326j266683j184548o21758J76342R45023J271972P70815
38143A083429k17582o62073j54432L59800j09072j032583j015261K38324J516729
38134G279J646128O90230m56276j043023q96738l41183J42134L53438M47254N11049
38124A060292L79228K4369k79027m04961n16669n34988r8148O12622P51508K4765
38114A018991p13538o98945l18636j98523n7301N44733J047772O87864m9885m2152
38104A220380O79703R71811L13932o05827j020570q10963j51143O04945P33744
$$ plain form
38172 -54001 377775 431373 122011 100608 482262 652327 380590 207819 429004 542145
38162 542145 136651 -383616 -454843 -165291 77843 253554 623290 1214376 1779534 2057616
38152 2057616 1834592 992266 -274417 -1458965 -2080723 -1904381 -959358 312614 1083429
38143 1083429 865847 203774 49342 409142 300070 -732513 -1747774 -1509450 7279
38134 7279 1653407 2343637 1887361 844338 -52400 -393583 -251449 101989 549243 1060292
38124 1060292 1439520 1463889 1184862 779901 263232 -271756 -369904 242718 994226 1018991
38114 1018991 305453 -393492 -712128 -910651 -967952 -423219 624553 1312417 1262532 1220380
38104 1220380 1900083 2871894 3185826 2579999 1559429 748466 597323 1202268 1936012
38095A936012j72483j306556j369318k57508Q16995R19942K94907l07312l93120
38086A61559J17504P10786M31964r11570j984121j433020J08122Q31256L98305
38077a569215J95395Q12571J041389O8334r25242m94211Q52852J427205O95157
38068B104235l30552p13450n80375m92417n88904n87399k90281J32908L70883
38059i75352M02689M86058O32135M75737o6803m98259n20751n18490o61143k74678
38049a518857R43428J808509J068166n42590j146299l70480L80398J90723m12393
38040D00605p94562q98651m94869O03681J446982Q48036m39812m32620Q76568
38031A115358J281537l1146j109501n62068K58599j8964l04773O16634J436639
$$ plain form
38095 1936012 1763529 456973 -912345 -1169853 -352858 567084 861991 554679 161559
38086 161559 279063 989849 1421813 510243 -1473878 -2906898 -2798776 -1967520 -1569215
38077 -1569215 -1373820 -561249 480140 548474 -376768 -870979 -18127 1409078 2104235
38068 2104235 1773683 1060233 479858 -12559 -601463 -1188862 -1479143 -1346235 -975352
38059 -975352 -572663 -86605 545530 1021267 954464 456205 -64546 -583036 -1244179 -1518857
38049 -1518857 -575429 1233080 2301246 1758656 612357 241877 622275 812998 400605
38040 400605 -393957 -1292608 -1787477 -1183796 263186 1111222 671410 238790 1115358
38031 1115358 2396895 2365749 1256248 694180 952779 933815 629042 1245676 2682315
38022B682315N38263q91065p51224L15700J40089j044796j029305M34293J248269
38013A642539O00725K2011L62653M73044l31748r77718p66856n84361r31230q24077
38003a315018J82733Q12774K04338n20561k04799M32312K99903j26532L7908K99696
37993A02754j50548o93470l46414L51934L06444p0485L59692J204702J050847
37984B115456n9486o36027k20167M8357m14571p28535k95614J71648N6605j33784
37974i6118Q4145K34806q3589l31604m9976K55281J27572P4562M81037N78726
37964A274842k78276j142857p50638K94671K80973q37396j192327J29591J610154
37955f11263J516923L09362l13632P6229L88268n0484n62917l18836M27570P37859
$$ plain form
38022 2682315 3220578 2329513 1578289 1893989 2034078 989282 -40023 394270 1642539
38013 1642539 2243264 2265275 2627928 3100972 2769224 1791506 1024650 440289 -490941 -1315018
38003 -1315018 -1132285 -319511 -115173 -635734 -840533 -408221 -108318 -234850 -196942 102754
37993 102754 -47794 -741264 -1087678 -735744 -429300 -499785 -140093 1064609 2115456
37984 2115456 2055970 1419943 1199776 1248133 833562 105027 -190587 -18939 37666 -96118
37974 -96118 -11973 222833 139244 -192360 -242336 12945 140517 215079 696116 1274842
37964 1274842 996566 -146291 -896929 -602258 -321285 -1158681 -2351008 -2221417 -611263
37955 -611263 905660 1215022 901390 977619 1365887 1315403 752486 433650 861220 1599079
37945A599079J79904p51016j216387q36380o712N02379L29118j35077k92491r4396
37935g21979K2582j13039j24232K90804P90913P93173L11154Q899L37812R23731
37925B519818J025478M06739n14133j225758j457787j046877l9284R15383Q98859
37916A482438r6994q49582m03505N44192O11039k07933n65783R2890O64665J91354
37906A462781n81646l90235N46589Q40728k4868j009251r63731l4176O39398K67158
37896G52747p05061j002787L7386J482679J781643Q06812O8957M82547R57101
37887D662024J24260j448901k089431j473154p45976m57707J4543Q76310J321734
37878G83702R76756N76779O06802M73913k50166q38887n10787L26531P59689O05727
$$ plain form
37945 1599079 1778983 1027967 -188420 -1024800 -1031512 -529133 -200015 -335092 -627583 -721979
37935 -721979 -699397 -812436 -936668 -645864 145049 938222 1249376 1258275 1596087 2519818
37925 2519818 3545296 3952035 3437902 2212144 754357 -292520 -331804 583579 1482438
37916 1482438 1385444 535862 132357 676549 1287588 1079655 513872 606762 1271427 1462781
37906 1462781 881135 490900 1037489 1878217 1853349 844098 -119633 -153809 485589 752747
37896 752747 47686 -955101 -917715 564964 2346607 3153419 3222376 3704923 4662024
37887 4662024 4786284 3337383 1247952 -225202 -971178 -1428885 -1414342 -538032 783702
37878 783702 1760458 2337237 2944039 3417952 3167786 2328899 1818112 2144643 2904332 3510059
37868C510059K20894k61658p51906q63566m91865j85990k80074k68147K45293
37859H73040O59658L18120k99131l42742l9711k15709o98731m64238O21555J369040
37849A781151Q65360l58991j096422p74005K32341J064931R97324N3455q64734
37840A900410q77453j73721K73837j3971n62201p46326m77628o37M57954O96365
37830D76629O29788M75435M71199M36364Q3024l05848j66511L08449J90815p81165
37820A818179j508526q55676P26355J607760R62686k67943o31835M5708O30874
37811B527582L44703k18022j51523K53385n610q29764r42403r84N29287m21272
37801A085379j575967j040178P40172J551134P19308j09639J88221N65501j01299
$$ plain form
37868 3510059 3730953 3469295 2717389 1853823 1361958 1175968 895894 627747 873040
37859 873040 1532698 1850818 1551687 1208945 1169234 953525 254794 -209444 412111 1781151
37849 1781151 2646511 2287520 1191098 417093 649434 1714365 2711689 2765144 1900410
37840 1900410 1022957 849236 1123073 1109102 546901 -199425 -677053 -677690 -219736 476629
37830 476629 1106417 1581852 2053051 2489415 2572439 2266591 2100080 2408529 2599344 1818179
37820 1818179 309653 -546023 180332 1788092 2750778 2482835 1851000 1896708 2527582
37811 2527582 2872285 2654263 2502740 2756125 2750515 1920751 978348 977364 1506651 1085379
37801 1085379 -490588 -1530766 -790594 760540 1479848 1370209 1558430 2123931 2022632
37792B022632r97028q41775q4967J8684l55941r2495O25195M80535n51241q31989
37782f08390L53216J482432R95506m77576j228859q63508k96453J5035M31531
37773a97066R25142Q43330N2228p29097r74221q25912l59108N74806J425436J065591
37763A801129m44977j352300n27044P12159N23886n09280k91141J189987J471004
37754B573423n35847k448111j649628R13949K094649Q55416q22867j137235n48581
37745g04832k27868j35160L50310R76003R33328J52594o05185p66483m69010j99315
37735f95618k96645o66719p54586p6623J012611J485995Q76557q3678m37108j67410
37725A96776R8604J26012J49609J96347N9528j48778j05596P1925n6082m29906
$$ plain form
37792 2022632 1025604 183829 98862 117546 -238395 -330890 294305 774840 223599 -608390
37782 -608390 -255174 1227258 2222764 1745188 516329 -347179 -643632 -628597 -197066
37773 -197066 728076 1571406 1623634 894537 -79684 -905596 -1264704 -689898 735538 1801129
37763 1801129 1356152 3852 -523192 188967 712853 203573 -87568 1102419 2573423
37754 2573423 2037576 -410535 -2060163 -1146214 948435 1803851 980984 -156251 -704832
37745 -704832 -932700 -1067860 -717550 258453 1191781 1344375 739190 -27293 -496303 -695618
37735 -695618 -992263 -1658982 -2413568 -2490191 -1477580 8415 884972 801294 364186 196776
37725 196776 295380 421392 571001 767348 826876 678098 572502 644427 588345 158439
37715A58439m60904Q884L69232J53916k77260l36414k3811K46507K68755J27683
37705B35027k9357p667L05623N84800L02637l83496n88559j922M56269j5548p74930
37694H2877p48166k05550k36662p44442m83617P53086J510118Q02847m12140o90322
37684c71971J4288P60926J029329Q23969J44365p17170r86828m03507J91020O5798
37674E50219l02433k33485j09439m86788p27403P2685J348103J739795J092392
37665B943646K93182m39369j400744j891513q92621P50036R64542l62817j006747
37656a042405J11083J241944P29666m35866n25958J72640L16090q3114r3560K11931
37646F02451J21608q3538L61147J021394P98689j30274n23968q4294K66446P4096
$$ plain form
37715 158439 -302465 -293581 75651 229567 -47693 -384107 -407918 -161411 107344 235027
37705 235027 205670 198003 503626 1088426 1391063 1007567 419008 417086 873355 857807 82877
37694 82877 -665289 -870839 -1107501 -1851943 -2335560 -1582474 -72356 730491 318351 -371971
37684 -371971 -357683 403243 1432572 2256541 2400906 1683736 696908 293401 484421 550219
37674 550219 247786 14301 -95138 -581926 -1309329 -1236644 111459 1851254 2943646
37665 2943646 3236828 2797459 1396715 -494798 -1387419 -637383 327159 -35658 -1042405
37656 -1042405 -931322 310622 1040288 604422 78464 251104 567194 484080 390520 602451
37646 602451 724059 640521 1001668 2023062 2821751 2691477 2167509 2083215 2349661 2423757
37636B423757j32423q2463j68316m51727m74051k11875j20297j62586O8624K66642
37626I55285k45610r84935n88094R87427J989952J280018p8541n17267j43927
37617B654308j20405o55945q68513l34986L05267L41838j47047n83795o16282
37608b5560m06457l42593m85788l74702L60510J254022J372048N51975k78729
37599A624726l32013J2655r1546o12437o72462J15846R79363R42304J04890m72773
37589A598553j36743N35793N37965k34731r20793q65231k98174K35317N19388
37580I71344N02942J08444l94248l93846J76737M97818R279o19523m24042L60730
37570G95635O21229k0655p73159q27258k27257M26692N76394O3249o15893n92022
$$ plain form
37636 2423757 2291334 2208871 2040555 1588828 1114777 902902 782605 620019 688643 955285
37626 955285 709675 -275260 -863354 124073 2114025 3394043 3315502 2798235 2654308
37617 2654308 2533903 1877958 1009445 674459 979726 1321564 1174517 590722 -25560
37608 -25560 -432017 -774610 -1260398 -1635100 -1274590 -20568 1351480 1903455 1624726
37599 1624726 1292713 1305368 1213822 601385 -71077 44769 1024132 1966436 2071326 1598553
37589 1598553 1461810 1997603 2535568 2300837 1380044 514813 216639 451956 971344
37580 971344 1474286 1582730 1188482 794636 971373 1469191 1478470 858947 434905 795635
37570 795635 1416864 1396209 623050 -204208 -431465 -4773 571621 634870 18977 -573045
37560e73045L24562J172596J012326J91471k71427j40634O3725J19882J12364
37551B011820k19933r58188j170202k1186J450434J296050m59747j596055q30402
37542d97409M94578O80649R3580J15447Q35765J165733O08247k74525p87097o15660
37532A819308J84867R92230R02170p8888p19137k29160M33736l3476j157165j298480
37522H16005j68953P02110K79394m81655j60489R87345J396230L89939r10707
37513B849219j066467o9013Q47751Q20633J81023l11488m04328k35381J31757
37504B743706N29837M80866j87630q16507o81625m8111K55899R0027O676J73035
37494B546173K05578K3865p2918j72399n93937r46199m65546N57657R07571L12867
$$ plain form
37560 -573045 -248483 924113 1936439 2127910 1856483 1715849 1779574 1899456 2011820
37551 2011820 1791887 833699 -336503 -357689 1092745 2388795 1929048 332993 -497409
37542 -497409 -2831 677818 771398 886845 1722610 2888343 3496590 3222065 2434968 1819308
37532 1819308 2004175 2996405 3898575 3819687 3100550 2871390 3305126 3271650 2114485 816005
37522 816005 647052 1349162 1628556 1146901 986412 1973757 3369987 3759926 2849219
37513 2849219 1782752 1713739 2561490 3382123 3563146 3251658 2847330 2611949 2743706
37504 2743706 3273543 3754409 3566779 2750272 2068647 2020536 2276435 2366462 2373138 2546173
37494 2546173 2751751 2775616 2702698 2530299 1936362 990163 524617 1082274 1989845 2302712
37484B302712o4109N00140J182822J071656N40842K94302J00127m76951r37617
37475D513924n59067L57251R66322J134243J304258J529715J480257J080683M84523
37466A2292109k03079o85869n67719j77618m69090j457680j769346o54793O01798
37457F908713M98329m24302o07142L8988L76659K29376M37535R10348N49346o85192
37447H232658j430444j090838o92641r38206r84640p0856J011296J194757P86446
37438F017532O22973M91907k08491q77342l80866Q70975J144800j8824r37824
37429F724840k79695Q77915P19992m89140r30943k20796Q8033o50239q65509N04690
37419E479148J784352R93800p61345q14139P84079J341413k1636j002994j03656
$$ plain form
37484 2302712 2238603 2738743 3921565 4993221 5534063 5828365 5928492 5451541 4513924
37475 4513924 3954857 4312108 5278430 6412673 7716931 9246646 10726903 11807586 12292109
37466 12292109 12089030 11403161 10835442 10657824 10188734 8731054 6961708 6306915 6908713
37457 6908713 7407042 6982740 6375598 6414586 6791245 7020621 7458156 8368504 8917850 8232658
37447 8232658 6802214 5711376 5018735 4080529 3095889 3025033 4036329 5231086 6017532
37438 6017532 6640505 7132412 6923921 6046579 5665713 6536688 7681488 7662664 6724840
37429 6724840 6445145 7323060 8043052 7553912 6622969 6402173 6490206 5839967 4974458 5479148
37419 5479148 7263500 8257300 7495955 6681816 7465895 8807308 8785672 7782678 7679022
37410G679022R42390L88452m89889J19485J204226Q30457k28724J07229J280848
37401A1833496R46732o82372q88864Q72370J833418M41315j168412p96204N11284
37392A2902763P86108M38146Q46267J428042P43545n76307o01459P16144J510787
37383A8194036J021121M64418O89932R27663M56509o6198K57841J194227J865394
37374B5004943J858563J319025N74153P6122J65750N87753P48266O19283P79214
37365C1733072J390451J840702J682256J255047J031893R77212R31007J005739
37357D1847379J182849J145202R89922J431371K655735L628447L396155K581800
37349E8858860K592543L633756M557015M581898M130012L910202M199565N147618
$$ plain form
37410 7679022 8621412 9009864 8519975 8639460 9843686 10674143 10445419 10552648 11833496
37401 11833496 12780228 12097856 11208992 12081362 13914780 14356095 13187683 12391479 12902763
37392 12902763 13688871 14127017 14973284 16401326 17144871 16568564 15967105 16683249 18194036
37383 18194036 19215157 19679575 20369507 21297170 21753679 21687481 21945322 23139549 25004943
37374 25004943 26863506 28182531 28756684 28832806 28998556 29586309 30334575 30953858 31733072
37365 31733072 33123523 34964225 36646481 37901528 38933421 39910633 40841640 41847379
37357 41847379 43030228 44175430 45165352 46596723 49252458 52880905 56277060 58858860
37349 58858860 61451403 65085159 69642174 74224072 78354084 82264286 86463851 91611469
37341I1611469O698073P951581P787678O615455O340958P885640R850958J0531567
37333A55273379J0136371R848711R735047R130489Q355847Q268873Q413372P362170
37325B26524259M911552K354984M79640j172740k907212m340986n547730p130860
37317B13170907q775783r371733r034530r232896j0270722j0578268r443956q418900
37309A38044119q648111q798953p480670n955371o142709p242280o922792n131910
37301H1721323m098321m711344n338928m562678l060585k222088k427626l165609
37293E2134144l659200l177282j816079q92348j384648k297567k018609r06813
37285C5981598p01475j570181j890900j137999p25061j382983j881462j306658
$$ plain form
37341 91611469 98309542 106261123 114048801 120664256 127005214 134890854 144741812 155273379
37333 155273379 165409750 175258461 184993508 194123997 202479844 210748717 219162089 226524259
37325 226524259 231435811 233790795 234270435 233097695 230190483 225849497 220301767 213170907
37317 213170907 204395124 195023391 185988861 176755965 166485243 155906975 146463019 138044119
37309 138044119 129396008 120597055 113116385 107161014 101018305 93776025 86853233 81721323
37301 81721323 77623002 72911658 67572730 63010052 59949467 57727379 55299753 52134144
37293 52134144 48474944 45297662 43481583 42589235 41204587 38907020 36888411 35981598
37285 35981598 35280123 33709942 31819042 30681043 29955982 28572999 26691537 25384879
37277B5384879o15661p33612r09668l63704L8556o36639j468331j089881l0820
37268A9575119J40945o56123j121415q21313o07158q41158q19106k62819k6020
37259A4560952p07590j516990j259508M3545J168768J169398L51699l17513m37563
37250A3055198m28189o02877n75101j6769M82353J13674p89511j032624k87607
37241I918547M11438K22584l54934m49441j95124l57826r68199j129768k44912
37232F852365J046162J410226K78749j374356j950378r65205M90691J164538R48718
37223G901510M48430l0053m18880m97444l61378o25513j291150j221149J26989
37214D031362J338088R11557l11853m39919L99583M73876m02558o01095L13531
$$ plain form
37277 25384879 24769218 24035606 23125938 22762234 22800790 22164151 20695820 19605939 19575119
37268 19575119 19716064 19059941 17938526 17117213 16510055 15668897 14849791 14586972 14560952
37259 14560952 13853362 12336372 11076864 11120409 12289177 13458575 13810274 13492761 13055198
37250 13055198 12627009 12024132 11449031 11432262 11914615 12028289 11238778 10206154 9918547
37241 9918547 10329985 10552569 10197635 9748194 9553070 9195244 8227045 7097277 6852365
37232 6852365 7898527 9308753 9587502 8213146 6262768 5297563 5788254 6952792 7901510
37223 7901510 8349940 8319887 7901007 7403563 7042185 6416672 5125522 3904373 4031362
37214 4031362 5369450 6281007 5969154 5529235 5928818 6402694 6000136 5399041 5712572
37205E712572Q33107K99688N682O35329R08542p3892j182629j210107o46347l14737
37195D967208j0399L34487m2632j029749j107886J69240J081370N07791k66609
37186D602821n7453J44530n01201o12125P84243J753942M51180j319692q05841
37177D440404R67642Q07614j279764k162352p48347O46831M28683j93495P873
37168B915089M31732N43602R50451J543815R98132p47384j719000q31959M14094
37159D498572M26548j42948J5572N25816J93367q27073j264580o28916K52318
37150C048676L96265k63712q62423n22718N30269J103140O89683K61282O02602
37141D983064Q55504N4930q97671o17677K55436J11109p07063m90408O97785J136570
$$ plain form
37205 5712572 6545679 6845367 6851049 7486378 8394920 8321028 7138399 5928292 5281945 4967208
37195 4967208 4956809 5291296 5248664 4218915 3111029 3280269 4361639 4869430 4602821
37186 4602821 4545368 4689898 4188697 3576572 4360815 6114757 6565937 5246245 4440404
37177 4440404 5408046 6215660 4935896 2773544 2025197 2672028 3100711 2907216 2915089
37168 2915089 3346821 3890423 4840874 6384689 7382821 6635437 4916437 4084478 4498572
37159 4498572 4925120 4782172 4797744 5323560 5516927 4689854 3425274 2796358 3048676
37150 3048676 3444941 3181229 2318806 1796088 2326357 3429497 4119180 4380462 4983064
37141 4983064 5838568 5893498 4995827 4378150 4633586 4744695 4037632 3547224 4245009 5381579
37131E381579N68986L85833O11826k18369j748598j643989L31486J342606m8175
37122D963185j578407j156143j830J40307N2539Q54074J347776L03855q08950
37113D116406k29785Q90769O10717k79192K9990P43805k1666j368797r34206P07399
37103D265440P51102r88121j742877n77116K47023m75599q44029M75240J683682
37094B794745R56514m24525l33795O90082O18815o00270j153044m21010K04258
37085B331770l17615j147797r36666K88077J257224J077046J77382l86731k48122
37076B094568K8898l6497j91110j15567p2632k60098j31919P29925J523336J103422
37066D672326k52799j075510o91243O4285K38124j06679l84176l01932P8291M93047
$$ plain form
37131 5381579 5950565 6336398 6948224 6729855 4981257 3337268 3668754 5011360 4963185
37122 4963185 3384778 2228635 2226805 2367112 2419651 3273725 4621501 4925356 4116406
37113 4116406 3886621 4777390 5388107 5108915 5138905 5882710 5861044 4492247 3558041 4265440
37103 4265440 5016542 4028421 2285544 1708428 1955451 1479852 635823 1111063 2794745
37094 2794745 3751259 3326734 2992939 3683021 4301836 3701566 2548522 2127512 2331770
37085 2331770 2014155 866358 -70308 217769 1474993 2552039 2729421 2342690 2094568
37076 2094568 2123466 2086969 1895859 1780292 1707660 1447562 1315643 2045568 3568904 4672326
37066 4672326 4419527 3344017 2652774 2717059 2955183 2848504 2464328 2162396 2240687 2733734
37056B733734N59213J90969j48448j13780p7607l80588m46391L52634J317542
37047C987278J148855p8330r25058n98739K73154R44222J315359J199575K07868
37038G474184j143207j451962k38406J222275J487417N64136n42999j073702q23069
37029E474667k9773N43477J69327p57072r57955k2231R26350Q12445K891n01306
37019E660820m53735j91289K36332Q83440J280792Q61117j02497o26936j43872
37010G404172Q44979J303909P80475k6355q804R10801J541624J036983J28784
37001A3916568l2539L61812L65331J41030O79209J770740J988801R78514R8068
36992B0267534K53227P06223P38700Q56714J339943J141242m30756k159012k487184
$$ plain form
37056 2733734 3292947 3483916 3335468 3221688 3144081 2763493 2317102 2669736 3987278
37047 3987278 5136133 5057803 4132745 3534006 3807160 4751382 6066741 7266316 7474184
37038 7474184 6330977 4879015 4640609 5862884 7350301 7914437 7371438 6297736 5474667
37029 5474667 5444894 5988371 6157698 5400626 4442671 4420440 5346790 6159235 6162126 5660820
37019 5660820 5207085 5015796 5252128 6135568 7416360 8277477 8174980 7548044 7404172
37010 7404172 8249151 9553060 10333535 10307180 10298376 11209177 12750801 13787784 13916568
37001 13916568 13884029 14245841 14611172 14752202 15431411 17202151 19190952 20169466 20267534
36992 20267534 20520761 21226984 21965684 22822398 24162341 25303583 24872827 22713815 20226631
36983B0226631j710305j209769j299238j262669r33395q04456r27122r61933j032933
36974A0084811j379421j460942n94925O85768J054412J73137q97829j135886o36360
36965E892765j80101k68347o28730m56503N92033J581147J186572l70977j313181
36956F034678p31636J65332M2048o00136o06266j19728Q5801J79003N53107M60277
36946E462480q02102k052590j542582L34302J570999J418873P96149K18147n24482
36937D879194q79954j05353P10083k53254k193083k210421J59250J834087Q08121
36928B748670r33560q78159K19457L04238l38892j04926P57644P72776J16914
36919B664162K02712R02566P26012m14635r78034m05805J74132M8745k42477l93084
$$ plain form
36983 20226631 18516326 17306557 16007319 14744650 13811255 13006799 12079677 11117744 10084811
36974 10084811 8705390 7244448 6649523 7335291 8389703 8562840 7665011 6529125 5892765
36965 5892765 5712664 5444317 4815587 4359084 4951117 6532264 7718836 7347859 6034678
36956 6034678 5303042 5468374 5510422 4910286 4304020 4184292 4270093 4449096 5002203 5462480
36946 5462480 4660378 2607788 1065206 1399508 2970507 4389380 5185529 5403676 4879194
36937 4879194 3999240 3893887 4603970 4350716 2157633 -52788 106462 1940549 2748670
36928 2748670 1815110 936951 1156408 1460646 1121754 1016828 1774472 2547248 2664162
36919 2664162 2866874 3769440 4495452 4080817 3102783 2696978 2871110 2919855 2677378 2284294
36909B284294p25466q32052J74330J604984J470201m34941j753592r43579M98456
36900A342635N87221j47133j6004Q55095J019365L29772o6141M6257k15571q17962
36890B917534o21049M67565R48962j4073j306369j592948j043757m83448p942
36881g35525N53965Q11898N37229L71167P08833P03696l44670j370796q65651
36872C70146O63434J255954L42470p12529r44432q16927o10494K33353J413970
36863A194945J371090k35939j425281p72649K57690k32795j260779n73393J347208
36854c29903J759489K8883j330870n94436P80858Q81504K58774M44738J155311
36845C054348R27859l10102j131086p86228n8552O8530m40064r48066q92129k11537
$$ plain form
36909 2284294 1558828 726776 901106 2506090 3976291 3541350 1787758 844179 1342635
36900 1342635 1929856 1782723 1766719 2621814 3641179 3970951 3904810 3951067 3735496 2917534
36890 2917534 2296485 2764050 3713012 3698939 2392570 799622 -244135 -727583 -735525
36881 -735525 -181560 630338 1167567 1538734 2247567 2951263 2606593 1235797 370146
36872 370146 1033580 2289534 2632004 1919475 975043 158116 -452378 -219025 1194945
36863 1194945 2566035 2330096 904815 132166 389856 157061 -1103718 -1677111 -329903
36854 -329903 1429586 1458469 127599 -466837 314021 1195525 1454299 1899037 3054348
36845 3054348 3982207 3672105 2541019 1754791 1696239 1764769 1324705 376639 -515490 -727027
36835g27027N60668P56782L56920j9418n9067j00542k95499k11267K94183O21147
36825A176880M19039J99100L00866J43892o42064j225033p79791N6660J53278
36816a97173k64492n0782R03051J448877Q57332l45503j180146j029754R8288
36807B39698J311331J288085n0861r58425j69459R58681L35011j416476j656729
36798a19144J34006J429124N69513q05400o19615L93125K38799r60070j329185
36789a068847k85653Q66389J208307J212652J273245Q68846k12398j054137q29599
36780A978805p3225M9437o79137j370168j277363o05763p113K62594L78749M01494
36770i41690J90122q0389J27182Q51175J195716M26423p94102j127259m22434
$$ plain form
36835 -727027 -166359 590423 947343 927925 868858 768316 472817 261550 555733 1176880
36825 1176880 1595919 1795019 2095885 2239777 1597713 372680 -407111 -350451 -197173
36816 -197173 -461665 -512447 390604 1839481 2696813 2351310 1171164 141410 239698
36807 239698 1551029 2839114 2788253 1829828 1660369 2619050 2954061 1537585 -119144
36798 -119144 14862 1443986 2013499 1208099 588484 981609 1220408 260338 -1068847
36789 -1068847 -1354500 -488111 720196 1932848 3206093 4074939 3862541 2808404 1978805
36780 1978805 1905580 1955017 1275880 -94288 -1371651 -1977414 -1984527 -1721933 -1343184 -941690
36770 -941690 -751568 -831957 -704775 146400 1342116 1768539 974437 -152822 -575256
36761e75256J49968k0181j14142N58618J219208P98585k88165o94303j06147M67233
36751A395418K91237k43574n27725n92401o91434o81484k89634L67745R06668
36742f5184J086964Q55403K32600n49138r92232p90656l01859j87906m74191l57858
36732a544057O76282J827420J715120J93278j288185j475887p66011k77925j76453
36723a116418J27360N93606O01177K28349J97826M44874P0288r43608j334898
36714a131444n03369M38866M19412K5328K85889Q70483Q12401K58588Q2657K61132
36704A819943O1216m40357m26681J50808M34417R0634l04301m24154o05624r02986
36694e47085p99037j57212M68619P50829R34978J027585N68900m23017j139228
$$ plain form
36761 -575256 -425288 -445469 -559611 -993 1218215 2016800 1728635 1034332 928185 1395418
36751 1395418 1686655 1443081 915356 322955 -368479 -1049963 -1339597 -971852 -65184
36742 -65184 1021780 1877183 2109783 1560645 568413 -222243 -524102 -712008 -1186199 -1544057
36732 -1544057 -867775 959645 2674765 2868043 1579858 103971 -662040 -939965 -1116418
36723 -1116418 -989058 -395452 205725 434074 631900 1076774 1147062 203454 -1131444
36714 -1131444 -1634813 -1195947 -776535 -751207 -465318 405165 1217566 1476154 1558811 1819943
36704 1819943 1881159 1440802 1014121 1164929 1599346 1689980 1385679 961525 355901 -547085
36694 -547085 -1346122 -1503334 -1034715 -283886 651092 1678677 2247577 1824560 685332
36685F85332j041019n07183m5341M06472R43117J122296M87762p09067j669796
36676c27427j703371p12362N80925J058643M44372j62727K05979P86497K55148
36667D25677q43978o69495P83271J260954k17873j535227o66685J104673J180851
36658H22168m20021j398750p43600L08713O43489M54926j1504q82731j501318
36649b728628p48827R28227J581941N54856m80700j49213O41724N42496M0326
36640A82202K90013Q35115L71162q48719j241504l63366N25639M93998O1117m2951
36630B62706M5611m111k282K31997M04109K95199J21733k3224l89936q70833q30968
36619g59999q5784O72896Q84214P81919N69465j05406j088201j148752L25293
$$ plain form
36685 685332 -355687 -862870 -908211 -501739 441378 1563674 2051436 1342369 -327427
36676 -327427 -2030798 -2743160 -2162235 -1103592 -659220 -821947 -615968 170529 425677
36667 425677 -418301 -1087796 -304525 956429 738556 -796671 -1463356 -358683 822168
36658 822168 402147 -996603 -1740203 -1431490 -788001 -333075 -344579 -1227310 -2728628
36649 -2728628 -3477455 -2549228 -967287 -412431 -893131 -1042344 -400620 141876 182202
36640 182202 472215 1307330 1678492 829773 -411731 -775097 -249458 244540 305657 262706
36630 262706 308317 304206 301924 533921 938030 1233229 1354962 1331738 941802 70969 -759999
36619 -759999 -845783 -172887 711327 1493246 2062711 1957305 869104 -279648 45645
36610D5645J820777J349740p63624k236490j845379n76358L24484Q23012J146322
36601H8129R07797N7512m92243j54844L71972L38804J77932M73012O18920j92948
36591B194043j298322j264446L5744J294407J528488Q69283j78926j124514j301450
36582G54307m69453M67012M29938k83549n62875l21511l36773m47367K89530J476060
36572I95319J397068j97376j282821n75832M78682J70479o88103l40537P91240
36563G48119Q19398l78497r38781m1229R23125P02864m3510j55158J80535O983
36553A823849p92789j424611j301238n21495M87094J238060J302742O78725j2370
36544A477967j15035K22954J73148n98208j201137n29699J002761J554876K42214
$$ plain form
36610 45645 1866422 3216162 2452538 216048 -1629331 -2205689 -1881205 -1058193 88129
36601 88129 995926 1053438 561195 406351 778323 1117127 1295059 1768071 2386991 2194043
36591 2194043 895721 -368725 -332981 961426 2489914 3359197 3180271 2055757 754307
36582 754307 284854 751866 1181804 898255 335380 13869 -322904 -770271 -480741 995319
36572 995319 2392387 2195011 912190 336358 815040 985519 297416 -43121 748119
36563 748119 1567517 1189020 250239 209010 1132135 1834999 1791489 1636331 1816866 1823849
36553 1823849 1031060 -393551 -1694789 -2216284 -1729190 -491130 811612 1490337 1477967
36544 1477967 1362932 1585886 1759034 1160826 -40311 -570010 432751 1987627 2229841
36535B229841j341132j087840O31373J477379N69749m50066k74233J43724l24398
36526A574397q11005j35764P75392K98656r96024j139020O0789Q99274O26918
36517A153613J69646p6m24720q52963k06911J102070J144719m12273j438042o81490
36507d46427K73734j39463q38268k45856P75674M82126o13837o66170K90708N90284
36497e37495J0137Q3494J202270J734835O73072p41456r52030k14433K18006J8024
36487A494424j51827N4043K20557m8455m82040m84235m761K43956k14400o75744
36477d8482j40045R08252Q85654l34953q48287K99556J227371M1841j879809j779953
36467a668855J95047J311055N63868j90415K43864O30441K7492l76852L33978
$$ plain form
36535 2229841 888709 -199131 432242 1909621 2479370 2029304 1755071 1898795 1574397
36526 1574397 763392 627628 1403020 1701676 705652 -433368 -372579 526695 1153613
36517 1153613 1323259 1323183 898463 45500 -161411 940659 2085378 1673105 235063 -446427
36507 -446427 -172693 -312156 -1150424 -1396280 -620606 -138480 -752317 -1418487 -1127779 -537495
36497 -537495 -527358 -443864 758406 2493241 3166313 2424857 1472827 1258394 1476400 1494424
36487 1494424 1342597 1396640 1617197 1568742 1086702 602467 597706 841662 627262 -48482
36477 -48482 -188527 719725 1605379 1270426 422139 721695 1949066 1990907 111098 -1668855
36467 -1668855 -1473808 -162753 401115 210700 454564 1085005 1112497 735645 1069623
36458A069623Q69631O5406q04410k07382P67031J88192j224600j148989L89070
36449c6428J007349j8844o23179L80135J182326J06368j324797o63561J459208
36440A468577K110972L99923j388232j318189k98097q6886n96695o87224m22158
36431h18009o92333j184255o52950Q06741J590585J046246L78581M42800L59576
36422A276982n93201j328340p38337J74593j37623r84392l78823J625655K754431
36413A670945J812335J72320m93794k34706O0945O5899j91626p14988j078231
36404A069099o34959L41637P74041L47355j80134m00838o09776n90543K39568
36395C55450J169450O80856q19118r87535P48057J859223O09550j077013p48395
$$ plain form
36458 1069623 1939254 2004660 1200250 992868 1759899 1948091 723491 -425498 -36428
36449 -36428 970921 952077 328898 709033 1891359 1997727 672930 9369 1468577
36440 1468577 3579549 3979472 2591240 1273051 974954 888068 291373 -395851 -818009
36431 -818009 -1510342 -2694597 -3347547 -2540806 -950221 96025 474606 917406 1276982
36422 1276982 683781 -644559 -1382896 -1208303 -1345926 -2330318 -2709141 -1083486 1670945
36413 1670945 3483280 3655600 3161806 2927100 2988045 3053944 2862318 2147330 1069099
36404 1069099 434140 775777 1549818 1897173 1717039 1316201 706425 115882 355450
36395 355450 1524900 2205756 1386638 399103 1147160 3006383 3615933 2538920 1790525
36386A790525O53327O26506p06841j173538l29282K76179J26048J90526M81131
36377A934581j14600j322498j352354J70921J370653Q98940l61603j038456r63534
36368g77950m80923L06773R33474O66923k22959o34045l96250l64021n20303J69226
36358a320055J533126J826379M48362q48708n81615L32882L53897k87173m21820
36349A035275K5456L18239L34945L92566L42873m2912m24229n08483n69310n98613
36339C05807N2856J293465J682199L84256j252505j388136j49748R18126J127086
36330B973406R48205O05158j27716r45073j151385p43370l17873j4774M81082
36321A707660J001718R18713J35194o92577r63646o43377p4578K80972J05701
$$ plain form
36386 1790525 2443852 3070358 2363517 1189979 860697 1136876 1262924 1453450 1934581
36377 1934581 1819981 497483 -854871 -683950 686703 1585643 1224040 185584 -777950
36368 -777950 -1258873 -952100 -18626 648297 425338 -208707 -604957 -968978 -1489281 -1320055
36358 -1320055 213071 2039450 2487812 1639104 1057489 1390371 1744268 1457095 1035275
36349 1035275 1060731 1378970 1713915 2106481 2449354 2406442 1982213 1473730 904420 305807
36339 305807 358663 1652128 3334327 3718583 2466078 1077942 928194 1846320 2973406
36330 2973406 3921611 4526769 4399053 3453980 2302595 1559225 1241352 1226578 1707660
36321 1707660 2709378 3628091 3763285 3070708 2107062 1463685 1389107 1670079 1775780
36312A775780m11507p41031p37658p13401o46718j07218P40112J004479M19383
36303E82221j50841j11098J467k96924n12393k16496J29791K30044N74594J079015
36293A309380N77016j075818j951665p62536Q42428P20866l18572K3519J535055
36284H99673J770796J30864j125005m37399Q38661P06923p17586j737640j265167
36275i35880K26589J275286P66717p21539j263854o1239J200595P05882p26672
36266D65885j020001j44676K12249k24075r4529P42776Q03844j99587o89156l4035
36256a81305L86580k22070p34179l54935K2064j80817m9615P40017Q31087l53644
36246i6817j131193k43633Q72857M12201q52642r90332L4631P59580O60321L19673
$$ plain form
36312 1775780 1364273 623242 -114416 -827817 -1474535 -1581753 -841641 162838 582221
36303 582221 431380 320282 321749 24825 -487568 -704064 -574273 -344229 230365 1309380
36293 1309380 1886396 810578 -1141087 -1903623 -1061195 -340329 -658901 -635382 899673
36284 899673 2670469 2801333 1676328 1238929 2077590 2784513 2066927 329287 -935880
36275 -935880 -709291 565995 1332712 611173 -652681 -713920 486675 1192557 465885
36266 465885 -554116 -698792 -486543 -710618 -805147 -62371 741473 541886 -147270 -181305
36256 -181305 205275 -16795 -750974 -1105909 -1083845 -1264662 -1314277 -574260 256827 -96817
36246 -96817 -1228010 -1471643 -598786 -186585 -1039227 -2029559 -1994928 -1235348 -575027 -255354
36236b55354J4118k04070J29425R27299R47628l05996j214483k98363J284179
36227A024383J414467J67668p66317q97500r46038p89353J96237J186613P37658
36218A327818n93264q09978L13735R20310J96067m98625j57208L72504K16518
36209A287877o8741J80034M69645J38167n73724j127301j308523q49736L79349
36200a472953J492270J237461j22282r68289o61928j65643j8784M35796J197715
36191I53363J020058l06079j062189l33293L08544m48715j104609J80070K037997
36182A245147J625971q08940k019194n15799J439036J330344l46858j464329j216113
36173g30735l88751J80781J89496l39886q66374n49593N45441J153598N31607
$$ plain form
36236 -255354 -241236 -445306 -315881 611418 1559046 1253050 38567 -259796 1024383
36227 1024383 2438850 2606518 1840201 942701 -3337 -792690 -596453 590160 1327818
36218 1327818 734554 -75424 238311 1158621 1354688 856063 698855 1071359 1287877
36209 1287877 1219136 1399170 1868815 2006982 1433258 305957 -1002566 -1852302 -1472953
36200 -1472953 19317 1256778 1134496 166207 -495721 -661364 -680148 -244352 953363
36191 953363 1973421 1667342 605153 271860 580404 131689 -972920 -792850 1245147
36182 1245147 2871118 2062178 42984 -472815 966221 2296565 1949707 485378 -730735
36173 -730735 -1119486 -938705 -749209 -1089095 -1955469 -2505062 -1959621 -806023 -274416
36164b74416k82428O4118J181052J554459P74977j73774o43393r46096j199479
36155E5020r49786k80044K1622j09424K64863J254250J427470J5932j439405j120014
36145h59516L62999J014007N22322L12603P95696P10127m72599j452908j154813
36136b22082k71105Q9651n8300k24626l61586l10485M05040J377367J252106j46290
36126A529690j059634l89891M45199j46822j142998n49959J146196J571661J49165
36117A552607j134064p99864L09325P58431L90820j37327m29005m05641j91773
36108h6491j83161m81549m35348L35003R08742L35952n76856l88320M97239M53682
36098C78893m71074n73017M41035Q74431J04231l07973M12004O67474o04548j731732
$$ plain form
36164 -274416 -556844 -492726 688326 2242785 3017762 2843988 2200595 1254499 55020
36155 55020 -894766 -1174810 -1153188 -1262612 -997749 256501 1683971 1699903 260498 -859516
36145 -859516 -496517 517490 1039812 1352415 2148111 2858238 2385639 932731 -222082
36136 -222082 -493187 -403536 -461836 -686462 -1048048 -1358533 -953493 423874 1675980 1529690
36126 1529690 470056 80165 525364 378542 -764456 -1314415 -168219 1403442 1552607
36117 1552607 418543 -381321 -71996 686435 1077255 939928 510923 105282 -86491
36108 -86491 -269652 -751201 -1186549 -851546 57196 393148 -183708 -572028 -74789 378893
36098 378893 -92181 -665198 -224163 650268 754499 446526 858530 1526004 921456 -810276
36088h10276r74067M97376N22495n98324r19212p1129O64280P94367Q62953P24791
36078F93254j98617j163175p83411N06467P61194m66961j418642q75841K47611
36069b698121P11650O29680N21981K38897j96337l2828Q28304J098940k3241j264514
36059a85589r57693M38664J054073M27173o0772L50214N46835n48412k060640
36050i96147k264307r63275L77255O94291M39263M42010O45453N51704K40541
36041h33212J56735K48305J20407j31353o0038K14567J10013k84447j17084Q31731
36031B55624J546892J125085o565q37848j082225j033662p15494k2174O69831
36022a00536Q43055N55001J75246k47085o89866o81611L3744P23971N01845l40801
$$ plain form
36088 -810276 -1784343 -1286967 -764472 -1362796 -2282008 -2353137 -1688857 -894490 -31537 693254
36078 693254 494637 -668538 -1451949 -945482 -184288 -651249 -2069891 -2945732 -2698121
36069 -2698121 -1986471 -1356791 -834810 -595913 -792250 -825078 3226 1102166 1078925 -185589
36059 -185589 -1143282 -704618 349455 776628 715856 1066070 1612905 1064493 -996147
36050 -996147 -3260454 -4223729 -3846474 -3152183 -2712920 -2270910 -1625457 -1073753 -833212
36041 -833212 -676477 -428172 -307765 -439118 -499156 -284589 -174576 -459023 -576107 255624
36031 255624 1802516 2927601 2921036 2083188 1000963 -32699 -748193 -770367 -100536
36022 -100536 742519 1297520 1472766 1225681 535815 -145796 -112052 611919 1113764 772963
36012G72963q00531o91225n92720m80181K44115J272171J377010L01905o49215
36003G54292n28003k2921l0774j34404L88974J007192P33533j23126m09919J804
35993A636648K05077j8104M5739L93523j3740j296299j839280n45898J201180
35984b31154J290888o2917o95494K28324J099330N22207n70965o00271J02331
35975A082279J1277r29298j154800o2616R37264N92536l42104m42930K04987M50606
35965C47201J05745Q7338O19170O93049k72246j362371j447993p22797j46276
35956b099180O9549M48656R99537J022875K91243m83171p06270o56732o88332
35947a801825m10821N42303J444553J199397j8690q68807o80665j83511j14300
$$ plain form
36012 772963 -27568 -718793 -1311513 -1791694 -1547579 -275408 1101602 1403507 754292
36003 754292 226289 203368 172594 38190 427164 1434356 2167889 2044763 1634844 1636648
35993 1636648 1841725 1823621 1869360 2262883 2249143 952844 -886436 -1432334 -231154
35984 -231154 1059734 996817 301323 529647 1628977 2151184 1580219 979948 1082279
35975 1082279 1093556 164258 -990542 -1053158 -115894 476642 134538 -308392 -103405 347201
35965 347201 452946 540284 1159454 1852503 1580257 217886 -1230107 -1952904 -2099180
35956 -2099180 -2029631 -1580975 -581438 441437 732680 249509 -456761 -1113493 -1801825
35947 -1801825 -2212646 -1670343 -225790 973607 954917 86110 -594555 -778066 -892366
35938h92366j31858K78913P10407M96441j18849l60563j12727N8759j69870n77593
35928h19306p81399m54028M12856J053235M87339q65625j159825L22120J729083
35919g5550J177621l83286p45261O0302K36370l78230k10829P49149O11861q36270
35909B05877j299556P7702R31817l51179j666181n82375J588617J886711J90882
35900I82315j167631j039265p6428J177625K217566J662600q25982k666402j356538
35891a092140J428910J932821p1883j308909m76023J91018n92668j009005J37676
35882h60203J042568J89578r14717m78656N41517M17162l67374l79509J71126
35873f38508K76126J33204K71227L3812j023533j521414j98196J640658J814976
$$ plain form
35938 -892366 -1024224 -745311 -34904 461537 342688 -17875 -130602 -71843 -241713 -819306
35928 -819306 -1600705 -2054733 -1641877 -588642 -101303 -966928 -2126753 -1804633 -75550
35919 -75550 1102071 718785 -26476 33826 270196 -108034 -318863 430286 1042147 205877
35909 205877 -1093679 -1015977 -84160 -435339 -2101520 -2683895 -1095278 791433 982315
35900 982315 -185316 -1224581 -1301009 -123384 2094182 3756782 2930800 264398 -1092140
35891 -1092140 336770 2269591 2197708 888799 412776 603794 11126 -997879 -860203
35882 -860203 182365 371943 -542774 -1021430 -479913 -62751 -430125 -809634 -638508
35873 -638508 -362382 -229178 42049 75861 -947672 -2469086 -2667282 -1026624 788352
35864G88352N18806l04841j00997N152m31612o83284n08137m00091l28130Q6349
35854a358433L85448q3518o78802l20955N34511O02090Q2833K63156J019386R20174
35844A365890j20138n49121J02762M24477l23530r88111p23830l83369n91748
35835a786718l70491Q46400J537665L00207j512696j447440M06678J531621O78249
35826A83475n21840k22315R54261J077451j26904r52154l49889M90841L3504j086069
35816e19639r16174O61985J457429K54609j188221p84017O84924R43468j61628
35807D32736p22676o0562M93707K81609L57193J154840J359563K09157j007188
35798B498379j041925n67137n56778m39500M49554J050968K29980q89070m69783
$$ plain form
35864 788352 1307158 1002317 901320 906472 474860 -208424 -716561 -1116652 -1444782 -1358433
35854 -1358433 -972985 -1056503 -1735305 -2056260 -1521749 -919659 -836826 -573670 445716 1365890
35844 1365890 1245752 696631 799393 1223870 900340 -87771 -811601 -1194970 -1786718
35835 -1786718 -2157209 -1310809 226856 527063 -985633 -2433073 -2026395 -494774 183475
35826 183475 -338365 -560680 393581 1471032 1344128 391974 42085 532926 566430 -519639
35816 -519639 -1435813 -773828 683601 938210 -250011 -1034028 -349104 594364 432736
35807 432736 -289940 -350502 143205 424814 782007 1936847 3296410 3505567 2498379
35798 2498379 1456454 889317 332539 -106961 342593 1393561 1623541 734471 264688
35789B64688Q86510R18990o20520j498858n09562Q07724P65079q2068l37464n8601
35779E35918j72835n64735l17267N29940Q76666K40375o02004q80071p72112o68196
35769a794321l47764L98205R25748M72565m90287o71376J65311P87243L81707
35760a72969k06908M8874O00752K82131o20725p80101n4004L45690J4061l7117
35750e80316N77060O66794m92105j638025j296939M7618Q90347Q95108P37024
35741a93434N06390j49731p25726l10756P31743R83053l62j108733j314295p65066
35731b346917k8768O65713J080302Q31387O5267m77440m63878l55197m44864k50962
35721a725357N91576J415703J210060J4302r88782q78383r8822J72577l43269
$$ plain form
35789 264688 1151198 2070188 1449668 -49190 -558752 248972 1014051 931983 594519 535918
35779 535918 363083 -201652 -518919 11021 887687 1128062 526058 -354013 -1126125 -1794321
35769 -1794321 -2142085 -1743880 -818132 -345567 -835854 -1507230 -1341919 -554676 -172969
35760 -172969 -379877 -331003 269749 551880 -68845 -848946 -902950 -557260 -543199 -580316
35750 -580316 -3256 663538 171433 -1466592 -2763531 -2715913 -1825566 -930458 -193434
35741 -193434 312956 163225 -562501 -873257 -141514 841539 841177 -267556 -1581851 -2346917
35731 -2346917 -2375685 -1709972 -629670 201717 266984 -210456 -674334 -1029531 -1474395 -1725357
35721 -1725357 -1133781 281922 1491982 1506284 517502 -360881 -459703 -287126 -630395
35712f30395n67726L69601J601569J484269n1076j316117j281541p85671o63650
35703a840737k09250J184261K177483J165469r51458j710995n42183O76966N53043
35694E02599k16609m95031k32217J87000O21173O56141j94831j250659j034111
35685a456545N11297J583573J022565j26089m06346j1306r183n73874j051888
35676e17796j013781m14907N38974J111580N87686l90558k93330Q78095J203658
35667A689621j61579j325125m74372J219515J464169L97107O921P15805R30436
35658D462498j09608j233010j403004j037391p43645k78174N56907J162288R98008
35649B374869M10529P7991J59109K81014l381p45492j264327o56032Q34044J559902
$$ plain form
35712 -630395 -1198121 -828520 773049 2257318 2206242 890125 -391416 -1177087 -1840737
35703 -1840737 -2049987 -865726 1311757 2477226 1525768 -185227 -727410 -50444 502599
35694 502599 285990 -209041 -441258 -254258 366915 1023056 828225 -422434 -1456545
35685 -1456545 -945248 638325 1660890 1534801 1128455 1117149 1107966 534092 -517796
35676 -517796 -1531577 -1946484 -1407510 -295930 291756 -98802 -392132 485963 1689621
35667 1689621 1528042 202917 -271455 948060 2412229 2809336 2816257 3532062 4462498
35658 4462498 4352890 3119880 1716876 679485 -64160 -342334 214573 1376861 2374869
35649 2374869 2785398 2863389 3022498 3303512 3300131 2554639 1290312 634280 1468324 3028226
35639C028226M72099j213178j475082j90634Q87507O14311l64866q50155l65487
35630E42741P48038J527140R03866r56179k250442j639564j64375L73808K07355
35621g07612P89070J739308J173557q21767j749977n03478Q93693N34847o09615
35612G38026p09793L6944L01315l7809k10984j46998j67696j0888M31959L33132
35602E57208p09850j447331o02166J056712J745676J105195J76221m28709q49611
35593F03345r66007n20181L8532O5614k26604k52472q1062K0114L48032R56460
35583a4229R79353Q8334l89899N32882J422268M13048j530375j814928k79729
35574e93275O31650j45990q94148l26465M04197O6706n34265k74631K80634J63532
$$ plain form
35639 3028226 3500325 2287147 812065 621431 1508938 2123249 1758383 908228 542741
35630 542741 1290779 2817919 3721785 2765606 515164 -1124400 -1288775 -914967 -707612
35621 -707612 81458 1820766 2994323 2172556 422579 -80899 812794 1347641 738026
35612 738026 28233 65177 366492 328683 117699 -29299 -196995 -207883 224076 557208
35602 557208 -152642 -1599973 -2202139 -1145427 600249 1705444 1881665 1452956 603345
35593 603345 -362662 -882843 -844311 -778697 -1005301 -1257773 -1338835 -1318721 -970689 -14229
35583 -14229 965124 1053458 663559 1196441 2618709 3031757 1501382 -313546 -593275
35574 -593275 38375 -107615 -1001763 -1328228 -924031 -857325 -1391590 -1666221 -1385587 -1222055
35564a222055j62851J54679O56745M67716l9721K9367M54838M17237L3298p202
35554G82051J50074j64823p63521q24568l08601N1989P0601K54428O15076M52407
35544C15113m18192j129833q61700R2975O97636L21410o17559j006433j60879
35535b767462J234028J656622N52659q40592r85602R2186J113458J307405R72639
35526B335341N02869r7684o04436m50052L63766R20597M55304o65563j440184
35517A319958j357272o42424K81383J060262J276598O26738n69588j388984j168482
35508e61811k50161M21719M05354J08005k3666j41026m55664n53968L7988Q23877
35498a89353P40849l01884j117523q01625J33408O49588N58407L79290L11835
$$ plain form
35564 -1222055 -1384906 -1230227 -573482 -105766 -145487 -116120 338718 755955 789253 782051
35554 782051 932125 767302 3781 -820787 -1129388 -1077399 -1006798 -752370 -137294 315113
35544 315113 -103079 -1232912 -2094612 -2001637 -1304001 -982591 -1600150 -2606583 -2767462
35535 -2767462 -1533434 123188 675847 -164745 -1150347 -1058161 55297 1362702 2335341
35526 2335341 2838210 2740526 2136090 1686038 2049804 2970401 3425705 2760142 1319958
35517 1319958 -37314 -679738 -398355 661907 1938505 2565243 1995655 606671 -561811
35508 -561811 -811972 -390253 15101 123106 99440 -41586 -497250 -1051218 -1013230 -189353
35498 -189353 551496 249612 -867911 -1669536 -1536128 -886540 -328133 51157 362992
35489C62992R0191l39463o26383m79477M4363O14570P62099K40348m59660l81001
35479a71421O56071J501423R82761n32419j565687j342127m69043J39741K78218
35470e22483K30400J60235O3547J695P8890K72560M05913K99668K0968m5371L65555
35459A331577Q42463N88614n21208j586998j680194q15321L25490J140543J269797
35450H94763O38279j82107k98375K48554K86442p12791j522106q76195N14101
35441a009435J044563O53767M77934M91936m25956j948944k030731O506K011778
35432g28582J851555K20859p61994n43404j58147j42196j03493J6167k21528o93280
35422a264043p01435q8492N50000P53445N23923p3045q10546r93317j65249R68556
$$ plain form
35489 362992 453183 113720 -512663 -992140 -947777 -333207 428892 669240 209580 -171421
35479 -171421 484650 1986073 2968834 2436415 870728 -471399 -940442 -800701 -522483
35470 -522483 -292083 -131848 -68301 -66606 12284 284844 690757 990425 1011393 966022 1331577
35459 1331577 2174040 2762654 2241446 654448 -1025746 -1841067 -1515577 -375034 894763
35450 894763 1533042 1350935 1052560 1301114 1587556 874765 -647341 -1523536 -1009435
35441 -1009435 35128 688895 1166829 1658765 1232809 -716135 -2746866 -2740360 -728582
35432 -728582 1122973 1343832 581838 38434 -119713 -261909 -365402 -349235 -570763 -1264043
35422 -1264043 -1965478 -2053970 -1503970 -750525 -226602 -299647 -1110193 -2103510 -2268759 -1300203
35412a300203J224239M95644k41849m02418k81639p3187M86377J208863J243494
35403B359321L11333o51759o82814l4880L26813K3097m77036o13090l32134o6622
35393A62229k86527q94315j108236l43189Q61258J372644R13792K61669n5244
35384H84081l39994p37513p05714r0232K38675k76841p08789M7484J335296J456641
35374A103094J85494q09423l34251P36964Q62548n7171q00904n88154J02623L92173
35364G92993O0519l90466m06780N5216N41518N93813J96338l08173o67005r01799
35354d33826j046240r29186l68414M90189J132964J045710K31341o17769o85187
35345a180418O2804P45896N89968j43100n84000l85939N3958L38402M20922K47394
$$ plain form
35412 -1300203 -75964 419680 177831 -224587 -506226 -579413 -93036 1115827 2359321
35403 2359321 2670654 2018895 1336081 1301201 1628014 1651111 1174075 560985 228851 162229
35393 162229 -124298 -1018613 -2126849 -2470038 -1608780 -236136 677656 939325 884081
35384 884081 544087 -193426 -899140 -989372 -750697 -1027538 -1736327 -1688843 -353547 1103094
35374 1103094 1288588 479165 144914 881878 1744426 1687255 886351 298197 400820 792993
35364 792993 853512 463046 56266 111482 653000 1246813 1443151 1134978 467973 -433826
35354 -433826 -1480066 -2409252 -2777666 -2287477 -1154513 -108803 122538 -495231 -1180418
35345 -1180418 -1117614 -371718 218250 75150 -508850 -894789 -840831 -502429 -81507 165887
35335A65887k53893o94588m60748K99390O46594K13457j70476J69149N47932J7433
35325D80137r21120r29253O6751P23656L80255j9764L71405Q85330N07931m36017
35315A109311q70968o74897o14753q33728o00985L29856J146022J079200L08900
35306C77958n28281j013242q49250Q8534J130641J044031l78934j601414j137329
35297b867286L56743Q73077j76744j161000n24254J144956K054699J545955N87302
35288A833448J83207J94864m7882o07112r01511o01036j06617j4265l27771m68480
35278h63155r6358L36196J26275o56544j074974m48178P12156J250980P56219
35269D2617j7115j99558J18473J84543k86813p50386o16885J8708O24568Q76094
$$ plain form
35335 165887 -88006 -782594 -1243342 -943952 -297358 -83901 -254377 -85228 462704 480137
35325 480137 -440983 -1370236 -1303485 -579829 -199574 -219338 152067 1037397 1545328 1109311
35315 1109311 238343 -436554 -1051307 -1885035 -2486020 -2156164 -1010142 69058 377958
35306 377958 -150323 -1163565 -2012815 -1924281 -793640 250391 -128543 -1729957 -2867286
35297 -2867286 -2510543 -1637466 -1814210 -2975210 -3499464 -2354508 -299809 1246146 1833448
35288 1833448 2016655 2211519 2163637 1556525 655014 53978 -52639 -66904 -394675 -863155
35278 -863155 -959513 -623317 -497042 -1153586 -2228560 -2676738 -1964582 -713602 42617
35269 42617 25502 -174056 -55583 128960 -157853 -908239 -1525124 -1506416 -881848 -5754
35259e754P77414M19639j228j17144K00530M49452K2227q60135j264614p00222
35249a079835L51664J159463J384621Q66326l95785j621126j530553m3605J104545
35240A95715N14341p59983o26667Q83444J570918L50077j154898j056061J91765
35231A08651P83260J72623o07976p03151k75401K23503N91124O60362L14004k17493
35221A049506n89007p96654r52113q40548k85292K59629J66532l77870m84604
35212b850421K75782J325894J773425J285753K61879n75842p88994n86719m29800
35203c09043k68762K98931R84001P87755m26629j241958m85400J003050J515282
35194A857227Q19694Q2539j56879m72733j080360j302617p45274J30842Q02590
$$ plain form
35259 -5754 771660 1191299 1190071 1072927 1273457 1722909 1745136 885001 -379613 -1079835
35249 -1079835 -728171 431292 1815913 2682239 2286454 665328 -865225 -908830 195715
35240 195715 710056 -49927 -676594 206850 1777768 2127845 972947 -83114 108651
35231 108651 891911 1064534 456558 -246593 -521994 -298491 292633 952995 1266999 1049506
35221 1049506 460499 -336155 -1288268 -2128816 -2414108 -2154479 -1987947 -2365817 -2850421
35212 -2850421 -2574639 -1248745 524680 1810433 2072312 1496470 707476 120757 -309043
35203 -309043 -577805 -278874 705127 1492882 1066253 -175705 -661105 341945 1857227
35194 1857227 2676921 2759460 2602581 2129848 1049488 -253129 -998403 -867561 -64971
35185f4971J051992N66921o44351j472967p39716Q70680J389049L23529p30952
35176E49214o14160k0830J83047K55156L32026k74906j392224j397167K44821
35167b135023J571616R56932k84033j38147P77877N74297m33908m21211M86910
35158I55310M51698n67965o16081O08049R51311m26710j374874l21988J010433
35149F69183M46658j101667j241843J09258R31237L84369l59736m07960l20927
35140h91428p17018j151910q78006J33312J225440J616243R87282k6657k51183
35131D6075N77309J248177O68075n40769r73636m79229r6604k45575k74028J74701
35121A04496N78250N62715M43551M12471J47677l76816n78784k18534J27690J8187
$$ plain form
35185 -64971 987021 1553942 909591 -563376 -1303092 -432412 956637 1280166 549214
35176 549214 -64946 -85776 97271 352427 684453 409547 -982677 -2379844 -2135023
35167 -2135023 -563407 393525 109492 -28655 749222 1323519 889611 468400 955310
35158 955310 1407008 839043 222962 831011 1782322 1355612 -19262 -341250 669183
35149 669183 1115841 14174 -1227669 -1118411 -187174 197195 -162541 -570501 -891428
35140 -891428 -1608446 -2760356 -3638362 -3505050 -2279610 -663367 323915 297258 46075
35131 46075 623384 1871561 2539636 1998867 1025231 546002 449398 203823 -70205 104496
35121 104496 682746 1245461 1689012 2101483 2249160 1872344 1293560 1075026 1202716 1220903
35111A220903j81415j02825j20279o20540j123213q95436o9166N58242N80392
35102g53337K21463k32032n98122n69147K5021P50286R34649N38742J83552K66362
35092G67437M90839L67082j79099p88684j002719o03315J41081O28895N54131
35083C75648K31650L9136j55760n58816p87615l61077L43189M73236K7936j17371
35073d89844L46645O58010K54962l80205o23485n67969m27013J246N79015M89730
35063a58908m42821j006642k80175P76768P19718j38073m24106m8540m0490l86842
35053a430111o5376P53396O89588k81806m61784O04657J025073l16675j640959
35044a123997j042713M07669N07173m90448o00978L88361P59007J576m12738K49350
$$ plain form
35111 1220903 1039488 936663 816384 195844 -927369 -1822805 -1891971 -1333729 -753337
35102 -753337 -531874 -763906 -1362028 -1931175 -1906154 -1155868 -221219 317523 501075 767437
35092 767437 1258276 1625358 1446259 657575 -345144 -948459 -807378 -178483 375648
35083 375648 607298 646434 490674 -68142 -855757 -1216834 -873645 -400409 -372473 -489844
35073 -489844 -143199 514811 769773 389568 -233917 -801886 -1228899 -1227653 -648638 -158908
35063 -158908 -601729 -1608371 -1888546 -1111778 -392060 -530133 -954239 -1002779 -1043269 -1430111
35053 -1430111 -1495487 -742091 -52503 -334309 -796093 -191436 833637 516962 -1123997
35044 -1123997 -2166710 -1759041 -1251868 -1742316 -2343294 -1954933 -1195926 -1194350 -1607088 -1357738
35034a357738P54796J62179n77978l11045M93463P12601K84679j13842k89048
35025b41933m18945l14862K56996Q53932P50426p1727q49612q83686j84904N86255
35015e18060P12963J46818m14999m71616m57931r21865j277389m42310J251805
35006b392584K018970R45097p29562j320784p32595M6791N90043J041696J079470
34997E46542K11416r78839j128602M2329J127100Q26369l43459q36658j78317
34988g12119N52928L51689m03220o83478k78676J66701K96973L88828N53551M77507
34978G10684J99675K76376P47195Q05181Q0560o41414p44294q51427j497168j678565
34968b593197k64308J761522K232432P93472p61415j161881q90056n05319L25668
$$ plain form
35034 -1357738 -602942 -440763 -1018741 -1329786 -836323 -123722 160957 47115 -241933
35025 -241933 -660878 -975740 -718744 135188 885614 813887 -35725 -919411 -1104315 -518060
35015 -518060 194903 341721 -73278 -544894 -1002825 -1924690 -3202079 -3644389 -2392584
35006 -2392584 -373614 571483 -158079 -1478863 -2211458 -2164667 -1574624 -532928 546542
34997 546542 757958 -220881 -1349483 -1307154 -180054 646315 302856 -533802 -712119
34988 -712119 -159191 192498 -210722 -894200 -1172876 -1006175 -709202 -320374 233177 710684
34978 710684 910359 1186735 1933930 2739111 2819671 2178257 1433963 582536 -914632 -2593197
34968 -2593197 -2857505 -1095983 1136449 1929921 1168506 6625 -883431 -1388750 -1063082
34959a063082J413566J457481J6285j322926j013573K87824Q96576N39000K39530
34950A450681L74693K72069l98428j006792q81710j27562N78674O13581o8042
34941H07164p73300p19315m0920L30693J8461k73222N125K91029q4540n97949
34931a036774k08921R57211J547991O97766q33750j511534p73651L34517M29045
34922c98100m18486p22447K83776J367206J024116k53636q21796m95357n23017
34913i57741j059342p57943O53127J493328P88709q8539K75845J058914P52330
34904B158688l74378r99925q74991o32359l62389J11113L27177j4712j54055M43180
34894c72651P91672r1516j251002j080219J74720R42938P56003L87221J01609
$$ plain form
34959 -1063082 350484 1807965 1824250 501324 -512249 -224425 672151 1211151 1450681
34950 1450681 1825374 2097443 1699015 692223 -189487 -317049 261625 875206 807164
34941 807164 33864 -685451 -726371 -395678 -377217 -650439 -645314 -354285 -438825 -1036774
34931 -1036774 -1245695 -288484 1259507 1957273 1123523 -388011 -1161662 -827145 -398100
34922 -398100 -816586 -1539033 -1255257 111949 1136065 882429 60633 -434724 -957741
34913 -957741 -2017083 -2775026 -2121899 -628571 160138 71599 347444 1406358 2158688
34904 2158688 1784310 784385 -90606 -722965 -1085354 -974241 -647064 -661776 -815831 -372651
34894 -372651 419021 327505 -923497 -2003716 -1828996 -886058 -130055 257166 358775
34885C58775m06536p30824k32443M90656L69480k17130q6468N29574L78218m31974
34875B1328n53615J18869K55854m29890o66312L4460O16614N81206P50772J250239
34865A979525Q45563p09917j654801q14897M92144N54870j88315k35597M81912
34856G50487P71558J51141p02997j059182o97736J93069R40587P46382k31923
34847H61386p91205k75380M93096N28454J04712N1919L62193M13987O8566k90118
34837A527610m27213l16262N8445M06206J46363o97617j160375n53807M50104
34828e66546O72964K2006m97192k06299M47806N96352O9424l95979q8465O49087
34818G03158P08964k72863j258201j175263l56655J70663K38718L23172L00094
$$ plain form
34885 358775 -47761 -778585 -1011028 -520372 -150892 -368022 -454490 75084 453302 21328
34875 21328 -532287 -413418 -157564 -587454 -1253766 -1219306 -602692 -21486 729286 1979525
34865 1979525 2825088 2115171 460370 -354527 137617 692487 504172 268575 750487
34856 750487 1522045 1673186 970189 -88993 -786729 -593660 346927 1093309 861386
34847 861386 70181 -205199 287897 816351 921063 972982 1335175 1749162 1817728 1527610
34837 1527610 1100397 784135 842580 1248786 1395149 697532 -462843 -1016650 -566546
34828 -566546 106418 128424 -368768 -575067 -127261 469091 538515 142536 54071 703158
34818 703158 1412122 1139259 -118942 -1294205 -1650860 -1480197 -1241479 -918307 -618213
34809f18213k44590p90697m47440M05585N63086p051k42439n072j50103m99618
34799b036552Q2163J190233Q52726j109895k120055o39523J311714J261361n9398
34790a267226l68259M38727P06547J39741o0331K99155J64467n40871n93945L51124
34780g30871J059585O44203k18746m71306J9881P00024R87611M99326n79151j258934
34770F51622o91956N79801J101651L25043p67597r77173k15747O25955P07336
34761A338935L1309n98048n04849k8042j7270m36104l44604M39612P84051M1642
34751G06632p05335k65440P28869Q23564K9523l22127K99097J004266R63757L79522
34741C642328j29432k70415j28340o7803m83125j171191j290117m79023M39948
$$ plain form
34809 -618213 -862803 -1653500 -2100940 -1695355 -1132269 -1139320 -1381759 -1386831 -1536934 -2036552
34799 -2036552 -1954389 -764156 88570 -1021325 -3141380 -3780903 -2469189 -1207828 -1267226
34790 -1267226 -1635485 -1196758 -490211 -350470 -410801 -111646 52821 -488050 -1081995 -730871
34780 -730871 328714 972917 754171 282865 302746 1002770 1990381 2489707 1910556 651622
34770 651622 -40334 539467 1641118 1966161 1198564 221391 5644 631599 1338935
34761 1338935 1370244 772196 267347 239305 222035 -214069 -558673 -119061 664990 706632
34751 706632 1297 -264143 464726 1288290 1317813 995686 1294783 2299049 3262806 3642328
34741 3642328 3512896 3242481 3114141 3046338 2563213 1392022 101905 -377118 62830
34732F2830N02127j41034o40752n95972j48550M46270P07496J38746p64859o51072
34722a084770P09474J653387R14461m59435q42988n37356p90809j271549o30417
34713b340002Q84886J517370O76146l55013n20955j47601J87228M27162M68828
34704G98049J22589k49713j98645j19107n04404o95110J08772J052428O95000
34695A009859m45782n17531N82220J019213J46562n26988p9081L71676j45768
34686A414380q36070p70678l78028k46028m3502L69491L28306j73540j6448J039509
34676F87392J526550N56087p16550j104130j140310j444109j129544L82889J565612
34667h16113Q70207o11951p28986M14828R01956J28639o69273o94404l84808n4703
$$ plain form
34732 62830 564957 423923 -216829 -812801 -961351 -515081 192415 331161 -433698 -1084770
34722 -1084770 -375296 1278091 2192552 1733117 890129 352773 -438036 -1709585 -2340002
34713 -2340002 -1455116 62254 738400 383387 -137568 -285169 -97941 329221 798049
34704 798049 920638 670925 472280 353173 -151231 -846341 -737569 314859 1009859
34695 1009859 564077 46546 628766 1647979 1794541 1267553 1188472 1560148 1414380
34686 1414380 578310 -192368 -570396 -816424 -859926 -490435 -162129 -335669 -352117 687392
34676 687392 2213942 2770029 2053479 949349 -190961 -1635070 -2764614 -2381725 -816113
34667 -816113 54094 -557857 -1286843 -872015 29941 158580 -510693 -1205097 -1589905 -1644608
34657a644608M34415O71611O5123p57162n34412N57140J003129K94140l84731
34648b95355j42672L78351K40750n19178j332468j779712j483245l38419Q43609
34639d428339R76650K87547J45850R43893J389762N31889p19558j002971m45004
34630b320281r1315j11412J81919Q22113R15184M1502r52364r60866N0406J080179
34620a344935J243705O10317p0713k62011q5271Q3111J66029K94124L57928N4075
34610A046359n97961j104427r72251j94507P11198J040789M89695l77530n67409
34601e26044N8370L86441l86063j261889o71393R50566J350474k72690j736387
34592b108615q35226J357810J927090L02434j041756l20451J103832J034162k92200
$$ plain form
34657 -1644608 -1210193 -538582 -473459 -1230621 -1765033 -1207893 -204764 89376 -295355
34648 -295355 -438027 -59676 181074 -338104 -1670572 -3450284 -4933529 -5271948 -4428339
34639 -4428339 -3451689 -3164142 -3018292 -2074399 -684637 -152748 -872306 -1875277 -2320281
34630 -2320281 -2411596 -2523008 -2341089 -1518976 -603792 -562290 -1514654 -2475520 -2425114 -1344935
34620 -1344935 -101230 509087 438374 176363 91092 174203 340232 634356 992284 1046359
34610 1046359 448398 -656029 -1628280 -1822787 -1111589 -70800 418895 41365 -526044
34601 -526044 -467674 -81233 -467296 -1729185 -2400578 -1450012 -99538 -372228 -2108615
34592 -2108615 -2943841 -1586031 341059 643493 -398263 -718714 385118 1419280 1127080
34583A127080q53064k2000O57798m2703j242945j306119j17518Q46197M78150
34574d75124o08351q99993J06805J218774J036106j46861o69639J25257Q44244
34565E31218J12131j201403j139131M12391J537406J093658R2637k07321q1318
34556A150268l41269p96508p92957l92372Q119M54987Q87372O55682l51041r65858
34546d83577l57737M66344K04906n10648j95669P87968P05393n51273j161316
34537a095609l79658L35893n9549m96175J28017R17711N58449l90233m65144L04075
$$ plain form
34583 1127080 274016 252016 909814 867111 -375834 -1681953 -1799471 -953274 -475124
34574 -475124 -1083475 -1983468 -1876663 -657889 378217 231356 -438283 -313026 531218
34565 531218 643349 -558054 -1697185 -1284794 252612 1346270 1438907 1231586 1150268
34556 1150268 808999 12491 -780466 -1172838 -1164719 -709732 177640 833322 482281 -483577
34546 -483577 -841314 -374970 -170064 -680712 -876381 -88413 616980 65707 -1095609
34537 -1095609 -1475267 -1139374 -1198923 -1695098 -1567081 -649370 -90921 -481154 -946298 -642223
$$ [...]
##END NTUPLES=NMR SPECTRUM
##END=
