##TITLE=31Pdec_LR-758-CR3-CHL
 CCl4, 24 sc
 22.11.2022
##JCAMPDX= 6.0         $$ Bruker NMR JCAMP-DX V2.0
##DATA TYPE= NMR SPECTRUM
##DATA CLASS= NTUPLES
##ORIGIN= UXNMR, Bruker Analytische Messtechnik GmbH
##OWNER= root
$$ XWIN-NMR		Version 3.5
$$ Tue Nov 22 14:52:34 2022 Russian Standard Time (UT+4h)  she@DPX200
##.OBSERVE FREQUENCY= 81.013821
##.OBSERVE NUCLEUS= ^31P
##.ACQUISITION MODE= SIMULTANEOUS
##.ACQUISITION SCHEME= undefined
##.AVERAGES= 24
##.DIGITISER RES= 16
##SPECTROMETER/DATA SYSTEM= spect
##.PULSE SEQUENCE= zgpg30
##.SOLVENT NAME= CDCl3
##.SHIFT REFERENCE= (INTERNAL, CDCl3, 0, 248.564)
##AUDIT TRAIL= $$ (NUMBER, WHEN, WHO, WHERE, WHAT)
$$ ##TITLE= Audit trail, XWIN-NMR		Version 3.5
$$ ##JCAMPDX= 5.01
$$ ##ORIGIN= Bruker BioSpin GmbH
$$ ##OWNER= she
$$ F:/spectra/data/she/nmr/P31/1/pdata/1/auditp.txt
$$ ##AUDIT TRAIL=  $$ (NUMBER, WHEN, WHO, WHERE, WHAT)
(   1,<2022-11-22 14:51:12.89 +0400>,<she>,<DPX200>,
      <created by zg, POWCHK disabled, PULCHK disabled
       configuration hash MD5:
       00 E9 B6 7A A2 85 ED C7 34 08 36 98 17 FE 4E 26
       data hash MD5: 32K
       D5 86 92 58 40 92 7F FA CB 66 4B EE 31 B6 C4 DF>)
(   2,<2022-11-22 14:51:15.76 +0400>,<she>,<DPX200>,
      <Start of raw data processing
       efp BC_mod = 2 LB = 1 FT_mod = 6 PKNL = 1 PHC0 = -10224.6 PHC1 = 44.85597 SI = 64K 
       data hash MD5: 64K
       0B 97 DA 2D 4C 23 1B 32 95 76 99 19 CB 53 D0 A5>)
(   3,<2022-11-22 14:52:03.93 +0400>,<she>,<DPX200>,
      <pk PHC0 = -76.10303 PHC1 = 174.2001 
       data hash MD5: 64K
       AC B3 2B BB 4B 7B 43 4A 1A 67 CF DC B4 3A 15 DF>)
$$ ##END=
$$ 
$$ hash MD5
$$ 3B 47 42 D7 B4 44 25 AD 53 50 32 FC C7 60 40 E0
##$RELAX= 
##$RELAX= 
##$RELAX= 
##$RELAX= 
##$RELAX= 
##$RELAX= 
##$RELAX= 
##$RELAX= 
##$RELAX= 
$$ Bruker specific parameters
$$ --------------------------
##$DU= <F:/spectra>
##$EXPNO= 1
##$NAME= <P31>
##$PROCNO= 1
##$TYPE= <nmr>
##$USER= <she>
##$AMP= (0..31)
100 100 100 100 100 100 100 100 100 100 100 100 100 100 100 100 100 100 
100 100 100 100 100 100 100 100 100 100 100 100 100 100 
##$AQSEQ= 0
##$AQ_mod= 1
##$AUNM= <au_zg>
##$AUTOPOS= <>
##$BF1= 81.014009
##$BF2= 200.13
##$BF3= 200.13
##$BF4= 200.13
##$BF5= 200.13
##$BF6= 200.13
##$BF7= 200.13
##$BF8= 200.13
##$BYTORDA= 1
##$CFDGTYP= 0
##$CFRGTYP= 5
##$CHEMSTR= <none>
##$CNST= (0..31)
1 1 145 1 1 1 1 1 1 1 1 1 1 1 1 1 1 1 1 1 1 1 1 1 1 1 1 1 1 1 1 1 
##$CPDPRG= <waltz16>
##$CPDPRG1= <>
##$CPDPRG2= <waltz16>
##$CPDPRG3= <>
##$CPDPRG4= <mlev>
##$CPDPRG5= <mlev>
##$CPDPRG6= <mlev>
##$CPDPRG7= <mlev>
##$CPDPRG8= <mlev>
##$CPDPRGB= <>
##$CPDPRGT= <>
##$D= (0..31)
0 1 0 0 0 0 0 0 0 0 0 0.03 2e-05 3e-06 0 0 0 0 0 0 0 0 0 0 0 0 0 0 0 0 
0 0 
##$DATE= 1669114272
##$DBL= (0..7)
120 120 120 11 120 120 24 19 
##$DBP= (0..7)
150 150 150 150 150 150 150 150 
##$DBP07= 0
##$DBPNAM0= <>
##$DBPNAM1= <>
##$DBPNAM2= <>
##$DBPNAM3= <>
##$DBPNAM4= <>
##$DBPNAM5= <>
##$DBPNAM6= <>
##$DBPNAM7= <>
##$DBPOAL= (0..7)
0.5 0.5 0.5 0.5 0.5 0.5 0.5 0.5 
$$ [...]
##$SUBNAM2= <"">
##$SUBNAM3= <"">
##$SUBNAM4= <"">
##$SUBNAM5= <"">
##$SUBNAM6= <"">
##$SUBNAM7= <"">
##$SUBNAM8= <"">
##$SUBNAM9= <"">
##$SW= 501.771253377433
##$SWIBOX= (0..15)
0 1 3 0 0 0 0 0 0 0 0 0 0 0 0 0 
##$SW_h= 40650.406504065
##$TD= 32768
##$TD0= 1
##$TE= 0
##$TE2= 300
##$TE3= 300
##$TEG= 300
##$TL= (0..7)
0 120 53 12 22 120 120 120 
##$TP= (0..7)
150 150 150 150 150 150 150 150 
##$TP07= 0
##$TPNAME0= <>
##$TPNAME1= <>
##$TPNAME2= <>
##$TPNAME3= <>
##$TPNAME4= <>
##$TPNAME5= <>
##$TPNAME6= <>
##$TPNAME7= <>
##$TPOAL= (0..7)
0.5 0.5 0.5 0.5 0.5 0.5 0.5 0.5 
##$TPOFFS= (0..7)
0 0 0 0 0 0 0 0 
##$TUNHIN= 0
##$TUNHOUT= 0
##$TUNXOUT= 0
##$USERA1= <user>
##$USERA2= <user>
##$USERA3= <user>
##$USERA4= <user>
##$USERA5= <user>
##$V9= 5
##$VALIST= <valist>
##$VCLIST= <CCCCCCCCCCCCCCC>
##$VD= 0
##$VDLIST= <DDDDDDDDDDDDDDD>
##$VPLIST= <PPPPPPPPPPPPPPP>
##$VTLIST= <TTTTTTTTTTTTTTT>
##$WBST= 1024
##$WBSW= 4
##$XGAIN= (0..3)
0 0 0 0 
##$XL= 0
##$YL= 0
##$YMAX_a= 9257
##$YMIN_a= -11856
##$ZGOPTNS= <>
##$ZL1= 120
##$ZL2= 120
##$ZL3= 120
##$ZL4= 120
##$ABSF1= 0
##$ABSF2= 0
##$ABSG= 0
##$ABSL= 0
##$ALPHA= 0
##$AQORDER= 0
##$ASSFAC= 0
##$ASSFACI= 0
##$ASSFACX= 0
##$ASSWID= 0
##$AUNMP= <proc_1d>
##$AZFE= 0.1
##$AZFW= 0.5
##$BCFW= 0
##$BC_mod= 2
##$BYTORDP= 0
##$COROFFS= 0
##$CY= -3
##$DATMOD= 1
##$DC= 0
##$DFILT= <>
##$DTYPP= 0
##$F1P= 0
##$F2P= 0
##$FCOR= 1
##$FTSIZE= 65536
##$FT_mod= 6
##$GAMMA= 0
##$GB= 0
##$INTBC= 1
##$INTSCL= 6.047779e-11
##$ISEN= 30
##$LB= 1
##$LEV0= 0
##$LPBIN= 0
##$MAXI= 10000
##$MC2= 0
##$MEAN= 0
##$ME_mod= 0
##$MI= 50
##$NCOEF= 0
##$NC_proc= -8
##$NLEV= 6
##$NOISF1= 182.463
##$NOISF2= 159.3651
##$NSP= 0
##$NTH_PI= 0
##$NZP= 0
##$OFFSET= 248.5645
##$PC= 4
##$PHC0= -10300.7
##$PHC1= 219.0561
##$PH_mod= 1
##$PKNL= yes
##$PPARMOD= 0
##$PSCAL= 0
##$PSIGN= 0
##$REVERSE= no
##$SF= 81.0140089999694
##$SI= 65536
##$SIGF1= 159.3651
##$SIGF2= -187.1042
##$SINO= 113.3802
##$SIOLD= 16384
##$SREGLST= <1H.CDCl3>
##$SSB= 0
##$STSI= 65536
##$STSR= 0
##$SW_p= 40650.406504065
##$SYMM= 0
##$S_DEV= 0
##$TDeff= 32768
##$TDoff= 0
##$TI= <>
##$TILT= no
##$TM1= 0
##$TM2= 0
##$TOPLEV= 0
##$USERP1= <user>
##$USERP2= <user>
##$USERP3= <user>
##$USERP4= <user>
##$USERP5= <user>
##$WDW= 1
##$XDIM= 65536
##$YMAX_p= 348997745
##$YMIN_p= -29493158
$$ End of Bruker specific parameters
$$ ---------------------------------
##NTUPLES= NMR SPECTRUM
##VAR_NAME=  FREQUENCY,     SPECTRUM/REAL,   SPECTRUM/IMAG
##SYMBOL=    X,             R,               I
##VAR_TYPE=  INDEPENDENT,   DEPENDENT,       DEPENDENT
##VAR_FORM=  AFFN,          ASDF,            ASDF
##VAR_DIM=   65536,         65536,           65536
##UNITS=     HZ,            ARBITRARY UNITS, ARBITRARY UNITS
##FACTOR=    0.620285442955139, 1,           1
##FIRST=     20137.2065510682, 0,            0
##LAST=      -20513.1999529968, 0,           0
##MIN=       -20513.1999529968, -29493158,   0
##MAX=       20137.2065510682, 348997745,    0
$$ Real data points
##PAGE= N=1
##DATA TABLE= (X++(R..R)), XYDATA
$$ [...]
13045d309583q68770K713511O308796K398442n662000p210920m33118N003895
$$ -4309583 -5178353 -2464842 3843954 6242396 580396 -6630524 -7063642 -2059747
13037b059747K633879k705219m145420j912209O34619K948605M767379L551543
$$ -2059747 574132 -2131087 -6276507 -8188716 -7554097 -4605492 161887 3713430
13029C713430q53440l812152k364069L92665J073342J134307K185192J682520
$$ 3713430 2859990 -952162 -3316231 -2923566 -1850224 -715917 1469275 3151795
13021C151795j612486l207162M6831L320948J132999l059594k496489J136649
$$ 3151795 1539309 -1667853 -1621022 1699926 2832925 -226669 -2723158 -1586509
13013a586509O08700m073068n342829p52398L107402J300534k698895l760604
$$ -1586509 -977809 -5050877 -10393706 -11146104 -8038702 -6738168 -9437063 -13197667
13005a3197667j917376P33670M075112P326189P221716K618765k616103m358655
$$ -13197667 -15115043 -14381373 -10306261 -2980072 4241644 6860409 4244306 -114349
12997a14349k868213n52808J517587K740715K056356J51650m97110L37990j36320
$$ -114349 -2982562 -3535370 -2017783 722932 2779288 2930938 2433828 2771818 2635498
12988B635498k669918l847114j364392K097303K970196J677523O84093M22905
$$ 2635498 -34420 -3881534 -5245926 -3148623 -178427 1499096 2183189 2606094
12980B606094p3141o90716p99428n09634K31876J815574L279805K975997J519723
$$ 2606094 2532953 1842237 1042809 533175 765051 2580625 5860430 8836427 10356150
12971A0356150R34746O08764j697262m468902l553563K02381Q88428k586924l734089
$$ 10356150 11290896 11899660 10202398 5733496 2179933 2382314 3270742 683818 -3050271
12962c050271N11600L585811J08589m123602j162496N439040N736464p74950m587325
$$ -3050271 -2538671 1047140 1155729 -2967873 -4130369 1308671 7045135 6270185 1682860
12953A682860j039025L732712L398357m9126j523060m81538L64030m4422p89350
$$ 1682860 643835 4376547 7774904 7725778 6202718 5721180 6085210 6040788 5251438
12944E251438j270590j696617k514330l823595m217997j332593M342726P983285
$$ 5251438 3980848 2284231 -230099 -4053694 -8271691 -9604284 -5261558 2721727
12936B721727N935665R91431j569199j392385j966581l702241l613862j417491
$$ 2721727 8657392 9648823 8079624 6687239 4720658 1018417 -2595445 -4012936
12928d012936k95803j073953q12776J771511M088384M032777K530303Q23205r66873
$$ -4012936 -4308739 -5382692 -6195468 -4423957 -335573 3697204 6227507 7050712 6083839
12919F083839j953364j026556K72388o49625k761437k601943k95324M26899j274238
$$ 6083839 4130475 3103919 3376307 2726682 -34755 -2636698 -2932022 -2505123 -3779361
12910c779361j942788k2142J607385Q84248l46422k80527J56069K42876Q95012
$$ -3779361 -5722149 -5744291 -4136906 -3252658 -3599080 -3879607 -3723538 -3480662 -2585650
12901b585650J680265O82341j315108j048283J456602K208400n2534j632485l53538
$$ -2585650 -905385 -223044 -1538152 -2586435 -1129833 1078567 1026033 -606452 -959990
12892i59990J029883L43678k73177R88142K157357J668125J222238J510533j1160
$$ -959990 69893 413571 140394 1128536 3285893 4954018 6176256 7686789 7675629
12883G675629l859741n992638m035451j200209m26621L20937K930803M470835
$$ 7675629 3815888 -2176750 -6212201 -7412410 -7839031 -7518094 -4587291 -116456
12875a16456K282989q66039j434916n94099n74359j04787J761031J952420j350685
$$ -116456 2166533 1300494 -134422 -728521 -1302880 -1407667 353364 2305784 955099
12866I55099m254651l071746p3501J618805L341155N489731L414361l904624p693464
$$ 955099 -3299552 -6371298 -6444799 -4825994 -1484839 4004892 7419253 3514629 -4178835
12857d178835j235942P792557P546104n6117l584194r18909l31861l848504l866249
$$ -4178835 -5414777 2377780 9923884 9867767 6283573 5364664 5032803 1184299 -2681950
12848b681950J654316M302027J8641l377098K45194M641745J767121n074344o938552
$$ -2681950 -1027634 3274393 3293034 -84064 161130 4802875 6569996 1495652 -5442900
12839e442900k545669J849188K317523M52121j050942r62368P67129K537706K120642
$$ -5442900 -7988569 -6139381 -3821858 -3369737 -4420679 -5383047 -4615918 -2078212 42430
12830D2430Q6927m52919J176787K150846J242291N51635P73968k09974k312585
$$ 42430 129357 -323562 853225 3004071 4246362 4797997 5571965 5361991 3049406
12821C049406k292076J29999J011211p05167j225836L10606n87597m608366m969063
$$ 3049406 757330 887329 1898540 1193373 -32463 278143 -309454 -4917820 -9886883
12812i886883J480243O978550L900908l258980n097358j316951J246148O61382
$$ -9886883 -8406640 -1428090 2472818 -786162 -5883520 -7200471 -5954323 -5292941
12804e292941O83716J825844P47350k214427k975599j024427K69638L73517J740129
$$ -5292941 -4609225 -2783381 -2036031 -4250458 -7226057 -8250484 -7980846 -7607329 -5867200
12795e867200L491217J984918j978496l310253p56087J517836J297725R15228
$$ -5867200 -2375983 -391065 -2369561 -5679814 -6435901 -4918065 -3620340 -2705112
12787b705112J368450L63146j940087j470499K857179O257749M934659J071711
$$ -2705112 -1336662 -973516 -2913603 -4384102 -1526923 4730826 9665485 10737196
12779A0737196j715805l310818m518841l894413o98446K266494K196752K80013
$$ 10737196 9021391 5710573 1191732 -2702681 -3401127 -1134633 1062119 1342132
12771A342132n79958J13838R18321J076681O86914r1230o36468l53674j85359
$$ 1342132 762174 876012 1794333 2871014 3557928 3466698 2830230 2476556 2291197
12762B291197j400404k607823j034204K673812M445414K574057j15616j113277
$$ 2291197 890793 -1717030 -2751234 -77422 4367992 6942049 6826433 5713156
12754E713156j392144k121300k168609j022813m64129r70796j70206K506758L410785
$$ 5713156 4321012 2199712 31103 -991710 -1455839 -2426635 -2596841 -90083 3320702
12745C320702J41388l954123m314462j362904J278859K059529J495313l37391
$$ 3320702 3462090 -492033 -4806495 -6169399 -4890540 -2831011 -1335698 -1673089
12737a673089k477134j866242K311899N413449L049332j926965l127135J28132
$$ -1673089 -4150223 -6016465 -3704566 1708883 4758215 2831250 -295885 -167753
12729a67753K685763J978674P69680R95152N79654j757372l436689k531360j468671
$$ -167753 2518010 4496684 5266364 6261516 6841170 5083798 1647109 -884251 -2352922
12720b352922k925533m841950l221222J558701M780375L556959J03578j794230
$$ -2352922 -5278455 -10120405 -13341627 -11782926 -7002551 -3445592 -3342014 -5136244
12712e136244j359644m69345j13947O37940K137138K777202J424957l24629l35208
$$ -5136244 -6495888 -6965233 -7079180 -6441240 -4304102 -1526900 -101943 -426572 -761780
12703g61780O59979L81134q51189m64742J736210K839137J632637M68051P39777
$$ -761780 -101801 279333 -571856 -1036598 699612 3538749 5171386 5639437 6379214
12694F379214L38484j993731l541950k078378k395j75855p79850J080224L301403
$$ 6379214 6717698 4723967 1182017 -896361 -898756 -1074611 -1854461 -774237 2527166
12685B527166J736639k364557l524387k08522L396910L947218K485882Q97821
$$ 2527166 4263805 1899248 -1625139 -1833661 1563249 5510467 7996349 8894170
12677H894170p66996k473018l284321l007476k034993k2409K366677K099458j737857
$$ 8894170 8127174 5654156 2369835 -637641 -2672634 -2695043 -328366 1771092 33235
12668C3235m312686j477938K424148N16705m517035l638878L191720N732575J84822
$$ 33235 -4279451 -5757389 -3333241 -2816536 -7333571 -10972449 -7780729 -2048154 -1863332
12659a863332m113608j99202N073253L196467j742313j234988K522386J375476
$$ -1863332 -5976940 -6176142 -1102889 2093578 351265 -883723 1638663 3014139
12651C014139l736407m625176k08210K775388K287278K602811L429790n18799
$$ 3014139 -722268 -5347444 -5555654 -2780266 -492988 2109823 5539613 5020814
12643E020814p294750p204005J434672P346959L009311l951354l585713J241140
$$ 5020814 -2273936 -9477941 -8043269 -696310 2313001 -1638353 -5224066 -3982926
12635c982926J935972q04957j34066L141388J600915n053631q248141m011914
$$ -3982926 -2046954 -2851911 -2985977 155411 1756326 -3297305 -11545446 -15557360
12627a5557360J212161J400779l46667J465436N477192O580456M256232K067122
$$ -15557360 -14345199 -12944420 -13291087 -11825651 -6348459 231997 4488229 6555351
12619F555351J112827m60324k307671j614370J397374K462225k76373k713793
$$ 6555351 7668178 7207854 4900183 3285813 4683187 7145412 6869039 4155246
12611D155246p03437L363484L840573J13090k864002k142998l14720l35217j288261
$$ 4155246 3451809 6815293 10655866 10768956 7904954 5761956 5447236 5112019 3823758
12602C823758j681081k807748n188569n194574j08524N804021N874103O36335
$$ 3823758 2142677 -665071 -5853640 -11048214 -11156738 -5352717 521386 1157721
12594A157721k872783j339656J232628J130333P7979L96291N00593j264640k764306
$$ 1157721 -1715062 -3054718 -1822090 -691757 -613778 -217487 283106 -981534 -3745840
12585c745840j951107q88944j817817k498981p114L526751L886109J604802P51173
$$ -3745840 -5696947 -6585891 -8403708 -10902689 -10909803 -7383052 -3496943 -1892141 -1140968
12576a140968J927220J643462j285853l501076k293621P31027K559546K490434
$$ -1140968 786252 2429714 1143861 -2357215 -4650836 -3919809 -1360263 1130171
12568A130171J651339R53319O30342L79688n12545k054662k880719k068300p83841
$$ 1130171 2781510 3734829 4365171 4744859 4232314 2177652 -703067 -2771367 -3555208
12559c555208l33337J96119J894667K984454J193076j693273j697467R71182J779369
$$ -3555208 -3888545 -3692426 -1797759 1186695 2379771 686498 -1010969 -39787 1739582
12550A739582r62275l182001j375963J995529K515290M03397n42151Q71765J786562
$$ 1739582 777307 -2404694 -3780657 -1785128 730162 1133559 591408 1463173 3249735
12541C249735O0028k412140k321003N28940K753617J564517j442460j939342J342006
$$ 3249735 3309763 897623 -1423380 -894440 1859177 3423694 1981234 41892 1383898
12532A383898M183439K080257l318024n858058k917685J417056K349802N71392
$$ 1383898 5567337 7647594 4329570 -1528488 -4446173 -3029117 -679315 -107923
12524a07923Q2678J769766K324649n50763m493850n297821k176033J396482K157561
$$ -107923 -25245 1744521 4069170 3518407 -975443 -6273264 -8449297 -7052815 -4895254
12515d895254Q21489J20562L14588o69449k667144k469164P12249K618455J35221
$$ -4895254 -4073765 -3953203 -3638615 -4308064 -6975208 -9444372 -8732123 -6113668 -5978447
12506e978447k950089j079672M232876O332139L344449m6466j064712k254486
$$ -5978447 -8928536 -10008208 -5775332 556807 3901256 3854790 2790078 535592
12498E35592m456124l377349K662848P494619N241415o25707k549461m1425J146239
$$ 535592 -3920532 -7297881 -4635033 2859586 8101001 7475294 4925833 4884408 6030647
12489F030647q47132j899244R227J385133m08412k936794l291048k375694j817684
$$ 6030647 5183515 3284271 3293498 4678631 4270219 1333425 -1957623 -4333317 -6151001
12480f151001m70498K605534M624352K463160j969102l525196o97692K485417
$$ -6151001 -6621499 -4015965 608387 3071547 1102445 -2422751 -3120443 -635026
12472f35026K105342n76729j299869J137774L102167J042214l254927m437455
$$ -635026 1470316 893587 -406282 731492 3833659 4875873 1620946 -2816509
12464b816509p92829K846913J365904l355737m743980o23450L820772L290135
$$ -2816509 -3609338 -762425 603479 -2752258 -7496238 -8119688 -4298916 -1008781
12456a008781q31314l237167j744244J349596L385741L635570K134406n88027
$$ -1008781 -1840095 -5077262 -6821506 -5471910 -2086169 1549401 3683807 3095780
12448C095780k423601j227556J778955K713265K97846k005926q45117K244314
$$ 3095780 672179 -555377 1223578 3936843 4234689 2228763 1383646 3627960
12440C627960L324333J661929j66067q61841j614784k619171k012785M27392J750250
$$ 3627960 6952293 8614222 8448155 7586314 5971530 3352359 1339574 1766966 3517216
12431C517216J30474j895350j145306J317401K103227P92842j82841q2221m32771
$$ 3517216 3647690 1752340 607034 1924435 4027662 4820504 4637663 4555442 4122671
12422D122671j180449l17346J811166J820768j280769l579883j861815J220010
$$ 4122671 2942222 2624876 4436042 6256810 4976041 1396158 -465657 754353
12414G54353J019705k025655l119385k92363K859167K329076j155727l506788
$$ 754353 1774058 -251597 -3370982 -3663345 -804178 1524898 369171 -3137617
12406c137617k256827J097195L158873K263685k9462j074017m05353J55718k77884
$$ -3137617 -5394444 -4297249 -1138376 1125309 1095847 21830 -383523 -227805 -505689
12397e05689j97114J417650K645721J273581j303043j578405R61791L036748K316441
$$ -505689 -702803 714847 3360568 4634149 3331106 1752701 2714492 5751240 8067681
12388H067681K80847q56933j596708l277041m387181j922080L432356O432202
$$ 8067681 8348528 7491595 5894887 2617846 -1769335 -3691415 -259059 6173143
12380F173143L447350k213720l855471M945L556932J456718l946029n841211k023345
$$ 6173143 9620493 7406773 3551302 3556247 7113179 8569897 4623868 -1217343 -3240688
12371c240688K616123K734092j289235m771059m174203j38543L386738K606626
$$ -3240688 -624565 2109527 820292 -3950767 -8124970 -8263513 -4876775 -2270149
12363b270149j909940m703459j532043M407233O026758K238760o41878J106163
$$ -2270149 -4180089 -8883548 -10415591 -6008358 18400 2257160 1615282 2721445
12355B721445K956708J09967m276450m402357j223847J72163k98592J196659L718404
$$ 2721445 5678153 5788120 1511670 -2890687 -4114534 -3942371 -4240963 -3044304 674100
12346F74100K359986j942225k086591L336184O167753J028748n772753n782973
$$ 674100 3034086 1091861 -994730 2341454 8509207 9537955 3765202 -2017771
12338b017771j035636L78815k400741k590236K406533O768330N307736M24238
$$ -2017771 -3053407 -2674592 -5075333 -7665569 -5259036 1509294 6817030 7241268
12330G241268k575673k362064p98974J100170L037131L540178J519596j380769
$$ 7241268 4665595 2303531 1504557 2604727 5641858 9182036 10701632 9320863
12322I320863k611323k177764j971181k239702j336431Q36563J733605k13232
$$ 9320863 6709540 4531776 2560595 320893 -1015538 -178975 1554630 1341398
12314A341398k700025k158451J507537M579102L870107M9269l508460m028087
$$ 1341398 -1358627 -3517078 -2009541 2569561 6439668 6488937 2980477 -1047610
12306a047610j392606J870086K485079l65815l558692l265992K31204L054850
$$ -1047610 -2440216 -570130 1914949 1549134 -2009558 -5275550 -5044346 -1989496
12298a989496L228203K553779K025960m46706m876380o018131m44170O198700
$$ -1989496 1238707 3792486 5818446 5371740 495360 -5522771 -5966941 231759
12290B31759N516792j337011m885542j174607L234678K347196p71025r35916L15775
$$ 231759 5748551 4411540 -474002 -1648609 1586069 3933265 3162240 2226324 2542099
12281B542099j099594l716681l422712j094918l91504l12030K689229O454085
$$ 2542099 1442505 -2274176 -5696888 -6791806 -7183310 -7495340 -4806111 1647974
12273A647974M796095k173920o781467m520419N26758L179749L662418L562765
$$ 1647974 6444069 4270149 -2511318 -7031737 -6504979 -3325230 337188 3899953
12265C899953J504128k712206m753057j729459K335103K267761k44909n2196K548030
$$ 3899953 5404081 2691875 -2061182 -3790641 -1455538 812223 567314 515118 3063148
12256C063148K554910j163788m211765l777574j890582o61299P11798K623967
$$ 3063148 5618058 4454270 242505 -3535069 -5425651 -6086950 -5375152 -2751185
12248b751185L155822J537007j5244J33447P05575M28985J40393K06553r08709
$$ -2751185 404637 1941644 1926400 2059847 2765422 3194407 3334800 3541353 2632644
12239B632644l348059m212626j652874K156285M453403N314911N152487K342909
$$ 2632644 -715415 -4928041 -6580915 -4424630 28773 5343684 10496171 12839080
12231A2839080l108948o858684n513676j837618n4689R97827M196889O486566
$$ 12839080 9730132 2871448 -2642228 -4479846 -4534535 -3536708 660181 7146747
12223G146747K755476l732444l835659L126996O626868L58353p861598p624324
$$ 7146747 9902223 6169779 2334120 5461116 12087984 12446337 4584739 -3039585
12215c039585o57907L481290J737266p29642o09497J08197K48661J435366L030757
$$ -3039585 -3697492 -216202 1521064 791422 181925 290122 538783 1974149 5004906
12206E004906J621966k688516n016898k871341J82885M08822q16561l75367J506368
$$ 5004906 6626872 3938356 -1078542 -3949883 -3766998 -3358176 -4174737 -4550104 -3043736
12197c043736K567389K145294O43266k261619n904770p012863l067915L461467
$$ -3043736 -476347 1668947 2312213 50594 -5854176 -12867039 -15934954 -12473487
12189a2473487P005895N044744N57014j765892m34075J991247K201019k15542
$$ -12473487 -5467592 -422848 134166 -1631726 -2065801 -74554 2126465 1910923
12181A910923k635170k750673j057704N80356J474301J849585J449318M15145
$$ 1910923 -724247 -3474920 -4532624 -3952268 -2477967 -628382 820936 1236081
12173A236081L26013J919601K934844J091068j871384k460620p50896L87091M17455
$$ 1236081 1562094 3481695 6416539 7507607 5636223 3175603 2424707 2811798 3229253
12164C229253R41804J118659j158581l559922j303175M027305M752796j161708
$$ 3229253 4171057 5289716 4131135 571213 -731962 3295343 8048139 6886431
12156F886431n836831l184618J905184J850818k013800l143702o70477J045051
$$ 6886431 1049600 -2135018 -229834 1620984 -392816 -3536518 -4206995 -3161944
12148c161944Q46351J215440K030958J050885m70273N05608K251477L36942m059171
$$ -3161944 -2315593 -1100153 930805 1981690 1511417 2017025 4268502 4605444 546273
12139E46273m938195j056892K163003J437640k91164l11807l42634j797916k480280
$$ 546273 -4391922 -5448814 -3285811 -1848171 -2139335 -2451142 -2793776 -4591692 -7071972
12130g071972q36109J207460K101531K889561L538657J930395j261238j856968
$$ -7071972 -7908081 -6700621 -4599090 -1709529 1829128 3759523 2498285 641317
12122F41317R35779K165183r98234m207655k841068P89081J856469N82115K47190
$$ 641317 1577096 3742279 2744045 -1463610 -4304678 -3515597 -1659128 -1077013 -829823
12113h29823R35627N47070l97317m0951O07729m80059j919778r32748J518579
$$ -829823 105804 652874 255557 214606 822335 342276 -1577502 -2510250 -991671
12104i91671K090161N59215k96460L91176P84597k310r79639j539042j618309
$$ -991671 1098490 1657705 1361245 1752421 2537018 2534708 1555069 16027 -1602282
12095a602282n55432J306690J407054j332499l456355j565274J904697K131093
$$ -1602282 -2157714 -851024 556030 -776469 -4232824 -5798098 -3893401 -1762308
12087a762308l98655r14099J748571L832023L153648J465268l2120k031204l163185
$$ -1762308 -2160963 -3075062 -1326491 2505532 5659180 7124448 7092328 5061124 1897939
12078A897939m03853M829956O345343J455117m920735o995699m833466j761404
$$ 1897939 1494086 6324042 12669385 14124502 9203767 2208068 -2625398 -4386802
12070d386802Q07579K791060L088997J166160j383360l196685m489858m421313
$$ -4386802 -3579223 -788163 2300834 3466994 2083634 -1113051 -5602909 -10024222
12062a0024222r20660M453931N862497J110757l723821k272204K784769L857752
$$ -10024222 -10944882 -6490951 -628454 482303 -3241518 -5513722 -2728953 1128799
12054A128799k96397l580650k129203J126907K274202J601581J133722J043188
$$ 1128799 832402 -2748248 -4877451 -3750544 -1476342 125239 1258961 2302149
12046B302149Q03237R41714J415469N77737j967620l339243q14575L614440M766907
$$ 2302149 3105386 4047100 5462569 6040306 4072686 733443 -81132 3533308 8300215
12037H300215O43692m765725o147040l041308L05713P28313n26325q87399l38496
$$ 8300215 8943907 4178182 -1968858 -5010166 -4704453 -3976140 -4502465 -5389864 -5728360
12028e728360j18885L69298K112968L199545R86849k731561l175623J67380K421809
$$ -5728360 -5847245 -5477947 -3364979 -165434 821415 -1910146 -5085769 -4918389 -2496580
12019b496580R74405o66696O90892K424027R17374k130826k768000r94693O46989
$$ -2496580 -1522175 -2188871 -1497979 926048 1843422 -287404 -3055404 -4050097 -3403108
12010c403108J765155K640515J104213l520293o097849j869367M954277N987992
$$ -3403108 -1637953 1002562 2106775 -1413518 -7511367 -9380734 -4426457 1561535
12002A561535J018679k228406n99153P56749j214969k071255J345539M406761
$$ 1561535 2580214 351808 -247345 509404 -705565 -2776820 -1431281 2975480
11994B975480K251788k206532l485130j832763o19211K43812K122277K531183
$$ 2975480 5227268 3020736 -464394 -2297157 -2916368 -2672556 -550279 1980904
11986A980904j049168m708689k524171L683879N896085J289913m297191n308009
$$ 1980904 931736 -3776953 -6301124 -2617245 3278840 4568753 271562 -5036447
11978e036447k928324o43719J246344L409863L871448P50865l465051m146396
$$ -5036447 -7964771 -8608490 -7362146 -3952283 -80835 670030 -2795021 -6941417
11970f941417m63320L613152M280667J852390o75149j395171p64081O0339N93447
$$ -6941417 -7404737 -3791585 489082 2341472 1666323 271152 -492929 -432590 160857
11961A60857N15269o26216k068656j648288J044533K578383j98863m569519m487648
$$ 160857 676126 49910 -2018746 -3667034 -2622501 -44118 -242981 -4812500 -9300148
11952i300148P78672N041938L968828Q12062L09671J304299M4270k566035k644340
$$ -9300148 -8521476 -3479538 489290 1301352 1611023 2915322 2959592 393557 -2250783
11943b250783m15611R1139k038950l166079j053982J955794K558926K22409k941202
$$ -2250783 -2666394 -2575255 -4614205 -7780284 -8834266 -6878472 -4319546 -4097137 -7038339
11934g038339l651145K17989O069838P368678J803451l867137k401260L059362
$$ -7038339 -10689484 -10471495 -4401657 2967021 4770472 903335 -1497925 1561437
11926A561437L833435l53684j417937K707125M044873j683548p154476n290407
$$ 1561437 5394872 5041188 3623251 6330376 10375249 8691701 1537225 -3753182
11918c753182o17837r45717m256667l044456K520669N296324L089240R15066J576946
$$ -3753182 -4371019 -5316736 -9573403 -12617859 -10097190 -4800866 -1711626 -796560 780386
11909G80386K026785J74348j513588j016717O0121L7219n09252j136143k220857
$$ 780386 2807171 2981519 1467931 451214 511335 548554 39302 -1096841 -3317698
11900c317698k638197r04752J078049O6176k452104j558549K883262N205006K912608
$$ -3317698 -5955895 -6860647 -5782598 -5716422 -8168526 -9727075 -6843813 -1638807 1273801
11891A273801N92377J872784L391598J081001k622882l127229j284337r03589
$$ 1273801 1866178 3738962 7130560 8211561 5588679 2461450 1177113 273524
11883B73524j611665l58737J776556P92580k620106l072652P85649L345686M33349
$$ 273524 -1338141 -1696878 79678 872258 -1747848 -4820500 -4034851 -689165 -255816
11874b55816m077363l807693R80364M058279J993835j703144j940611J249964
$$ -255816 -4333179 -8140872 -7160508 -3102229 -1108394 -2811538 -4752149 -3502185
11866c502185L334240J481874k143027l825621l100655k172148j566888N54068
$$ -3502185 -167945 1313929 -829098 -4654719 -7755374 -9927522 -11494410 -10940342
11858a0940342M122711N460489K224009k255184k872779J76286J871146j98203
$$ -10940342 -6817631 -1357142 866867 -1388317 -4261096 -4084810 -2213664 -2411867
11850b411867k623369j569051J844541L712656K726375Q59542j60172n67851r88783
$$ -2411867 -5035236 -6604287 -4759746 -1047090 1679285 2538827 2378655 1810804 822021
11841H22021j254371j207538j197621j117735n1706K192707L880296K947882j05803
$$ 822021 -432350 -1639888 -2837509 -3955244 -4006950 -1814243 2066053 5013935 4908132
11832D908132k146793j038568J511729K060784p5981k230310k383603j562499
$$ 4908132 2761339 1722771 3234500 5295284 5219303 2988993 605390 -957109
11824i57109j285286r16724M48946J319396k08096k802941l260340j216648M81674
$$ -957109 -2242395 -3159119 -2710173 -1390777 -1598873 -4401814 -7662154 -8878802 -8397128
11815h397128L49442K15942J730176L524042L183043K42269l593933n532415k988140
$$ -8397128 -8047686 -7831744 -6101568 -2577526 605517 847786 -2746147 -8278562 -11266702
11806a1266702L487552Q384012O056406j459200n513806j792227M093631N020179
$$ -11266702 -7779150 604862 6661268 5202068 -311738 -2103965 1989666 7009845
11798G009845J805480m32384j201769l315998n263933k787178K312350L031080
$$ 7009845 8815325 8382941 7181172 3865174 -1398759 -4185937 -1873587 1157493
11790A157493j554404l665066R87611N530391K138768n465932o938601J6282P157379
$$ 1157493 -396911 -4061977 -3074366 2456025 4594793 -871139 -7809740 -7793458 -636079
11781f36079P429134K715422j280488k499073k342942j791602q31868L6537J98055
$$ -636079 6793055 9508477 8227989 5728916 3385974 1594372 762504 799041 997096
11772I97096M3896J50328K7545r96390k138951j772937J84871J533025K25761
$$ 997096 1040992 1191320 1218865 222475 -1916476 -3689413 -3504542 -1971517 -1745756
11763a745756k736816l919909j504648K202075L489914J786151k17445n34995
$$ -1745756 -4482572 -8402481 -9907129 -7705054 -4215140 -2428989 -2646434 -3181429
11755c181429K75734J257044K332921K871882J905252P26080J824063L733691
$$ -3181429 -2905695 -1648651 684270 3556152 5461404 6187484 8011547 11745238
11747A1745238J320764n753386r586342m309327M015445M894179j386445m586345
$$ 11745238 13066002 7312616 -2273726 -6583053 -2567608 2326571 940126 -3646219
11739c646219n80087K925852j01911m003102j412385L956648L484250j687274
$$ -3646219 -4226306 -1300454 -1402365 -5405467 -6817852 -2861204 623046 -1064228
11731a064228k417736K971411N440686q0654o061996l906903K950172M957970
$$ -1064228 -3481964 -510553 4930133 4849479 -1212517 -5119420 -2169248 2788722
11723B788722J077095j110432J485404L063131o02579n007825m444511q83710
$$ 2788722 3865817 2755385 4240789 7303920 6701341 1693516 -2750995 -3634705
11715c634705K11099j064269o25794J263806L82007k909500k713183K768512O974546
$$ -3634705 -3423606 -4487875 -5113669 -3849863 -3467856 -6377356 -9090539 -6322027 652519
11706F52519M083326k540282n528461l430077l89769J409955L248575M844763
$$ 652519 4735845 2195563 -3332898 -6762975 -7152744 -5742789 -2494214 2350549
11698B350549L527579p64564m043337l350208l33081J452357O06539j508900k458135
$$ 2350549 5878128 5113564 1070227 -2279981 -2613062 -1160705 -554166 -2063066 -4521201
11689d521201q10826J940703K207374j015627l648342j620843K963174M667238
$$ -4521201 -5332027 -3391324 -1183950 -2199577 -5847919 -7468762 -4505588 161650
11681A61650K587053M62619n49992l113750o711178o092346J14176N209963L624276
$$ 161650 2748703 3211322 2661330 -452420 -7163598 -13255944 -13141768 -7931805 -4307529
11672d307529m48482M78660N384816O324855P47522m654689l753870R25608K868007
$$ -4307529 -4756011 -4277351 1107465 7432320 8179842 3525153 -228717 696891 3564898
11663C564898N94594j720377j061132P07604M71082j374921j787881J77238J912539
$$ 3564898 4159492 2439115 1377983 2085587 2556669 1181748 -606133 -428895 1483644
11654A483644J216697n06175q22180k40245q51243k156688j723100K79834R09166
$$ 1483644 2700341 2194166 1371986 1131741 280498 -1876190 -3599290 -3319456 -2410290
11645b410290p04648j980707j267424l303O30551J435883K159230Q39656j906414
$$ -2410290 -3114938 -5095645 -6363069 -6366372 -5735821 -4299938 -2140708 -1301052 -3207466
11636c207466k378186p4744L76080k890296m308668O80184P070318O944276J550496
$$ -3207466 -5585652 -5660396 -5284316 -8174612 -12483280 -11803096 -4732778 2211498 3761994
11627C761994r87736J458493K727961n03614l411099j639306J513394Q34328k671404
$$ 3761994 2774258 4232751 6960712 6457098 3045999 1406693 2920087 3754415 1083011
11618A083011m145628k395687m96242l35382m80340P18898K693087L754113L127127
$$ 1083011 -3062617 -5458304 -5954546 -6289928 -6770268 -6051370 -3358283 395830 3522957
11609C522957J540364L69667J72827J11517o37709j321900p13538N37179M74411
$$ 3522957 5063321 5432988 5605815 5717332 5079623 3757723 3044185 3581364 4055775
11600D055775j054218j872830q46271R6666j244566l760526m099840j163311K101517
$$ 4055775 3001557 1128727 282456 379122 -865444 -4625970 -8725810 -9889121 -7787604
11591g787604K282329k7858j049673P05675K108514L99307j806904l25886L054402
$$ -7787604 -5505275 -5533133 -6582806 -5877131 -3768617 -3369310 -5176214 -5502100 -2447698
11582b447698K321243k826512n103254o25610M435361L276514r10070q04045K560260
$$ -2447698 -126455 -2952967 -8056221 -8681831 -4246470 -969956 -1880026 -2684071 -123811
11573a23811J948679l115137n012126o15591L687047K604097j88583O42643L203583
$$ -123811 1824868 -1290269 -6302395 -6917986 -3230939 -626842 -815425 -172782 3030801
11564C030801K477775j050606k787711j497324p784K37226O39059J759996J954661
$$ 3030801 5508576 4457970 1670259 172935 165151 402377 1041436 2801432 4756093
11555D756093J34895k521321m003752l256048p61882J664550K280449J351127
$$ 4756093 4890988 2369667 -1634085 -4890133 -5652015 -3987465 -1707016 -355889
11547c55889Q10067J554634K445495K396323J646528L84448j762790l954907m031186
$$ -355889 454178 2008812 4454307 6850630 8497158 8881606 7118816 3163909 -867277
11538h67277j415463J696757L051153K416898M01077k309949l670227j250016
$$ -867277 -2282740 -585983 2465170 4882068 5283145 2973196 -697031 -1947047
11530a947047L801917O453929L601531j847449m610600k924378Q36410L459149
$$ -1947047 1854870 8308799 11910330 10062881 5452281 2527903 3364313 6823462
11522F823462L087126l2322l266999l589233j057764J316916J761196J386810
$$ 6823462 9910588 9878266 6611267 3022034 1964270 3281186 5042382 6429192
11514F429192J130909K94369q32650n17435P73051J79054k318142k859223k60722
$$ 6429192 7560101 7854470 7021820 6504385 7277436 7456490 5138348 2279125 2018403
11505B018403J301279n51048j813031P37848K992062K80234l752695k588475J998646
$$ 2018403 3319682 2768634 955603 1693451 4685513 4965747 1213052 -1375423 623223
11496F23223K733621p71953j597173K119221L636492q82488n619826m347565K79067
$$ 623223 3356844 2584891 987718 3106939 6743431 5860943 241117 -4106448 -3827381
11487c827381K173285J368558J818694L112535J252724l416442n385630j987721
$$ -3827381 -1654096 -285538 1533156 4645691 5898415 2481973 -2903657 -4891378
11479d891378K654526L633642J633412O37248J580847J676558m29268k198407
$$ -4891378 -2236852 1396790 3030202 3667450 5248297 6924855 6495587 4297180
11471D297180j273855M75144l14476k939858l291793k91362K052826O46673k071393
$$ 4297180 3023325 3498469 3183993 244135 -3047658 -3339020 -1286194 -639521 -2710914
11462b710914k272325n62405R0865R5490K207726N544388N545992P59245m397206
$$ -2710914 -4983239 -5545644 -5454779 -5359289 -3151563 2392825 7938817 8698062 4300856
11453D300856n225422k109937J181824K007672K54576k452295l455976r38670
$$ 4300856 -924566 -3034503 -1852679 154993 409569 -2042726 -5498702 -6437372
11445f437372L482206N654007L571237l69394k714587k758995j889568j009121
$$ -6437372 -2955166 2698841 6270078 5900684 3186097 427102 -1462466 -2471587
11437b471587k19815K91948O47047J566496K933301L044695P60863k325551l406661
$$ -2471587 -2691402 -2399454 -1752407 -185911 2747390 5792085 6552948 4227397 820736
11428H20736j872875J46338O94651J73876L5743K61652m92510k235100k806379
$$ 820736 -1052139 -905801 -211150 -37274 -1531 260121 -232389 -2467489 -5273868
11419e273868r65991J077050N90281r99794J96627L782386M259603r04697o478142
$$ -5273868 -6239859 -5162809 -4572528 -5572322 -5375695 -1593309 2666294 1761597 -4716545
11410d716545o403347k220790J80202k57335M10152L274887M876853L822848L049957
$$ -4716545 -11119892 -13340682 -13160480 -13417815 -13007663 -9732776 -4855923 -1033075 2016882
11401B016882L809902L020579o69212l213812j301134J848268J145896k677348
$$ 2016882 5826784 8847363 8178151 4964339 3663205 5511473 6657369 3980021
11393C980021m502148k301476J023736K587258K501378J812521O49335p23914
$$ 3980021 -522127 -2823603 -1799867 787391 3288769 5101290 5750625 5026711
11385E026711j201506k77323R50821J018414j50969j192415r80653j61263m51809
$$ 5026711 3825205 3547882 4498703 5517117 5366148 4173733 3193080 3031817 2580008
11376B580008k097979k982860j290008J910497M120291M293780K505313j517669
$$ 2580008 482029 -2500831 -3790839 -1880342 2239949 6533729 9039042 7521373
11368G521373o605841q579911m681208J311109L200047J179141Q38421L192904
$$ 7521373 915532 -7664379 -12345587 -11034478 -7834431 -6655290 -5816869 -2623965
11360b623965K830745j906309m564129q46539L662952K225622k312371k824834
$$ -2623965 206780 -1699529 -6263658 -7110197 -3447245 -1221623 -3533994 -6358828
11352f358828N09851K102670J277291J877699L290519J119781l281950l222102
$$ -6358828 -5848977 -3746307 -2469016 -591317 2699202 3818983 537033 -2685069
11344b685069J937569M664543J284026k296820r09544J705032M96225j988393
$$ -2685069 -747500 3917043 5201069 2904249 1994705 3699737 4195962 2207569
11336B207569j072420R36860j293600o266218p158724j754844N316699R252645
$$ 2207569 1135149 2072009 778409 -5487809 -12646533 -14401377 -9084678 167967
11328A67967Q590519L475537l718961p075754k810060L877825M001243k722610
$$ 167967 8758486 12234023 8515062 1439308 -1370752 2507073 6508316 3785706
11320C785706p253012m340862R32484K529482K166908L806689N542018L472916
$$ 3785706 -3467306 -7808168 -6875684 -4346202 -2179294 1627395 7169413 10642329
11312A0642329m90211j669061q28126k244483n035265l873313J521947M934762
$$ 10642329 10152118 8483057 7654931 5410448 375183 -3498130 -1976183 2958579
11304B958579L279207Q46691J215540J448273j420288l893609j802639J719545
$$ 2958579 6237786 7084477 8300017 9748290 8328002 4434393 2631754 4351299
11296D351299Q25767l131889l623425P1998J627008j476777l404592K99584M849772
$$ 4351299 5177066 2045177 -1578248 -1506250 120758 -1356019 -4760611 -4461027 388745
11287C88745L465958j953632l875397o00700K136149R85672k70041J894099M175968
$$ 388745 3854703 1901071 -1974326 -2575026 -438877 546795 276754 2170853 6346821
11278F346821J685776l620569n140152j311619K179958J023934j532536k24532
$$ 6346821 8032597 4412028 -728124 -2039743 140215 1164149 -368387 -592919
11270e92919L715687M183363n72069n150497m647104j017422R16263P30720J654818
$$ -592919 3122768 7306131 6734062 1583565 -3063539 -4080961 -3164698 -2433978 -779160
11261g79160M040301M270758Q43997k488629j801934J471577K698204J96851l311676
$$ -779160 3261141 7531899 8375896 5887267 4085333 5556910 8255114 8451965 5140289
11252E140289m655040l242662l25332K588496M115396L491783J515909Q5k90629
$$ 5140289 485249 -2757413 -3082745 -494249 3621147 7112930 8628839 8628924 8338295
11243H338295k99427q90067j526809j516615j458501k110626k521718j096123
$$ 8338295 8038868 7148801 5621992 4105377 2646876 536250 -1985468 -3081591
11235c081591J479709K323987J68709k617395l126088j527699K03836J739340
$$ -3081591 -1601882 722105 890814 -1726581 -4852669 -6380368 -6176532 -4437192
11227d437192L836267N132373L058633j524876m076984k211813J239955K702256
$$ -4437192 -600925 4531448 7590081 6065205 1988221 -223592 1016363 3718619
11219C718619K186486R25831j680945n205942n659771q11924M314761L152033
$$ 3718619 5905105 6830936 5149991 -55951 -5715722 -6527646 -2212885 939148
11211I39148k395287m108003L07984M092512K267687j249238r03374K001178K838522
$$ 939148 -1456139 -5564142 -5256158 -1163646 1104041 -145197 -1048571 952607 3791129
11202C791129J241035k5797m76966j097357p40623J583051L011004O40905k776140
$$ 3791129 5032164 5006367 4529401 3432044 2691421 4274472 7285476 7926381 5150241
11193E150241k495165K44176J3191l537506m818828j591660J432877O23375r02912
$$ 5150241 2655076 2899252 2912443 -625063 -5443891 -7035551 -5602674 -4979299 -5882211
11184e882211O50248K894440J354142k625914l322045R44796N221792M354059
$$ -5882211 -5231963 -2337523 -983381 -3609295 -6931340 -5986544 -764752 3589307
11176C589307p98138m636981l105421J997976M910616K275400k921623m984636
$$ 3589307 2791169 -1845812 -4951233 -2953257 1957359 4232759 1311136 -3673500
11168c673500k412327J151325K624660K793252L019236K351465J75379j401234
$$ -3673500 -6085827 -4934502 -2309842 483410 3502646 5854111 6029490 4628256
11160D628256p91458m2478j422227l087853j941079R27146J933522J025233J256117
$$ 4628256 3836798 3794320 2372093 -715760 -2656839 -1729693 203829 1229062 2485179
11151B485179K676798J854545j655369l588470j777114K03305p41149j902345
$$ 2485179 5161977 7016522 5361153 1772683 -4431 198874 -542275 -2444620
11143b444620J5801K216552O5596m329674m395338M88061L525711Q43548k962701
$$ -2444620 -2428819 -212267 -146671 -4476345 -8871683 -8383622 -4857911 -4014363 -6977064
11134f977064k546010L98138J328252M73501R74181K431691K098250P24784J231201
$$ -6977064 -9523074 -9124936 -7796684 -7323183 -6349002 -3917311 -1819061 -1094277 136924
11125A36924K363364O3235m439503m615834J177818N771962L131619k906669m462096
$$ 136924 2500288 2563523 -1875980 -6491814 -5313996 457966 3589585 682916 -3779180
11116c779180l01063M239674N169590K701261j669114n861010o387758j826630
$$ -3779180 -4080243 159431 5329021 8030282 6361168 500158 -5887600 -7714230
11108g714230L590050M325076P25805k500341l717758m801471m953570q42661
$$ -7714230 -4124180 200896 926701 -1573640 -5291398 -10092869 -15046439 -15889100
11100a5889100O049690Q904365M993858j46102j211699l82000j874121m047781
$$ -15889100 -9839410 -935045 4058813 3912711 2701012 2319012 444891 -3602890
11092c602890k443757K294573N065994L471387k10063l182824m261074k760976
$$ -3602890 -6046647 -3752074 1313920 4785307 4575244 1392420 -2868654 -5629630
11084e629630P62626L141067J609650j983941l268706j401332L54438J17163j54072
$$ -5629630 -4867004 -1725937 -116287 -2100228 -5368934 -6770266 -6415828 -6298665 -6452737
11075f452737J386943L178619K631743j14499k496756k677000j161545M81397
$$ -6452737 -5065794 -1887175 744568 630069 -1866687 -4543687 -5705232 -5223835
11067e223835J692557L065978M315685L472591r0855k934907j195245L124128
$$ -5223835 -3531278 -465300 3850385 7322976 7232121 4297214 3101969 6226097
11059F226097L810393m99729l918105k428618J09057o37095j585489J726529N654039
$$ 6226097 10036490 9536761 5618656 3190038 3299095 2662000 1076511 2803040 8457079
11050H457079L376406l103869n124807j141955J081827k400538n583114k971308
$$ 8457079 11833485 8729616 3604809 2462854 3544681 1144143 -4438971 -7410279
11042g410279J944282L457052K113494J145638K45842j536389j764516P66437
$$ -7410279 -5465997 -2008945 104549 1250187 1496029 -40360 -1804876 -1038439
11034a038439J996490q37758l089936J22510M740356L602497j617140l080215
$$ -1038439 958051 120293 -2969643 -2847133 1893223 5495720 3878580 798365
11026G98365K26129J532290j482000k974228K47396K979704Q69585k023426m40349
$$ 798365 1024494 2556784 1074784 -1899444 -1652048 1327656 2197241 173815 -266534
11017b66534L020655K400096j846253l996017k040975L46769K53649j094126j762671
$$ -266534 2754121 5154217 3307964 -688053 -2729028 -2382259 -2128610 -3222736 -4985407
11008d985407j831273j644568l94751K159563M420587M562046K477945l74040
$$ -4985407 -6816680 -8461248 -8855999 -6696436 -2275849 2286197 4764142 4390102
11000D390102k387803k890904k262125j019315R32290L273531L976689J206568
$$ 4390102 2002299 -888605 -3150730 -4170045 -3237755 35776 4012465 5219033
10992E219033l128993m476583j578290J549711J546270M08531J148829J965573
$$ 5219033 2090040 -2386543 -3964833 -2415122 -868852 -460321 688508 2654081
10984B654081m95171m240444m123912k01943K260959J491927J338669L128209
$$ 2654081 2158910 -2081534 -6205446 -6407389 -4146430 -2654503 -1315834 1812375
10976A812375K512730k042552m552391q57849L316367R84641m075651k911175
$$ 1812375 4325105 2282553 -2269838 -3127687 188680 1173321 -2902330 -5813505
10968e813505L644636N769757M34459l948328j375027K751869J483436k733953
$$ -5813505 -2168869 3600888 4035347 87019 -1288008 1463861 2947297 213344
10960B13344l494549q54730P62190Q30819J811961K895679J419467j404257k312815
$$ 213344 -3281205 -4135935 -3373745 -2542926 -730965 2164714 3584181 2179924 -132891
10951a32891j825658k377750k494158P74347N035436N010740J121499j186415
$$ -132891 -1958549 -4336299 -6830457 -6056110 -1020674 3990066 5111565 3925150
10943C925150l45894J81175l49807J142923L867224K455233l518157o929960l586821
$$ 3925150 3579256 3760431 3410624 4553547 8420771 10876004 7357847 427887 -3158934
10934c158934J501300K373863L83142l20520J29191k37102m85367N56923R87637
$$ -3158934 -1657634 716229 1099371 778851 908042 670940 185573 742496 1730133
10925A730133l67700r11169P93957J491402r18554k665476k55567L178249L073504
$$ 1730133 1362433 451264 1245221 2736623 1818069 -847407 -1102974 2075275 5148779
10916E148779O64708o27991j615069l857631m065845Q10288O346444O044841J330560
$$ 5148779 5813487 5185496 3570427 -287204 -4353049 -3542761 2803683 8848524 10179084
10907A0179084j234531l31639Q1592j000588j279231j472668l971166o215614
$$ 10179084 8944553 8612914 8694506 7693918 6414687 4942019 970853 -5244761
10899e244761l453761K491656N135214L547345K592307L302916J663994k588512
$$ -5244761 -8698522 -6206866 -1071652 2475693 5068000 8370916 10034910 7446398
10891G446398m709541l589462l167160l972115k037364K108308K643008q30300
$$ 7446398 2736857 -852605 -4019765 -7991880 -10029244 -7920936 -5277928 -6108228
10883f108228j239956L696984O570661K413187l148474l672699j670458j920684
$$ -6108228 -7348184 -3651200 2919461 5332648 2184174 -1488525 -3158983 -5079667
10875e079667k352162P21601M092687K512357j896090k661351J081770M172766
$$ -5079667 -7431829 -6710228 -2617541 -105184 -2001274 -4662625 -3580855 591911
10867E91911L406062P17304n82020Q11963L319197L131321j698300o947411o417193
$$ 591911 3997973 4715277 4133257 4945220 8264417 11395738 9697438 2750027 -3667166
10858c667166j318957P54756k078994k820625K062261N864984K962230j489588
$$ -3667166 -4986123 -4231367 -6310361 -9130986 -7068725 -1203741 1758489 268901
10850B68901q13119J624772p02728m919135l344187L074128O129242L287686o4287
$$ 268901 -544218 1080554 377826 -4541309 -7885496 -4811368 1317874 4605560 4541273
10841D541273n11121l19480j213867j723173j273782j148075j221971l49669Q46951
$$ 4541273 4030152 3710672 2496805 773632 -500150 -1648225 -2870196 -3219865 -2372914
10832b372914J522971K728491M030489J821915l992233o465378j416531M304423
$$ -2372914 -849943 1878548 5909037 7730952 3738719 -2726659 -4143190 161233
10824A61233K696264k073599n02748N785465O466511l4283m211491j647197P61201
$$ 161233 2857497 783898 281150 6066615 12533126 12498843 8287352 6640155 7401356
10815G401356k060413n110936l089593Q40186J657362M57372M01579P65712o374
$$ 7401356 5340943 230007 -2859586 -2019400 -362038 95334 496913 1262625 1256251
10806A256251m41404M60598N36059j004071r87654K143419M609472K826647j208297
$$ 1256251 814847 1275445 1811504 807433 -180221 1963198 6572670 9399317 8191020
10797H191020l434988l179389k170620j301634q16322q22036n0259K689193N075932
$$ 8191020 4756032 1576643 -593977 -1895611 -2711933 -3533969 -3584228 -895035 4180897
10788D180897L492319o72441k095923k8374K09866l646286o370387l389957K043164
$$ 4180897 7673216 7000775 4904852 4876478 5086344 1440058 -4930329 -8320286 -6277122
10779f277122L997505J939658l62253o26045P73086K562383K784560R5979l247261
$$ -6277122 -2279617 -339959 -702212 -1328257 -555171 2007212 4791772 4887751 1640490
10770A640490l139289J30533J710565n5714r60583J428399L178878R27286j880678
$$ 1640490 -1498799 -1368266 342299 286585 -673998 754401 3933279 4860565 2979887
10761B979887o32302K778209L245149L84271j901153j672507m07553J45924q32130
$$ 2979887 2347585 5125794 8370943 8755214 6854061 5181554 4774001 4919925 4087795
10752D087795l249268m630770j551213M547402O739996J765184m138490l690636
$$ 4087795 838527 -3792243 -5343456 -796054 5943942 7709126 3570636 -120000
10744a20000P05743J261085k560572l559165J046461M921037K762828j434452
$$ -120000 585743 1846828 -713744 -4272909 -3226448 1694589 4457417 3022965
10736C022965r94722L006895L847723k08733l618513k557384m18099j240658k428133
$$ 3022965 2028243 5035138 8882861 8674128 5055615 2498231 2080132 839474 -1588659
10727a588659N38996M954324L674668l062114o440154k212205K623849J214781
$$ -1588659 -1049663 3904661 7579329 4517215 -1922939 -4135144 -1511295 -296514
10719b96514k157642Q8649N477451N374610o17334m135253j505365J716682R51696
$$ -296514 -2454156 -2365507 3111944 8486554 7869220 3733967 2228602 3945284 4896980
10710D896980j154485j148934j98314k09736n22275r64447k786424m623535l042407
$$ 4896980 3742495 2593561 2395247 2185511 1663236 698789 -2087635 -6711170 -9753577
10701i753577J188917L079167J272031o6509J085437J458435p53355k361183j157947
$$ -9753577 -8564660 -5485493 -4213462 -4279971 -3194534 -1736099 -2489454 -4850637 -6008584
10692f008584M09931J90074n10035p60830j392807j144163K161430N490866L245950
$$ -6008584 -5598653 -5408579 -5918614 -6679444 -8072251 -9216414 -7054984 -1564118 1681832
10683A681832k600735l808140O10026K186517k236831m543943K79019M764404
$$ 1681832 -918903 -4727043 -4117017 -1930500 -4167331 -8711274 -8432255 -3667851
10675c667851J725167l501102k801698J246679J725688o6683R89151K865749O59086
$$ -3667851 -1942684 -5443786 -8245484 -6998805 -5273117 -5339800 -4350649 -1484900 -825814
10666h25814k932700k088749J093257N12347k425102j770219J473109J644824
$$ -825814 -3758514 -5847263 -4754006 -4241659 -6666761 -8436980 -6963871 -5319047
10658e319047k54913J114422L604188L42572o041903n066449L752342P779235
$$ -5319047 -5573960 -4459538 -855350 -512778 -6554681 -11621130 -7868788 -89553
10650h9553P50653o636808l145472N795853P078466l37330n450514k360923K960433
$$ -89553 661100 -5975708 -9121180 -3325327 3753139 3415809 -2034705 -4395628 -1435195
10641a435195L845247J982621J660648J695312j102633m463569l607958j47063
$$ -1435195 2410052 4392673 6053321 7748633 6646000 2182431 -1425527 -1572590
10633a572590m98489m616356m427571K926917Q382081M059632l875054m561779
$$ -1572590 -2071079 -6687435 -11115006 -8188089 193992 4253624 378570 -4183209
10625d183209N96130J420468l579646n589017j051309L385433L225878K037872
$$ -4183209 -3587079 -2166611 -5746257 -11335274 -12386583 -9001150 -5775272 -3737400
10617c737400K389620J678603j11081Q28620K860213k49557o389163n781107J662004
$$ -3737400 -1347780 330823 219742 1048362 3908575 3659018 -2730145 -8511252 -6849248
10608f849248L955874k441989n233601K387748Q757065L379658n091690m270782
$$ -6849248 -2893374 -5335363 -10568964 -8181216 575849 3955507 -1136183 -5406965
10600e406965J380102P80557l671893k588543K307001K933643R29373K969345
$$ -5406965 -4026863 -3246306 -6918199 -9506742 -7199741 -4266098 -3336725 -367380
10592c67380N733246J445731o137767o790500j208513J454875K7053O64039K896144
$$ -367380 5365866 6811597 673830 -6116670 -7325183 -5870308 -5843255 -5179216 -2283072
10583b283072J059146k745350j526750K728698K062744k420456k384242K435730
$$ -2283072 -1223926 -3969276 -5496026 -2767328 -704584 -3125040 -5509282 -3073552
10575c073552M381815K011335Q71233J536925j80596k692658j071554K015703
$$ -3073552 1308263 3319598 4190831 5727756 5547160 2854502 1782948 3798651
10567C798651N94437k179737O83098N517818L378173l136847l922984L38276K00707
$$ 3798651 4393088 2213351 2896449 8414267 11792440 8655593 4732609 5070885 5271592
10558E271592m186387l735177J526797K327211j910166k127197K652174L542925
$$ 5271592 1085205 -2649972 -1123175 1204036 -706130 -2833327 -181153 3361772
10550C361772j037409k890504j16239M42252j918889m76588M215830M301546K1478
$$ 3361772 2324363 -566141 -682380 -240128 -2159017 -2635605 1580225 5881771 5903249
10541E903249q80284R66021j831340o568133l482292M717417N654187m95711j866401
$$ 5903249 5022965 5988986 4157646 -2410487 -5892779 -1175362 4478825 3983114 2116713
10532B116713K052789J76970o529548m694346N551664Q379669J68451m475515
$$ 2116713 4169502 4346472 -2183076 -6877422 -1325758 7053911 7222362 2746847
10524B746847K08496K342935k949398m356081K544529O313857J673109j771062
$$ 2746847 2955343 5298278 2348880 -2007201 537328 6851185 8524294 6753232
10516F753232K41472j63114m020763k738201J803650j002259o589335r06383R249885
$$ 6753232 6994704 6831590 2810827 72626 1876276 874017 -5715318 -6621701 2628184
10507B628184M062068j0336134q449245O913967P050956p903372o459587J2995833
$$ 2628184 6690252 -3645882 -12095127 -5181160 1869796 -6033576 -12493163 502670
10499E02670J4476764p078159j1425096J0703855J5187276j0377013j4958836
$$ 502670 14979434 7901275 -3523821 7180034 22367310 11990297 -2968539
10492b968539J8002339K5189852j7813459k0803462P8080235J68590401J00720378
$$ -2968539 15033800 40223652 22410193 1606731 79686966 248277367 348997745
10485C48997745p9067005j70437800r5460741J2233445K3092761k2176439k5360213
$$ 348997745 269930740 99492940 4032199 16265644 39358405 17181966 -8178247
10478h178247Q117628J3058376j0334492j2928312P150887J0995854m236657p250865
$$ -8178247 -60619 12997757 2663265 -10265047 -3114160 7881694 3645037 -3605828
10470c605828M713461O175204m621430o198728K229049K597670l989349j436511
$$ -3605828 1107633 7282837 2661407 -3537321 -1308272 1289398 -2699951 -4136462
10462d136462O823535M473478m243737k399132O066190L943843n538426n076940
$$ -4136462 2687073 7160551 2916814 517682 6583872 10527715 4989289 -87651
10454h7651L218713K363851o735308p537947J034567M482843M35389m86503J928966
$$ -87651 3131062 5494913 -1240395 -8778342 -7743775 -3260932 -2825543 -3312046 -1383080
10445a383080r06279n182176n15279P204406M279282m013129j599001P563493
$$ -1383080 -2289359 -7471535 -7986814 -782408 3496874 -516255 -2115256 5448237
10437E448237N011008p992336j0867391P45954Q400486L298510j871090Q26557
$$ 5448237 10459245 2466909 -8400482 -7654528 745958 4044468 2173378 2999935
10429B999935K109724l120781n185819P16971M766327J237518j450733K291961
$$ 2999935 5109659 1988878 -3196941 -2479970 2286357 3523875 2073142 4365103
10421D365103N259177K330489n66541L28109m34690m597721n001909K63176K962040
$$ 4365103 9624280 11954769 11388228 11716337 11281647 6683926 1682017 1945193 4907233
10412D907233l3336j269741J602411K00037p439478r766106p48783Q474234P065162
$$ 4907233 4873897 3604156 5206567 5406604 -2032874 -11798980 -12547763 -4073529 2991633
10403B991633O20814q00150J002904m71511k890069p28799K911840J422829l541259
$$ 2991633 3612447 2812297 3815201 3343690 453621 -275178 2636662 4059491 518232
10394E18232n036539j683073K229846L984539L531044Q87710k439114l017481
$$ 518232 -4518307 -6201380 -3971534 13005 3544049 4431759 1992645 -1024836
10386a024836l47986J849195J856858K237070L566949K404529j567127l365369
$$ -1024836 -1372822 476373 2333231 4570301 8137250 10541779 8974652 5609283
10378E609283j176039J76239j801111k241741K187766O328071M316949j295592
$$ 5609283 4433244 4609483 2808372 566631 2754397 9082468 13399417 12103825
10370A2103825l968827k212703P75805K568335K407359K78548j747657j004961
$$ 12103825 8134998 5922295 6698100 9266435 11673794 11952342 10204685 9199724
10362I199724R04266n20303m827012o094892k319036J354629J456465J171664
$$ 9199724 10103990 9583687 4756675 -1338217 -3657253 -2302624 -846159 325505
10354C25505L036999L819127J026786k073997k562235k789494m637748m990486
$$ 325505 3362504 7181631 8208417 6134420 3572185 782691 -3855057 -8845543
10346h845543j724403J661389K135857J992443L021144K159030j926837m361572
$$ -8845543 -10569946 -8908557 -6772700 -4780257 -1759113 399917 -1526920 -5888492
10338e888492j872650J201527P27102J16560L030801N176849J468378m113027
$$ -5888492 -7761142 -6559615 -5832513 -5715953 -2685152 2491697 3960075 -152952
10330a52952m527782j107505j16084j611221q92874J752387J998170K55342N21791
$$ -152952 -4680734 -5788239 -5904323 -7515544 -8408418 -6656031 -4657861 -4402519 -3880728
10321c880728J898488K64477k581333q89837M025554M490760o08561l273552N93617
$$ -3880728 -1982240 -1717763 -4299096 -5188933 -1163379 3327381 2718820 -554732 38885
10312C8885M777473L388380l33510j062207j44406j134016k232098n1889L017039
$$ 38885 4816358 8204738 7871228 6809021 6664615 5530599 3298501 3246612 6263651
10303F263651K171987j450836k411687K04171J829541J99970j703915j444684
$$ 6263651 8435638 6984802 4573115 4777286 6606827 6806797 5102882 3658198
10295C658198o68780j043300j141187J11913O76112q58283j947584j49401K063926
$$ 3658198 2989418 1946118 804931 916844 1592956 734673 -1212911 -1362312 701614
10286G01614Q54902k368386k842603k39370Q80265j056657j985300O05491L306588
$$ 701614 1556516 -811870 -3654473 -3893843 -3013578 -4070235 -6055535 -5450044 -2143456
10277b143456K848609J505125K112424K208336j329146n339230m436706L17944
$$ -2143456 705153 2210278 4322702 6531038 5201892 -137338 -4574044 -4256100
10269d256100L285714L036050K447120J471122k302169o198487m345500J698517
$$ -4256100 -970386 2065664 4512784 5983906 3681737 -2516750 -6862250 -5163733
10261e163733L239142j750681m336088J016056O733824M115178k529133l117614
$$ -5163733 -1924591 -3675272 -8011360 -6995304 -261480 3853698 1324565 -1793049
10253a793049J984737L641936m46810k706693R26908M445165K098284k434337
$$ -1793049 191688 3833624 3386814 680121 1607029 6052194 8150478 5716141
10245E716141k389109J639791L311835J50028l678224l962277j839288j168713
$$ 5716141 3327032 4966823 8278658 8428686 4750462 788185 -1051103 -2219816
10237b219816k709299l205393l00346L556335L868328J43651l140843k180772
$$ -2219816 -4929115 -8134508 -8434854 -4878519 -1010191 -866540 -4007383 -6188155
10229f188155J692945M338813L765552J402970j17107O84421K647069K391004
$$ -6188155 -4495210 -156397 3609155 5012125 4895018 5579439 8226508 10617512
10221A0617512j724757o032179n354823p84602J248371p57395m24241N257867
$$ 10617512 8892755 2860576 -2494247 -3278849 -2030478 -2787873 -3212114 2045753
10213B045753Q669465K742926o163183o370295J145030M072238k077504p808178
$$ 2045753 10715218 13458144 7294961 924666 2069696 6141934 4064430 -3743748
10205c743748n485830j13407J418483J770356N483587P894762K294621o695607
$$ -3743748 -9229578 -9342985 -7924502 -6154146 -670559 7224203 9518824 2823217
10197B823217q179548j521322L114660J024662j026017K172746N355048K518710
$$ 2823217 -5356331 -6877653 -3762993 -2738331 -3764348 -1591602 3763446 6282156
10189F282156k421410k256044J541803J747305k394145m164741m61046L496977
$$ 6282156 3860746 1604702 3146505 4893810 2499665 -1665076 -2126122 1370855
10181A370855K453024j623734l525749j987878L88224J705290K105495K059694
$$ 1370855 3823879 2200145 -1325604 -3313482 -2925258 -1219968 885527 2945221
10173B945221J890920K078134K211526P51314k456208m679625l328834M61946
$$ 2945221 4836141 6914275 9125801 9877115 7420907 2741282 -587552 -125606
10165a25606L222992L235043J269076j639670m527003n313842k465423J929711
$$ -125606 3097386 6332429 7601505 5961835 1434832 -3879010 -6344433 -4414722
10157d414722L724403K067849L60282R07083J774707P62077o53830k62515N16648
$$ -4414722 -690319 1377530 1737812 2644895 4419602 5181679 4527849 4265334 4781982
10148D781982r69281l380529k931397K04179J652272j23535j177073J190190L225557
$$ 4781982 3812701 432172 -2499225 -2295046 -642774 -766309 -1943382 -753192 2472365
10139B472365K35823n404142o652794j474792M494869N594960K534482k78606
$$ 2472365 2708188 -2695954 -9348748 -10823540 -6328671 -733711 1800771 1522165
10131A522165n13997J039242K723211L011028J009396j941038k690216l23781
$$ 1522165 1008168 2047410 4770621 7781649 8791045 6850007 4159791 3836010
10123C836010J826608O05861k083066j961729R13293J844081j565141n497147
$$ 3836010 5662618 6268479 4185413 2223684 3136977 4981058 3415917 -2081230
10115b081230m769147L75992M407832K982132k055711m688380j783936K708258
$$ -2081230 -6850377 -6474385 -2066553 915579 -1140132 -5828512 -7612448 -4904190
10107d904190K464747k307921m177566J079779P183419N388879k629672o671077
$$ -4904190 -2439443 -4747364 -8924930 -7845151 -661732 4727147 2097475 -4573602
10099d573602k561955K645327K241923o72868r661L017411L017864K3496j300141
$$ -4573602 -7135557 -4490230 -2248307 -2921175 -2930836 86575 3104439 3127935 1827794
10090A827794k08763m31482k411840j973628J929349M386858K044294j699045
$$ 1827794 1619031 1187549 -1224291 -3197919 -1268570 3118288 5162582 3463537
10082C463537k214209j63772J064279R42760Q59590L40495j491762k656866r90274
$$ 3463537 1249328 1085556 2149835 3092595 3952185 4292680 2800918 144052 -846222
10073h46222J240664J17901l185635l564531j15617K397912J612026J236705L640001
$$ -846222 394442 512343 -2673292 -6237823 -6353440 -3955528 -2343502 -1106797 2533204
10064B533204M555744K86039m643396l871869J01537j69149m053615l228730L930454
$$ 2533204 7088948 7374987 2731591 -1140278 -1038741 -1207890 -5261505 -8490235 -4559781
10055d559781Q202280L587001l436156m546007j619199q04736j434258K32285
$$ -4559781 3642499 7229500 3793344 -752663 -2371862 -3176598 -4610856 -4378571
10047d378571J687820j161171l920850M67905Q007064P743406o40891n709501
$$ -4378571 -2690751 -3851922 -7772772 -7304867 702197 8445603 7804712 2095211
10039B095211k446372R80434j535565m327735j736874J510632j38683k485597
$$ 2095211 -351161 629273 -906292 -5234027 -6970901 -5460269 -5598952 -8084549
10031h084549J97627M019320K417064j791028j463798K273650K646501o16447
$$ -8084549 -7886922 -3867602 -1450538 -3241566 -4705364 -2431714 214787 -401660
10023d01660j513384J524031L902490K897984M5678l122377n092766k584235M170355
$$ -401660 -1915044 -391013 3511477 6409461 6455139 3332762 -1760004 -4344239 -173884
10014a73884P521891J974727n577937m699823K284911L892793k025307n675879
$$ -173884 7348007 9322734 3744797 -955026 1329885 5222678 3197371 -2478508
10006b478508k091347J877769O27457j471022N06943L416557K705262Q1416j026463
$$ -2478508 -4569855 -2692086 -2064629 -3535651 -3028708 387849 3093111 3174527 2148064
9997B148064j294259j988285j570929J5149l18955k404276j277994L903033O412140
$$ 2148064 853805 -1134480 -2705409 -2690260 -3009215 -5413491 -6691485 -2788452 3623688
9988C623688K306528k650962k083795J489585K508771J566420J673198Q84273
$$ 3623688 5930216 3279254 1195459 2685044 5193815 6760235 8433433 9317706
9980I317706l314461o572071l198670L561044N135358K41275l812341k272455
$$ 9317706 6003245 -568826 -3767496 -206452 4928906 5170181 1357840 -914615
9972i14615J515239K590554P34542j243300j610137o42052K36095k26940j334077
$$ -914615 600624 3191178 3925720 2682420 1072283 430231 666326 439386 -894691
9963h94691r19663J197406K333041J129619j48168L56331R32951j50865j247955
$$ -894691 -1814354 -616948 1716093 2845712 2697544 3053875 3986826 3835961 2588006
9954B588006o01651K20403m78890j121528j45165N98172o08530j787532j031041
$$ 2588006 1986355 2206758 1727868 606340 461175 1059347 450817 -1336715 -2367756
9945b367756k26841j061723j228662J032252K823100J840577J187854L401933
$$ -2367756 -2594597 -3656320 -4884982 -3852730 -1029630 810947 1998801 5400734
9937E400734M509446O87656l798834l023579M25324K76207k131958j039533K141733
$$ 5400734 9910180 10597836 6799002 3775423 4200747 4476954 2344996 1305463 3447196
9928C447196J173546k623992j813593L279145L968831j644420m678160m17752
$$ 3447196 4620742 1996750 183157 3462302 7431133 5786713 1108553 690801
9920F90801L755265J010028l942467l452136J068999L107975J423400m38569r46422
$$ 690801 4446066 5456094 1513627 -1938509 -869510 2238465 3661865 3223296 2276874
9911B276874r61555l39922J204121K402271K608445K577457J482437k165712n402382
$$ 2276874 1315319 975397 2179518 4581789 7190234 9767691 11250128 9084416 3682034
9902C682034l122886K602458L437098k013320m951608p66322L412566J914244
$$ 3682034 559148 3161606 6598704 4585384 -366224 -1132546 2280020 4194264
9894D194264M56960L856376M769842k907797r231553k476595R227994Q855452
$$ 4194264 4651224 8507600 13277442 10369645 1138092 -1338503 7889491 16744943
9886A6744943j459451m007171L796812N556444k582405j232773J8350775L1346480
$$ 16744943 15285492 11278321 15075133 20631577 18049172 16816399 35167174 66513654
9878F6513654J1409254k7741130m6519271l0174464k981201Q525469N276556K319997
$$ 66513654 77922908 50181778 3662507 -26511957 -29493158 -20967689 -15691133 -13371136
9870a3371136L772415L391822l08886k394354r89765J063263K301776L415367
$$ -13371136 -9598721 -6206899 -6515785 -8910139 -9899904 -8836641 -6534865 -3119498
9862c119498L221396q2809m195223m498634p47842K394619J973055M63p55589
$$ -3119498 101898 19089 -4176134 -8674768 -9422610 -7027991 -5054936 -5054473 -5810062
9853e810062o13857q91941q89419N45890K140572J629021m18022p79931J802347
$$ -5810062 -6423919 -7315860 -8205279 -7659389 -5518817 -3889796 -4307818 -5087749 -3285402
9844c285402M355984L549783L45318j493206q27946j36067o84507j67954K788804
$$ -3285402 1070582 4620365 4965683 3472477 2644531 2508464 1823957 1656003 4444807
9835D444807M852180K278368k887965n164891l391539j523331j576802r93518
$$ 4444807 9296987 11575355 8687390 3522499 130960 -1392371 -2969173 -3962691
9827c962691J377398K026344j031880l365001m08426M465468M124372j444663
$$ -3962691 -2585293 -558949 -1590829 -4955830 -5364256 -898788 3225584 1780921
9819A780921m775931j944477K180913K024904p01029j121900N33920N2594l054195
$$ 1780921 -2995010 -4939487 -2758574 -733670 -1434699 -2556599 -2022679 -1970085 -5024280
9810e024280m361936j459719K520688L950591L501409L302102K401063j096947
$$ -5024280 -9386216 -10845935 -8325247 -4374656 -873247 2428855 4829918 3732971
9802C732971n069866n124744j350665J142474j76337j447393R21004L678219J570282
$$ 3732971 -1336895 -6461639 -7812304 -6669830 -6846167 -8293560 -7372556 -3694337 -2124055
9793b124055l523329m200280J638335P211034O052635J98691l797818l468527
$$ -2124055 -5647384 -9847664 -8209329 -998295 5054340 5253031 1455213 -2013314
9785b013314j343163L31117J562604K089451P37419k007621l368561j478733J962632
$$ -2013314 -3356477 -3025360 -1462756 626695 1364114 -643507 -4012068 -5490801 -3528169
9776c528169L277464R25743k484929l009586l65517J411079l03405k407638p24311
$$ -3528169 -250705 675038 -1809891 -4819477 -5184994 -3773915 -4077320 -6484958 -7209269
9767g209269K772595K580390q19937p95019M131339O056764m47541q548664q158891
$$ -7209269 -4436674 -1856284 -2676221 -3471240 660099 6716863 6269322 -2279342 -10438233
9758a0438233l84952M918891L467542J04150r82510j081758j174661O19496L488154
$$ -10438233 -10823185 -5904294 -2436752 -2332602 -3315112 -4396870 -5571531 -4952035 -1463881
9749a463881K971998j210349k826407J298494N123656K010667m937565p121069
$$ -1463881 1508117 297768 -2528639 -1230145 3893511 5904178 966613 -6154456
9741f154456k382040L204801M416531K322530K92328q02863j654766j848343n24884
$$ -6154456 -8536496 -5331695 -915164 1407366 1699694 896831 -757935 -2606278 -3131162
9732c131162J461801K034975O53007o42178K30345K327462K496329n76668m661321
$$ -3131162 -1669361 365614 1018621 376443 606788 2934250 5430579 4853911 192590
9723A92590o905203o575780l937528R30278O028711O970157K223973l113046k918855
$$ 192590 -6712613 -13288393 -17225921 -16295643 -10266932 -3296775 -1072802 -4185848 -7104703
9714g104703J866948N048975L953783J495133N5739j166330k258774j552466K61645
$$ -7104703 -5237755 -188780 3765003 5260136 5315875 4149545 1890771 338305 599950
9705E99950R1965j941423j905102J131719K924440J134725o71170O15535K201831
$$ 599950 691915 -1249508 -3154610 -2022891 901549 2036274 1365104 1980639 4182470
9696D182470M73468k533023k415408O79310K870797K328087L84307j590256l050218
$$ 4182470 4655938 2122915 -292493 386817 3257614 5585701 5970008 4379752 1329534
9687A329534l200966j836905k46969O38998J540498K728862K728827Q91279q50855
$$ 1329534 -1871432 -3708337 -3955306 -3316308 -1775810 953052 3681879 4573158 3722303
9678C722303o20952Q67516J759774J122867j092359l692084l767089O06L701979
$$ 3722303 3101351 3968867 5728641 6851508 5759149 2067065 -1700024 -1699418 2002561
9669B002561K447963j750451k230054J597732L029903m94010k974459o41709J314349
$$ 2002561 4450524 2700073 470019 2067751 5097654 4603644 1629185 987476 2301825
9660B301825j499965m278874j824821J440104p55593m627499k335583M234910
$$ 2301825 801860 -3477014 -5301835 -3861731 -4617324 -9244823 -11580406 -7345496
9652g345496O288726K300466j098346j270430k182167m573819l621229J620885
$$ -7345496 -1056770 1243696 145350 -1125080 -3307247 -7881066 -11502295 -9881410
9644i881410N258411L810327R94291N33037R48300M39193P21832K637418L169965
$$ -9881410 -4622999 -812672 181619 714656 1662956 2102149 2823981 5461399 8631364
9635H631364L18617l112608l587255j554738P2731m37553k715150m611941l362593
$$ 8631364 8949981 5837373 2250118 695380 768111 330558 -2384592 -6996533 -10359126
9626a0359126R36181L991756K824205O95181J868009L818706J222086l985370
$$ -10359126 -9422945 -5431189 -2606984 -1911803 -43794 3774912 4996998 1011628
9618A011628m636020k81758J635551j884121m554616j385270L805130N535892
$$ 1011628 -3624392 -3906150 -2270599 -4154720 -8709336 -10094606 -6289476 -753584
9610g53584M339441K755974l47m277627o293262l501344O53595K034931J742736
$$ -753584 3585857 6341831 6341484 2063857 -4229405 -7730749 -7077154 -5042223 -3299487
9601c299487K341958K531140N30325j122979N16564L207430K964440M72278q39592
$$ -3299487 -957529 1573611 2103936 980957 1497521 4704951 7669391 8141669 7302077
9592G302077p66304j476863k611818k023692j07769Q55517N54947J24601q07767
$$ 7302077 6535773 5058910 2447092 423400 315631 1171148 1726095 1850696 1042929
9583A042929k749923l479250p01406L347107M104922J200652j096763j94931J554690
$$ 1042929 -1706994 -5186244 -5887650 -2540543 1564379 2765031 1668268 1473337 3028027
9574C028027R13055j570368k576786n92006J979737J695451j364071l364969k011751
$$ 3028027 3941082 2370714 -206072 -798078 1181659 2877110 1513039 -1851930 -3863681
9565c863681p7279j016237k930294j304439L080189M507733J196270k037760j696707
$$ -3863681 -3940960 -4957197 -7887491 -9191930 -6111741 -1604008 -407738 -2445498 -4142205
9556d142205k23861m2350Q54010L361577L270078j735083o035139l450035L007209
$$ -4142205 -4366066 -4408416 -3554406 -192829 3077249 1342166 -4692973 -8143008 -5135799
9547e135799N410413K316592q68167j134550n60021m08658P05904K171399Q99427
$$ -5135799 274614 2591206 1723039 588489 28468 -380190 325714 2497113 3396540
9538C396540k997445m942828k205067K233760L826561J633511j970460m414439
$$ 3396540 399095 -4543733 -6748800 -4515040 -688479 945032 -1025428 -5439867
9530e439867m609396l083109j123010P81080K847494L863097J638410k693661
$$ -5439867 -10049263 -13132372 -14255382 -13474302 -10626808 -6763711 -5125301 -7818962
9522g818962m069364k89264L745082K696622j312757k567448p77161J10430J91786
$$ -7818962 -11888326 -12177590 -8432508 -5735886 -7048643 -9616091 -10393252 -10282822 -10091036
9513a0091036L104109P451892O761720j75066o165923n791774k295510p08047
$$ -10091036 -6986927 464965 7226685 7051619 885696 -4906078 -7201588 -7909635
9505g909635k18066J774883L222087J072405k131967j556538J972533L251598
$$ -7909635 -8127701 -6352818 -3130731 -2058326 -4190293 -5746831 -3774298 -522700
9497e22700J046142n60089O63285J986219J140857P2204P95757J287813j131433
$$ -522700 523442 -36647 626638 2612857 3753714 3825918 4621675 5909488 4778055
9488D778055m725375n328927k337416P68209J696954J762583K356092K386111
$$ 4778055 52680 -5276247 -7613663 -6845454 -5148500 -3385917 -1029825 1356286
9480A356286J100647N48774K274717L632076J164516l352870m526581j221055
$$ 1356286 2456933 3005707 5280424 8912500 10077016 6724146 2197565 976510
9472I76510J485873l98952m475724o182636m905173k962124j266574O53743K166651
$$ 976510 2462383 2063431 -2412293 -8594929 -13500102 -16462226 -17728800 -17075057 -14908406
9463a4908406K223269J325954M71403k75515k01560K415728O452714P032273K343975
$$ -14908406 -12685137 -11359183 -10887780 -11163295 -11364855 -8949127 -2496413 4535860 6879835
9454F879835j992188n79220K820234Q40908n019556n980454j78646L915191J076363
$$ 6879835 4887647 4308427 7128661 7969569 2950013 -3030441 -3209087 706104 1782467
9445A782467k532326j98065L917306J973727l989117m843022J146293N591785
$$ 1782467 -749859 -947924 2969382 4943109 953992 -3889030 -2742737 2849048
9437B849048K696640l006182m579133k309554j061951k026500k180969k46810
$$ 2849048 5545688 2539506 -2039627 -4349181 -5411132 -7437632 -9618601 -9865411
9429i865411J521950J478009P48702M40582k22136j489490j464734Q34788K795014
$$ -9865411 -8343461 -6865452 -6116750 -5676168 -5898304 -7387794 -8852528 -8017740 -5222726
9420e222726J593462r13456l89061K972287L842205l52751m986450m669064q48939
$$ -5222726 -3629264 -4542720 -4931781 -1959494 1882711 1529960 -3456490 -8125554 -8974493
9411h974493J146648M10047O87846L017941L625573M61572k824848k080020J384028
$$ -8974493 -7827845 -7417798 -6729952 -3712011 -86438 375134 -2449714 -4529734 -3145706
9402c145706K960742R62903k035019l065992j794491K6578P81969O60623J242893
$$ -3145706 -184964 777939 -1257080 -4323072 -6117563 -6090985 -5309016 -4648393 -3405500
9393c405500K891031L297455M94068l273378l648354l91575J974186Q84051o79559
$$ -3405500 -514469 2782986 3277054 3676 -3644678 -4036253 -2062067 -1178016 -1857575
9384a857575M10033K078111P20580k430061k988148j91752K296064K117537Q54382
$$ -1857575 -1447542 630569 1351149 -1078912 -4067060 -4258812 -1962748 154789 1009171
9375A009171M65352N03909n3703q45327j128208p93742L12004K167436L320133
$$ 1009171 1474523 1978432 1924729 1079402 -48806 -842548 -530544 1636892 4957025
9366D957025K220592L26934R22488L536036K884753l725411j0548211r345832
$$ 4957025 7177617 7504551 8427039 11963075 14847828 11122417 574206 -8771626
9358h771626o07310N842856L047736m097087n451283R76648O893733N277980n79497
$$ -8771626 -9378936 -3536080 -488344 -4585431 -10036714 -9060066 -2166333 3111647 2532150
9349B532150k565802Q11629L279771O30036l353128k958586J187728L638089K050862
$$ 2532150 -33652 777977 4057748 4687784 1334656 -1623930 -436202 3201887 5252749
9340E252749n28887j204202j166744k595346m413154l694647k13986K840085K907439
$$ 5252749 4723862 3519660 2352916 -242430 -4655584 -8350231 -8564217 -5724132 -2816693
9331b816693J094348K36906R51324J203503j32516j152377J98778K478784K524480
$$ -2816693 -1722345 -1485439 -534115 669388 536872 -615505 -416727 2062057 4586537
9322D586537M65881k96096J141989J207563k040439m485701j776048K986155K854744
$$ 4586537 5052418 4756322 5898311 7105874 5065435 579734 -1196314 1789841 4644585
9313D644585k430482n458805j826477L731467M586166J023117j938830k163848
$$ 4644585 2214103 -3244702 -5071179 -1339712 3246454 4269571 2330741 166893
9305A66893j471502j032495l3606J562354K334758J564070j92063k270698l669606
$$ 166893 -1304609 -2337104 -2370710 -808356 1526402 3090472 2898409 627711 -3041895
9296c041895k617121J151148M482322L888804J31511k841287l103481k116110
$$ -3041895 -5659016 -4507868 -25546 3863258 3994769 1153482 -1949999 -4066109
9288d066109j149679L91815K408847K878101P82127j649534j335807J804304M498050
$$ -4066109 -5215788 -4823973 -2415126 462975 1245102 -404432 -1740239 64065 4562115
9279D562115L540674o11794l858413k889966N15041J621557m21383j160062J824950
$$ 4562115 8102789 7490995 3632582 742616 1257657 2879214 2457831 1297769 3122719
9270C122719M061599P20376n137483o425928k420625R29215N94240k09800Q31262
$$ 3122719 7184318 7904694 2767211 -3658717 -6079342 -5150127 -4555887 -4765687 -3934425
9261c934425J217089p60246k198997n69569K084629L070833L088860L342326K577315
$$ -3934425 -2717336 -3477582 -5676579 -6246148 -4161519 -1090686 1998174 5340500 7917815
9252G917815J56637j631885j458597j485312k998173l483577j399819L41124m62748
$$ 7917815 8074452 6442567 4983970 3498658 500485 -2983092 -4382911 -4041787 -4504535
9243d504535r30546J589847M001891K506884o07599j056377n3742j255601l056550
$$ -4504535 -5435081 -3845234 156657 2663541 2055942 999565 945823 -309778 -3366328
9234c366328j209407K625229K607370j457369l485078r37362J778526J325564
$$ -3366328 -4575735 -1950506 656864 -800505 -4285583 -5222945 -3444419 -2118855
9226b118855L45633J697155L167660J338699k875200n558956m505977q06682K596459
$$ -2118855 -1773222 -76067 3091593 4430292 1555092 -4003864 -8509841 -9316523 -6720064
9217f720064L244030J620480R01294K433327L082228N8003l683144l240578N72426
$$ -6720064 -3476034 -1855554 -954260 1479067 4561295 4619298 936154 -2304424 -1731998
9208a731998K529977J113523j89901M28488P27113o35583j876586j685807o67422
$$ -1731998 797979 1911502 1721601 2150089 2877202 2241619 365033 -1320774 -1988196
9199a988196J022975L092948K847895j157618m211764r03207N046874M463441
$$ -1988196 -965221 2127727 4975622 3818004 -393760 -1296967 3749907 8213348
9191H213348l053146p462921l298478K617379K656588p90272j695018l61188k08972
$$ 8213348 5160202 -2302719 -5601197 -2983818 -327230 -1117502 -2812520 -3173708 -3382680
9182c382680l07901J625067K950872K7957m380496m343694J92989L499695K423534
$$ -3382680 -3690581 -2065514 885358 913315 -3467181 -7810875 -7617886 -4118191 -1694657
9173a694657k93696r24768P68145K202764J024023k238126l946084j461590K525945
$$ -1694657 -1988353 -2913121 -2144976 57788 1081811 -1156315 -5102399 -6563989 -4038044
9164d038044K963011j89038k011520o21844M70838n83812r03168O65955O33243
$$ -4038044 -1075033 -1264071 -3275591 -3897435 -3426597 -4010409 -4913577 -4247622 -3614379
9155c614379k122464l061068Q1372K727210J734328J357145M918627P286692L087827
$$ -3614379 -5736843 -8797911 -8716539 -5989329 -4255001 -2897856 2020771 9307463 12395290
9146A2395290l341539m372560q17554R50882l60860j412291j748956k609269j558211
$$ 12395290 9053751 4681191 3863637 4814519 4453659 3041368 1292412 -1316857 -2875068
9137b875068L150614O046166J437864n779988o151052m93328J795681j662334
$$ -2875068 275546 6321712 7759576 1979588 -4171464 -4664792 -2869111 -4531445
9129d531445l500949k86972K248537M76651q06710K282056N581711M291739Q04064
$$ -4531445 -8032394 -8319366 -6070829 -5594178 -6400888 -4118832 1462879 5754618 6558682
9120F558682j21248J112192J100744o28601j984969j978886j085657j9267K48547
$$ 6558682 6437434 7549626 8650370 8021769 6036800 4057914 2972257 2952990 3201537
9111C201537o24653r75691P19020K646268K009958q4466k77208J163559R24706
$$ 3201537 2576884 1601193 2320213 4966481 6976439 6891973 6614765 7778324 8703030
9102H703030j226352k054646o64156L77721j36404j013623k215225m268115m697231
$$ 8703030 7476678 5422032 4757876 5135597 4999193 3985570 1770345 -2497770 -7195001
9093g195001r30019L690271L278884j324818l517670j230747J126762J418591
$$ -7195001 -8125020 -4434749 -1155865 -2480683 -5998353 -7229100 -6102338 -4683747
9085d683747K342071M006157K485372j938685l517178r34282N987k818444l178432
$$ -4683747 -2341676 1664481 4149853 2211168 -1306010 -2240292 -2234305 -5052749 -8231181
9076h231181K336226O881151L701638k998980m733034q97929K747799L449510
$$ -8231181 -5894955 986196 4687834 1688854 -3044180 -3942109 -1194310 2255200
9068B255200K531418M85144k670376m492409k895609J07152J432676J186422N70525
$$ 2255200 4786618 5271762 2601386 -1891023 -4786632 -4679480 -3246804 -2060382 -1489857
9059a489857j047206l424619l561819l46532K625869K538311J610378K185068
$$ -1489857 -2537063 -5961682 -9523501 -9870033 -7244164 -4705853 -3095475 -910407
9051i10407K184533k19509k112054r11635N30729r14895k729700j383139J311088
$$ -910407 1274126 1054617 -1057437 -1969072 -1438343 -2353238 -5082938 -6466077 -5154989
9042e154989K052428K006435L050610K569644j402896m249622j451730K760121
$$ -5154989 -3102561 -1096126 1954484 4524128 3121232 -1128390 -2580120 180001
9034A80001J738299j957149o34127M852269N618302r00598o721242n462680o01257
$$ 180001 1918300 -38849 -672976 4179293 9797595 8896997 2175755 -3286925 -3888182
9025c888182J421367j30331j813429j472066O22899K815265K802103J89919j618243
$$ -3888182 -2466815 -2597146 -4410575 -5882641 -5259742 -2444477 357626 547545 -1070698
9016a070698N49808M349782M692621R83591k879974m690009n011914l283074J066184
$$ -1070698 -520890 3828892 8521513 9505104 6625130 1935121 -3076793 -6359867 -5293683
9007e293683M249621J744469l480632l548470K369887O079305K607447k828940
$$ -5293683 -1044062 700407 -2780225 -6328695 -3958808 2120497 4727944 1899004
8999A899004l601556q29752P38441M85687M60071L41082j055150k249699j532384
$$ 1899004 -1702552 -2532304 -1793863 -1308176 -848105 -507023 -1562173 -3811872 -5344256
8990e344256m14233p69918j061933P30641K856068K546294R67732J144358K460426
$$ -5344256 -5758489 -6528407 -7590340 -6859699 -4003631 -1457337 -489605 654753 3115179
8981C115179J697106j125571k291884r7420K649494K776061N71565j676995k726438
$$ 3115179 4812285 3686714 1394830 1297410 3946904 6722965 7294530 5617535 2891097
8972B891097k523501r36146J793402L814487K692435j520641n190735m570630
$$ 2891097 367596 -568550 1224852 5039339 7731774 6211133 1020398 -3550232
8964c550232l88487K674364J755060q36183j461840k26981M43539N85076K219529
$$ -3550232 -3938719 -1264355 490705 -345478 -1807318 -2034299 -1590760 -1005684 1213845
8955A213845M571379L959925n62989m993395n347133k100769J717619M160327
$$ 1213845 5785224 9745149 9182160 4188765 -1158368 -3259137 -1541518 2618809
8947B618809M515414K496673o90828k517356k155052j490701j731706j374637
$$ 2618809 7134223 9630896 8940068 6422712 4267660 2776959 1045253 -329384
8939c29384O78910K557054K347364J247080J016968M75319k078330m630862l637142
$$ -329384 349526 2906580 5253944 6501024 7517992 7993311 5914981 1284119 -2353023
8930b353023K51908K606287J461164o14950j324908j677586k606844k112533J337071
$$ -2353023 -2101115 505172 1966336 1351386 26478 -1651108 -4257952 -6370485 -5033414
8921e033414M935013M622013J139907n26659J788928M044080J500974m295139
$$ -5033414 -98401 4523612 5663519 5136860 6925788 10969868 12470842 8175703
8913H175703o791471k633707L765355N310415P39877m055145l566053N52095K234676
$$ 8175703 1384232 -1249475 2515880 7826295 8566172 4511027 944974 1497069 3731745
8904C731745m33157k693483m54188K946662J082376n551465q770445l536353M749068
$$ 3731745 3298588 605105 150917 3097579 4179955 -1371510 -10141955 -13678308 -8929240
8895h929240P319528L386879l29304J64146J958758J634450K60439j51864n39536
$$ -8929240 -1609712 1777167 1447863 1612009 3570767 5205217 5465656 5313792 4774256
8886D774256j909595k189758L02696K963384K423062p1932q77164k725n63485
$$ 4774256 2864661 674903 977599 3940983 6364045 6292113 5414949 5412224 4848739
8877D848739k969455m154441k725630p82911L8238O61975J823641K565277K458835
$$ 4848739 1879284 -2275157 -5000787 -5783698 -5745460 -5083485 -3259844 -694567 1764268
8868A764268K240747J411571j426273m807786m745946n79405L189389L183969
$$ 1764268 4005015 5416586 3990313 -817473 -5563419 -6142824 -2953435 230534
8860B30534J649161J731971J948914m42993l446210k920392K94652J328282q75257
$$ 230534 1879695 3611666 5560580 5117587 1671377 -1249015 -954363 373919 -501338
8851e01338k106657j87143J610616N67897r51297k75715N04110j330685l199826
$$ -501338 -2607995 -2795138 -1184522 -616625 -1567922 -1843637 -1339527 -2670212 -5870038
8842e870038q98160L666024M449304O31535k222301j345311o62027k784202l429969
$$ -5870038 -6768198 -3102174 1347130 1978665 -243636 -1588947 -2250974 -5035176 -8465145
8833h465145J268284O924562O750144J892173j079924q67893j790681m146655
$$ -8465145 -7196861 -272299 6477845 8370018 7290094 6422201 4631520 484865
8825D84865k952879K154154M428207J029057j552414J545884M602786P80475n422637
$$ 484865 -2468014 -313860 4114347 5143404 3590990 5136874 9739660 10520135 5097498
8816E097498m544760K496955N561051Q85696m354177m313164k019020j576021
$$ 5097498 552738 3049693 8610744 9496440 5142263 829099 -1189921 -2765942
8808b765942j139804J570390L485900J584769j049463m10158J306502q7559k691343
$$ -2765942 -3905746 -2335356 1150544 2735313 1685850 1275692 2582194 2494635 -196708
8799a96708j462124K590245L292208o77935l450789j242098J928281Q22082l143439
$$ -196708 -1658832 931413 4223621 3545686 94897 -1147201 781080 1603162 -1540277
8790a540277m484804j512739K203592L162074J580416j80998n56894L11608J239380
$$ -1540277 -6025081 -7537820 -5334228 -2172154 -591738 -772736 -1329630 -1018022 221358
8781B21358J065492l23622j821126k176178j119758O68711K256987K890076K270876
$$ 221358 1286850 963228 -857898 -3034076 -4153834 -3485123 -1228136 1661940 3932816
8772C932816Q34556n70851j504164k092206k345579j932941q20483M74773J445799
$$ 3932816 4767372 4196521 2692357 600151 -1745428 -3678369 -4498852 -4024079 -2578280
8763b578280J776152R58038j209339l431538l493772q50507K332720L597137K716568
$$ -2578280 -802128 155910 -1053429 -4484967 -7978739 -8829246 -6496526 -2899389 -182821
8754a82821R48790r35269k400478k165793K75492K688536K144913q02699k411918
$$ -182821 765969 -169300 -2569778 -4735571 -4460079 -1771543 373370 -429329 -2841247
8745b841247q44380J424061J460788j25474q92053m43107j81599k55532N29356
$$ -2841247 -3685627 -2261566 -800778 -926252 -1818305 -2261412 -2443011 -2698543 -2169187
8736b169187J860295J577862r32499k953678j647245J831887L258055P15302k424797
$$ -2169187 -308892 1268970 336471 -2617207 -4264452 -2432565 825490 1540792 -884005
8727h84005j456203L145051N439117J462267n061313p015160k850752K005278
$$ -884005 -2340208 804843 6243960 7706227 2644914 -4370246 -7220998 -5215720
8719e215720K688648K81862j425092j163414r6890Q45451J175787L60885q11816
$$ -5215720 -2527072 -2245210 -3670302 -4833716 -4930606 -4085155 -2909368 -2548483 -3360299
8710c360299l34823J687944K158305m15851l031151k497176J6498J673741K338287
$$ -3360299 -3695122 -2007178 151127 -264724 -3295875 -5793051 -5776553 -4102812 -1764525
8701a764525K751118J430973k156983m169123j422137K442077J740916k133697
$$ -1764525 986593 2417566 260583 -3908540 -5330677 -2888600 -1147684 -3281381
8693c281381k998345j07053J260918o29091j525700M99672J860814P53245M84844
$$ -3281381 -6279726 -6386779 -5125861 -5754952 -7280652 -6780980 -4920166 -4166921 -3682077
8684c682077K677746L919909K409332J274273J767635J97834m019256m700082
$$ -3682077 -1004331 2915578 5324910 6599183 8366818 8564652 4545396 -154686
8676a54686Q34138N008594J155168m784746l074000L736215M333230l280560q200848
$$ -154686 679452 5688046 6843214 2058468 -1015532 2720683 7053913 3773353 -4427495
8667d427495k930638N977983P819389J852312l624957k933233J027493K000240
$$ -4427495 -7358133 -1380150 6439239 8291551 4666594 1733361 2760854 4761094
8659D761094j393092m167680j783710L244533M430333O85712k057770k56408J683640
$$ 4761094 3368002 -799678 -2583388 661145 5091478 5777190 3719420 3463012 5146652
8650E146652q70589m659925l873218M28828K871341K651985K627355J950501k175381
$$ 5146652 4276063 -383862 -4257080 -3828252 -956911 1695074 4322429 6272930 4097549
8641D097549o587709m852476J728820M590219J096828j452030J770433N136363
$$ 4097549 -2490160 -7342636 -5613816 -1023597 73231 -1378799 391634 5527997
8633E527997K201067l642562m755679p42642K428835J922358K97307l53017r27133
$$ 5527997 7729064 4086502 -669177 -1411819 1017016 2939374 3236681 2883664 1956531
8624A956531k060592k633339j977547o76059Q72683K311316K134967p63985m327751
$$ 1956531 -104061 -2737400 -4714947 -5391006 -4518323 -2207007 -72040 -836025 -5163776
8615e163776m555833l25632M481571M741619k43299n343906m549212K148527P738901
$$ -5163776 -9719609 -10045241 -5563670 -822051 -1065350 -6409256 -10958468 -8809941 -1071040
8606a071040N707196j980038o851035m106552K057825M573246K152028p12322
$$ -1071040 4636156 2656118 -4194917 -8301469 -6243644 -1670398 481630 -230692
8598b30692o86699O90078L69775j636555k553653r37224J103967O32558j847235
$$ -230692 -917391 -227313 142462 -1494093 -4047746 -4984970 -3881003 -3248445 -5095680
8589e095680k605087K25517L648335L652705O56667j376730n25707J225671J649585
$$ -5095680 -7700767 -7475250 -3826915 -174210 482457 -894273 -1419980 -194309 1455276
8580A455276Q66149k84957j591098k090638j44488L359374M372289P43197l897606
$$ 1455276 2321425 2036468 445370 -1645268 -1789756 1569618 5941907 6685104 2787498
8571B787498m264209m33980K498587J692781n3796N05666J814174M69510k600380
$$ 2787498 -1476711 -1910691 587896 2280677 2226881 2732547 4546721 5016231 2415851
8562B415851l029902J59342K865460K233733N76723N40364L24838k313620m565167
$$ 2415851 -614051 -454709 2410751 4644484 5221207 5761571 6086409 3772789 -792378
8553g92378k386078K189352L506093J104944k90490N75731j0671k544799k345988
$$ -792378 -3178456 -989104 2516989 3621933 3331443 3907174 3896503 1351704 -994284
8544i94284J498019K955286q45449l623102R6722N466850M848531l63463l220841
$$ -994284 503735 3459021 2613572 -1009530 -912808 4554042 9402573 9039110 5818269
8535E818269k395811j608832j039226J839474M668639K519892k608678l422531
$$ 5818269 3422458 1813626 774400 2613874 7282513 9802405 7193727 3771196
8527C771196Q35942K759644j078785m549918k114250K367239J908181l145129
$$ 3771196 4607138 7366782 6287997 1738079 -376171 1991068 3899249 754120
8519G54120o021557k750439L297127N582936J495196m499832n219857O82477O321462
$$ 754120 -5267437 -8017876 -4720749 862187 2357383 -2142449 -7362306 -6679829 -358367
8510c58367N112336o92141l898509k563141r36312j392966j491864M65898K358197
$$ -358367 4753969 4061828 163319 -2399822 -3336134 -4729100 -6220964 -5755066 -3396869
8501c396869K024213N0895k012747k791094o48815M069674P023804M394854j271633
$$ -3396869 -1372656 -1321761 -3334508 -6125602 -6774417 -2704743 4319061 8713915 7442282
8492G442282m136553k855504m86339J666209M107080M577001N70878m207747l521574
$$ 7442282 3305729 450225 -36114 1630095 5737175 10314176 10885054 6677307 3155733
8483C155733J187395K215724k028881m564218j691647J248797n11300l456128
$$ 3155733 4343128 6558852 4529971 -34247 -1725894 -477097 -988397 -4444525
8475d444525k276915J921982M443290L504434M01883k916886m035016j676554
$$ -4444525 -6721440 -4799458 -356168 3148266 3550149 633263 -3401753 -5078307
8467e078307J535528K045957J029807J733167K236539j474169n922042l518592
$$ -5078307 -3542779 -1496822 -467015 1266152 3502691 2028522 -3893520 -7412112
8459g412112L605503M510290k809255o694652l86731O618797M008988l139957
$$ -7412112 -3806609 703681 -2105574 -8800226 -9186957 -2568160 1440828 -1699129
8451a699129l964646P31559K172439r51018k286661J56572K203580K048901J713012
$$ -1699129 -5663775 -4932216 -2759777 -3710795 -5997456 -5840884 -3637304 -1588403 124609
8442A24609J148265j289309l451262j605535K591170L620129K13380l306862l265840
$$ 124609 1272874 -16435 -3467697 -5073232 -2482062 1138067 1351447 -1955415 -5221255
8433e221255j1744L785168M768168R69285m565361n371284j17724M506880L256750
$$ -5221255 -5232999 -1447831 3320337 4289622 -275739 -5647023 -5764747 -1257867 1998883
8424A998883k71412m83121J355604J209671J67744J080501J575056j768463n516166
$$ 1998883 1727471 1244350 2599954 3809625 3977369 5057870 6632926 4864463 -651703
8415f51703l652376K366869N315503K533177k022082m543204m145224p52883L819338
$$ -651703 -4304079 -1937210 3378293 5911470 3889388 -653816 -4799040 -5551923 -1732585
8406a732585M760660J22593m562616l356633J281490L014040J599262J118060
$$ -1732585 3028075 3150668 -1411948 -4768581 -3487091 -473051 1126211 2244271
8398B244271J329738j003683m200881l394290Q07342K992689J543167l43027j064186
$$ 2244271 3574009 2570326 -1630555 -5024845 -4217503 -1224814 318353 -24674 -1088860
8389a088860j297973R7977L830156N686877J749811l877481m368524r94657m9795
$$ -1088860 -2386833 -2288856 1541300 7228177 8977988 5100507 731983 -262674 -312469
8380c12469j221684R95392N534748N265460l45004l637884j243410J828815K275459
$$ -312469 -1534153 -538761 4995987 10261447 9916443 6278559 5035149 6863964 9139423
8371I139423K642901L141624l93080o931629q538871k713309K599834J301542
$$ 9139423 11782324 14923948 14530868 7599239 -939632 -3652941 -1053107 248435
8363B48435k037663j228876J563417J435692k64409L93048K099369Q47312k916977
$$ 248435 -1789228 -3018104 -1454687 -18995 -283404 109644 2209013 3056325 139348
8354A39348n167758l995809n02114L505956N755747M364329Q67519q19168j74155
$$ 139348 -5028410 -9024219 -9526333 -6020377 -264630 4099699 4967218 4148050 3973895
8345C973895o94262l172281l618319m09973K047021L82999k121651j207219J515605
$$ 3973895 3279633 107352 -3510967 -3920940 -1873919 -1490920 -3612571 -4819790 -3304185
8336c304185J979064L40231l79185L07087N32176k09278r66094j440907j636449
$$ -3304185 -1325121 -984890 -1364075 -1056988 -524812 -734090 -1700184 -3141091 -4777540
8327d777540r75122L57100J046276R85932J674364L151949L277062J263262q92921
$$ -4777540 -5752662 -5395562 -4349286 -3363354 -1688990 1462959 4740021 6003283 5110362
8318E110362j658165j767458j847899j268863k25815K8242m09928m39834n67814
$$ 5110362 3452197 1684739 -163160 -1432023 -1657838 -1629596 -2039524 -2479358 -3047172
8309c047172j670543j897595O80318L223762J610441j791163o95555M391036N732380
$$ -3047172 -4717715 -6615310 -5934992 -2711230 -1100789 -2891952 -3587507 803529 6535909
8300F535909L76925n180702n293043k579975j164454K43082L405003N047330K214752
$$ 6535909 6912834 1732132 -3560911 -6140886 -7305340 -7062258 -3657255 1390075 3604827
8291C604827j747141k264199n40162j94003o97478L91563J860076J003813j005840
$$ 3604827 1857686 -406513 -946675 -1140678 -1838156 -1446593 413483 1417296 411456
8282D11456j040397M24763L21142j600814k484334r84217J019834J263002k66616
$$ 411456 -628941 -204178 116964 -1483850 -3968184 -4952401 -3932567 -2669565 -2936181
8273b936181j422816j13135K844652L758278Q34244k475870k065399O01808J292999
$$ -2936181 -4358997 -4472132 -1627480 2130798 2965042 489172 -1576227 -974419 318580
8264C18580K20259O26180J723976K87985j617421R79920N746813M757087k148692
$$ 318580 538839 1165019 2888995 3176980 1559559 2539479 8286292 13043379 10894687
8255A0894687n827947k406596J038886o18611k602736o25309J166805p02799j929173
$$ 10894687 5066740 2660144 3699030 3080419 477683 -147626 1019179 316380 -1612793
8246a612793J66388N5367m731396n897438J800499Q629521M004040n638752o747216
$$ -1612793 -1446405 -1391038 -6122434 -12019872 -10219373 -1589852 2414188 -3224564 -9971780
8237i971780j8594K868708m65422j488908K303468L792048K65617k274732o61924
$$ -9971780 -9990374 -7121666 -7587088 -9075996 -6772528 -2980480 -2714863 -4989595 -5651519
8228e651519J299805K065029M590864P373299M304861l694531p434931l343338
$$ -5651519 -4351714 -2286685 2304179 9677478 13982339 10287808 2852877 -490461
8220d90461J239878N20060j531905j70028J727923P3395k733400k420341J99685
$$ -490461 749417 1269477 -262428 -432456 1295467 1368862 -1364538 -3784879 -3585194
8211c585194J795763J565668J04485k228616l175421p1721M229956L202178k845126
$$ -3585194 -1789431 -223763 -119278 -2347894 -5523315 -5595036 -1365080 1837098 -1008028
8202a008028n241678P5420N476911L213430k593955k823079K645176N756220K541414
$$ -1008028 -6249706 -6174286 -697375 2516055 -77900 -2900979 -255803 5500417 8041831
8193H041831k732746m735889k523784J743374M756783L252653k435988o541627
$$ 8041831 5309085 573196 -1950588 -207214 4549569 7802222 5366234 -1175393
8185a175393l762342L254483O453233K653145k773930l708430j114718m39306
$$ -1175393 -4937735 -1683252 4769981 7423126 4649196 940766 -173952 -613258
8177f13258l222439m787037r22557N596121P721967L011495l147486m567356j839011
$$ -613258 -3835697 -8622734 -9545291 -3949170 3772797 6784292 3636806 -930550 -2769561
8168b769561q4590j154482k096106q07643J077634J719578J772162K099686J790924
$$ -2769561 -2854151 -4008633 -6104739 -6912382 -5834748 -4115170 -2343008 -243322 1547602
8159A547602K09292j217244r37113N45619J637188J561607N65613p05890j688273
$$ 1547602 1756894 539650 -397463 148156 1785344 3346951 3912564 3206674 1518401
8150A518401k462133l325214l199271m13969L420459L438112j349266m384617
$$ 1518401 -943732 -4268946 -7468217 -7882186 -4461727 -1023615 -2372881 -6757498
8142f757498k90452N666987M183111l382118n873544Q76066P498604N359503j084595
$$ -6757498 -7047950 -1380963 2802148 -579970 -6453514 -5577448 1921156 7280659 6196064
8133F196064k572744R49377K548780L43561j099116K56602J247185K2933j134260
$$ 6196064 3623320 4572697 7121477 7465038 6365922 6622524 7869709 7892642 6758382
8124F758382o17495k0296m70893o97941k58234r06935k916117l384351o60980
$$ 6758382 6140887 6120591 5649698 4951757 4693523 3786588 870471 -2513880 -3174860
8115c174860K110517Q93111l111396m434265o75969L882541L744646l65565k465872
$$ -3174860 -1064343 -171232 -3282628 -7716893 -8392862 -4510321 -765675 -1131240 -3597112
8106c597112J68352K920878O67156m067337m185635J549177O268494M476867q56790
$$ -3597112 -3428760 -507882 159274 -3908063 -8093698 -6544521 -276027 4200840 3344050
8097C344050l434695k095924l75650j63901j03095P44955J501117J614377J412416
$$ 3344050 -90645 -2186569 -2562219 -2726120 -2829215 -2084260 -583143 1031234 2443650
8088B443650O23996r63173j604526O90941M326296M964581J131141l539323m939685
$$ 2443650 3067646 2104473 499947 1190888 5517184 10481765 11612906 8073583 3133898
8079C133898l293178j685357j374217p44476J375473L253122K146456j725390
$$ 3133898 -159280 -1844637 -3218854 -3963330 -2587857 665265 2811721 1086331
8071A086331m257544j673015M360885P474736L694059l422098o693806l758462
$$ 1086331 -3171213 -4844228 -483343 6991393 10685452 7263354 569548 -3188914
8063c188914Q24093K045845K48504r92097m75884k17784j484657k721114k050017
$$ -3188914 -2364821 -318976 -70472 -1062569 -1538453 -1756237 -3240894 -5962008 -8012025
8054h012025j4021J330755J145322N19428P30685J653025K071762J170288n93570
$$ -8012025 -8026046 -6695291 -5549969 -5030541 -4299856 -2646831 -575069 595219 1649
8045A649k063363k552494k130059r75242P43128K179750K151179R08914L50480
$$ 1649 -2061714 -4614208 -6744267 -7719509 -6976381 -4796631 -2645452 -1736538 -1386058
8036a386058J196521J344358q80680l186633k249451N90193Q92260j337935r76825
$$ -1386058 -189537 1154821 274141 -2912492 -5161943 -4571750 -3679490 -5017425 -5994250
8027e994250L384840N692168J589591l920657l881157j62694N46997j564987o66644
$$ -5994250 -2609410 3082758 4672349 751692 -3129465 -3292159 -2745162 -4310149 -4976793
8018d976793L067188K995394j721858l524387O15666L474670Q4953l250915R4043
$$ -4976793 -1909605 1085789 -636069 -4160456 -3544790 -70120 14833 -3236082 -3142039
8009c142039N033472L079622l118764m084637J042359M120348J860646l25858
$$ -3142039 1891433 4971055 1852291 -2232346 -1189987 2930361 4791007 4465149
8001D465149R08462J769606n87409k953824k317216o95292m02440K565J767204
$$ 4465149 5373611 7143217 6555808 3601984 1284768 589476 187036 189601 1956805
7992A956805K666336Q79734j661727k443808j560099R4088K279242L584029J987175
$$ 1956805 4623141 5502875 3841148 1397340 -162759 -68671 2210571 5794600 7781775
7983G781775j328388k671666j476553q26889j445260n66620J757549J500462j702624
$$ 7781775 6453387 3781721 2305168 1478279 33019 -533601 1223948 2724410 1021786
7974A021786k422959J333494L504915k79709m695333l088343J550149J864845
$$ 1021786 -1401173 -67679 3437236 3157527 -1537806 -4626149 -3076000 -1211155
7966a211155j540633j782588K330753M792877K724154J34700J37773M67259j024814
$$ -1211155 -2751788 -4534376 -2203623 2589254 5313408 5448108 5585881 6053140 5028326
7957E028326k218500p89446J894986L222145K338376n17263m171296n348073j571522
$$ 5028326 2809826 2020380 3915366 7137511 9475887 8958624 4787328 -560745 -2132267
7948b132267L842872M366219p22603m803129l483633n16484q94349k941633j957830
$$ -2132267 1710605 6076824 5354221 551092 -2932541 -3449025 -4343374 -7285007 -9242837
7939i242837J835681M214859L706376K461332J514540k23950k527455l387552
$$ -9242837 -7407156 -3192297 514079 2975411 4489951 4266001 1738546 -1649006
7931a649006k261845o77321N46544J893417K913263K128818m25836k750681l240069
$$ -1649006 -3910851 -4588172 -4041628 -2148211 765052 2893870 2468034 -282647 -3522716
7922c522716j847940P30690L212034L723301J738141o66347j426348j102743p00303
$$ -3522716 -5370656 -4639966 -1427932 2295369 4033510 3367163 1940815 838072 137769
7913A37769Q88588L779437L962642j408021p255650n812494J591490N395031J710006
$$ 137769 1026357 4805794 8768436 7360415 104765 -5707729 -4116239 1278792 2988798
7904B988798k584638j585310J004353L4700j958106q21310M70695k258351m651048
$$ 2988798 404160 -1181150 -176797 -142097 -2100203 -2921513 -2450818 -4709169 -9360217
7895i360217J04429Q344267R547364K208026m061726l258061q5455Q7252q66459
$$ -9360217 -9255788 -911521 8635843 10843869 6782143 3524082 3438627 3525879 2659420
7886B659420j04270n7174l030578n542469l474728J412357M579088M581751K281387
$$ 2659420 2555150 2497976 -532602 -6075071 -9549799 -8137442 -3558354 1023397 3304784
7877C304784j746442n435549m954731M7846M572921M805600K540706L28460k648034
$$ 3304784 1558342 -3877207 -8831938 -8784092 -4211171 594429 3135135 3463595 815561
7868H15561o197739o216693j074653M045186M378974K372189J978252J615751
$$ 815561 -5382178 -11598871 -12673524 -8628338 -4249364 -1877175 101077 1716828
$$ [...]
##END NTUPLES=NMR SPECTRUM
##END=
