##TITLE=31Pdec_LR-758-CR2-CHL
 , 24 sc
 23.11.2022
##JCAMPDX= 6.0         $$ Bruker NMR JCAMP-DX V2.0
##DATA TYPE= NMR SPECTRUM
##DATA CLASS= NTUPLES
##ORIGIN= UXNMR, Bruker Analytische Messtechnik GmbH
##OWNER= root
$$ XWIN-NMR		Version 3.5
$$ Wed Nov 23 14:21:47 2022 Russian Standard Time (UT+4h)  she@DPX200
##.OBSERVE FREQUENCY= 81.013821
##.OBSERVE NUCLEUS= ^31P
##.ACQUISITION MODE= SIMULTANEOUS
##.ACQUISITION SCHEME= undefined
##.AVERAGES= 24
##.DIGITISER RES= 16
##SPECTROMETER/DATA SYSTEM= spect
##.PULSE SEQUENCE= zgpg30
##.SOLVENT NAME= CDCl3
##.SHIFT REFERENCE= (INTERNAL, CDCl3, 0, 248.564)
##AUDIT TRAIL= $$ (NUMBER, WHEN, WHO, WHERE, WHAT)
$$ ##TITLE= Audit trail, XWIN-NMR		Version 3.5
$$ ##JCAMPDX= 5.01
$$ ##ORIGIN= Bruker BioSpin GmbH
$$ ##OWNER= she
$$ F:/spectra/data/she/nmr/P31/1/pdata/1/auditp.txt
$$ ##AUDIT TRAIL=  $$ (NUMBER, WHEN, WHO, WHERE, WHAT)
(   1,<2022-11-23 14:20:03.12 +0400>,<she>,<DPX200>,
      <created by zg, POWCHK disabled, PULCHK disabled
       configuration hash MD5:
       00 E9 B6 7A A2 85 ED C7 34 08 36 98 17 FE 4E 26
       data hash MD5: 32K
       7A CB BD 5A 7B 6A 0B 02 21 55 E7 01 5E E4 88 6D>)
(   2,<2022-11-23 14:20:37.32 +0400>,<she>,<DPX200>,
      <Start of raw data processing
       efp BC_mod = 2 LB = 1 FT_mod = 6 PKNL = 1 PHC0 = -10512.3 PHC1 = -154.9443 SI = 64K 
       data hash MD5: 64K
       1B 2E 00 B2 C9 FE 17 73 F9 DA 66 3F 80 DF B6 BD>)
(   3,<2022-11-23 14:21:03.90 +0400>,<she>,<DPX200>,
      <pk PHC0 = 118.1223 PHC1 = -255.8 
       data hash MD5: 64K
       2E 0F 67 83 FB A4 33 7B AF 83 2E 5D 5A 21 3E 50>)
(   4,<2022-11-23 14:21:06.46 +0400>,<she>,<DPX200>,
      <abs ABSG = 5 
       data hash MD5: 64K
       84 2D 47 5A 50 EC 7B 7C DD BC E6 4C 1D 9F 44 97>)
(   5,<2022-11-23 14:21:15.06 +0400>,<she>,<DPX200>,
      <abs ABSG = 5 
       data hash MD5: 64K
       FC 5E A0 E8 52 2C CA 66 F1 1F 9A 88 20 49 E2 C2>)
$$ ##END=
$$ 
$$ hash MD5
$$ 80 0A 47 70 CB 3F 5D C6 39 D0 E8 DA 98 EA 91 34
##$RELAX= 
##$RELAX= 
##$RELAX= 
##$RELAX= 
##$RELAX= 
##$RELAX= 
##$RELAX= 
##$RELAX= 
##$RELAX= 
$$ Bruker specific parameters
$$ --------------------------
##$DU= <F:/spectra>
##$EXPNO= 1
##$NAME= <P31>
##$PROCNO= 1
##$TYPE= <nmr>
##$USER= <she>
##$AMP= (0..31)
100 100 100 100 100 100 100 100 100 100 100 100 100 100 100 100 100 100 
100 100 100 100 100 100 100 100 100 100 100 100 100 100 
##$AQSEQ= 0
##$AQ_mod= 1
##$AUNM= <au_zg>
##$AUTOPOS= <>
##$BF1= 81.014009
##$BF2= 200.13
##$BF3= 200.13
##$BF4= 200.13
##$BF5= 200.13
##$BF6= 200.13
##$BF7= 200.13
##$BF8= 200.13
##$BYTORDA= 1
##$CFDGTYP= 0
##$CFRGTYP= 5
##$CHEMSTR= <none>
##$CNST= (0..31)
1 1 145 1 1 1 1 1 1 1 1 1 1 1 1 1 1 1 1 1 1 1 1 1 1 1 1 1 1 1 1 1 
##$CPDPRG= <waltz16>
##$CPDPRG1= <>
##$CPDPRG2= <waltz16>
##$CPDPRG3= <>
##$CPDPRG4= <mlev>
##$CPDPRG5= <mlev>
##$CPDPRG6= <mlev>
##$CPDPRG7= <mlev>
##$CPDPRG8= <mlev>
##$CPDPRGB= <>
##$CPDPRGT= <>
##$D= (0..31)
0 1 0 0 0 0 0 0 0 0 0 0.03 2e-05 3e-06 0 0 0 0 0 0 0 0 0 0 0 0 0 0 0 0 
0 0 
$$ [...]
##$SUBNAM3= <"">
##$SUBNAM4= <"">
##$SUBNAM5= <"">
##$SUBNAM6= <"">
##$SUBNAM7= <"">
##$SUBNAM8= <"">
##$SUBNAM9= <"">
##$SW= 501.771253377433
##$SWIBOX= (0..15)
0 1 3 0 0 0 0 0 0 0 0 0 0 0 0 0 
##$SW_h= 40650.406504065
##$TD= 32768
##$TD0= 1
##$TE= 0
##$TE2= 300
##$TE3= 300
##$TEG= 300
##$TL= (0..7)
0 120 53 12 22 120 120 120 
##$TP= (0..7)
150 150 150 150 150 150 150 150 
##$TP07= 0
##$TPNAME0= <>
##$TPNAME1= <>
##$TPNAME2= <>
##$TPNAME3= <>
##$TPNAME4= <>
##$TPNAME5= <>
##$TPNAME6= <>
##$TPNAME7= <>
##$TPOAL= (0..7)
0.5 0.5 0.5 0.5 0.5 0.5 0.5 0.5 
##$TPOFFS= (0..7)
0 0 0 0 0 0 0 0 
##$TUNHIN= 0
##$TUNHOUT= 0
##$TUNXOUT= 0
##$USERA1= <user>
##$USERA2= <user>
##$USERA3= <user>
##$USERA4= <user>
##$USERA5= <user>
##$V9= 5
##$VALIST= <valist>
##$VCLIST= <CCCCCCCCCCCCCCC>
##$VD= 0
##$VDLIST= <DDDDDDDDDDDDDDD>
##$VPLIST= <PPPPPPPPPPPPPPP>
##$VTLIST= <TTTTTTTTTTTTTTT>
##$WBST= 1024
##$WBSW= 4
##$XGAIN= (0..3)
0 0 0 0 
##$XL= 0
##$YL= 0
##$YMAX_a= 10003
##$YMIN_a= -12513
##$ZGOPTNS= <>
##$ZL1= 120
##$ZL2= 120
##$ZL3= 120
##$ZL4= 120
##$ABSF1= 248.5645
##$ABSF2= -253.2056
##$ABSG= 5
##$ABSL= 3
##$ALPHA= 0
##$AQORDER= 0
##$ASSFAC= 0
##$ASSFACI= 0
##$ASSFACX= 0
##$ASSWID= 0
##$AUNMP= <proc_1d>
##$AZFE= 0.1
##$AZFW= 0.5
##$BCFW= 0
##$BC_mod= 2
##$BYTORDP= 0
##$COROFFS= 0
##$CY= -3
##$DATMOD= 1
##$DC= 0
##$DFILT= <>
##$DTYPP= 0
##$F1P= 0
##$F2P= 0
##$FCOR= 1
##$FTSIZE= 65536
##$FT_mod= 6
##$GAMMA= 0
##$GB= 0
##$INTBC= 1
##$INTSCL= 6.047779e-11
##$ISEN= 30
##$LB= 1
##$LEV0= 0
##$LPBIN= 0
##$MAXI= 10000
##$MC2= 0
##$MEAN= 0
##$ME_mod= 0
##$MI= 50
##$NCOEF= 0
##$NC_proc= -8
##$NLEV= 6
##$NOISF1= 182.463
##$NOISF2= 159.3651
##$NSP= 0
##$NTH_PI= 0
##$NZP= 0
##$OFFSET= 248.5645
##$PC= 4
##$PHC0= -10394.18
##$PHC1= -410.7443
##$PH_mod= 1
##$PKNL= yes
##$PPARMOD= 0
##$PSCAL= 0
##$PSIGN= 0
##$REVERSE= no
##$SF= 81.0140089999694
##$SI= 65536
##$SIGF1= 159.3651
##$SIGF2= -187.1042
##$SINO= 113.3802
##$SIOLD= 16384
##$SREGLST= <1H.CDCl3>
##$SSB= 0
##$STSI= 65536
##$STSR= 0
##$SW_p= 40650.406504065
##$SYMM= 0
##$S_DEV= 0
##$TDeff= 32768
##$TDoff= 0
##$TI= <>
##$TILT= no
##$TM1= 0
##$TM2= 0
##$TOPLEV= 0
##$USERP1= <user>
##$USERP2= <user>
##$USERP3= <user>
##$USERP4= <user>
##$USERP5= <user>
##$WDW= 1
##$XDIM= 65536
##$YMAX_p= 349611538
##$YMIN_p= -81043848
$$ End of Bruker specific parameters
$$ ---------------------------------
##NTUPLES= NMR SPECTRUM
##VAR_NAME=  FREQUENCY,     SPECTRUM/REAL,   SPECTRUM/IMAG
##SYMBOL=    X,             R,               I
##VAR_TYPE=  INDEPENDENT,   DEPENDENT,       DEPENDENT
##VAR_FORM=  AFFN,          ASDF,            ASDF
##VAR_DIM=   65536,         65536,           65536
##UNITS=     HZ,            ARBITRARY UNITS, ARBITRARY UNITS
##FACTOR=    0.620285442955139, 1,           1
##FIRST=     20137.2065510682, 0,            0
##LAST=      -20513.1999529968, 0,           0
##MIN=       -20513.1999529968, -81043848,   0
##MAX=       20137.2065510682, 349611538,    0
$$ Real data points
##PAGE= N=1
##DATA TABLE= (X++(R..R)), XYDATA
$$ [...]
##PAGE= N=2
##DATA TABLE= (X++(I..I)), XYDATA
13024e201702K041918J370130j927046l658123k057615O34655K249236K844258
13016c704289K747229J347917j267061l246352k731756j84314J862921J674873
13008c500832N10796R32804K855069L150006L66410k337065j458783J390750J727369
12999C636524j092963l315787k734565j077828K3834J275000K753832K699481
12991B167528R19322k17935J18112j64015j579779j418895Q77198J199596k621262
12982g20130n806464l104281K841524N078747K283730n64691m19059O66210O81591
12973I37177N78820R38020L10658j483488k114444m69420J409095J555012N91012
12964B252442j32604l48450J12270J512884K608085J549676q88690j888737j011045
$$ y = [-5201702, -3159784, -1789654, -3716700, -7374823, -9432438, -8797783, -6548547, -3704289, -957060, 390857, -876204, -4122556, -6854312, -7038626, -5175705, -3500832, -2990036, -2057232, 797837, 3947843, 4314253, 1977188, 518405, 1909155, 3636524, 2543561, -772226, -3506791, -4584619, -4560785, -3285785, -531953, 2167528, 3086850, 2868915, 2987027, 2823012, 1243233, -175662, 701536, 1901132, -720130, -6526594, -9630875, -6789351, -1710604, 573126, 8435, -410624, 255586, 937177, 1515997, 2454017, 2764675, 1281187, -833257, -1302677, 106418, 1661430, 2252442, 2119838, 1771388, 1883658, 3396542, 6004627, 7554303, 6665613, 4776876, 3765831]
12955C765831p21844j772134j963480p48589o54205k083459j382996K781862N620026
12946B841012K977583j910875l282730j294643k12689o34934M57395L165426M175063
12937F280608K543396O31298p05566k722767m569956l739330j017024K97037L45834
12928b656470K049107M085000J563171m543773o207843k12429N815543M307821
12920D200127j406572l290484o22724J178163K67276l88462L44729N81654O5279
12911I28986K22311K06080j791885l925136k693556Q76058K346396R77873L55451
12902b497422J726783K198574M68082q72555k68759K43549p15880j196420L45516
12893e68532J998775J321051j087528k686207k052919k3099R70762r18607l948949
$$ y = [3765831, 3043987, 1271853, -691627, -1440216, -2094421, -4177880, -5560876, -2779014, 2841012, 5818595, 3907720, 624990, -669653, -882342, -1517276, -1059881, 2105545, 6280608, 8824004, 9455302, 8749736, 6026969, 1457013, -2282317, -3299341, -3002304, -2656470, -607363, 3477637, 5040808, 497035, -5710808, -5923237, -107694, 4200127, 2793555, -496929, -1119653, 58510, 325786, -62676, 282053, 863707, 928986, 1151297, 1357377, -434508, -4359644, -7053200, -6177142, -3830746, -2852873, -2497422, -770639, 1427935, 1896017, 1023462, 754703, 998252, 282372, -914048, -568532, 1430243, 2751294, 1663766, -1022441, -3075360, -3098459, -2127697, -3046304, -6995253]
12884f995253l584129J305909N490310M355482J078459J539176M539228M010532
12876A1739714l80453k843418j789377k054436n125313n621411q33855L910826
12868b997723L673892R60696j59834o66073k292617k452389R02498M113046L020778
12859D102274o70011l066192l897833l978442j628223K987765M676135N16579
12851i57948l862631j893971L730878N409471K048744j154337j961658k573428
12843a214880l209162j576232J469650K168302j2182j809315j581202n09540Q76100
12834e398461K593228K727999M8307k184085k53125L537239L999786J248278l80415
12825E938751l81101k178613n441243n399062r08442L021470K378865j211808
$$ y = [-6995253, -10579382, -9273473, -3783163, 572319, 1650778, 3189954, 7729182, 11739714, 11359261, 8515843, 6726466, 4672030, -453283, -6074694, -6908549, -2997723, 676169, 1636865, 1477031, 810958, -1481659, -3934048, -3031550, 1081496, 4102274, 3432263, 366071, -3531762, -7510204, -9138427, -6150662, -1474527, -957948, -4820579, -6714550, -2983672, 2425799, 4474543, 3320206, 1358548, -1214880, -4424042, -6000274, -4530624, -2362322, -2374504, -4183819, -5765021, -6274561, -5398461, -2805233, -77234, -28927, -2213012, -2466137, 1071102, 5070888, 6319166, 5938751, 5557650, 3379037, -2062206, -7461268, -8369710, -5348240, -2969375, -4181183]
12817d181183m166767m691271k176775K602055O116759N150719J437456o77996
12809e87003m77907l90909o43713L24984J424861O60739p2861J825845L454593
12800E518629O57114l288581j893430K779330K549978k667463m161742L63957
12792a42208K583651j583073m409224K28767O149207N226362k2970k364144j354543
12783D311825p84380n63887Q24917R28547j935044l394663r0561K892621j60956
12774B028419m986962l686699J947830L329093p99707l168774n43494K080526
12766c799768J124160j85144J339020L316045K236080j290441m239052m797364
12758f296464k943038k48845N76657j198664k238087N64088M786030N495917K517645
$$ y = [-4181183, -8347950, -13039221, -15215996, -12613941, -6497182, -1346463, 90993, -587003, -1064910, -1455819, -2099532, -1774548, -349687, 311052, 238191, 2064036, 5518629, 6175743, 2887162, 993732, 3773062, 6323040, 3655577, -506165, -142208, 2441443, 858370, -3550854, -3322087, 2827120, 8053482, 8030512, 5666368, 4311825, 3527445, 2963558, 3788475, 4717022, 2781978, -612685, -703246, 2189375, 2028419, -2958543, -6645242, -4697412, -1368319, -2168026, -5336800, -5880294, -3799768, -2675608, -2860752, -1521732, 1794313, 4030393, 2739952, -1499100, -6296464, -9239502, -9488347, -8911690, -10110354, -12348441, -11784353, -6998323, -1502406, 1015239]
12749A015239J34711K95697R65737P96840L65033j042517m430321o676603l094749
12740a1670933M337113P347962K515909l383096k748154K586500M923227J538966
12732E447494k888119l559330j003890J167183R82200o44274j886224j895386
12724d280346r28083M93921J886400K552438K073593J226592J164855J313326
12716E502696j89389l060770m006685j074669L008693M262225K736305J527745
12708H706151J522483N43195k112885l581790j394854K489689L629658O05632
12700A0407279l023932l018194J18817J762142l95302k979282k085638O48291
12692A434181R70494o89300k00601K369623K194122j669345l729363j072576J578651
$$ y = [1015239, 1149950, 1445647, 2411384, 3208224, 3573257, 2530740, -1899581, -8576184, -11670933, -7333820, 14142, 2530051, -853045, -3601199, -1014699, 3908528, 5447494, 2559375, -999955, -2003845, -836662, 145538, -498736, -2384960, -4280346, -5208429, -4714508, -2828108, -275670, 1797923, 3024515, 4189370, 5502696, 5313307, 2252537, -1754148, -2828817, 179876, 4442101, 7178406, 8706151, 10228634, 10771829, 8658944, 5077154, 3682300, 6171989, 9801647, 10407279, 7383347, 4365153, 4483970, 6246112, 5850810, 2871528, 785890, 1434181, 2404675, 1715375, 1514774, 3884397, 6078519, 4409174, 679811, -392765, 1185886]
12683A185886J17357j825792K57374L243656J802514j920684k001022P43126M07563
12674B009978l136984l684502N88595L951364K553291n1944K61488J698824N93890
12665D784000k230029k969610m46430K605115K831323l57534l900494l841171
12657c524830j99041K290218M22513k526554j458108K855211N075387L097044
12649F031840o6188j529620j178591M26280K369158K181947j232322m336491l368177
12640g02164p38276j325916l581759j397043N133420Q495781M908710n51186k535989
12631G705578k352084k858428k620597L05299L328082K651811j205244m565142
12623C89275m980709k429409J324523L246480J689491r54070j440975q69755k107007
$$ y = [1185886, 1303243, -522549, -265175, 2978481, 4780995, 2860311, 859289, 1602415, 2009978, -1127006, -4811508, -4222913, -271549, 2281742, 2229798, 2491286, 4190110, 4784000, 2553971, -415639, -862069, 1743046, 4574369, 4216835, 316341, -3524830, -3723871, -1433653, -1011140, -3537694, -4995802, -2140591, 2934796, 6031840, 5965652, 4436032, 3257441, 3683721, 6052879, 8234826, 7002504, 2666013, -702164, -1440440, -2766356, -6348115, -7745158, -2611738, 5884043, 10792753, 10241567, 7705578, 5353494, 2495066, -125531, 179768, 3507850, 6159661, 4954417, 389275, -4591434, -7020843, -5696320, -2449840, -760349, -1714419, -3155394, -4025149, -6132156]
12614f132156l253997l91776L675659J980374m196837n138616J891754P060790
12606d504805L253764k597963j145497M602172N484686J096865j545747l93040
12598D250435L01574j032491j664200r24923p63950p57222R54629K834111K068421
12589E266384N0514p9499O44368l78828j318881O23319K373120n50600m961623
12580A668274m189246K36226Q34446k434121j817751L909001O008323L09056n321511
12571g97303l612276J159437J729486l93561K59380K536949J631538j253685q74838
12562C85127K374560K856692n95698k622271r8842L020736J856109k584855n292080
12553g00522l613548L00541K460449J395500m15282J86259K494275K551392j007629
$$ y = [-6132156, -9386153, -9777929, -6102270, -4121896, -8318733, -13457349, -11565595, -4504805, -1251041, -3849004, -4994501, -392329, 5092357, 6189222, 4643475, 4250435, 4552009, 3519518, 1855318, 930395, 166445, -590777, 363852, 3197963, 5266384, 5316898, 5237399, 5881767, 5502939, 4184058, 4807377, 7180497, 6629897, 1668274, -2520972, -2284746, -1450300, -3884421, -5702172, -1793171, 4215152, 4524208, -797303, -4409579, -3250142, -1520656, -1914217, -1654837, 882112, 2513650, 1259965, 385127, 2759687, 5616379, 5020681, 2398410, 2299568, 5320304, 7176413, 4591558, -700522, -4314070, -4013529, -1553080, -157580, -572862, -386603, 2107672, 4659064, 3651435]
12544C651435m481617m455304k780793k916019l572770n70672N673093R244494
12536b08153O353864K40268l166094j904982J264012K737226J083154k389316
12528D009979m695068l762583p87528J059733P21149L40301J403794J954006k64169
12519b0386l351716k896540J884431O244981N343683k4020m647960n043708k678759
12510e189994r73475o74330M39878L581245O311629N099563L4336m576889m895838
12501h43875j673056J285979J775304Q10261J68514K33369N14058O39678K72231
12492C182463o25599j042519L4735J473528R24542j363204k133010J0444J990444
12483B451824Q90170j340826j152698O81490O52776j148840j174955J100580J917633
$$ y = [3651435, -830182, -5285486, -8066279, -10982298, -14555068, -15125740, -9452647, -208153, 6145711, 6385979, 3219885, 1314903, 2578915, 5316141, 6399295, 4009979, -685089, -4447672, -5235200, -4175467, -3454318, -3114017, -1710223, 243783, -20386, -3372102, -6268642, -4384211, 1860770, 7204453, 7180433, 2532473, -2511235, -5189994, -6163469, -6837799, -6397921, -2816676, 3494953, 8594516, 8628852, 4051963, -843875, -2516931, -1230952, 544352, 1354613, 1523127, 1756496, 2270554, 2910232, 3182463, 2556864, 1514345, 1549080, 3022608, 3947150, 2583946, 450936, 461380, 2451824, 3341994, 2001168, 848470, 1529960, 2182736, 1033896, -141059, 959521, 2877154]
12474B877154l25519k193283j050263N94710j91959j395406M32710L771172L892156
12465F411472N8815l392261l390017j813976j653681k384270j306847J843633
12457e627132L893677K187470j794486m029259k841104m94207O55509J389292
12449f660240L098958M163177K225942j088852j847694L6142P35102q92024j405746
12440a635235J007929L161085K079201p00786k768887m554356o246140n279892
12432a4937081q20084L123642L332565K418607L630494M590805J926065j439476
12424A825537n04867K845658K675995o29439r08180K910936M723042J572756j722691
12415A2788747j187523K5977j988700m947319m550151j451754N41603K86486o49565
$$ y = [2877154, 2551635, 358352, -691911, -97201, -289160, -1684566, -1251856, 2519316, 6411472, 6470287, 3078026, -311991, -2125967, -3779648, -6163918, -7470765, -5627132, -1733455, 454015, -1340471, -5369730, -8210834, -8705041, -8049532, -6660240, -3561282, 601895, 2827837, 1738985, -108709, -72567, 662535, -229489, -1635235, -627306, 2533779, 4612980, 3912194, 1143307, -3411049, -9657189, -14937081, -15757165, -12633523, -9300958, -6882351, -3251857, 1338948, 3265013, 1825537, 1320670, 4166328, 6842323, 6212884, 5304704, 8215640, 12938682, 14511438, 12788747, 11601224, 11627201, 9638501, 4691182, 141031, -1310723, -769120, -482634, -1132199]
12406a132199j322310j356694J58043K554308K669395p30745l834442k610675
12398e605319J116345K258508q0074j764055n5262K817574L368074J400002n30508
12389B925285o60535L03050O52928Q4150J42280J804615L141311J130067l688895
12380E834256o460114l701447J642858L311261m14693m511351l717009Q88068
12372g128171L734519K068351j235255k371586j254371K28888J998475M538014
12364E78864N465933J813617m241111o533054l023100J622275L254372L232261
12356B170057L564931K376406j414205l669047j028900K424609J001290k980316
12348B444825k630417K162549M400149P03331m649694o778362m967723k49356
$$ y = [-1132199, -2454509, -3811203, -3653160, -1098852, 1570543, 839798, -2994644, -5605319, -4488974, -2230466, -2310540, -4074595, -4129857, -1312283, 2055791, 3455793, 2925285, 2264750, 2567800, 3220728, 3304878, 3447158, 5251773, 8393084, 9523151, 5834256, -625858, -4327305, -2684447, 626814, 212121, -4299230, -8016239, -7128171, -3393652, -1325301, -2560556, -4932142, -6186513, -5957625, -3959150, 578864, 6044797, 7858414, 3617303, -2915751, -5938851, -4316576, -1062204, 2170057, 5734988, 8111394, 6697189, 3028142, 1999242, 4423851, 5425141, 2444825, -185592, 1976957, 6377106, 7080437, 2430743, -4347619, -9315342, -9564698]
12340i564698N397652P485312L512503j116247O43830N438966L190154o052790
12332H934682j0017087k890348N085192L499811k759943l121972J552050K340885
12324B623270k276776n448761m109512j934143p22887J974426N741476N774989
12316A622082P31696l869302k770839K316164N237703K505240l109497n291462
12308b628215j208905M129499L542240j978244m051804M3919K567560j637063
12300a221013n340733m49729P431576O908979j031472n017310j620034J142725
12292H02989p61344j387734K432586M384427L55685l464984j227789K390113O17087
12283D141036l629472l105116J446137L215204P80535p65552Q59166K111371L19566
$$ y = [-9564698, -4167046, 3318266, 6830769, 5714522, 6358352, 11797318, 14987472, 8934682, -1082405, -3972753, 1112439, 4612250, 1852307, -1269665, 282385, 2623270, 346494, -5102267, -9211779, -11145922, -11868809, -9894383, -4152907, 1622082, 2353778, -1515524, -4286363, -1970199, 3267504, 5772744, 2663247, -2628215, -3837120, 292379, 3834619, 1856375, -2195429, -2151510, 416050, -1221013, -6561746, -7011475, 420101, 7329080, 6297608, 1280298, -339736, 802989, 41645, -1346089, 1086497, 5470924, 5826609, 2361625, 1133836, 3523949, 4141036, 511564, -2593552, -1147415, 2067789, 2848324, 2082772, 2941938, 5053309, 5372875]
12274E372875k616399m212660m347009l221725m87641K383772K442878l61973
12266e047882j994546M20195M085434L717934j321470n430584l334796L113530
12258e792185O813028M070585j222753l423206k327365j484422j566508j33902
12250e066728K543155K675531p63293l560986k363119N36981J241041p5315o25252
12241e457985K78320J224248J787132K559672L056173K127248j13900k588511
12233B872397m577289n176871k883627K031375N826155M716897o1738l036122
12225b88823j025022K940167L578198K10324k465897j015753J547903r3984n237454
12216a850341p191538k735753L014382M123416J816372M19393n01106l392377
$$ y = [5372875, 2756476, -1456184, -5803193, -9024918, -9512559, -7128787, -4685909, -5047882, -7042428, -6622233, -2536799, 1181135, -140335, -5570919, -8905715, -5792185, 1020843, 5091428, 3868675, 445469, -1881896, -3366318, -4932826, -5066728, -2523573, 151958, -611335, -4172321, -6535440, -5998459, -4757418, -4832733, -5457985, -5179665, -3955417, -2168285, 391387, 3447560, 5574808, 5460908, 2872397, -1704892, -6881763, -9765390, -7734015, -1907860, 2809037, 2747299, -288823, -1313845, 1626322, 5204520, 5414844, 2948947, 1933194, 3481097, 3387113, -1850341, -9041879, -11777632, -8763250, -4639834, -2823462, -2404069, -2905175, -6297552]
12208f297552n186306q86428O322382P639036K251211r16336K311893M649371
12200I887271q057o121071n739308r48667J135892J83503N37956J474803r25473
12191e23151m595835l698783Q13171J975692j474657k937568Q22286M405256K735279
12182b478310j521610l130872j489301Q71944K555543K912864J252461q86644
12174a913925l94983K235467K567058n86320k391810K71509L144905J222787l039381
12165A115307l715618p61712O84509j024973k085164p1747K515634K735280J188460
12156E79976O7375K16528J302903K491048K280600K0466k182852j761554P2023
12147C086513k54477k709086l235678m11502K072747J752166J328829K785943
$$ y = [-6297552, -11483858, -12370286, -6047904, 1591132, 3842343, 2926007, 5237900, 9887271, 9879214, 3758143, -1981165, -2929832, -1793940, -1610437, -1072481, 402322, -523151, -5118986, -8817769, -8004598, -6028906, -7503563, -10441131, -9618845, -5213589, -2478310, -3999920, -7130792, -8620093, -7748149, -5192606, -2279742, -1027281, -1913925, -2308908, -73441, 2493617, 1907297, -484513, -213004, 2931901, 4154688, 1115307, -2600311, -3362023, -2677514, -3702487, -5787651, -5859398, -3343764, -608484, 579976, 647351, 863879, 2166782, 4657830, 6938430, 6958896, 4776044, 3014490, 3086513, 2832036, 122950, -3112728, -3524230, -1451483, 300683, 1629512, 4415455]
12139D415455K507718k363193o833286m438156J814094L108054j302187k929017
12131f020518J790921N554656K479003k301336j668787J950144J973062q04426
12123B952719r30221J014240k13407m185522m986286j392795J639885J894703
12115d206684J985757K119056l74584l179029l41095O086450N995702k849110
12107E236463r038645m128229M370491M966631q49415l532467j246996J96867
12099d025300o79767q9706J749679O87838k393777k066832J803546L406090J036431
12090e71798n48618P77638J242752q23754j564807P36417J772909j067572l386625
12081c433458p61912L997542N309692K665139m18016k192231l191697l218182
$$ y = [4415455, 6923173, 4559980, -2273306, -6711462, -4897368, -1789314, -3091501, -6020518, -4229597, 1325059, 3804062, 1502726, -166061, 1784083, 3757145, 2952719, 2022498, 3036738, 2823331, -1362191, -6348477, -7741272, -6101387, -4206684, -2220927, -101871, -476455, -3655484, -3996579, 2089871, 8085573, 5236463, -3802182, -7930411, -3559920, 1406711, 557296, -2975171, -4222167, -4025300, -4705067, -4794773, -3045094, -2357256, -4751033, -6817865, -5014319, -1608229, -571798, -1120416, -342778, 899974, 76220, -1488587, -752170, 1020739, -46833, -3433458, -4195370, -197828, 5111864, 7777003, 7358987, 5166756, 1975059, -1243123]
12073a243123j773447k10669k82629j250790p65048J735471M012723L460000K50064
12064C932552k027948j37591L772570L591905k200133o930024m663026Q73610
12056c788085K201468j91356J04767L452984L643293m03378k353977r2856L47888
12047B920748l558622n087481o9778M649762K283600k152079l49023N047257M923181
12038H607565j247370n055031k425556J940022L307919K164142J57719k372167
12030E077243l896936k409531O36685J802192R48458N04195M13998r96063k228923
12021a48682n49331K130437J561982j209504j294093J118448P65541k896136l760277
12012d281615P31002M818876L335146r84600l041894k721480k512745k428914
$$ y = [-1243123, -3016570, -3227239, -3509868, -4760658, -5525706, -3790235, 222488, 3682488, 3932552, 1904604, 1767013, 5539583, 9131488, 6931355, 1331, -4661695, -3788085, -1586617, -1777973, -1673206, 1779778, 5423071, 5019693, 2665716, 2572860, 2920748, -637874, -5725355, -5795133, -1145371, 1138229, -1013850, -1362873, 3684384, 8607565, 7360195, 2305164, -120392, 1819630, 5127549, 7291691, 7449410, 5077243, 1180307, -1229224, -592539, 1209653, 2158111, 2662306, 3076304, 2080241, -148682, -698013, 1432424, 2994406, 1784902, 490809, 1609257, 2374798, -521338, -4281615, -3550613, 1268263, 4603409, 3618809, 576915, -2144565, -4657310, -7086224]
12004g086224j403560n402J470682L759762N014216J504945n032786o690382m38488
11995h907237N978106M789145p10707k577510o29956j85318j264912M13347L599836
11986E04794K600552j858421k605923J636648L401793r02791m488405j216264
11978b928017M530397N125298Q48226k676647l402428k790382r33106J668327
11970e58332J182275l611829n915545L04222Q711495P500365k764803q775226
11962c927378l727072L697905L985163L60772M50845K602539K34183n212871o127275
11953g663189j589287J440399J7416o68597K861219O153744M077382j433072m814634
11944a618619m002436p70746K626644M082206J922612k424371m533755k341007
$$ y = [-7086224, -8489784, -8495186, -7024504, -3264742, 1749474, 3254419, -1778367, -8468749, -8907237, -2929131, 1860014, 1149307, -1428203, -2058159, -2243477, -3508389, -3095042, 504794, 3105346, 1246925, -1358998, 277650, 3679443, 2776652, -1711753, -2928017, 1602380, 6727678, 7575904, 4899257, 1496829, -1293553, -2226659, -558332, 623943, -2987886, -8903431, -8599209, 112286, 7612651, 4847848, -3927378, -7654450, -3956545, 28618, 389390, 840235, 3442774, 3676957, -1535914, -7663189, -9252476, -7812077, -7794661, -8463258, -5602039, 551705, 4629087, 3196015, -1618619, -5621055, -6391801, -3765157, 317049, 2239661, -184710, -4718465, -7059472]
11936g059472J025191K060244J652593K176275K656617O30741k946105m533369
11928d337285l053186r10305k42521p17988r31112j1326J929694L541757L130901
11919a601371J011082l09366L76970J078865l925j282227n29681J053628P83829
11910E77804p51857m99736J864507L031507Q79910k534168l719903j729708J213868
11901a667776J995629m43978l633144l828786o40647K152788J795211L89310J143043
11892b738350K936655K174364j163260l185631j681515J198133K105525M653l259606
11883c609032m084791j45469N525182N978984o28119o431521l584610L972912
11875c006464N654029j38168m303522j935764P20691j846334m647107j165137
$$ y = [-7059472, -6034281, -3974037, -2321444, -145169, 2511448, 3142189, 196084, -4337285, -7390471, -8300776, -8543297, -9261285, -10192397, -10203723, -8274029, -4732272, -1601371, -590289, -899655, -522685, 556180, 552255, -729972, -1259653, -206025, 577804, -174053, -673789, 1190718, 4222225, 5102135, 2567967, -1151936, -2881644, -1667776, 327853, -116125, -3749269, -7578055, -8218702, -6065914, -4270703, -3881393, -2738350, 198305, 2372669, 1209409, -1976222, -3657737, -2459604, -354079, -349426, -3609032, -7693823, -7839292, -2314110, 3664874, 3036755, -3394766, -6979376, -3006464, 2647565, 2509397, -1794125, -3729889, -3009198, -4855532, -9502639, -10667776]
11867a0667776M862032N194751K81203k251500j61711J186332r20555k294072
11859d771296L00949L828424M432010K967531J885715P39146j745836m125403
11851C511240m119549k074380J15866J761585K658579J559990j714468m078414
11843b379551k422005J483478K674982r7653k459310p77410K545713K884952N69342
11834B022538L35895L628722N662855K422728k743622l569831k40417P89151l245493
11825E062526o970649n019183j8871K010063R65385J539851M224251M073609n83614
11816E283368m455096l224689k1396K18965j265807r0294K957506K890928r02637
11807A390848l342397j898269l11232j636329k765675K07099N040360O423745
$$ y = [-10667776, -5805744, -610993, -329790, -2581290, -2743001, -1556669, -2477224, -4771296, -4470347, -641923, 3790087, 6757618, 8643333, 9382479, 7636643, 3511240, -608309, -2682689, -2566823, -805238, 1853341, 3413331, 1698863, -2379551, -4801556, -3318078, -643096, -740749, -3200059, -3977469, -1431756, 1453196, 2022538, 2358433, 5987155, 11650010, 14072738, 11329116, 7759285, 7518868, 8308019, 5062526, -1908123, -6927306, -6946177, -4936114, -3970729, -2430878, 1793373, 5866982, 5283368, 828272, -2396417, -2417813, -2198848, -3464655, -3554949, -597443, 2293485, 1390848, -1951549, -3849818, -4161050, -5797379, -8563054, -8355955, -3315595, 3108150]
11799C108150L555429M3126j996029k948609k147813J139531L389335l65251p890424
11790d112555r892363k069307P909497R851168L737605k029932k429274j39860
11782H24979R61276R12242J280730J923989J825958O30971j532609l717604l742906
11773f32974p26759K265006J402614k083907l100956k06593K434293J965552R82970
11764B299246K100781K940629P37298j665783J24639L974135L237999l094527
11756A0654417p920606n536009Q17563L831893J501643j856243k364987p74059
11748a646388J71324l58200j270084j793974k007853j570990L90317L427657M853087
11739A94896K203653l191773o460018m126712J684546N235765L501858n68725
$$ y = [3108150, 6663579, 6706705, 4710676, 1762067, -385746, 753785, 4143120, 3777869, -4112555, -14004918, -16074225, -8164728, 1686440, 5424045, 3394113, 964839, 824979, 1786255, 2698497, 3979227, 5903216, 7729174, 8360145, 6827536, 3109932, -632974, -1359733, 905273, 2307887, 223980, -2876976, -3083569, -649276, 1316276, 2299246, 4400027, 7340656, 8077954, 6412171, 6536810, 10510945, 13748944, 10654417, 2733811, -2802198, -1984635, 1847258, 3348901, 1492658, -872329, -1646388, -1475064, -1833264, -3103348, -4897322, -6905175, -8476165, -8085848, -4658191, 194896, 2398549, -793224, -7253242, -11379954, -9695408, -4459643, -957785, -1526510]
11731a526510j782936J094227M147440L429722q6255j938026o6371K486433J542634
11722G300358k783956o071546m700570K38050M274765M011561J87005l059453
11714f03786k061718K575740O220331M979708j2779l941481l645156m95215J904661
11705D920305J551054o74477k392774j956991j9830J072597J44492j124020p66044
11696G54312O02j504231m212103l445942J866564N586289J902353n403883o457070
11687a0913109J338117Q612594N981257l085964o675574n23347O535355N177487
11679F446816j920511n104793j802187J255040m95153k883440p61502L420050
11671a845680L732964j3577k729672k126348r22121j126168j102202N77765K379176
$$ y = [-1526510, -3309446, -2215219, 1932221, 5361943, 5275688, 3337662, 3271291, 5757724, 7300358, 4516402, -1555144, -6255714, -6017664, -1742899, 2268662, 2455667, -603786, -2665504, -89764, 6130567, 11110275, 11097496, 7156015, 3510859, 3015644, 4920305, 6471359, 5796882, 3404108, 1447117, 1427287, 2499884, 2644376, 1520356, 754312, 754914, -749317, -4961420, -8407362, -6540798, -954509, 947844, -4456039, -10913109, -9574992, -962398, 5018859, 1932895, -4742679, -5266026, 1269329, 6446816, 4526305, -578488, -2380675, -1125635, -1620788, -4504228, -5265730, -1845680, 1887284, 1873707, -855965, -2982313, -3904434, -5030602, -6132804, -5555039, -3175863]
11662c175863K562842J704016R37802J90229n10752l27809M16371j92368k581409
11653i76941m176764k713947M46080K034633R22537j009242j481411k10427J184925
11644e980557J233732L68493J7613J4579j192518k939245j899353K363117M636561
11635c377578J030675m066089l696198R16011K440230l39008q27697L281570N178985
11626E40901M30102m808692l344381J812158L156360N91778n53580J43856j326631
11617c358129m252870l268366K111604N777502M305433J317079N96594P54225
11609C983072o05036k262585j965039j19930J607374K624860K504029M37504k705806
11600C498443m187249k726191l0839J784627K145036J044432j186488k733115
$$ y = [-3175863, -613021, 1090995, 2028797, 2219026, 1708274, 1380465, 1796836, 1604468, -976941, -5153705, -7867652, -7421572, -5386939, -4464402, -5473644, -6955055, -7165482, -5980557, -4746825, -4378332, -4360719, -4346140, -5538658, -8477903, -10377256, -8014139, -3377578, -2346903, -6412992, -10109190, -9193179, -6752949, -7091957, -7919654, -4638084, 540901, 971003, -3837689, -7182070, -5369912, -2213552, -1621774, -2175354, -2031498, -3358129, -7610999, -10879365, -8767761, -2990259, 1315174, 2632253, 3228847, 3983072, 3378036, 1115451, -849588, -969518, 637856, 3262716, 5766745, 6204249, 3498443, -688806, -3414997, -3445836, -1661209, 483827, 1528259, 341771, -2391344]
11592b391344j826533J09419l6462j907521j644856J897212M595835K630980k338610
11583i11880n521731m243830M58494N093118N633743J046794m130166l955971
11575f531429J092301M196287J563554k598182k912479k29253J424632J435255
11567b559314J622573J565480j37859j779178o31836J905402J970859m72147j674005
11558a90025m64476J52061j302645k000482K50872K985625K785534M43187o43299
11549B016352K37289N39284j104438k654420j744707Q74910K430569J685583k35973
11540B044449k113573l532577l225849N28837N880831O757768L17652o719730
11532f2192m867854M680367R699917K786800q165286j0214615j943184O270376
$$ y = [-2391344, -4217877, -4108458, -4144920, -6052441, -7697297, -5800085, -1204250, 1426730, -911880, -6433611, -10677441, -10218947, -5125829, 507914, 1554708, -2575458, -6531429, -5439128, -1242841, 320713, -2277469, -5189948, -5419201, -3994569, -2559314, -936741, 628739, 490880, -1288298, -1920134, -14732, 1956127, 1483980, -190025, -654501, -502440, -1805085, -3805567, -3554695, -569070, 2216464, 2659651, 2016352, 2253641, 2792925, 1688487, -965933, -2710640, -1835730, 594839, 2280422, 2044449, -69124, -3601701, -6827550, -6298713, -417882, 6339886, 6657538, -62192, -4930046, -249679, 9450238, 12237038, 4071752, -6142863, -8086047, -1815671]
11524a815671O302922L37567m680012m994273j639814J640422J267507k212405
11516e793757l454563P80184N448014L362588l403230n466136k96643L831350
11508d992193J281497j992942R19986N528945L030180m707727p280232j516419
11500i728905M603752M812193K363833J992239K006992n89586l136622j623816
11492G00080J779414J735724j596346k768377M11712L731097L007788m13341k516900
11483D070851k113923j053370m65819N45155K324048K866533K58741l663309m332429
11474a563522k58815M044905L336675j226439l465061o50334L069236K898557
11466F185202m62859l117476l469868k617961j454652l24678L7914j51359Q61637
$$ y = [-1815671, 4487251, 4824818, 144806, -4849467, -6489281, -4848859, -3581352, -5793757, -9248320, -8468136, -3020122, 342466, -3060764, -8526900, -8823543, -4992193, -3710696, -5703638, -4783652, 745293, 3775473, -932254, -8212486, -9728905, -5125153, -312960, 2050873, 4043112, 6050104, 5460518, 2323896, 700080, 2479494, 4215218, 2618872, -149505, 262207, 3993304, 7001092, 6587751, 4070851, 1956928, 903558, 437739, 982894, 3306942, 6173475, 6432216, 2768907, -1563522, -1822337, 2222568, 5559243, 4332804, 867743, 217409, 3286645, 6185202, 5722343, 2604867, -865001, -3482962, -4937614, -5262292, -5224378, -5375737, -4514100]
11457d514100L090267L170969p06387m512458l332186J077270K720693M89537
11449b516395p71090J401409L519443K545342M37169l67130j176634l214334l657197
11440c799417L3059M615606M693063M54334k680244j840220m9810r77651l613287
11431c164567m099291j233134J975424K314122M87393j35621J438639K316760
11423a00275N06158j296211K64384L252184K947755m23396j779691L62485J323573
11414E056966j604259m134584j948813K130924K801790L88764j001779n52666
11406A136343m17554n78782J66379j64846l740178o542949k220551P063946J0976187
11397E677995M800853l595139m667833J92914K315344j422174n532378m797378
$$ y = [-4514100, -1423833, 1747136, 1040749, -3471709, -6803895, -5726625, -3005932, -2516395, -3287485, -1886076, 1633367, 4178709, 4615878, 4248748, 3072114, -142220, -3799417, -3766358, 849248, 5542311, 5996645, 3316401, 1476181, 1426371, 448720, -3164567, -7263858, -8496992, -6521568, -4207446, -3720053, -3855674, -2417035, -100275, 405883, -890328, -625944, 2626240, 5573995, 5150599, 3370908, 3733393, 5056966, 3452707, -681877, -2630690, -499766, 2302024, 2690788, 1689009, 1136343, 718789, 140007, 306386, 141540, -3598638, -10141587, -12362138, -5298192, 5677995, 10478848, 6883709, 2215876, 2408790, 4724134, 3301960, -2230418, -7027796]
11389g027796p25339K080948K172202J550790J645888J524997J07545j572914
11381b43679j499178M03406J878278J325483j07990m58237J90884L78527k2670
11372A844824J34767P03747J5992k177862l515175j980201J245505L270036L085102
11363B626735K167537J569374P7114l474628o893917n956044m463N803382O118506
11354B033596K001694j061594r74639q27047k436691k852128K02127L401036K234698
11345A721052k098529m233179j827437K250056M174651K697576r15767l939709
11337b171286l818116q10595J888949K221141J637304J741581J416973o2071l35062
11328A708818J838685K854067m45083m500154l771097L65205J868047j31170q20358
$$ y = [-7027796, -7753135, -5672187, -3499985, -1949195, -303307, 1221690, 1329235, -243679, -1742857, -1339451, 538827, 1864310, 1756320, 1298083, 1488967, 1867494, 1844824, 1979591, 2683338, 2699330, 521468, -2993707, -4973908, -3728403, -458367, 2626735, 4794272, 6363646, 6440760, 2966132, -3927785, -9883829, -9888292, -4084910, 2033596, 4035290, 2973696, 1999057, 1172010, -1264681, -4116809, -3914682, -513646, 1721052, -377477, -4610656, -6438093, -4188037, -13386, 2684190, 1768423, -2171286, -5989402, -6799997, -4911048, -2689907, -1052603, 688978, 2105951, 2043880, 1708818, 3547503, 6401570, 5956487, 1456333, -2314764, -1949559, -81512, -212682, -1033040]
11319a033040J167083J546071j473130l868273k898578j172036q58005K43517
11311h346391L499343N645284L971480P60350j091919k513833m534709m508362
11303g118757o05906L534310L466279M88980j017852l70151p8247n88496k76518
11294b566358N95298L79689l26338L21506J426557M36443k036553k523112k09479
11285d502347J588751N07499j449932j171472J150265K725161K062913M27591
11277A338429l34019m9365L15698O95526J952478L559701L208638L72413j616620
11268I442879Q367K315117J77558n288408o877356j494136M688385M529236m74420
11259G027222l175806r77810J677810M80149l128090m505875j748995K213196
$$ y = [-1033040, 134043, 1680114, 206984, -3661289, -6559867, -7731903, -8589908, -8346391, -4847048, 798236, 4769716, 5530066, 4438147, 1924314, -2610395, -7118757, -7724663, -4190353, -724074, -235094, -1252946, -1623097, -1701344, -2289840, -2566358, -1971060, -1591371, -1917709, -1596203, -169646, 266797, -1769756, -4292868, -4502347, -2913596, -2406097, -3856029, -5027501, -3877236, -1152075, 910838, 1338429, 1004410, 955045, 1270743, 1966269, 3918747, 7478448, 10687086, 11059499, 9442879, 9451246, 11766363, 11943921, 6655513, -221843, -1715979, 2972406, 7501642, 7027222, 3851416, 2873606, 4551416, 5031565, 1903475, -2602400, -4351395, -2138199]
11251b138199L059527K10990k220833n91223L255077M478061J966289r12209k086103
11242E021377k855395l414160j469954K446959L459451l24041l566211j250793
11234a952767L481395M198639O32507k430200l165813l343309k577494J143144
11226d013898N348483M442575j374771m758587j410986L701568L864097j1512
11218E786969k042383n23690P39659o03646k060739r86715J067298J093209n44442
11209A925520r95308K81068Q29558m06064j287928n00285j11122j494743j733886
11200c493190J855935N858356M670993o67548l447324j431440J89975k207244
11192A328513m848184l097850J269726L515339K747943J185240j62590j190971
$$ y = [-2138199, 921328, 1132318, -1088515, -1679738, 1575339, 6053400, 8019689, 7107480, 5021377, 2165982, -1248178, -2718132, -271173, 3188278, 2864237, -701974, -1952767, 1528628, 5727267, 6359774, 3929574, 763761, -2579548, -5157042, -4013898, 1334585, 5777160, 4402389, -356198, -1767184, 1934384, 5798481, 5786969, 3744586, 3220896, 3960555, 3356909, 1296170, 309455, 1376753, 2469962, 1925520, 930212, 1211280, 2040838, 1634774, 346846, -153439, -264561, -1759304, -3493190, -1637255, 4221101, 8892094, 8224546, 4777222, 3345782, 3535757, 1328513, -3519671, -6617521, -5347795, -1832456, 915487, 2100727, 1938137, 747166]
11184G47166r69146J98157k5099j593649o85852L612538N741313J729436l606499
11175E148365l739630p81939j258590m446241l685628J634377M496249J815963
11167h17074q27244J117506L942661K242270k758141n907567n369640l048167
11159a1425396m93468J877079L163296K660205J291359M32329J53258j68602n91480
11150c101420r03212j057104o66973P94765K857014M148976L782200J808967j119295
11141F543918l423176l074477j98757K004974J171256o51779m0579K325064K543510
11132G199954n94078l864873l998511j210817J756156K148673p09080m035138
11124c307714l680922L36353K746854M39629k169285J44902M299155L126972k766101
$$ y = [747166, -221980, -23823, -48922, -1642571, -2328423, 1284115, 7025428, 8754864, 5148365, 1408735, 626796, -631794, -5078035, -8763663, -7129286, -2633037, -817074, -1644318, -526812, 3415849, 5658119, 2899978, -3007589, -8377229, -11425396, -11918864, -10041785, -6878489, -4218284, -2926925, -2494596, -2341338, -2509940, -3101420, -4004632, -5061736, -5728709, -4933944, -2076930, 2072046, 5854246, 7663213, 6543918, 3120742, 46265, -152492, 1852482, 3023738, 2371959, 2331380, 4656444, 7199954, 6605876, 2741003, -1257508, -2468325, -712169, 1436504, 727424, -3307714, -6988636, -6652283, -3905429, -3465800, -5635085, -5490183, -1191028, 1935944, -830157]
11115h30157n096804n26474M325153K986393k160549m789011l140609J97060L055538
11106e979460M402174L181078q7916k407644j516209J407796L603609L570965
11098F174393J411597j488671k842035j899552j062887k159305k585259M07682
11090d044037L427728J438022k652444j372035M004507L723774m032275q097684
11082g604444j762266N393877K407355n259368m814277L096616O391197J560689
11074e90621k421973p28120M40939k760466l938820J498999O530261L343585l267914
11065a894130l009077L717768O672807J558066m413501m235117m99412O83891
11057a418705o72865l22296J833595J435630k368917m352687j169893K426956
$$ y = [-830157, -5926961, -6453435, -2128282, 858111, -1302438, -6091449, -9232058, -9034998, -5979460, -1577286, 1603792, 1515876, -891768, -2407977, -1000181, 2603428, 6174393, 7585990, 6097319, 3255284, 1355732, 292845, -1866460, -4451719, -4044037, -616309, 821713, -1830731, -3202766, 801741, 4525515, 493240, -7604444, -9366710, -3972833, -1565478, -6824846, -11639123, -8542507, -2151310, -590621, -3012594, -3740714, -3299775, -6060241, -9999061, -8500062, -1969801, 1373784, -1894130, -4903207, -1185439, 5487368, 7045434, 2631933, -1603184, -2102596, -1418705, -2091570, -2413866, -580271, 855359, -1513558, -5866245, -7036138, -4609182]
11049d609182R2791n588027n457936K522318Q673572M850603l278958m272718
11041g067537J954514M248365k070977p373250k356059P362848R200093J662630
11033E560627m610778k768481K104677K687171j45805r04883J344908K570798
11025E838234M89498k562782l201064r34693J520621R87268k459320m607687j931349
11016f861274K888076L680223l84722l167358o71170L162817L205066Q72675K90072
11007C014405R61922J98251o93506N91782J154135k550353o255933l060560L979285
10998b660572M681154j921362m963306J190624P862672N726798j743466n712461
10990B460081n045489l740762j705579K872537O444403M337031p65600k485828
$$ y = [-4609182, -4516391, -10104418, -15562354, -13040036, -4366464, 484139, -2794819, -7067537, -5113023, -864658, -2935635, -10308885, -12664944, -5302096, 3897997, 5560627, 949849, -1818632, 286045, 2973216, 2827411, 1922528, 3267436, 5838234, 6327732, 3764950, 563886, -370807, 1149814, 2137082, -322238, -4929925, -6861274, -3973198, -292975, -677697, -3845055, -4516225, -1353408, 1851658, 2724333, 3014405, 3976327, 4174578, 3481072, 4072854, 5226989, 2676636, -3579297, -6639857, -2660572, 2020582, 99220, -4864086, -3673462, 4189210, 9916008, 8172542, 2460081, -2585408, -6326170, -8031749, -5159212, 1285191, 5622222, 4856622, 2370794]
10982B370794m55936R39888Q95079J677792K144826l36258l224724k008953J251402
10973C253910O63772l108065l595794M30510L171554J924068P61833K274421L211783
10964H987992R46273k197447l635809l968463l734081k096879l47920j214559
10956g260893l262344j749080L417949O539014M706207J542260L96775q5842j255562
10947B988484j391356j60036m46086k793398l428224o99357J880004J859596J540677
10938f49696K333766J216821l278455o778983n038338Q8025M242928N887780M940862
10929B964710J015470l525064l848301K00995K412192k78187k285781J429655
10921a914311O273198M887998j065636l540790k41258L155201K384852j34217
$$ y = [2370794, 1914858, 2854746, 3749825, 5427617, 7572443, 7236185, 4011461, 2002508, 3253910, 3917682, 809617, -2786177, -2355667, 815887, 2739955, 3501788, 5776209, 8987992, 9934265, 7736818, 4101009, 132546, -3601535, -5698414, -6046334, -7260893, -10523237, -12272317, -8854368, -2315354, 2390853, 3933113, 4329888, 4244046, 2988484, 1597128, 1437092, 991006, -1802392, -5230616, -5929973, -4049969, -2190373, -649696, 1684070, 2900891, -377564, -7156547, -12194885, -12106860, -7863932, -1976152, 2964710, 3980180, 455116, -3393185, -3192190, -779998, -1058185, -3343966, -1914311, 4358887, 9246885, 8181249, 4640459, 4399201, 7554402, 9939254, 9805037]
10913I805037m39013J103493Q90515k908543p490180p674603j975705M339781
10905d349218N083158J392707k70023J783361K500127m47981k255463O11705M146914
10896H195287L486749J70618k128876l717516n506787m854243o36751K426335
10888b565184P44930j511605O55542M199584L553952O89745J056362K877555J16486
10879I817367n672458o481964r31677L355612K030662k05219J028218K698738
10871E639279R66086j679611j236170M60490j063433m883317n346441m58816M774873
10862b827060M791717N80279k064412n78825J109115j152104m893040m219502
10854i253832J192178N167602L880409O85807J1955J133860J267447P63922J189974
$$ y = [9805037, 9366024, 10469517, 11360032, 8451489, 961309, -6713294, -8688999, -4349218, 733940, 2126647, 1856624, 3639985, 6140112, 5692131, 3436668, 4048373, 8195287, 11682036, 11852654, 9723778, 6006262, 499475, -4354768, -4991519, -2565184, -1820254, -3331859, -2676317, 1523267, 5077219, 5766964, 6823326, 9700881, 9817367, 4144909, -2337055, -3268732, 86880, 2117542, 1912323, 2940541, 5639279, 6605365, 4925754, 3689584, 4150074, 3086641, -1796676, -7143117, -7601933, -2827060, 1964657, 2544936, 480524, -98301, 1010814, -141290, -5034330, -9253832, -8061654, -2894052, 986357, 1672164, 1684119, 2817979, 4085426, 4849348, 6039322]
10845F039322J367730m96911k964822l323238j564491N36272K220978L073676
10837D888516K115114N4225m83827O90759L37836k412520l693539j445514O13952
10828F65002m87747j673434P2140J446382j341585m993978l921929J044154N040233
10819d150762O613872O496706L116635l419342o883322k696214L230468K239938
10811D547979l356021m013255J495036M825665K213052o83699K30697J306306
10803F565760r39630l760876l623442j468905L67041J259269N45888k089412l539690
10794f683997l95011M179695L337278k562214n251890r35527L937306K770563
10786a603797j732229k690996J135929N055456M915761P13458m022053m825632
$$ y = [6039322, 7407052, 6910141, 3945319, 622081, -942410, -406138, 1814840, 4888516, 7003630, 7057855, 6574028, 7264787, 7602623, 5190103, 1496564, 51050, 665002, 177255, -1496179, -1424039, 22343, -1319242, -6313220, -10235149, -9190995, -4150762, 2463110, 8959816, 12076451, 8657109, 1773787, -922427, 2308041, 4547979, 1191958, -2821297, -1326261, 3499404, 5712456, 5028757, 5259454, 6565760, 5626130, 1865254, -1758188, -3227093, -2860052, -1600783, -1054895, -3144307, -6683997, -7079008, -2899313, 437965, -2124249, -7376139, -8311666, -4374360, -1603797, -3336026, -6027022, -4891093, 164363, 5080124, 5793582, 1771529, -3054103]
10778c054103o87583L733914L316516o34579k835765k407553l088230n267003
10770a0924386m510864O24258N573312O581156N042056L172433P69987j751260
10762D576692k319425j164183r40997j532260q2543K560932J657311l178428n838667
10753f261568k633554K398741M040643K466602M78788p56103o74412J024035J735534
10744A818706j611044o007707m815333J449232M446293R08907k208529L68867
10736e650608L876503K855508N78562J803609L390048N96599l203964k094147
10728B152110J762839K100765o07509j367803n92536k326779m755774k389760
10720f024447L127144M267791R8087k140732M56107J858890j675739m549834j213260
$$ y = [-3054103, -3741686, -7772, 3308744, 2674165, -161600, -2569153, -5657383, -10924386, -15435250, -14810992, -9237680, -2656524, 2385532, 5557965, 6327952, 4576692, 2257267, 1093084, 152087, -1380173, -1462716, 1098216, 2755527, -422901, -6261568, -8895122, -6496381, -2455738, 10864, 489652, -266451, -940863, 83172, 1818706, 207662, -5800045, -10615378, -9166146, -4719853, -3810946, -6019475, -5650608, -1774105, 1081403, 1659965, 3463574, 6853622, 7450221, 4246257, 2152110, 3914949, 6015714, 5408205, 4040402, 3447866, 1121087, -3634687, -6024447, -2897303, 1370488, 1468575, -672157, -216050, 1642840, -32899, -4582733, -5795993]
10711e795993M277631M395316o59696m082164k293139J707730L693767K659527
10703C902979K39897j272461m66350J608639J910873r32262m279836m386460p90576
10694d465557L614963N808174M522224L84041l875895m714070j636165J351870
10686I89585P29729j376090m85996K751654L175408l64057k605589l24000K222601
10677D713245M31646k798177k209146L76497q68421m907633m301671K624429P902889
10668I63658N135855j783268m992977k794479N12117J260226o26090k688491j852124
10659f865573K030960M195382Q63730l322524p74673N823498N445389l382026
10651D014163p963999r48902O966185L609041n401325o592300j80998K863444
$$ y = [-5795993, -1518362, 2876954, 2217258, -1864906, -4158045, -2450315, 1243452, 3902979, 4142876, 2870415, 2404065, 4012704, 5923577, 4991315, 711479, -3674981, -4465557, -850594, 4957580, 9479804, 9863845, 5987950, 1273880, -362285, 989585, 1719314, 343224, -142772, 2608882, 5784290, 5420233, 2814644, 2490644, 4713245, 5144891, 2346714, 137568, 514065, -354356, -5261989, -9563660, -6939231, 963658, 6099513, 4316245, -676732, -3471211, -2959094, -1698868, -2324958, -5013449, -6865573, -4834613, -639231, 224499, -3098025, -3872698, 1950800, 7396189, 4014163, -3949836, -4898738, 2067447, 5676488, 275163, -6317137, -6498135, -3634691]
10643c634691M28615L66899L854864L234370k469161m414723N46255M323681J893206
10634D129315p77349J485197M065724J754771k169883k795389j877079k680477
10626A134830l087736l52333K763515K697730J237213J459891J911691J33779
10618G898580j958924j440952J61992l77123k415664k886651j167573R94251K485333
10609A293269L037175K415438J403248J365447J487628o35677m375864n524177
10601D66487k172429K160339L356727J892414J169001K656244M300395K893491
10593A6722669k009673o035069m061143K103113M090845j499021o849273l982569
10585a520121K835107L901101o68841k626242l04374k00697l750081m210334P51092
$$ y = [-3634691, -3206076, -2839177, 1015687, 4250057, 1780896, -2633827, -2087572, 2236109, 4129315, 3351966, 4837163, 8902887, 10657658, 8487775, 5692386, 3815307, 1134830, -1952906, -2305239, 458276, 3156006, 4393219, 5853110, 7764801, 7898580, 5939656, 4498704, 4660696, 4283573, 1867909, -1018742, -2186315, -1192064, 1293269, 4330444, 6745882, 8149130, 9514577, 11002205, 10366528, 5990664, 466487, -1705942, 454397, 3811124, 5703538, 6872539, 9528783, 13829178, 16722669, 14712996, 8677927, 4616784, 6719897, 10810742, 9311721, 2462448, -1520121, 1314986, 5216087, 4547246, 1921004, 1616630, 1415933, -2334148, -6544482, -5793390]
10576e793390M110121J244367k603085j486914K354178L803286K669627J386663
10568E684853Q3185j740352k543162j038576J668949L707319L621222N07977l706740
10559F244675m248451j86478K198803j433199n342980k461303L462646M224945
10551B458658J236550J675728M305718K261172k579730k198026J976349R46625
10543A0083044m648415m644830K284556N872563K099687j257001J77828J160113
10535A1127545r60242j658670J36135K3122j387699P05803L578775N36323m519272
10526G581820k264510L725690K159909m177299k646271M617638L713084l922716
10518H787345l349322M327197K825830o624776m803128Q538369J0760619k866048
$$ y = [-5793390, -1683269, -438902, -3041987, -4528901, -2174723, 1628563, 4298190, 5684853, 5768038, 4027686, 1484524, 445948, 2114897, 5822216, 9443438, 9951415, 6244675, 1996224, 1809746, 4008549, 2575350, -2767630, -5228933, -1766287, 2458658, 3695208, 5370936, 9676654, 11937826, 9358096, 7160070, 9136419, 10083044, 5434629, 789799, 3074355, 8946918, 11046605, 9789604, 9967432, 11127545, 10167303, 8508633, 8644768, 8667890, 7280191, 7985994, 11564769, 12101092, 7581820, 5317310, 9043000, 11202909, 7025610, 4379339, 8996977, 12710061, 8787345, 5438023, 9765220, 12591050, 5966274, 1163146, 9701515, 20462134, 17596086]
10510A7596086r342474O89661P710005K005345K19287Q493119Q133320m931378
10502C0572971p446634N594310P118041q987406j0573984J1124911J8094463l268282
10494D2228390r619428J7675740K8079999j787522m135620O0933456R4884994
10487B28260009q907432j69491939j96589507n8377343P2951880O8830560q99236
10480f4223008j6405996J5221013J9586370l786090l908142J5970134J2987116
10473b4558603q290540p995902J1168973J2101459n447781q211054O156487Q644719
10465a6432242l532899m779418O866247P227565n377823o997934N213845P839151
10457i973508l991629q207802K663969R742174L952400q21913K380774K434882
$$ y = [17596086, 8253612, 8943273, 16653278, 18658623, 18877910, 27371029, 35504349, 30572971, 23126337, 28720647, 35838688, 26851282, 16277298, 27402209, 45496672, 42228390, 32608962, 50284702, 78364701, 76577179, 72441559, 133375015, 228260009, 219352577, 49860638, -146728869, -205106212, -132154332, -63323772, -64223008, -80629004, -65407991, -45821621, -49607711, -53515853, -37545719, -24558603, -32849143, -40845045, -29676072, -17574613, -23022394, -31233448, -25076961, -16432242, -19965141, -24744559, -17878312, -10650747, -16028570, -23026504, -17812659, -9973508, -13965137, -22172939, -19508970, -9766796, -5814396, -6636309, -4255535, -1820653]
10449a820653m120717n411234R07702K124034m194373n086735K166934M519372
10441a0915670j242734k226804N004942O840629j936049p994265l332992J713665
10433a4089278j355088m936786r76590N262710O209245L321375L12026k892590
10425i144976m461975p06731M872942M368958r83439k406085Q89934J458677j176028
10416g288723j71645L476590J514046m773493m915150J771992M418565L10212
10408e657606q78680L887021N099912j164929n848639l565157r93830k333903
10400a1455811j508945M168746O872666K263331k459550j668249l4236j351501
10392e173549j057066K965739M172981n77463m173766j934089N3000k871102m356820
$$ y = [-1820653, -5941370, -11352604, -10444902, -8320868, -12515241, -17601976, -15435042, -10915670, -12158404, -14385208, -9380266, -2539637, -4475686, -12469951, -15802943, -14089278, -15444366, -20381152, -21357742, -16095032, -9885787, -6564412, -6252386, -9144976, -13606951, -14313682, -9440740, -5071782, -6055221, -8461306, -7571372, -6112695, -7288723, -7460368, -3983778, -2469732, -7243225, -12158375, -10386383, -5967818, -5657606, -6536286, -2649265, 2450647, 1285718, -4562921, -8128078, -9121908, -11455811, -12964756, -8796010, -1923344, 339987, -2119563, -3787812, -3822048, -5173549, -6230615, -3264876, 908105, 330642, -3843124, -5777213, -5724213, -8595315, -12952135]
10383a2952135J373828P979776O590162n61556m922026m062792j732913n11447
10375h799103p36143k448601l777623j709570K597882M410415L031510K376391
10367e054842K758686J16909m841639n648495r03208K750477J505845n09267r9241
10358i924775M219j569658j461363Q65868R20861j922532k088530K143737N095346
10349g936827L596245J387532M63077k209790n888535m534843J617266L796515
10341i709360q75515l617366J258302O604667M697758p12425k483122j303466
10333f140527r77795o98604L86782j125889n250363m850975K752896Q671728N304343
10324a928404j614608k794690K55897L94144k118594j960965P99712K233446K524924
$$ y = [-12952135, -11578307, -3598531, 2991631, 2430075, -2491951, -6554743, -8287656, -8799103, -9535246, -11983847, -15761470, -17471040, -14873158, -10462743, -7431233, -5054842, -2296156, -2179247, -7020886, -12669381, -13572589, -10822112, -9316267, -9825534, -9924775, -9920556, -11490214, -12951577, -12085709, -11164848, -13087380, -15175910, -13032173, -7936827, -4340582, -2953050, -2489973, -4699763, -10588298, -15123141, -13505875, -9709360, -10584875, -14202241, -12943939, -6339272, -1641514, -2353939, -4837061, -6140527, -7118322, -7816926, -7430144, -8556033, -13806396, -18657371, -15904475, -7232747, -1928404, -3543012, -6337702, -6081805, -5687661, -7806255, -9767220, -8967508, -6734062, -4209138]
10315d209138L778904L813201L45127k663798r21123K038999P52995k291594j324290
10306f80717J938766J431532k109527k463789J085542K847673M09166k390983
10298F7663k261838J334K554497L845265J961016k434954m367988r49445K879649
10289A295199R44993m164273m599969O20646M326733K176356j855411k465309
10281c721035k1879J721177J171493k70094j100690j622480k875416l930074j764986
10272a2413984L903952P321881L079033m625556n765655J065705N691314J368163
10264c75147n249193n107898l94011J023711p66496O04379N298953O331116J091684
10255B457098m441175m447335q920M313644N633977L250381j679694n681587n502687
$$ y = [-4209138, -430234, 3382967, 3728094, 1064296, 143173, 2182172, 2935167, 643573, -680717, 1258049, 2689581, 580054, -1883735, -798193, 2049480, 2458646, 67663, -2194175, -2192841, 361656, 4206921, 6167937, 3732983, -635005, -1584450, 1295199, 2240192, -1924081, -6524050, -5903404, -1576671, 599685, -1255726, -3721035, -3742914, -2021737, -850244, -1120338, -2221028, -3843508, -6718924, -10648998, -12413984, -8510032, -1188151, 1890882, -2734674, -8500329, -7434624, -1743310, -375147, -5624340, -10732238, -11126249, -10102538, -10869034, -10264655, -4965702, 1365414, 2457098, -1984077, -6431412, -6440332, -2126688, 3507289, 6757670, 5077976, -603611, -6106298]
10246f106298k012217R86416J856335K224910L013532K528538m44686l746612
10238a700082l657633N37983M631988L555008j933614m915069j129025M587163
10230b3281N079035J401536j09487O04121k194346p739433p570261J91433N921865
10221d438818L285165j065916K35270K873030P1270m102631j892901L848071M518886
10212C331426O63802k92538J524147q73088o830730p157672K66219N695545K401828
10203a271061l402261k815898L059725O404129L626495j953634n267820l909257
10195e529582M16310L079246J254584k322581l060555j015738L59032O74493K221242
10186c923549L773056J467784l462666m773887q39707K519655J484822j55387
$$ y = [-6106298, -8118515, -7132099, -5275764, -3050854, -37322, 2491216, 2046530, -1700082, -5357715, -4819732, -187744, 3367264, 1433650, -3481419, -4610444, -23281, 5055754, 6457290, 6347803, 6951924, 4757578, -2981855, -10552116, -10360683, -4438818, -1153653, -2219569, -1984299, 888731, 960001, -3142630, -5035531, -1187460, 3331426, 3995228, 3702690, 5226837, 4353749, -2476981, -9634653, -9368434, -3672889, -1271061, -4673322, -7489220, -4429495, 1974634, 5601129, 3647495, -1620325, -5529582, -5113272, -2034026, -779442, -3102023, -6162578, -7178316, -6819284, -6144791, -3923549, -150493, 1317291, -2145375, -6919262, -7758969, -5239314, -3754492, -3909879]
10178c909879J357041K808662N6924l887810l118162J691106M156581J403339
10170E57802k764611l817928j541955J287406K235527P49083j483408j624747
10162f402831J083573L565180K362330j558455l770617k156081P63097J892636
10154d221168J544486J820851K823085K696711Q05026j238054j829308j051435
10146A350194J94338J251106J512897O56977m30918m91924n7038p79945k099531
10137A106156j414288J143522J637307j426072l489924o41594L369370K307804
10129B592281k551018m084536k57495L349590K605492J2010q01467M657J065650
10120A935164K070627J578361k132070o254512n295534J68025K916967L7750k476931
$$ y = [-3909879, -2552838, 255824, 312748, -3575062, -6693224, -5002118, -845537, 557802, -2206809, -6024737, -7566692, -6279286, -4043759, -3294676, -4778084, -6402831, -5319258, -1754078, 608252, -950203, -4720820, -6876901, -6113804, -4221168, -2676682, -855831, 1967254, 4663965, 5468991, 4230937, 2401629, 1350194, 1544532, 2795638, 4308535, 4965512, 4534594, 4042670, 3985632, 3205687, 1106156, -308132, 835390, 2472697, 1046625, -2443299, -3084893, 284477, 2592281, 41263, -4043273, -4300768, -951178, 1654314, 1666324, 864857, 869514, 1935164, 4005791, 5584152, 3452082, -2802430, -8097964, -7929939, -5012972, -4975222, -7452153]
10111g452153K3006L204438J898381p96415L63265K923428J036012m041512n743385
10102h584935k291899K225200N114235O545616N342517L63872m727458m856531
10094h69383j361866p1316j952125k416756j09534Q06631j372911k438918M43594
10085i342584L717816L222345N55084j42105J390546K013908K18442k391409l593943
10076d351900k329658J113953M796938N659180K267892k849781n114275k926461
10068c734112J70444j81530l112780l409201O56467L870961J614336k428131j511555
10059h065101L251244M372167J98352k533083k72098J730626n10006k263395R98864
10050c092430M320286R67168n729654p011156j930813K594360K965691J880597
$$ y = [-7452153, -7429147, -4224709, -2326328, -3122743, -2759478, 163950, 1199962, -2841550, -8584935, -10876834, -8651634, -3537399, 3008217, 8350734, 8714606, 3987148, -869383, -2231249, -2302565, -4254690, -6671446, -6780980, -5974349, -7347260, -9786178, -9342584, -5624768, -2402423, -1847339, -1989444, -598898, 1415010, 1633452, -757957, -4351900, -6681558, -5567605, -770667, 4888513, 7156405, 4306624, -807651, -3734112, -3563668, -3745198, -6857978, -10267179, -9610712, -5739751, -4125415, -6553546, -8065101, -4813857, -441690, -243338, -2776421, -3048519, -1317893, -1827899, -4091294, -3092430, 1227856, 2195024, -3534630, -10545786, -12476599, -9882239, -6916548, -5035951]
10042e035951J207375j09747j115917P67186L859452L435239m11579k418694o10379
10033d33015J036336k51996k025295j608327n568J160874K133006K662026J347639
10024D015680j033173j518525K24935J054162k41936r42395K70295L29676k879807
10015g21088n784291l549331K712892O804633M991546m2354l023572j926612R31325
10006C93148K585175K567292J887091N27446j944900l970519l065547L35567K893943
9997B208696K897903J874109R60722q05193l296005m149153k641284j123173q76883
9988d950261m89475O2987j337062l486780j599453M115829O037150K63148n977539
9979g361456m393856K255715N399202L496703J579193J298706M05k071436j794879
$$ y = [-5035951, -3828576, -3938323, -5054240, -4287054, -427602, 3007637, 2596058, 177364, -433015, 603321, 351325, -1673970, -3282297, -3287865, -2126991, 6015, 2668041, 4015680, 2982507, 1463982, 1688917, 2743079, 2501143, 1558748, 1829043, 2158719, -721088, -6505379, -10054710, -7341818, -537185, 4454361, 4412007, 1388435, -538177, 393148, 2978323, 5545615, 7432706, 7960152, 6015252, 2044733, -1020814, -685247, 2208696, 5106599, 6980708, 7941430, 7136237, 3840232, -308921, -2950205, -4073378, -4950261, -5439736, -5376749, -6713811, -10200591, -11800044, -7684215, -1647065, -1383917, -7361456, -11755312, -9499597, -4100395, -603692, 975501, 2274207, 2274612, 203176, -1591703]
9970a591703K80653O05237n52408M49398L637527N022032L050896r81k610515
9961H290136m783467n138157k472006O87755J106586N0638M55412R63395j286099
9952b125807l803473j476761M583496P466914L990983j603521l868072j795849
9944A367910J702366K732305l40363m356280m315139m06551K143810J758155K381886
9935B668099M225937J707087m763546n596478K112647O897290J001547n536944
9927B715639j774430M551769O95035p477629m955608N753321Q304288o6591n461370
9918B284424j458793L191374K494027P56451J30982k556074m772132m13081O017323
9909E674501M034520l714975m693158J291215K495210j983288j154226N072364
$$ y = [-1591703, -1311050, -705813, -1258221, -808823, 2828704, 7850736, 10901632, 10900651, 8290136, 3506669, -1631488, -4103494, -3415739, -2309153, -2258515, -1803103, -839708, -2125807, -5929280, -7406041, -2822545, 4644369, 8635352, 7031831, 3163759, 1367910, 3070276, 5802581, 5462218, 1105938, -3209201, -3615752, -1471942, 286213, 2668099, 6894036, 8601123, 3837577, -1758901, 353746, 7251036, 8252583, 2715639, 941209, 5492978, 6188013, -1289616, -6245224, -491903, 7812385, 7745794, 2284424, 825631, 4017005, 6511032, 7267483, 7398465, 4842391, 70259, -342822, 5674501, 9709021, 5994046, 1300888, 2592103, 5087313, 3104025, 1949799, 7022163]
9901G022163M924476j296636p19341N665805K603659q944087r853568J990777
9893A393248N862325l298692m662198P436579R449102o268853j1884618N651156
9885C678049J6005122k31014j1374226O882513J4137510l2710123q9954374p3810426
9877a67376969J2492553P3911707N5096795O072228o906240Q627492R619941n380714
9869a3843207p449323N146693Q977913j23769m693972J21298K489776n46733m88643
9860a0409967K693757R54906l903169k506694M108918O244634K853035J229460
9852A264880K092866N4365l577864k869857K09882r02402l916696j326978M503002
9843d468802M051308k337449m261972J038026M326124L90076l834584j612169
$$ y = [7022163, 11946639, 10650003, 9930662, 15596467, 18200126, 9256039, -597529, 1393248, 7255573, 3956881, -705317, 6731262, 16180364, 9911511, -1973107, 3678049, 19683171, 19452157, 8077931, 14960444, 29097954, -3612169, -93566543, -167376969, -154884416, -80972709, -25875914, -19803686, -26709926, -18082434, -8462493, -13843207, -21292530, -16145837, -7167924, -7291693, -11985665, -11864367, -9374591, -9921324, -10409967, -7716210, -6761304, -10664473, -13171167, -9062249, -2817615, 35420, 1264880, 3357746, 3412111, -165753, -3035610, -2825728, -3728130, -7644826, -8971804, -4468802, -417494, -2754943, -7016915, -5978889, -1652765, -1262689, -5097273, -6709442]
9835f709442L134496L190793j231859m281372k510464K396715N974542M459853
9827D423262j397174n853523m365753O30776L439570K861500J897136J415748
9819C051542m71870l280649l736566j116192J228240O44947j491185j930869P48636
9810f353966M520896N271104J314239l147013k410331K185536L227175j292152
9802C315488m005407Q5418M742289K164153m146369m803522Q54478M817828L266946
9793F291302K84998r47567j980680l207213k101012Q32592J296310j510437l120176
9784d161883j416271J44265n82816m78082K455142M325656J443800l040719l357939
9775d668847P54259M385363M090430O73286l153707m793095k774859J371695L370387
$$ y = [-6709442, -3574946, -384153, -1616012, -5897384, -8407848, -6011133, -36591, 4423262, 3026088, -2827435, -7193188, -6562412, -3122842, -261342, 1635794, 3051542, 2579672, -700977, -4437543, -5553735, -4325495, -3680548, -5171733, -7102602, -6353966, -1833070, 3438034, 4752273, 1605260, -805071, 1380465, 4607640, 3315488, -689919, -604501, 4137788, 6301941, 2155572, -2647950, -1793472, 3024356, 6291302, 6576300, 5628733, 3648053, 440840, -1660172, -827580, 468730, -1041707, -4161883, -5578154, -5433889, -6016705, -6494787, -4039645, 286011, 1729811, -1310908, -4668847, -3914588, 470775, 4561205, 5234491, 2080784, -2712311, -5487170, -4115475, -745088]
9766g45088J010563k329980j775404K191826M084485P59811m444377n946719k276771
9757i471654L087225N867738M601811R43600k171622k780380j371338k43472p87092
9748b325184j702014q93255J201389J843301j06631k347134k247851k16110J462278
9739e331211J737994J062398j80373j525746j754461l83138J163369J765043K485121
9730i61004L916512L731648L41551k990787k342756l7804j651900o463129p373640
9721a3831309j583867N041420O667888M550316K252179k71565l476598m377362
9713e028898j234487J930742R38169j752110j289189J482095K013574j37077j466047
9704d543228r43179m43410O7104J908981L110686O37959l016857j947327L680303
$$ y = [-745088, 265475, -2064505, -3839909, -1648083, 2436402, 3196213, -1248164, -7194883, -9471654, -6384429, -516691, 4085120, 5028720, 2857098, 76718, -1294620, -1538092, -2325184, -4027198, -4920453, -3719064, -1875763, -1982394, -4329528, -6577379, -6793489, -5331211, -3593217, -2530819, -2711192, -4236938, -5991399, -6374537, -5211168, -3446125, -961004, 2955508, 6687156, 7028707, 4037920, 1695164, 1657360, 5460, -6457669, -13831309, -15415176, -10373756, -3705868, 844448, 3096627, 2825062, -651536, -5028898, -6263385, -4332643, -3394474, -5146584, -6435773, -4953678, -2940104, -3077181, -4543228, -5486407, -5929817, -5862713, -3953732, -843046, -205087, -3221944, -5169271, -1488968]
9695a488968O623358K880728k868674m788035l436483k197142q00937K739690
9687c336463O510626O112675J127745l735170m509257k384056j215837k198581
9679c628318k676371l46038K895944L171972L36423j400395L19842K378635J300681
9670B352375j117316j197168K04363k55241j730344o32237J949974J128976k764616
9661b061234l321353J429372M824489J896126k745194k875338p23038k021379
9653e597549n276653m202682J214893M379318K619775M02372R91388K064229J734200
9644a670709K235218M319110L953330r71593n487929m290472n358R73316j512684
9635b457771j828670J678315L712471M36438m269276m177955O71642M345211K948875
$$ y = [-1488968, 5134390, 8015118, 5146444, 358409, -3078074, -5275216, -6076153, -3336463, 3174163, 9286838, 10414583, 6679413, 2170156, -213900, -1429737, -3628318, -6304689, -6650727, -3754783, -582811, -246388, -1646783, -1326941, 1051694, 2352375, 1235059, 37891, 242254, -12987, -1743331, -2375568, -425594, 703382, -2061234, -5382587, -3953215, 871274, 2767400, 22206, -2853132, -3576170, -5597549, -10874202, -15076884, -13861991, -9482673, -6862898, -6460526, -5469138, -3404909, -1670709, 564509, 4883619, 8836949, 7865356, 2377427, -1913045, -1918403, -945087, -2457771, -4286441, -2608126, 1104345, 1540783, -2728493, -6906448, -6234806, -1889595, 1059280]
9626A059280r71482k529039q19961O64690n81463k529936j801032J186536K921659
9617c400748K215374J581840K495965K891814J259109l55489l12780q47004l603840
9608A924241m990366j360960L561241L042934j909584l502340N86044L623676
9600I74886R46104k790171j809183J646875J989925o88477k303696k000456j682198
9591e716391r47932J517277L377744J405517k349651k834801K04860K180911J202464
9582a960002K83171J570691L253842L117597J171903j803564m686426n036446
9574d089234j644095K163229K036913q42998j450080J046639K332767N05347j184008
9565a125520n27693K52328o11604j227142j02538J125704J287925J633583K166348
$$ y = [1059280, 87798, -2441241, -3261202, -2596512, -3177975, -5707911, -7508943, -6322407, -3400748, -1185374, 396466, 2892431, 5784245, 7043354, 6687865, 6375085, 5528081, 1924241, -3066125, -4427085, -865844, 2177090, 267506, -3234834, -2648790, 974886, 1920990, -869181, -2678364, -1031489, 958436, 269959, -2033737, -4034193, -5716391, -6664323, -5147046, -1769302, -363785, -2713436, -5548237, -5343377, -3162466, -1960002, -1676831, -106140, 3147702, 6265299, 7437202, 5633638, 947212, -4089234, -5733329, -3570100, -1533187, -2376185, -3826265, -2779626, -446859, 58488, -1125520, -1653213, -1400885, -2012489, -3239631, -3342169, -2216465, -928540, 705043, 2871391]
9556B871391P36589k019007j977596J433786K823059q87475m815499l225475K010475
9547c049752M829313L313911J2481k843426l951163j912672J890139K547005j625542
9538g89706m948878k161430L144546M020863J037821L36157K673141K577833j474818
9529D415529m013038j649859J563218R32795k057671l218790j947981n42144j564
9520f519505L15272N82467M63714O7922m39610r98256q04163R32907K900594K672905
9510h25753N92497j4477J997010K898100q52549o615444p902851k557179M233772
9501i046874O143161K925065m20219n75316P52269Q89967O08251J964858L654209
9492F895371K258932k081079n018233l937537j192864P8227K45280J207469K764508
$$ y = [2871391, 3607980, 1588973, -388623, 1045163, 3868222, 2980747, -1834752, -5060227, -3049752, 1779561, 5093472, 5105953, 2262527, -1688636, -3601308, -1711169, 835836, -789706, -5738584, -7900014, -4755468, -734605, 303216, 639373, 3312514, 5890347, 4415529, 402491, -1247368, 315850, 1248645, -809026, -4027816, -5975797, -6517941, -6519505, -6204233, -5621766, -5158052, -5090130, -5529740, -6527996, -7332159, -6399252, -3498658, -825753, -233256, -247733, 1749277, 4647377, 3794828, -2820616, -10723467, -13280646, -9046874, -2903713, 21352, -398867, -974183, -221914, 668053, 1276304, 3241162, 6895371, 9154303, 7073224, 2054991, -1882546, -3075410, -2997183, -2751903, -1544434, 1220074]
9483A220074L406656K860471J758273L47597r28429j364230j644142l196680m890893
9474b431303l589344N32953L012238J586599m05462R6744R62099m54918k020136
9465b710530q68968J046138O76977k31167J305014L021869Q16965l495888m361500
9456d801090j116516J730345J851577Q18268n10216k378423k973945q79268O37534
9447g621734j793849m466931j551611M231440M795792R5767j637539J899263L403646
9438b645756m16055k424739K154681O339600K500853m761213n630399J87910M373888
9429c21230K602562j415069k923737r60565K817010N456478M090212m70820l567053
9420E307788l015477k202666l560855l642294L37195L721794Q71788n022809n981530
$$ y = [1220074, 4626730, 7487201, 9245474, 9593071, 8664642, 7300412, 5656270, 2459590, -2431303, -6020647, -5487694, -2475456, -888857, -1294319, -1197575, -235476, -690394, -2710530, -3579498, -2533360, -1856383, -2087550, -782536, 2239333, 3056298, -439590, -4801090, -5917606, -4187261, -2335684, -1517416, -2027632, -4406055, -7380000, -8259268, -7621734, -9415583, -13882514, -15434125, -11202685, -6406893, -6311126, -7948665, -6049402, -2645756, -3061811, -5486550, -3331869, 3007731, 5508584, 747371, -4883028, -4695118, -321230, 2281332, 866263, -2057474, -3018039, -201029, 5255449, 9345661, 8874841, 5307788, 2292311, 89645, -3471210, -7113504, -6776309, -3054515, -2182727, -7205536, -13187066]
9411a3187066j009183L590875M468901M145550L792105R32675m022140n959023
9403g247306k713593J026151P72861j362805r76093J554374K465633R72891J26784
9394e381103J763753L812935L365547N68883j692218j430083J32544K90185j599749
9385a69306l219565k090841J473601M483482L949754j97310m263896l943077L53976
9376c623182K947521J38554l897779k554160L263494O260331L696298N97495O01171
9367G429743O72285j876506l943513k779214j334161k124428j771757K042072
9359c685479M128202R3043m228212j031131N744118N623645j595754n644935k429447
9350c025950N85891k008879n242213l426796Q47080K790631L193625M429045M634187
$$ y = [-13187066, -14196249, -10605374, -6136473, -1990923, 1801182, 2733857, -1288283, -7247306, -9960899, -8934748, -8161887, -9524692, -10500785, -8946411, -6480778, -5507887, -5381103, -3617350, 195585, 3561132, 4130015, 2437797, 1007714, 1140258, 1430443, -169306, -3388871, -5479712, -4006111, 477371, 4427125, 4229815, -34081, -3977158, -3623182, -675661, -537107, -4434886, -6989046, -3725552, 2534779, 6231077, 6828572, 7429743, 8102028, 6225522, 2282009, -497205, -1831366, -3955794, -5727551, -3685479, 442723, 535766, -3692446, -4723577, 1020541, 6644186, 5048432, -596503, -3025950, -2440059, -4448938, -9691151, -13117947, -12270867, -9480236, -6286611, -1857566, 2776621]
9341B776621J660696j752872k037673l53102L08377j5186k05725j062138k459540
9332c140542j528615K196925L947051O43498l368895k708189O59661J265702p86415
9323b819819j088784Q45101J338719m21160j467478r11939p46254o59624J922731
9314d008507N716645N399213m10385n995331n940312j651399K047021L166184
9306a676871K552422P75844j639960k880806j780534Q6294N46036j20409l03862
9297d441846M6318r7840m88251m9202R29484J227659R17761J044515J385894P86642
9287A261134l35933l16533N47699j38099k672825l748424j227341K072448K413254
9278b144620R95973J689389L857435K563933l132680p197289m691898J311246
$$ y = [2776621, 4437317, 2684445, 646772, 293670, 602047, 586861, 381136, -681002, -3140542, -4669157, -2472232, 1474819, 2118317, -1250578, -3958767, -3299106, -2033404, -2819819, -3908603, -3063502, -1724783, -2145943, -3613421, -4525360, -5271614, -5931238, -4008507, 1708138, 7107351, 6696966, 701635, -5238677, -6890076, -4843055, -1676871, 875551, 1651395, 11435, -2869371, -4649905, -4563611, -4017575, -4137984, -4441846, -4395528, -4493368, -4981619, -5030821, -4101337, -2873678, -1955917, -911402, 474492, 1261134, 925201, 608668, 1156367, 1018268, -1654557, -5402981, -6630322, -4557874, -2144620, -1148647, 540742, 4398177, 6962110, 3829430, -3367859, -8059757, -6748511]
9270f748511M564663L967658K581328J158908j664513m125320k535095J930159
9262h70723L513206L84653k533051j429483Q80409M72324j298437j079433M11830
9253a548705K55717j188799j267490Q5702O99162K85255K96406O29301K61210
9244a492241J90160J737490K804059K88737m172497n651740l207185o79901L22192
9235i860926K457495N904027N802355J93807m952298l874815J71447N38197j737278
9226e357989k59942M709470N399192p90356o107732l992287J179712J628309j945254
9217e536877k989943o2933K433500K677598K953676L232141Q79800k548210j933068
9208h94316K217063K965248j762744m977902j979883J988007J273895o75271R95090
$$ y = [-6748511, -2183848, 1783810, 4365138, 5524046, 3859533, -265787, -2800882, -870723, 2642483, 3027136, 494085, -935398, -54989, 417335, -881102, -1960535, -1548705, -1292988, -2481787, -3749277, -3663575, -2964413, -2679158, -2382752, -1753451, -1492241, -1302081, 435409, 3239468, 3528205, -644292, -6296032, -9503217, -10183118, -9860926, -7403431, -1499404, 4302951, 4496758, -455540, -4330355, -4158908, -3620711, -5357989, -5617931, -908461, 4490731, 3700375, -2407357, -6399644, -5219932, -3591623, -5536877, -8526820, -8589753, -6156253, -3478655, -524979, 2707162, 3586962, 1038752, -894316, 1322747, 4287995, 2525251, -2452651, -4432534, -2444527, -1170632, -1845903, -850813]
9199h50813K434124j578508n865585k028246O110074O867733o66457n328181k090073
9190b995932J491450L7840j324143J322805K615765j211019l893131q4003M313618
9181B73250K097843k681000k125461J926600K186292j136739k143840l79210p9373
9172b061638j096613j38444J418089K07015j268521J054341L495900P5436n320197
9163c634632l894797K519696L669973j471191k905415K585301N734177J285341
9155C888453k979786k81431L730814J651499l255343l966278j233440K48864O80709
9146a515939K138851K502146M000j539466O79155K169032j068256m206521j511768
9137b348766K766631J114390l779912k935196L688980O615226J606645m652734
$$ y = [-850813, 1583311, 4803, -5860782, -7889028, -1778954, 5088779, 4422322, -905859, -2995932, -1504482, -1466642, -2790785, -1467980, 1147785, -63234, -3956365, -4040368, 273250, 2371093, -309907, -2435368, -508768, 1677524, 540785, -1603055, -1982265, -2061638, -3158251, -3296695, -1878606, -1671591, -2940112, -1885771, 1610129, 1685565, -3634632, -7529429, -5009733, -1339760, -2810951, -5716366, -3131065, 2603112, 3888453, 908667, 627236, 4358050, 6009549, 2754206, -1212072, -2445512, -2196648, -1515939, 622912, 3125058, 3129058, 1589592, 2268747, 4437779, 3369523, -836998, -2348766, 417865, 1532255, -2247657, -5182853, -1493873, 5121353, 6727998, 2075264]
9129B075264n323228j842601Q59981J221809L77928p78120j505054j054818L25982
9120e642857K059941M076727N036939K253392l514723o484140l361275J069801
9112d506195J141471p13076J039139M440697K960213k758882n207421k082174
9104e686228P96629j40754j347547M5104J329778L12715m26379J037216J951881
9095b127585j50549l197128m276878l326082r17283K927453N681688L425155k327627
9086d288836m297613P40058O823648P164769K937327l52288r72759q85545j030274
9077E838487j324817k789460n461749o323806l105920J773717M532497N230978
9069a630073N955217N666888J406366n582595r058030m834499L322133P023522
$$ y = [2075264, -3247964, -5090565, -4230584, -3008775, -2630847, -3408967, -4914021, -5968839, -5642857, -3582916, 493811, 5530750, 7784142, 4269419, -2214721, -5575996, -4506195, -3364724, -4077800, -3038661, 1402036, 4362249, 1603367, -3604054, -5686228, -4889599, -5030353, -6377900, -6332796, -5003018, -4690303, -5116682, -4079466, -2127585, -2278134, -5475262, -9752140, -13078222, -13995505, -11068052, -5386364, -1961209, -4288836, -8586449, -7846391, -1022743, 6142026, 9079353, 8727065, 7754306, 6868761, 5838487, 4513670, 1724210, -3737539, -10061345, -13167265, -11393548, -6861051, -1630073, 4325144, 9992032, 11398398, 5815803, -3242227, -8076726, -4754593, 2268929]
9061B268929K787312l393037l293900K314972M159632k019794q218510n694523
9053a1088919J501305K908759j758460k967107K294878N952743K864188j528732
9045a821345j781827o69984j503306j557093P55578J122633j634733j012154M985600
9036c116631O881196j126246q490614l408398P220142P772467j429963n805141
9028a503188o86626L206965j48148k961725N99376L991333R40393l254575j586349
9019a402544K608221K324624j146259j605988J319662K735724R24955j320627
9011D437768k057344j819317j207219m89503k86468m01492P9839L68421j144069
9002b519384k757759q32459L380797L883288p94911m484730k778724O15964J013016
$$ y = [2268929, 5056241, 1663204, -1630696, 684276, 4843908, 2824114, -5394396, -11088919, -9587614, -6678855, -8437315, -11404422, -9109544, -3156801, -292613, -1821345, -3603172, -4273156, -5776462, -7333555, -6577977, -5455344, -7090077, -8102231, -3116631, 3764565, 2638319, -5852295, -9260693, -2040551, 5731916, 4301953, -1503188, -2189814, 1017151, 869003, -2092722, -1493346, 2497987, 3438380, 183805, -1402544, 1205677, 3530301, 2384042, 778054, 2097716, 4833440, 5758395, 4437768, 2380424, 561107, -646112, -1135615, -1422083, -1823575, -1743736, -1375315, -2519384, -5277143, -6109602, -2728805, 1154483, 359572, -4125158, -6903882, -6287918, -5274902]
8993e274902O64M76976N16484j656585k215938J636408M701253J563355l087284
8984c339569j260671M457324M427341j932271m833577j47007M212055J583750
8976C167375l476890m060746j670126j330104k135615k86868K586122J907618
8968e299234j259431j454362K105386M417569L015864J225771J749674K550695
8960G051932J396113l03006j046425k303398m459909l764531J770697O511870
8952D853343L535958m464751p600440k809644J818774k52238m046571j664585
8944a0630154M555023N664089N14476k473939J208305N288177K862011l237356
8936C750632n491665k650284K77717N64095L84563J369559J719582o5804k233774
$$ y = [-5274902, -5274238, -4797262, -4280778, -5937363, -8153301, -6516893, -1815640, -252285, -3339569, -4600240, -142916, 4284425, 2352154, -2481423, -2628430, 1583625, 3167375, -309515, -4370261, -6040387, -7370491, -9506106, -9792974, -7206852, -5299234, -6558665, -8013027, -5907641, -1490072, 1525792, 2751563, 4501237, 7051932, 8448045, 8145039, 7098614, 4795216, 335307, -3429224, -1658527, 4853343, 8389301, 3924550, -3675890, -6485534, -4666760, -4918998, -8965569, -10630154, -6075131, -411042, 103434, -2370505, -1162200, 4125977, 6987988, 3750632, -1741033, -4391317, -4113600, -3549505, -3164942, -1795383, -75801, -141605, -2375379]
8927b375379k342797o48253O67361M97475k16008j31217O85841R30992L5057o81656
8917c578584K20486J825447J853306J74981q12625J3966O82542n47911k278673
8908b447065k334195j141423m12673M8387J535665L340467L307933J375941j6111
8899C256926M34566R55234n43958l132441l725083j095519K170849K627076L78732
8890A326382j189713n85686n64774l159014m985465j724530M228236O098061K667747
8881B111244l22648K0963m33554l952776n133491J28104N939890M487425j435786
8872A409371k835893R94712K130057k042456m504936p39609L762586K764355j026804
8863h8617j368240J452402K255059k81193k453777j957306n41429k75191p98568
$$ y = [-2375379, -4718176, -5366429, -4699068, -4201593, -4417601, -4548818, -3862977, -2931985, -2896928, -3578584, -3358098, -1532651, 320655, 495636, -316989, -303023, 379519, -168392, -2447065, -4781260, -5922683, -6335356, -6286969, -4751304, -1410837, 1897096, 3273037, 3256926, 3691492, 4646726, 4102768, 970327, -2754756, -3850275, -1679426, 947650, 1326382, 136669, -449017, -1013791, -4172805, -9158270, -10882800, -6654564, -556503, 2111244, 1788596, 1809559, 1376005, -2576771, -7710262, -7582158, -1642268, 2845157, 1409371, -1426522, -431810, 1698247, -344209, -4849145, -5588754, -1826168, 938187, -88617, -1456857, -4455, 2250604, 1969411, -484366, -2441672, -2983101, -3258292, -4056860]
8854d056860q13438l3638P36447L40130j515267l093254j956207J588356M055279
8845d748452L157036Q29953J27342Q44194O26706p42437r71677Q91671K608050
8836B622386J582392j743166m345267m132475k173610r64475j032946o43570R77030
8827i853701K235717K196500K534556M037791L675021r08611n820164n070635
8819f973526K56463K865767R6139k282343M55281M583356M037378o57700m263117
8810a882302m332806k281893M46992K866333L203233J352301O41345L134833N288931
8801H436967K731922k565037m869719l046308j048854q20845k70471J411757J752143
8792A711555m46810k946336l859138l850030l378237j392707J852495L969772
$$ y = [-4056860, -4870298, -4903936, -4167489, -3827359, -5342626, -8435880, -10392087, -8803731, -4748452, -1591416, -761463, -634121, 210073, 836779, 94342, -877335, 14336, 2622386, 4204778, 2461612, -1883655, -6016130, -8189740, -9154215, -10187161, -10830731, -9853701, -7617984, -5421484, -2886928, 1150863, 4825884, 3917273, -1902891, -6973526, -6717063, -3851296, -3755157, -6037500, -5582219, -998863, 3038515, 2380815, -1882302, -6215108, -8497001, -8050009, -5183676, -1980443, -628142, 13203, 3148036, 8436967, 11168889, 8603852, 3734133, 687825, -361029, -1181874, -1452345, -40588, 1711555, 1264745, -1681591, -5540729, -9390759, -12768996, -14161703, -12309208, -8339436]
8784h339436L820131K909344K447321J896524J179739J169446J192974n53408
8776E722635l147952l136306P4567K657309J920480q7181n23937J08364J47652
8767C735631k1693M05585M44201o92919j665664j326007o76805m98817L22785
8758B6297J901133J718224j382826m333692l959567j428968M10298J456432K748308
8749b844361L122413J386531m55603k22232L44153j228123l038587j832624P78440
8740c989993P37204j111301l43336K765752L047335n60840k605755p2728K486720
8731C53058M46263l434863l645120l84990J457521j79495k317425j579369J867518
8722g416902M712007L431829k052583o876995n626698P28260N260559L980077
$$ y = [-8339436, -4519305, -1609961, 837360, 2733884, 3913623, 5083069, 6276043, 5722635, 2574683, -561623, -487056, 2170253, 4090733, 4003552, 3479615, 3587979, 3735631, 3713938, 4119523, 4563724, 3870805, 2205141, 879134, 202329, -296488, 26297, 1927430, 3645654, 2262828, -2070864, -6030431, -7459399, -7049101, -5592669, -2844361, 278052, 1664583, 1208980, 986748, 1330901, 102778, -2935809, -4768433, -3989993, -3252789, -4364090, -4707426, -1941674, 1105661, 544821, -2060934, -2133662, 353058, 799321, -2635542, -6280662, -6665652, -5208131, -5387626, -7705051, -9284420, -7416902, -2704895, 726934, -1325649, -8202644, -13829342, -13101082, -7840523, -3860446]
8714c860446O60497K84395J719288J086635q88557m14060K146782K398600p33817
8705B399317l046127j639957R03983Q56420j467136l015106k240799r1275J745920
8696e594760K124974J049678j15852n2578N67447m6278j722672j991210L86701
8687e394550L248460L569460J040632j927933k989544j856724r0496N81594M3158
8678c775943k28166N59486J028348k66595k030872j647212P76475K190303Q98734
8669b495442j286068k121757j905602j885712j613611R1772K573835L655587K299458
8660b687540k16515j650923q14669J297034K184046N23634j775871j618888J003208
8651c756484K772525J733988j59327n52936j96838o65110r01647O83360K272817
$$ y = [-3860446, -3199949, -2915554, -1196266, -109631, -998188, -1412248, 734534, 3133134, 2399317, -646810, -2286767, -1382784, -526364, -1993500, -5008606, -7249405, -7340680, -5594760, -3469786, -2420108, -2535960, -2588538, -2021091, -2067369, -3790041, -5781251, -5394550, -2146090, 1423370, 2464002, 536069, -2453475, -4310199, -4400695, -3819101, -3775943, -4004109, -3444623, -2416275, -2682870, -4713742, -6360954, -5584479, -3394176, -2495442, -3781510, -5903267, -7808869, -9694581, -11308192, -11216420, -8642585, -4986998, -2687540, -2904055, -4554978, -5369647, -4072613, -1888567, -1364933, -3140804, -4759692, -3756484, -983959, 750029, 590702, 37766, -159072, -824182, -1725829, -1042469, 1230348]
8642A230348Q09796k454727k975025q5932J380422j302627l825028j281658L604747
8633d899684L936111q27090l627361l58325L769170K000907l697160n391120o69522
8624i764074M263879L744603j68212k150548j251936l65012o81654r72520j131085
8615h476559k067621k318922P99549N810820P119127K460246l288291m509251
8607d470902k068606o75777j379520j152372R82298K289843J581537J637439M045867
8598G89807N238325J381530m819446o599443k220774K621031K765474J74572k12799
8589h81723J709586J775524j223097l550865k474893k810J142395J613043K832744
8580I39904L436106J740572n98235j132503q70468j939550k861329j049206J385148
$$ y = [1230348, 2040144, -414583, -3389608, -3475540, -2095118, -3397745, -7222773, -8504431, -4899684, -963573, -1790663, -5418024, -5776349, -2007179, -6272, -3703432, -9094552, -9764074, -5500195, -1755592, -1923804, -4074352, -5326288, -5691300, -6372954, -7345474, -8476559, -10544180, -12863102, -12063553, -6252733, 866394, 3326640, 38349, -4470902, -6539508, -7215285, -8594805, -9747177, -8764879, -6475036, -4893499, -3256060, 789807, 6028132, 7409662, 2590216, -4009227, -6230001, -3608970, -843496, -668924, -881723, 827863, 2603387, 1380290, -2170575, -4645468, -4648278, -3505883, -1892840, 939904, 4376010, 6116582, 5518347, 4385844, 3515376, 1575826, -1285503, -2334709, -949561]
8571i49561K75272k588776j041636M747092O722570J304345m151713k610518J565862
8562C272937K79942m628152m713354N87706L036048m15299k691391J135472N476267
8553A340176L702774q98486r33148K766474K826806k209238n215788j637921L382555
8544C124204K587404l098431o393681l798535O01043J616566m51168j563283r4786
8535g470667J581556J393633P30494J826228L661152L008398n22206l099447j744181
8526f35040J112381O95032l094679m863715j129919M179120M497020m26867m060103
8517c726770j969719K566931L765842R24619k317522l806584l835208j861335
8509a0259746K684459O499677M755223j321839m390961r92288L273978K127774
$$ y = [-949561, -674289, -3263065, -4304701, 442391, 7164961, 8469306, 4317593, 1707075, 3272937, 3552879, -1075273, -5788627, -5200921, -2164873, -2580172, -5271563, -4136091, 1340176, 5042950, 4144464, 3211316, 5977790, 8804596, 6595358, 1379570, -258351, 3124204, 5711608, 2613177, -3780504, -7579039, -6977996, -5361430, -5812598, -7375881, -7470667, -5889111, -4495478, -3764984, -1938756, 1722396, 4730794, 4208588, 1109141, -635040, 477341, 1172373, -1922306, -6786021, -7915940, -3736820, 760200, 333333, -3726770, -5696489, -3129558, 636284, 1560903, -756619, -4563203, -8398411, -10259746, -7575287, -1075610, 3679613, 2357774, -2033187, -3025475, 248503, 2376277]
8501B376277k285350l547530q30261J270255R42889J041247K836487L473471R52373
8492F229858k576825m080369l181122j365920j89150p74872k634063k960862J34094
8483a1399231L987504M289410J355981m03005O55542J536341L41513q25068l11593
8474g72606J76237o47289j001898K73822J064508k60016j804673j675816j281755
8465e929486k129794k493156n55944J966940K683365K319504K402974K006085
8457B70488L35746m02183J265382K446663N24725j538800M6273K512771M86672
8448E947737m300762m721192L05474L655465R71754l252154l517352r68648P68951
8439e110727J928283L766592L713305p17394n721555m999911J030160N298147
$$ y = [2376277, 90927, -3456603, -4286864, -3016609, -2073720, -1032473, 1804014, 5277485, 6229858, 3653033, -427336, -3608458, -4974378, -5163528, -5938400, -8572463, -11533325, -11399231, -7411727, -3122317, -1766336, -2169341, -1513799, 22542, 364055, -461013, -772606, -596369, -1243658, -2245556, -1971734, -907226, -1167242, -2971915, -4647731, -5929486, -8059280, -10552436, -11108380, -9141440, -6458075, -4138571, -1735597, 270488, 606234, 204051, 1469433, 3916096, 4440821, 2902021, 2948294, 5461065, 5947737, 1646975, -3074217, -2768743, 886722, 1858476, -1393678, -4911030, -5879678, -5110727, -3182444, 584148, 4297453, 3580059, -2141496, -7141407, -6111247, -813100]
8431h13100L748169P3378o62627J052395J319110q97848k941944k800953j203941
8422c127361O48295K671984M141331K780888j955678o034278m604955J108357
8414d371417M086347M13425n074116n050578M60535M534481L021741n88616j134169
8405c702367J085390J755387q46399l564536k607166J607631M586900K706768
8397A021608k274893m687820j635355L195350M151389P46056k531205k752153
8389d767023j386618m36896L90780J331326J004554n91646o62222K031941M063512
8380I77708J958162k087963l042403n27798Q02330j367932l406215j322867L022165
8371d994813M208415O45763l151487k348468J960432M120751J297334k735301
$$ y = [-813100, 2935069, 3008447, 2345820, 3398215, 4717325, 3819477, 877533, -1923420, -3127361, -2479066, 192918, 4334249, 7115137, 5159459, -874819, -5479774, -4371417, -285070, 128355, -4945761, -9996339, -9535804, -5001323, -1979582, -2568198, -3702367, -2616977, -861590, -1707989, -5272525, -7879691, -6272060, -1685160, 1021608, -1253285, -5941105, -7576460, -4381110, -229721, 516335, -2014870, -4767023, -6153641, -6590537, -6199757, -4868431, -3863877, -4455523, -5117745, -3085804, 977708, 2935870, 847907, -2194496, -2722294, -1919964, -3287896, -6694111, -8016978, -4994813, -786398, -140635, -3292122, -5640590, -3680158, 440593, 1737927, -997374]
8363i97374k750070O27914J913707j054412l763439j706468K912524M500946J979766
8354A663094p28091j262981j419280k504107k326448R13834M710565N209747K508414
8345F764747J25719r5301K49844m34346j244832r26434n06683j735186l770839
8336a573311l757297j010039J447999P95123j631051k172735J08991K466350K569020
8327b756950J292709O06679P19040P50157O78132Q35892N22737r64901k459427
8318g75932j953060N51200K795368L062070J941394R95368O57407n5255k110446
8309E108114m848579n847037l191061J661518M381484K247356k599251n468724
8301h556180l996963L30033M493030O228712M824445J528294j029551j253993
$$ y = [-997374, -3747444, -3119530, -1205823, -2260235, -6023674, -7730142, -4817618, -316672, 1663094, 935003, -327978, -1747258, -4251365, -6577813, -5663979, -953414, 4256333, 6764747, 6890466, 6795165, 7045009, 6610663, 5365831, 4439397, 3932714, 2197528, -1573311, -5330608, -6340647, -4892648, -4097525, -5728576, -7901311, -7792320, -5325970, -2756950, -1464241, -857562, -138522, 611635, 1289767, 2125659, 2648396, 1683495, -775932, -2728992, -2177792, 617576, 3679646, 5621040, 6616408, 7273815, 7218560, 5108114, 259535, -5587502, -8778563, -7117045, -2735561, -488205, -3087456, -8556180, -12553143, -12223110, -7730080, -1501368, 3323077, 4851371, 3821820, 2567827]
8293B567827j68438L76694L8856p86809k420124m331888l771409Q20965O040721
8284a633605O815014L069350o22430j765549k036894k503033j747545l010q8715
8275e16417k131785k309948M52759J700174j024308l133187m44272L215565K212735
8266a978684j112211m97151L092625K967035j538017l762965j132019Q80631j154727
8257d235483k708763K74085M003068L219005n62507k689156k623211j983181L27455
8248f978688M746416O491987J563464n120761n230090M14628K704393j843238
8240c251889n977574l110739L071082M757345R39456k788559k643955k77001J015251
8231h266583J74379j535304k213977r23329J468904L232707L673091L206770J856982
$$ y = [2567827, 2399389, 2776083, 2814939, 2028130, -391994, -4723882, -8495291, -7674326, -1633605, 5181409, 8250759, 7628329, 5862780, 3825886, 1322853, -424692, -427702, -516417, -2648202, -4958150, -4505391, -2805217, -3829525, -6962712, -7406984, -4191419, -1978684, -3090895, -3588046, -495421, 2471614, 933597, -2829368, -3961387, -3080756, -4235483, -6944246, -6670161, -2667093, 551912, -10595, -2699751, -5322962, -7306143, -6978688, -2232272, 4259715, 5823179, 702418, -4527672, -4113044, -1408651, -3251889, -9229463, -12340202, -9269120, -4511775, -3572319, -6360878, -9004833, -9281834, -8266583, -8092204, -9627508, -11841485, -12764814, -11295910, -8063203, -4390112, -1183342, 673640]
8222F73640n34514k650971k574063o95700O31604P65965J295756K290631J541604
8213G43952j010272j896179L16810J782236o56937l482948j414246L722359M884936
8204B989711M20755l127248o28628M232022M498017n82940n671559p003347n664601
8195a0537818l636378q13602K658656M358168K562691m23814p86228J523674K849301
8186b245350J353341n57940n80819k66634j828407l518945j913179K229881M426319
8177b901733K854093L22254q67338j808625l001518j844336K502198N249372J705479
8168B209846m911313o453071o48167N604319N150650o75979m545718k357845K577731
8159d049547M215980P67340l813677m787464j878447J284101K128979J553553
$$ y = [673640, 139126, -2511845, -5085908, -5781608, -5150004, -4384039, -3088283, -797652, 743952, -266320, -2162499, -1845689, -63453, -720390, -4203338, -5617584, -1895225, 2989711, 3410466, 283218, -345410, 3886612, 8384629, 7801689, 2130130, -4873217, -10537818, -14174196, -14987798, -12329142, -7970974, -5408283, -5832097, -6618325, -5094651, -2245350, -892009, -1449949, -2030768, -2297402, -4125809, -7644754, -9557933, -7328052, -2901733, -47640, 274614, -592724, -2401349, -5402867, -7247203, -4745005, 504367, 2209846, -2701467, -9154538, -9802705, -4198386, 952264, 276285, -4269433, -6627278, -4049547, 166433, 933773, -2879904, -7667368, -9545815, -8261714, -6132735, -4579182]
8151d579182J235244R92825J08286q06458r92633q48704l90610J495741M161271
8142C75780M032397m76919n000990m216879N64022L332565K211454J174654K434716
8133D430800K584489j286330o016649o411417k275904J792417K258962r7779j926071
8124f947482p55745K543548M247889K076761j192490j040171J907620K323978
8116C163908j389774m012030j788476R91751j280345n783519m849439J996837
8108a2951087O608388L986264q17496p74505K931289L581243o07873l965663j732614
8099c742054L182745M239241N9046l948592k960193J059132K584355L12882j605663
8090h19101k27321J923383J185016j532034k490958q85199O79584P97221P72323
$$ y = [-4579182, -3343938, -2351113, -2242827, -3049285, -4041918, -4890622, -5281232, -3785491, 375780, 4408177, 3931258, -1069732, -5286611, -4722589, -1390024, 821430, 1996084, 4430800, 7015289, 5728959, -287690, -6699107, -8975011, -7182594, -4923632, -5021411, -6947482, -7703227, -5159679, -911790, 1164971, -27519, -1067690, 839930, 3163908, 1774134, -2237896, -4026372, -3034621, -4314966, -10098485, -14947924, -12951087, -6342699, -2356435, -3173931, -3948436, -1017147, 2564096, 1956223, -2009440, -3742054, -559309, 3679932, 3738978, -209614, -3169807, -2110675, 473680, 786562, -819101, -1046422, 876961, 2061977, 529943, -1961015, -2846214, -2166630, -1369409, -597086]
8081e97086J288025R85476n64131j439682n52341J96663j035891k710390j965501
8072f394858J085037L329382K497579o28653l419402l454491j39078M109284N132529
8063B117329J595675k418032k089194J202723J323520l336135o366240k219264
8055a0189618M981342O491629J059745l855722l159687k78101j9970j119212k88218
8046f377812Q83577q99249l379588j574469L048493L530172j362150m095036K48932
8037i977130N946902N151330l61616k500831O93818K995278K32780l888282m157266
8028e865017j135136R91353P09804N9346P00984J917762K273695J466643L21751
8019A441185k26734k2319K61623J24222M0145O03011J204592P21693n46240j025651
$$ y = [-597086, 690939, 1676415, 1112284, -327398, -879739, -683076, -1718967, -4429357, -6394858, -5309821, -1980439, 517140, -111513, -3530915, -6985406, -7124484, -3015200, 2117329, 3713004, 1294972, -794222, 408501, 1732021, -1604114, -7970354, -10189618, -5208276, 1283353, 2343098, -1512624, -4672311, -4950412, -4970382, -6089594, -6377812, -5494235, -6393484, -9773072, -11347541, -8299048, -4768876, -6131026, -10226062, -9977130, -4030228, 1121102, 759486, -1741345, -1047527, 1947751, 2180531, -1707751, -5865017, -7000153, -6008800, -5298996, -5239650, -4538666, -2620904, -347209, 1119434, 1441185, 1214451, 1192132, 1453755, 1577977, 1618122, 2221133, 3425725, 4147418, 3601178, 2575527]
8009B575527k85051R2828j202796l176862l764573k378187k35247J440795K562943
8000d370623L482351L851270K673015l81725l820847n046827k885748P09868K297333
7991c491933O49166j704000j206782K542446N864348M674508q84530n988666n905464
7982e450907j031415L678112M332718J948284R8325J42109M23093l70094j126319
7973B643906l22522J240494J121999j442916l978385l273341P04945M236492L766919
7964D697591p9259l275670k966825j93074J967987J694628n35144k870672l284895
7955d845333r91454K336557L676454J998503l49539o75646N58088P61139q28361
7946A640408k034087q94187J459818J997700n08571l697306l950175n09811L354934
$$ y = [2575527, 2290476, 2383304, 1180508, -1996354, -5760927, -8139114, -8374361, -6933566, -4370623, -888272, 2962998, 5636013, 5254288, 1433441, -3613386, -6499134, -5789266, -3491933, -2842767, -4546767, -5753549, -3211103, 2653245, 7327753, 6443223, 454557, -5450907, -6482322, -2804210, 1528508, 3476792, 3575117, 3717226, 4140319, 3770225, 2643906, 2321384, 3561878, 4683877, 3240961, -737424, -4010765, -3305820, 930672, 4697591, 4618332, 1342662, -1624163, -1817237, 150750, 1845378, 1310234, -1560438, -4845333, -5836787, -3500230, 176224, 2174727, 1825188, 1149542, 1707630, 2468769, 1640408, -393679, -1287866, 171952, 2169652, 1661081, -2036225, -5986400, -6496211, -3141277]
7937c141277L914986J162213j631700k093130r45946q0140j26597l79139J47288
7928c173442J704623K735330O46993m235816o773009k794639L873960N265153
7920b750847O43478k203420P47509L273556m21047n249915l141740L344835M754697
7911a002894l0885k340769J971998O407762M867708L98146j566621j773408l434226
7902C496811n151601l595277m48J513842K03612j195676j122197j97583J002746
7893e045771J900388J064729j629616l546817k696194p15151K09707Q93865K318251
7884g246609K067894j818910n551269l590577K797951O409901L837136o33214
$$ y = [-3141277, 773709, 1935922, 304222, -1788908, -2734854, -2814994, -2941591, -3320730, -3173442, -1468819, 1266511, 1913504, -2322312, -9095321, -11889960, -8016000, -2750847, -2107369, -4310789, -3563280, -289724, -710771, -5960686, -9102426, -5757591, -1002894, -1033779, -3374548, -1402550, 5005212, 9872920, 10271066, 8704445, 6931037, 3496811, -1654790, -5250067, -5250515, -3736673, -3533061, -4728737, -5850934, -6048517, -5045771, -3145383, -2080654, -3710270, -7257087, -9953281, -10668432, -10458725, -9564860, -7246609, -5178715, -6997625, -12548894, -16139471, -13341520, -6931619, -3094483, -3727697]
$$ [...]
##END NTUPLES=NMR SPECTRUM
##END=
