##TITLE=31Pdec_LR-758-CR2-BA
 CCl4, 24 sc
 22.11.2022
##JCAMPDX= 6.0         $$ Bruker NMR JCAMP-DX V2.0
##DATA TYPE= NMR SPECTRUM
##DATA CLASS= NTUPLES
##ORIGIN= UXNMR, Bruker Analytische Messtechnik GmbH
##OWNER= root
$$ XWIN-NMR		Version 3.5
$$ Tue Nov 22 14:22:49 2022 Russian Standard Time (UT+4h)  she@DPX200
##.OBSERVE FREQUENCY= 81.013821
##.OBSERVE NUCLEUS= ^31P
##.ACQUISITION MODE= SIMULTANEOUS
##.ACQUISITION SCHEME= undefined
##.AVERAGES= 24
##.DIGITISER RES= 16
##SPECTROMETER/DATA SYSTEM= spect
##.PULSE SEQUENCE= zgpg30
##.SOLVENT NAME= CDCl3
##.SHIFT REFERENCE= (INTERNAL, CDCl3, 0, 248.564)
##AUDIT TRAIL= $$ (NUMBER, WHEN, WHO, WHERE, WHAT)
$$ ##TITLE= Audit trail, XWIN-NMR		Version 3.5
$$ ##JCAMPDX= 5.01
$$ ##ORIGIN= Bruker BioSpin GmbH
$$ ##OWNER= she
$$ F:/spectra/data/she/nmr/P31/1/pdata/1/auditp.txt
$$ ##AUDIT TRAIL=  $$ (NUMBER, WHEN, WHO, WHERE, WHAT)
(   1,<2022-11-22 14:21:19.82 +0400>,<she>,<DPX200>,
      <created by zg, POWCHK disabled, PULCHK disabled
       configuration hash MD5:
       00 E9 B6 7A A2 85 ED C7 34 08 36 98 17 FE 4E 26
       data hash MD5: 32K
       61 2C D9 2F B6 98 57 50 69 DA 87 EF B2 91 D2 4D>)
(   2,<2022-11-22 14:21:51.60 +0400>,<she>,<DPX200>,
      <Start of raw data processing
       efp BC_mod = 2 LB = 1 FT_mod = 6 PKNL = 1 PHC0 = -10223.19 PHC1 = 14.05597 SI = 64K 
       data hash MD5: 64K
       1B BD 0A CF 03 14 B9 A0 4A 76 78 D9 34 EC 7F B9>)
(   3,<2022-11-22 14:22:15.95 +0400>,<she>,<DPX200>,
      <pk PHC0 = -1.409049 PHC1 = 30.8 
       data hash MD5: 64K
       DC 8F 31 F0 93 6F DC A5 4C 6B B1 76 85 40 80 37>)
(   4,<2022-11-22 14:22:20.09 +0400>,<she>,<DPX200>,
      <abs ABSG = 5 
       data hash MD5: 64K
       60 36 CB 4A BF D0 AD F1 55 C3 D5 29 83 85 CF 6F>)
$$ ##END=
$$ 
$$ hash MD5
$$ DB 70 2D 00 E1 D2 7B 62 5B C2 37 C1 7E AE F4 8B
##$RELAX= 
##$RELAX= 
##$RELAX= 
##$RELAX= 
##$RELAX= 
##$RELAX= 
##$RELAX= 
##$RELAX= 
##$RELAX= 
$$ Bruker specific parameters
$$ --------------------------
##$DU= <F:/spectra>
##$EXPNO= 1
##$NAME= <P31>
##$PROCNO= 1
##$TYPE= <nmr>
##$USER= <she>
##$AMP= (0..31)
100 100 100 100 100 100 100 100 100 100 100 100 100 100 100 100 100 100 
100 100 100 100 100 100 100 100 100 100 100 100 100 100 
##$AQSEQ= 0
##$AQ_mod= 1
##$AUNM= <au_zg>
##$AUTOPOS= <>
##$BF1= 81.014009
##$BF2= 200.13
##$BF3= 200.13
##$BF4= 200.13
##$BF5= 200.13
##$BF6= 200.13
##$BF7= 200.13
##$BF8= 200.13
##$BYTORDA= 1
##$CFDGTYP= 0
##$CFRGTYP= 5
##$CHEMSTR= <none>
##$CNST= (0..31)
1 1 145 1 1 1 1 1 1 1 1 1 1 1 1 1 1 1 1 1 1 1 1 1 1 1 1 1 1 1 1 1 
##$CPDPRG= <waltz16>
##$CPDPRG1= <>
##$CPDPRG2= <waltz16>
##$CPDPRG3= <>
##$CPDPRG4= <mlev>
##$CPDPRG5= <mlev>
##$CPDPRG6= <mlev>
##$CPDPRG7= <mlev>
##$CPDPRG8= <mlev>
##$CPDPRGB= <>
##$CPDPRGT= <>
##$D= (0..31)
0 1 0 0 0 0 0 0 0 0 0 0.03 2e-05 3e-06 0 0 0 0 0 0 0 0 0 0 0 0 0 0 0 0 
0 0 
##$DATE= 1669112479
##$DBL= (0..7)
120 120 120 11 120 120 24 19 
##$DBP= (0..7)
150 150 150 150 150 150 150 150 
##$DBP07= 0
##$DBPNAM0= <>
##$DBPNAM1= <>
$$ [...]
##$SUBNAM3= <"">
##$SUBNAM4= <"">
##$SUBNAM5= <"">
##$SUBNAM6= <"">
##$SUBNAM7= <"">
##$SUBNAM8= <"">
##$SUBNAM9= <"">
##$SW= 501.771253377433
##$SWIBOX= (0..15)
0 1 3 0 0 0 0 0 0 0 0 0 0 0 0 0 
##$SW_h= 40650.406504065
##$TD= 32768
##$TD0= 1
##$TE= 0
##$TE2= 300
##$TE3= 300
##$TEG= 300
##$TL= (0..7)
0 120 53 12 22 120 120 120 
##$TP= (0..7)
150 150 150 150 150 150 150 150 
##$TP07= 0
##$TPNAME0= <>
##$TPNAME1= <>
##$TPNAME2= <>
##$TPNAME3= <>
##$TPNAME4= <>
##$TPNAME5= <>
##$TPNAME6= <>
##$TPNAME7= <>
##$TPOAL= (0..7)
0.5 0.5 0.5 0.5 0.5 0.5 0.5 0.5 
##$TPOFFS= (0..7)
0 0 0 0 0 0 0 0 
##$TUNHIN= 0
##$TUNHOUT= 0
##$TUNXOUT= 0
##$USERA1= <user>
##$USERA2= <user>
##$USERA3= <user>
##$USERA4= <user>
##$USERA5= <user>
##$V9= 5
##$VALIST= <valist>
##$VCLIST= <CCCCCCCCCCCCCCC>
##$VD= 0
##$VDLIST= <DDDDDDDDDDDDDDD>
##$VPLIST= <PPPPPPPPPPPPPPP>
##$VTLIST= <TTTTTTTTTTTTTTT>
##$WBST= 1024
##$WBSW= 4
##$XGAIN= (0..3)
0 0 0 0 
##$XL= 0
##$YL= 0
##$YMAX_a= 3776
##$YMIN_a= -5858
##$ZGOPTNS= <>
##$ZL1= 120
##$ZL2= 120
##$ZL3= 120
##$ZL4= 120
##$ABSF1= 248.5645
##$ABSF2= -253.2056
##$ABSG= 5
##$ABSL= 3
##$ALPHA= 0
##$AQORDER= 0
##$ASSFAC= 0
##$ASSFACI= 0
##$ASSFACX= 0
##$ASSWID= 0
##$AUNMP= <proc_1d>
##$AZFE= 0.1
##$AZFW= 0.5
##$BCFW= 0
##$BC_mod= 2
##$BYTORDP= 0
##$COROFFS= 0
##$CY= -3
##$DATMOD= 1
##$DC= 0
##$DFILT= <>
##$DTYPP= 0
##$F1P= 0
##$F2P= 0
##$FCOR= 1
##$FTSIZE= 65536
##$FT_mod= 6
##$GAMMA= 0
##$GB= 0
##$INTBC= 1
##$INTSCL= 6.047779e-11
##$ISEN= 30
##$LB= 1
##$LEV0= 0
##$LPBIN= 0
##$MAXI= 10000
##$MC2= 0
##$MEAN= 0
##$ME_mod= 0
##$MI= 50
##$NCOEF= 0
##$NC_proc= -7
##$NLEV= 6
##$NOISF1= 182.463
##$NOISF2= 159.3651
##$NSP= 0
##$NTH_PI= 0
##$NZP= 0
##$OFFSET= 248.5645
##$PC= 4
##$PHC0= -10224.6
##$PHC1= 44.85597
##$PH_mod= 1
##$PKNL= yes
##$PPARMOD= 0
##$PSCAL= 0
##$PSIGN= 0
##$REVERSE= no
##$SF= 81.0140089999694
##$SI= 65536
##$SIGF1= 159.3651
##$SIGF2= -187.1042
##$SINO= 113.3802
##$SIOLD= 16384
##$SREGLST= <1H.CDCl3>
##$SSB= 0
##$STSI= 65536
##$STSR= 0
##$SW_p= 40650.406504065
##$SYMM= 0
##$S_DEV= 0
##$TDeff= 32768
##$TDoff= 0
##$TI= <>
##$TILT= no
##$TM1= 0
##$TM2= 0
##$TOPLEV= 0
##$USERP1= <user>
##$USERP2= <user>
##$USERP3= <user>
##$USERP4= <user>
##$USERP5= <user>
##$WDW= 1
##$XDIM= 65536
##$YMAX_p= 328304504
##$YMIN_p= -74471743
$$ End of Bruker specific parameters
$$ ---------------------------------
##NTUPLES= NMR SPECTRUM
##VAR_NAME=  FREQUENCY,     SPECTRUM/REAL,   SPECTRUM/IMAG
##SYMBOL=    X,             R,               I
##VAR_TYPE=  INDEPENDENT,   DEPENDENT,       DEPENDENT
##VAR_FORM=  AFFN,          ASDF,            ASDF
##VAR_DIM=   65536,         65536,           65536
##UNITS=     HZ,            ARBITRARY UNITS, ARBITRARY UNITS
##FACTOR=    0.620285442955139, 1,           1
##FIRST=     20137.2065510682, 0,            0
##LAST=      -20513.1999529968, 0,           0
##MIN=       -20513.1999529968, -74471743,   0
##MAX=       20137.2065510682, 328304504,    0
$$ Real data points
##PAGE= N=1
##DATA TABLE= (X++(R..R)), XYDATA
$$ [...]
$$ plain form
36778 -1618309 -1011672 -403084 395794 1589575 2343058 1418423 -810911 -2207341 -1340624
36769 -1340624 820138 2318635 2490824 2085231 1793786 1630040 1499523 1496386 1558137 1448625
36759 1448625 1255123 1416152 1940791 1934014 469180 -1941548 -3283331 -2073545 652301
36750 652301 2152690 1020427 -1335086 -2681917 -2528266 -1764282 -619725 1341189 3345901
36741 3345901 3470608 1315421 -908142 -1125052 -68506 213330 -409278 -328808 650345
36732 650345 527929 -1763943 -4176284 -3946377 -1299330 810475 460003 -1112056 -1434696
36723 -1434696 163671 2076136 2457756 1170856 -187061 57640 1884542 3436402
36715 3436402 2842473 128763 -2972510 -4886325 -5227996 -4140035 -1762517 1074224
$$ packed form
36778a618309O06637O08588P98878J193781P53483r24635k229334j396430Q66717
36769a340624K160762J498497J72189m05593k91445j63746j30517l137O1751j09512
36759A448625j93502J61029N24639o777j464834k410728j341783J209786K725846
36750F52301J500389j132263k355513j346831J53651P63984J144557J960914K004712
36741C345901J24707k155187k223563k16910J056546K81836o22608Q0470R79153
36732F50345j22416k291872k412341K29907K647047K109805l50472j572059l22640
36723a434696J598367J912465L81620j286900j357917K44701J826902J551860
36715C436402n93929k713710l101273j913815l41671J087961K377518K836741
$$ plain form
36707 1074224 2614719 1742437 -544211 -2133722 -2138401 -1447834 -1111948 -1136026 -1069844 -960689
36697 -960689 -1213451 -1847495 -2239817 -1587189 262129 2274988 2889184 1638482 -225022
36688 -225022 -1243069 -1363482 -1246867 -631123 1148926 3201785 3447523 1519264 -257577
36679 -257577 207455 2065759 2969872 2284845 1371057 1130887 899157 -29598 -1123801
36670 -1123801 -1552321 -1564273 -2039438 -2941001 -3098517 -1803516 -1089 770792 399857
36661 399857 298039 1319538 2527042 2625049 1780484 1142543 1270943 2087320 3647861
36652 3647861 5561534 6247071 4555979 1887607 747942 1183093 778889 -1419026 -3295083
36643 -3295083 -2913783 -1274607 -490730 -941988 -1627079 -1867090 -1385418 -164640 650200
$$ packed form
36707A074224J540495q72282k286648j589511m679O90567L35886k4078O6182J09155
36697i60689k52762o34044l92322O52628J849318K012859O14196j250702j863504
36688b25022j018047j20413J16615O15744J780049K052859K45738j928259j776841
36679b57577M65032J858304R04113o85027r13788k40170k31730r28755j094203
36670a123801m28520j1952m75165r01563j57516J295001J802427P71881l70935
36661C99857j01818J021499J207504R8007q44565o37941J28400Q16377J560541
36652C647861J913673O85537j691092k668372j139665M35151m04204k197915j876057
36643c295083L81300J639176P83877m51258o85091k40011M81672J220778Q14840
$$ plain form
36634 650200 -503145 -2690209 -2516515 1099767 4514016 4160770 1508397 107392 -135889
36625 -135889 -1580789 -3205880 -1465385 3129230 5404499 2914495 -641829 -1613733
36617 -1613733 -1755312 -4055669 -6681648 -5577575 -1343276 1127562 -269482 -2158742
36609 -2158742 -988923 2246329 4294937 4260130 3630671 2983250 1215601 -1843777 -4122685
36600 -4122685 -3660574 -1195614 790969 1067681 459772 -40726 -424033 -650403 -106481
36591 -106481 1028176 1205607 -464837 -2619275 -3359764 -2678809 -1803429 -1061676 -79469
36582 -79469 678598 513274 174572 968600 2441233 2895835 2028271 1068716 500802 -194662
36572 -194662 -655029 49662 1061623 287866 -2186905 -3771024 -3121127 -1705787 -892374
$$ packed form
36634F50200j153345k187064J73694L616282L414249l53246k652373j401005k43281
36625a35889j444900j625091J740495M594615K275269k490004l556324r71904
36617a613733j41579k300357k625979J104073M234299K470838j397044j889260
36609b158742J169819L235252K048608l4807o29459o47421j767649l059378k278908
36600d122685M62111K464960J986583K76712o07909n00498l83307k26370N43922
36591a06481J134657J77431j670444k154438p40489O80955Q75380P41753R82207
36582g9469P58067j65324l38702P94028J472633M54602q67564r59555n67914o95464
36572a94662m60367P04691J011961p73757k474771j584119O49897J415340Q13413
$$ plain form
36563 -892374 -229008 362731 -320614 -1940334 -1862358 699616 2578500 1238364 -1044143
36554 -1044143 -611827 1976838 3157904 1837914 275448 187053 1071306 2078066 2783971
36545 2783971 2345076 441393 -1169949 -534406 1338979 1757571 517413 -38025 865943
36536 865943 1332828 365004 -458471 44602 696348 397345 160754 969718 1580896 507657
36526 507657 -1193332 -1231937 565122 2112943 2013324 1047379 601433 819880 829640 234932
36516 234932 -195609 449976 1639641 1480374 -1020600 -4305674 -5898146 -5400869 -4586411
36507 -4586411 -4524999 -4209531 -2614433 -655378 52134 -498761 -873194 -293664 487479
36498 487479 388185 -693140 -1896492 -2259797 -1451614 -3617 1014479 812502 -289949
$$ packed form
36563h92374O63366N91739o83345j619720P7976K561974J878884j340136k282507
36554a044143M32316K588665J181066j319990j562466q8395Q84253J006760P05905
36545B783971m38895j903683j611342O35543J873385M18592j240158n55438R03968
36536H65943M66885r67824q23475N03073O51746k99003k36591Q08964O11178j073239
36526E07657j700989l8605J797059J547821r9619r65945m45946K18447R760n94708
36516B34932m30541O45585J189665j59267k500974l285074j592472M97277Q14458
36507d586411O1412L15468J595098J959055P07512n50895l74433N79530P81143
36498D87479r9294j081325j203352l63305Q08183J447997J018096k01977j102451
$$ plain form
36489 -289949 -897669 102531 1946461 2390738 511978 -1464758 -633688 2382958 3739872
36480 3739872 1653489 -824118 -128840 2545521 3054064 507620 -1488782 -136680
36472 -136680 2844797 4013288 2614079 635711 -171401 270855 1192333 1861155 1897340
36463 1897340 1646189 2121591 3903841 6122493 7029612 5771087 3468466 2259235 2912700
36454 2912700 3637161 2185673 -786992 -2019550 -123748 2047963 1352059 -894764
36446 -894764 -912099 1590162 2866239 898257 -1657012 -1643668 349370 1920365 2697687
36437 2697687 3697233 4361688 3064527 124220 -2051283 -1988032 -617072 465863 791813
36428 791813 743920 609699 383331 -91573 -999417 -2154419 -2774699 -2175478 -702517
$$ packed form
36489b89949o07720J000200J843930M44277j878760j976736Q31070L016646J356914
36480C739872k086383k477607O95278K674361N08543k546444j996402J352102
36472a36680K981477J168491j399209j978368q07112M42256R21478O68822L6185
36463A897340k51151M75402J782250K218652R07119j258525k302621j209231O53465
36454B912700P24461j451488k972665j232558J895802K171711o95904k246823
36446h94764j7335K502261J276077j967982k555269J3344J993038J570995P77322
36437B697687R99546O64455j297161k940307k175503O3251J370960J082935L25950
36428G91813m7893j34221k26368m74904r07844j155002o20280N99221J472961
$$ plain form
36419 -702517 459640 476883 -367596 -1055424 -831529 108813 896819 1012919 791287 683506
36409 683506 556485 334741 678665 1912385 2835450 2183899 982984 1412045 3113868
36400 3113868 2987037 -326496 -3927064 -4302959 -1811220 446699 946103 680558 504850
36391 504850 -41954 -1116060 -1709094 -1032818 374745 1347987 1186104 30042 -1172668
36382 -1172668 -1332009 -612503 -684521 -2542791 -4632482 -4597127 -2578450 -1063047 -1366100
36373 -1366100 -2071787 -1516766 -142556 594526 298773 -559714 -1835875 -3342105 -4049095
36364 -4049095 -3160053 -1633972 -1190579 -1921822 -2379955 -2109150 -2316247 -3345114 -3287961
36355 -3287961 -642537 2886072 4212272 2909045 1339065 934160 719762 29981 165321
$$ packed form
36419g02517J162157J7243q44479o87828K23895R40342P88006J16100k21632j07781
36409F83506j27021k21744L43924J233720R23065o51551j200915M29061J701823
36400C113868j26831l313533l600568l75895K491739K257919M99404k65545j75708
36391E04850n46804j074106n93034O76276J407563R73242j61883j156062j202710
36382a172668j59341P19506p2018j858270k089691L5355K018677J515403l03053
36373a366100p05687N55021J374210P37082k95753q58487j276161j506230p06990
36364d049095Q89042J526081M43393p31243m58133K70805k07097j028867N7153
36355c287961K645424L528609J326200j303227j569980m04905k14398o89781J35340
$$ plain form
36346 165321 1911837 3486764 2970724 1315804 729274 1144108 708034 -873434 -2030428
36337 -2030428 -2179026 -2393662 -3063269 -3240731 -2709994 -2378856 -2060528 -296176 2660923
36328 2660923 4063289 2316067 -546148 -1598284 -596510 753696 1562025 2020633
36320 2020633 2109195 1819290 1866264 2689126 3486703 3513318 3435420 4080936 4751082 4193820
36310 4193820 2493273 663297 -885712 -2196563 -2874858 -2674507 -2309230 -2537035 -3161667
36301 -3161667 -3852027 -4818333 -5642377 -4970291 -2857551 -1770336 -3232378 -4973950 -3908318
36292 -3908318 -796458 876966 9309 -1102603 -695329 444387 1267748 2067124 2960499
36283 2960499 3005830 1868844 715977 576332 1116380 1558453 1530822 726596 -838164
$$ packed form
36346A65321J746516J574927n16040j654920n86530M14834m36074j581468j156994
36337b030428j48598k14636o69607j77462N30737L31138L18328J764352K957099
36328B660923J402366j747222k862215j052136J001774J350206Q08329M58608
36320B020633Q8562k89905M6974Q22862P97577K6615p7898O45516O70146n57262
36310D193820j700547j829976j549009j310851o78295K00351L65277k27805o24632
36301c161667o90360r66306q24044O72086K112740J087215j462042j741572J065632
36292c908318L111860J673424q67657j111912M07274J139716Q23361P99376Q93375
36283B960499M5331j136986j152867j39645N40048M42073k7631q04226j564760
$$ plain form
36274 -838164 -1956978 -1145430 1247735 3294939 4053224 4267891 4348155 3597429 2066456
36265 2066456 1292784 2212811 3800628 4685139 4802480 4602922 3929661 2689833 1621442
36256 1621442 1450719 1972208 2526890 2717099 2428365 2004092 2374203 3823602 4770708
36247 4770708 3445634 878175 179014 2264061 4350831 3713458 1046839 -1163769
36239 -1163769 -1869817 -1500640 -279675 1611094 3057663 2955986 1768117 923667 1057170
36230 1057170 1750172 2439150 2673546 2069325 851302 -146929 -682356 -1479848 -2725972
36221 -2725972 -3271290 -2347621 -1038510 -743029 -989043 -231330 1650647 3104405 3079173
36212 3079173 2282301 2070235 2767654 3267084 2147518 -583940 -2952751 -2964255 -1087551
$$ packed form
36274h38164j118814Q11548K393165K047204P58285K14667Q0264p50726j530973
36265B066456p73672R20027J587817Q84511J17341j99558o73261j239828j068391
36256A621442j70723N21489N54682J90209k88734m24273L70111J449399R47106
36247D770708j325074k567459o99161K085047K086770o37373k666619k210608
36239a163769p06048L69177J220965J890769J446569j01677j187869q44450J33503
36230A057170O93002O88978K34396o04221j218023r98231n35427p97492j246124
36221b725972n45318R23669J309111K95481k46014P57713J881977J453758k5232
36212C079173p96872k12066O97419M99430j119566k731458k368811j1504J876704
$$ plain form
36203 -1087551 339848 328553 257470 1094892 1544047 387077 -985828 -433913 1570371
36194 1570371 2625229 1976314 1265033 1694702 2430146 2309337 1592947 1282238 1722703
36185 1722703 2508797 3067430 2898864 1829008 387230 -523170 -621060 -578532 -1119500
36176 -1119500 -1979562 -1992622 -365240 2060038 3173317 1800170 -676750 -1754433 -802007
36167 -802007 485967 706210 332838 132531 -388071 -1736776 -2875858 -2442040 -850502
36158 -850502 194017 -101080 -978516 -1302094 -506886 1081725 2139932 1360634 -642761
36149 -642761 -1569297 -596482 105925 -1386386 -3424610 -2980442 -231832 1703970 1292760
36140 1292760 56915 -717196 -1868495 -3838257 -4724194 -2774710 611358 2354863
$$ packed form
36203a087551J427399j1295p1083Q37422M49155j156970j372905N51915K004284
36194A570371J054858o48915p11281M29669P35444j20809p16390l10709M40465
36185A722703P86094N58633j68566j069856j441778r10400r7890M2528n40968
36176a119500q60062j3060J627382K425278J113279j373147k476920j077683R52426
36167h02007J287974K20243l73372k00307n20602j348705j139082M33818J591538
36158h50502J044519k95097q77436l23578P95208J588611J058207p79298k003395
36149f42761r26536R72815P02407j492311k038224M44168K748610J935802m11210
36140A292760j235845p74111j151299j969762q85937J949484L386068J743505
$$ plain form
36132 2354863 1601637 515770 1158847 2835030 3138000 1136011 -1276612 -1579051 287490
36123 287490 1966455 1824024 740858 218591 210773 89769 382709 1662027 2660486
36114 2660486 1704772 -429915 -1346801 -540797 226427 153230 527196 2033236 3257749
36105 3257749 2908850 1658625 773461 572019 1091960 2511677 3963696 3766303 1950275
36096 1950275 746718 1360392 2157076 1466138 183781 -191411 -156068 -639722 -596400
36087 -596400 1261458 3669116 4448800 3836227 3383514 2687449 579307 -1238360 143697
36078 143697 3402693 3614874 -392602 -3569214 -1885651 1736432 2126234 -489242 -1788671
36069 -1788671 -506021 445105 -378848 -803037 472636 1199006 -625969 -3262164 -3901129
$$ packed form
36132B354863p53226j085867O43077J676183L02970k001989k412623l02439J866541
36123B87490J678965j42431j083166n22267p818j21004K92940J279318R98459
36114B660486r55714k134687r16886Q06004P67224p3197L73966J506040J224513
36105C257749l48899j250225q85164k01442N19941J419717J452019j97393j816028
36096A950275j203557O13674P96684o90938j282357l75192L5343m83654M3322
36087e96400J857858K407658P79684o12573m52713o96065k108142j817667J382057
36078A43697L258996K12181m007476l176612J683563L622083L89802k615476j299429
36069a788671J282650R51126q23953m24189J275673P26370j824975k636195o38965
$$ plain form
36060 -3901129 -2714317 -1795667 -1635923 -1236293 -768424 -1462786 -3070879 -3766991 -2788129
36051 -2788129 -1272159 -208918 651957 1465119 1630031 1112311 826035 918747 215617
36042 215617 -1635092 -2956787 -2346053 -962343 -867997 -1888020 -1940071 -201930 1820030
36033 1820030 2580321 2310192 1953227 1492687 314086 -1340812 -2291922 -1875975 -822748
36024 -822748 -215024 130473 1418637 3716269 5039851 3773785 1398565 1014758 3047780
36015 3047780 4461812 3092218 744800 383508 1897327 2874032 2540373 2390250 3163341
36006 3163341 3666393 2991256 1841361 969677 21548 -1220397 -1863544 -1159568 263358
35997 263358 1251710 1472154 1352548 1423429 2119341 3393692 4155945 3055943 357388
$$ packed form
36060c901129J186812R18650J59744L99630M67869o94362j608093o96112R78862
36051b788129J515970J063241Q60875Q13162J64912n17720k86276R2712p03130
36042B15617j850709j321695O10734J383710R4346j020023n2051J738141K021960
36033A820030P60291k70129l56965m60540j178601j654898r51110M15947J053227
36024h22748O07724L45497J288164K297632J323582j266066k375220l83807K033022
36015C047780J414032j369594k347418l61292J513819R76705l33659j50123P73091
36006C163341N03052o75137j149895q71684r48129j241945o43147P03976J422926
35997B63358R88352K20444j19606P0881O95912J274351P62253j100002k698555
$$ plain form
35988 357388 -1850628 -1896482 -247350 1473110 2397247 2838600 3539905 4970277 6686884
35979 6686884 7085733 4733473 487822 -2637139 -2495205 -72465 1889767 1915628 830907
35970 830907 363893 1371989 3125029 3971243 3069201 1529464 1163329 2078100 2572124
35961 2572124 1694049 652735 998642 2531990 3962441 4749985 5208081 5374246 4858066
35952 4858066 3593145 2006208 604154 -187754 -114266 616715 1426911 1855740 1579867
35943 1579867 309673 -1365775 -1477300 1257245 4834483 5530430 2660808 -381017
35935 -381017 -796827 272808 580696 415812 983064 1281207 -197344 -1997671 -1466297
35926 -1466297 617955 870852 -1079943 -1581822 1276996 4314712 3795139 758943 -835064
$$ packed form
35988C57388k208016m5854J649132J720460R24137M41353P01305J430372J716607
35979F686884L98849k352260m245651l124961J41934K422740J962232K5861j084721
35970H30907m67014J008096J753040Q46214r02042j539737l66135R14771M94024
35961B572124q78075j041314L45907J533348J430451P87544M58096J66165n16180
35952D858066j264921j586937j402054p91908P3488P30981Q10196M28829k75873
35943A579867j270194j675448j11525K734545L577238O95947k869622l041825
35935c81017m15810J069635L07888j64884N67252K98143j478551j800327N31374
35926a466297K084252K52897j950795n01879K858818L037716n19573l036196j594007
$$ plain form
35917 -835064 231598 1397718 473651 -1584317 -2497803 -1664427 -471570 -275697 -818077
35908 -818077 -753691 488280 1819428 1813850 551006 -554300 -568264 210900 1299894
35899 1299894 2731700 4320272 5158160 4507023 2713260 868823 11720 750490 2842012
35890 2842012 4761116 4545749 1802991 -1553467 -3115503 -2230371 -144455 1569892
35882 1569892 2218429 2005878 1497777 1116150 941744 944760 1232941 1800325 2232028 2137697
35872 2137697 1749609 1550316 1462325 1082085 584200 562843 994569 1251370 1198952 1332149
35862 1332149 1731685 1970650 2215194 3087055 4000325 3187185 393235 -1829218 -1039030
35853 -1039030 1786560 3594232 3428425 3307458 4746816 6364460 6017727 3968214 2335658
$$ packed form
35917h35064J066662J166120r24067k057968r13486Q33376J192857J95873n42380
35908h18077O4386J241971J331148n578j262844j105306j3964P79164J088994
35899A299894J431806J588572Q37888o51137j793763j844437q57103P38770K091522
35890B842012J919104k15367k742758l356458j562036Q85132K085916J714347
35882A569892O48537k12551n08101l81627j74406L016K88181N67384M31703r4331
35872B137697l88088j99293q7991l80240m97885k1357M31726K56801n2418J33197
35862A332149L99536K38965K44544Q71861R13270q13140k793950k222453P90188
35853a039030K825590J807672j65807j20967J439358J617644l46733k049513j632556
$$ plain form
35844 2335658 1946084 1445741 -170167 -1733511 -1724266 -872402 -1204322 -2677822 -2718374
35835 -2718374 96489 3501324 4159986 1850289 -623397 -1192345 -445138 158437 271478
35826 271478 391607 893615 1888024 3182433 4127195 4302298 4277266 4654658 4695026 3468436
35816 3468436 2116216 2750819 4829703 5233598 2999974 1296987 2774394 5350018
35808 5350018 5369056 3218108 2421870 3900666 4740609 3113751 1137299 1369645 2939043
35799 2939043 3246063 2059253 1633049 3093676 4657326 4045675 1571274 -151714 656057
35790 656057 2960337 4441737 4309342 3625483 3111533 2116281 350826 -668988 862644
35781 862644 4713851 8820179 11335684 11685924 10306501 8367131 7140502 6643862 5588455
$$ packed form
35844B335658l89574n00343j615908j563344R245Q51864l31920j473500m0552
35835b718374K814863L404835O58662k309697k473686n68948P47207O03575J13041
35826B71478J20129N02008R94409J294409R44762J75103k5032L77392M0368j226590
35816C468436j352220O34603K078884M03895k233624j702987J477407K575624
35808E350018J9038k150948p96238J478796Q39943j626858j976452K32346J569398
35799B939043L07020j186810m26204J460627J563650o11651k474401j722988Q07771
35790F56057K304280J481400j32395o83859n13950r95252j765455j019814J531632
35781H62644L851207M106328K515505L50240j379423j939370j226629m96640j055407
$$ plain form
35772 5588455 3602306 2363263 3092024 4163955 3292594 1145341 284040 1075802 1497655
35763 1497655 894964 811374 1588811 1366857 -377711 -1392707 -444593 384045 -568306
35754 -568306 -1260039 610435 3088075 2547238 -456642 -1798778 18257 2028048 1783821
35745 1783821 794394 1492905 3339736 3876476 2133908 -663516 -2803774 -3243696 -1937275
35736 -1937275 -137310 339881 -875026 -2054538 -1562772 6257 799105 178369 -839339
35727 -839339 -1233092 -961994 -368133 394905 1017894 757457 -943916 -3536352 -5298256
35718 -5298256 -4590388 -1526598 1812688 3373529 3225893 3000339 3384737 3348165 2220800
35709 2220800 1253687 2027172 4080532 5395101 4947884 3622255 2613415 2036153 1399893
$$ packed form
35772E588455j986149j239043P28761J071931q71361k147253q61301P91762M21853
35763A497655o02691q3590P77437k21954j744568j014996R48114Q28638r52351
35754e68306o91733J870474K477640n40837l003880j342136J817035K009791k44227
35745A783821r89427O98511J846831N36740j742568k797424k140258m39922J306421
35736a937275J799965M77191j214907j179512M91766J569029P92848o20736j017708
35727h39339l93753K71098N93861P63038O22989k60437j701373k592436j761904
35718e298256P07868L063790L339286J560841j47636k25554L84398l6572j127365
35709B220800r67113P73485K053360J314569m47217j325629j008840n77262o36260
$$ plain form
35700 1399893 586635 -138677 -585633 -690062 -387191 315730 1297258 2346693 2985531
35691 2985531 2507653 854882 -610388 -169384 1984935 3418270 2245263 -314040
35683 -314040 -1288519 274624 2149905 1940203 67964 -1235035 -1152065 -1016444 -1850488
35674 -1850488 -2713148 -2306036 -1162085 -986844 -2225288 -3503728 -3519231 -2437587 -1182556
35665 -1182556 -294125 63360 -223556 -913400 -1361077 -1363962 -1556467 -2376286 -3153448 -2948535
35655 -2948535 -1889320 -884278 -316408 122615 505707 534363 344303 556394 1368490
35646 1368490 2355026 3273383 4224682 4839250 4292240 2593869 958690 222207 -322312
35637 -322312 -1637980 -3103062 -3058936 -1032090 1584880 3160304 3281859 2374825 744270
$$ packed form
35700A399893q13258p25312m46956j04429L02871P02921R81528J049435O38838
35691B985531m77878j652771j465270M41004K154319J433335j173007k559303
35683c14040r74479J563143J875281k09702j872239j302999Q2970J35621q34044
35674a850488q62660M07112J143951J75241j238444j278440j5503J081644J255031
35665a182556Q88431L57485k86916o89844m47677k885j92505q19819p77162K04913
35655b948535J059215J005042N67870M39023L83092K8656j90060K12091Q12096
35646A368490R86536R18357R51299O14568n47010j698371j635179p36483n44519
35637c22312j315668j465082M4126K026846K616970J575424J21555r07034j630555
$$ plain form
35628 744270 -1331564 -3017790 -3305296 -2138141 -634866 122102 162058 108918 -10622
35619 -10622 -643695 -1496654 -1567012 -824490 -678031 -1798478 -2592258 -1414602 520799
35610 520799 602790 -1044091 -1435261 715973 2953016 2955400 1996987 2358928 3307095 2539623
35600 2539623 442702 -309656 913273 1877486 1314070 662563 1163777 1894782 2000609
35591 2000609 2525248 4322587 6058126 6201110 5515018 5562322 5893108 4884370 2693652
35582 2693652 1209587 1199262 1395477 653069 -483678 -761730 284109 2080049 3428075
35573 3428075 3083189 770817 -2182809 -3873615 -3602077 -2239294 -998913 -359115 -484
35564 -484 672678 1725227 2152224 821136 -1581498 -2532729 -571566 2626335 4257532
$$ packed form
35628G44270k075834j686226k87506J167155J503275P56968L9956n3140j19540
35619a0622o33073q52959p0358P42522J46459j120447p93780J177656J935401
35610E20799Q1991j646881l91170K151234K237043K384r58413L61941R48167p67472
35600B539623k096921p52358J222929R64213n63416o51507N01214P31005J05827
35591B000609N24639J797339J735539J42984o86092M7304L30786j008738k190718
35582B693652j484065j0325J96215p42408j136747k78052J045839J795940J348026
35573C428075l44886k312372k953626j690806K71538J362783J240381O39798L58631
35564d84O73162J052549M26997j331088k402634r51231J961163L197901J631197
$$ plain form
35555 4257532 3727637 2602910 1924884 1343002 667718 445411 753168 931880 834552
35546 834552 1054960 1687785 2121485 2252524 2599012 2997381 2573330 1342284 461311
35537 461311 455164 525656 115524 -168217 215403 835937 1261870 1796111 2607733 3161487
35527 3161487 3046728 2419025 1369371 45117 -519786 642599 2373274 2273014 266465
35518 266465 -914045 211913 1722789 1729471 1493738 2777810 4115830 2739414 -882160
35509 -882160 -3414789 -3187161 -1763336 -1126420 -1625973 -2758743 -3837205 -3684247 -1556204
35500 -1556204 1396309 3169673 3369802 3072093 2599292 1444633 188096 192277 1243257
35491 1243257 1750075 1550098 2118665 3500579 3637300 1782449 150670 692001 2262560
$$ packed form
35555D257532n29895j124727o78026n81882o75284k22307L07757J78712r7328
35546H34552K20408O32825M33700J31039L46488L98369m24051j231046q80973
35537D61311o147P0492m10132k83741L83620O20534M25933N34241Q11622N53754
35527C161487j14759o27703j049654j324254n64903J162385J730675j00260k006549
35518B66465j180510J125958J510876O682k35733J284072J338020j376416l621574
35509h82160k532629K27628J423825O36916m99553j132770j078462J52958K128043
35500a556204K952513J773364K00129k97709m72801j154659j256537M181J050980
35491A243257N06818j99977N68567J381914J36721j854851j631779N41331J570559
$$ plain form
35482 2262560 2622583 1530940 231631 -581942 -648763 501393 2274758 2518244 361527
35473 361527 -1621484 -429416 2933622 4509099 2652503 -142200 -959879 199168
35465 199168 1565024 2244280 2514740 2647204 2712136 3051140 3942233 4912639 5003002 3748347
35455 3748347 1653139 -213460 -945725 -318518 1135446 2505120 3093041 2854911 2420833
35446 2420833 2575392 3488578 4548000 5182595 5601133 6254538 6861999 6755174 6072839
35437 6072839 5643968 5586025 5087669 3886246 2818381 2364874 1826899 768032 120227
35428 120227 655550 1269541 299940 -1883364 -3135788 -2371474 -777234 97315 300124
35419 300124 904300 2220542 3369421 3486235 2780919 2126586 1788584 1110799 -209209
$$ packed form
35482B262560L60023j091643j299309q13573o6821J150156J773365K43486k156717
35473C61527j983011J192068L363038J575477j856596k794703q17679J159047
35465A99168J365856O79256K70460J32464O4932L39004Q91093R70406R0363j254655
35455C748347k095208j866599p32265O27207J453964J369674N87921k38130m34078
35446B420833J54559R13186J059422O34595M18538O53405O07461j06825o82335
35437F072839m28871n7943m98356j201423j067865m53507n37975j058867o47805
35428A20227N35323O13991r69601k183304j252424P64314J594240Q74549K02809
35419C00124O04176J316242J148879J16814p05316o54333l38002o77785j320008
$$ plain form
35410 -209209 -1146829 -596070 728839 1021622 164970 144599 1933897 3616694 3045302
35401 3045302 1094367 396146 1552359 2617565 2170509 928924 -3367 -714061 -1522261
35392 -1522261 -1786164 -749903 1106453 2491568 2833887 2777418 3176569 3926917 3968621
35383 3968621 2579392 570158 -335612 453327 1645788 1905726 1711392 2407252 3859837
35374 3859837 4301205 2614607 -174866 -2015634 -1885735 -520246 571773 657032 332108
35365 332108 364077 308917 -796884 -2459763 -2999320 -2330278 -2606667 -4744062 -6113409
35356 -6113409 -3926818 281574 2220117 424248 -2362383 -3412890 -3011349 -2670687
35348 -2670687 -2720459 -2684131 -2314482 -1382586 121552 1107521 410080 -882590 -232316
$$ packed form
35410b09209r37620N50759J324909K92783q56652k0371J789298J682797n71392
35401C045302j950935o98221J156213J065206m47056j241585r32291p10694q08200
35392a522261k63903J036261J856356J385115L42319n6469L99151P50348M1704
35383C968621j389229k009234r05770P88939J192461K59938j94334O95860J452585
35374C859837M41368j686598k789473j840768J29899J365489J092019Q5259l24924
35365C32108L1969n5160j105801j662879n39557O69042k76389k137395j369347
35356f113409K186591M208392J938543j795869k786631j050507M01541L40662
35348b670687m9772L6328L69649R31896J504138R85969o97441j292670O50274
$$ plain form
35339 -232316 2431671 3887119 2048907 -920021 -1743247 -449250 559037 492131 656937
35330 656937 1481918 1536126 -111553 -2273580 -3066914 -2085466 -687913 -416754 -1198358
35321 -1198358 -1246792 636344 2869491 2619872 -150085 -2033607 -676948 1935759 2515320
35312 2515320 1204414 746508 1781094 1943422 -53247 -2089121 -1601651 866302 2537910
35303 2537910 1930330 252638 -397230 714604 2584693 3783193 3745352 2785738 1327602
35294 1327602 -234136 -1057214 -280509 1667004 3118048 3132207 2516771 2187926 1585136
35285 1585136 -118097 -2049323 -2343521 -550773 1795625 2853950 1926162 -292942
35277 -292942 -2031628 -1576940 901222 3198155 3653188 3071460 3000922 3230767 2687412
$$ packed form
35339b32316K663987J455448j838212k968928q23226J293997J008287o6906J64806
35330F56937Q24981N4208j647679k162027p93334R81448J397553K71159p81604
35321a198358m8434J883136K233147k49619k769957j883522J356659K612707N79561
35312B515320j310906m57906J034586J62328j996669k035874M87470K467953J671608
35303B537910o07580j677692o49868J111834J870089J198500l7841r59614j458136
35294A327602j561738q23078P76705J947513J451044J4159o15436l28845o02790
35285A585136j703233j931226k94198J792748K346398J058325r27788k219104
35277b92942j738686M54688K478162K296933M55033n81728p0538K29845n43355
$$ plain form
35268 2687412 1867325 2230686 3629801 4504610 4447422 4448257 4716813 4558750 4456492 5707057
35258 5707057 7554925 7397333 4823985 2845395 3625751 5334109 5102548 3113861 1558727
35249 1558727 1079308 647116 -436 -141743 183642 214350 -20780 89372 374196 342648
35239 342648 549059 1713141 2885984 2550077 1393983 1672360 3479067 4121820 2247887
35230 2247887 319817 1176378 3771242 4642906 2869203 1141485 1731683 3512439 3951164
35221 3951164 2574753 1033998 469193 373704 106587 171130 1281992 2919185 3706804
35212 3706804 3047752 1700328 722043 417127 504027 843388 1552670 2449765 2743406
35203 2743406 1658394 -474674 -2103044 -1997227 -808178 -266625 -716867 -624955 802647
$$ packed form
35268B687412q20087L63361J399115Q74809n7188Q35K68556j58063j02258J250565
35258E707057J847868j57592k573348j978590P80356J708358k31561j988687j555134
35249A558727m79419m32192o47552j41307L25385L0708k35130J10152K84824l1548
35239C42648K06411J164082J172843l35907j156094K78377J806707O42753j873933
35230B247887j928070Q56561K594864Q71664j773703j727718N90198J780756M38725
35221C951164j376411j540755n64805r5489k67117O4543J110862J637193P87619
35212C706804o59052j347424r78285l04916Q6900L39361P09282Q97095K93641
35203B743406j085012k133068j628370J05817J189049N41553m50242R1912J427602
$$ plain form
35194 802647 1846441 586319 -1931598 -2827450 -1407553 94347 74045 -353031 258293
35185 258293 1208405 1094637 293894 315293 1591687 3400241 5130812 6158959 5378637
35176 5378637 2646594 558 -502640 335023 228002 -749381 -293190 1976921 3391093
35167 3391093 2357332 942659 1435987 2510902 1398531 -1431537 -2649800 -853722
35159 -853722 1585893 1883557 56511 -1861917 -2280288 -1058469 682612 1210203 -179295
35150 -179295 -1748784 -945704 1989922 3672271 1854433 -1518104 -3020535 -2110625 -827447
35141 -827447 -207771 487343 1244777 640957 -1611475 -3551404 -3482309 -2094706 -1055626
35132 -1055626 -798195 -845739 -1224701 -2240223 -3463539 -4000793 -3411877 -1836264 82406
$$ packed form
35194H02647J043794j260122k517917q95852J419897J501900k0302m27076O11324
35185B58293R50112j13768q00743K1399J276394J808554J730571J028147p80322
35176E378637k732043k646036n03198Q37663j07021r77383M56191K270111J414172
35167C391093j033761j414673M93328J074915j112371k830068j218263J796078
35159h53722K439615K97664j827046j918428m18371J221819J741081N27591j389498
35150a79295j569489Q03080K935626J682349j817838l372537j502431R09910J283178
35141h27447O19676O95114P57434o03820k252432j939929O9095J387603J039080
35132a055626K57431m7544l78962j015522j223316n37254N88916J575613J918670
$$ plain form
35123 82406 985205 -287826 -2776743 -3686981 -1723882 1098156 2308839 2305371 3035983
35114 3035983 4583446 5422356 5395550 5807369 6619302 6183784 4310249 3223666 4457355
35105 4457355 6644364 7464171 6295185 4057310 1958009 1360465 3294867 6726933
35097 6726933 8519772 6621055 2645081 178790 1064688 4127678 6815322 7273346
35089 7273346 5550380 3585301 3389258 4688184 5216520 3831908 2100578 1937212 2924706
35080 2924706 3208851 2132643 711639 94071 575547 1632524 2241315 1853693 1460781
35071 1460781 2491609 4195625 3926532 1054361 -1421337 -820003 1545063 2733363
35063 2733363 2457723 2392607 2650778 2042658 1007034 1057668 1660505 893996 -791210
$$ packed form
35123H2406R02799j273031k488917r10238J963099K822038J210683l468P30612
35114C035983J547463Q38910k6806M11819Q11933m35518j873535j086583J233689
35105D457355K187009Q19807j168986k237875k099301n97544J934402L432066
35097F726933J792839j898717l975974k466291Q85898L062990K687644M58024
35089G273346j722966j965079j96043J298926N28336j384612j731330j63366R87494
35080B924706K84145j076208j421004o17568M81476J056977O08791l87622l92912
35071A460781J030828J704016k69093k872171k475698O01334K365066J188300
35063B733363k75640o5116K58171o08120j035624N0634O02837p66509j685206
$$ plain form
35054 -791210 -809736 1151533 2372071 1684694 1435850 3257240 5003549 4197908 2039216
35045 2039216 1318475 2115464 2308648 1267548 422210 650738 1340040 1900655 2379479
35036 2379479 2544729 1830852 303336 -1309328 -2363782 -2279225 -389053 3020060 6030708
35027 6030708 6772205 5540003 4131807 3420841 2838041 2023625 1567938 1883790 2419795
35018 2419795 2378430 1627460 784654 772697 2006963 3537890 3551716 1519563 -695736
35009 -695736 -895999 727262 2088228 2110775 1778906 2252109 3217737 3490703 2381505
35000 2381505 235287 -1683906 -1880443 -78900 2044672 2549388 1599289 1034662 1612457
34991 1612457 2109487 1498470 504442 265659 809036 1822400 3626800 5991687 7018767
$$ packed form
35054g91210j8526J961269J220538o87377k48844J821390J746309q05641k158692
35045B039216p20741P96989J93184j041100q45338K28528O89302N60615M78824
35036B379479J65250p13877j527516j612664j054454Q4557J890172L409113L010648
35027F030708P41497j232202j408196p10966n82800q14416m55687L15852N36005
35018B419795m1365p50970q42806j1957J234266J530927J3826k032153k215299
35009f95736k00263J623261J360966K2547l31869M73203R65628K72966j109198
35000B381505k146218j919193j96537J801543K123572N04716r50099n64627N77795
34991A612457M97030o11017r94028k38783N43377J013364J804400K364887J027080
$$ plain form
34982 7018767 5040491 1294832 -1051542 -703804 465763 312689 -903485 -1625680 -1550746
34973 -1550746 -1683683 -2371924 -2678160 -1783674 5521 1856040 3168384 3504684 2612087
34964 2612087 996790 -149260 -68301 964622 2331339 3545880 3799008 2341959 170019
34955 170019 -95645 2468468 5097205 4759040 2623067 2313661 4067944 4196156 1260879
34946 1260879 -931624 1090830 4902395 5624930 3063704 1512919 3146814 5513196
34938 5513196 5987948 5196370 4794074 4725012 4355112 4155733 4496648 4415514 3276292 2290276
34928 2290276 2695594 3519115 2883156 820573 -779206 -547501 1327984 3857660 5683130
34919 5683130 5293620 2393598 -1009788 -2207465 -626953 1837982 3239762 3321327 2874022
$$ packed form
34982G018767j978276l745659k346374L47738J169567j53074j216174p22195P4934
34973a550746j32937o88241l06236Q94486J789195J850519J312344L36300q92597
34964B612087j615297j146050Q0959J032923J366717J214541K53128j457049k171940
34955A70019k65664K564113K628737l38165k135973l09406J754283J28212k935277
34946A260879k192503K022454L811565P22535k561226j550785J633895K366382
34938E513196M74752p91578m02296o9062l69900j99379L40915q1134j139222r86016
34928B290276M05318Q23521o35959k062583j599779K31705J875485K529676J825470
34919E683130l89510k900022l403386j197677J580512K464935J401780Q1565m47305
$$ plain form
34910 2874022 2409516 1807296 704156 -941175 -2399606 -2565068 -1235611 450729 1463519
34901 1463519 2167943 3288847 4235890 3820105 2397026 1768065 2669042 3701055 3401405
34892 3401405 2362940 2405377 4111252 5959256 5916341 3603918 841712 -29473 1507077
34883 1507077 3639648 4217833 2897824 1047966 47069 191875 842709 1084462 621132
34874 621132 368214 1434796 3138577 3298396 1376962 -224667 435809 1739923 1142112
34865 1142112 -398056 244833 3151320 5025136 4328761 3141590 2982930 2484075 924194
34856 924194 478083 2348143 3778015 2163154 -348291 -3703 2663349 4009171 3154442
34847 3154442 2595542 3375435 3650316 2393966 987329 493179 510284 1328325 3951485
$$ packed form
34910B874022m64506o02220j103140j645331j458431j65462J329457J686340J012790
34901A463519P04424J120904R47043m15785j423079o28961R00977J032013k99650
34892C401405j038465M2437J705875J848004m2915k312423k762206q71185J536550
34883A507077K132571N78185j320009j849858j000897J44806O50834K41753m63330
34874F21132k52918J066582J703781J59819j921434j601629O60476J304114n97811
34865A142112j540168O42889K906487J873816o96375j187171j58660m98855j559881
34856I24194m46111J870060J429872j614861k511445L44588K667052J345822q54729
34847C154442n58900P79893K74881j256350j406637m94150J7105Q18041K623160
$$ plain form
34838 3951485 7077381 7383826 4290941 1435996 1634759 3092412 2677587 540059 -925317
34829 -925317 -843450 -147025 556922 1166764 1115627 170916 -565648 -16808 1323222 2406731
34819 2406731 3052989 3214919 2374790 1072925 1305701 3662187 5780648 5558435 4044462
34810 4044462 2970660 1574630 -1166717 -3155959 -1845842 1000855 1436298 -347573
34802 -347573 -250336 2961534 5593885 4852778 2593865 1502666 1256580 728852 687488
34793 687488 1542419 1135463 -2099160 -5723999 -6172887 -3721799 -1648074 -1364195 -1341681
34784 -1341681 -516157 72005 -560796 -1692086 -2136285 -1796721 -1394714 -1414915 -1564438
34775 -1564438 -913845 1109762 3496355 4203418 2661135 898313 1223576 3502805 5670439
$$ packed form
34838C951485L125896L06445l092885k854945J98763J457653m14825k137528j465376
34829i25317Q1867O96425P03947O09842n1137r44711p36564N48840J340030J083509
34819B406731O46258J61930q40129j301865K32776K356486K118461k22213j513973
34810D044462j073802j396030k741347j989242J310117K846697M35443j783871
34802c47573R7237L211870K632351p41107k258913j091199k46086n27728m1364
34793F87488Q54931m06956l234623l624839m48888K451088K073725K83879K2514
34784a341681Q25524N88162o32801j131290m44199L39564M02007k0201j49523
34775a564438O50593K023607K386593P07063j542283j762822L25263K279229K167634
$$ plain form
34766 5670439 6180309 4985345 2937595 1335481 1292842 2427408 2910451 1828584 529793
34757 529793 512882 1228238 1488392 1755345 2961411 4041025 3086500 584026 -879716
34748 -879716 -182945 1172362 1639311 1375219 1085942 952219 1165218 1969318 2813832
34739 2813832 2906932 2782145 3741600 5586536 6611568 6103176 5055846 4074831 2523761
34730 2523761 400296 -832342 -228256 1355589 2753031 3779603 4332688 3855853 2608024
34721 2608024 1911168 2165816 2102126 959240 -125280 48395 1034459 1977694 3025529
34712 3025529 4297257 4965970 4679059 4416751 4640224 4243666 2852702 2321774 3923527
34703 3923527 5688714 4948856 2278137 373036 -33473 -487437 -1672405 -2623269 -2815609
$$ packed form
34766E670439N09870j194964k047750j602114m2639J134566M83043j081867j298791
34757E29793j6911P15356K60154K66953J206066J079614r54525k502474j463742
34748h79716O96771J355307M66949k64092k89277j33723K12999Q04100Q44514
34739B813832R3100j24787R59455J844936J025032n08392j047330r81015j551070
34730B523761k123465j232638O04086J583845J397442J026572N53085m76835j247829
34721B608024o96856K54648o3690j142886j084520J73675R86064R43235J047835
34712C025529J271728O68713k86911k62308K23473l96558j390964n30928J601753
34703C923527J765187p39858k670719j905101m06509m53964j184968r50864j92340
$$ plain form
34694 -2815609 -2565313 -1539253 650029 2474754 1765758 -802890 -2054455 -604042
34686 -604042 1588333 2485137 2350299 2143657 1982995 2182852 3479977 5057013 4601323
34677 4601323 1681262 -1090855 -1703925 -1328059 -1550240 -1391917 511359 2684551 2652422
34668 2652422 826237 -264016 123422 543272 417242 677166 1323035 1020153 -356510
34659 -356510 -1092285 -258345 1023798 1657708 1991027 2302167 1760989 117765 -1146599
34650 -1146599 -759584 460645 1042896 1153191 1950551 3393709 4259799 4019986 3300054
34641 3300054 2591335 1773433 983712 795884 1231119 1509858 1186693 854079 1335011
34632 1335011 2700015 4412495 5954350 6914522 6868935 5692384 3873676 2193570 1179234
$$ packed form
34694b815609K50296J026060K189282J824725p08996k568648j251565J450413
34686f04042K192375Q96804j34838k06642j60662J99857J297125J577036m55690
34677D601323k920061k772117o13070L75866k22181J58323J903276K173192l2129
34668B652422j826185j090253L87438M19850j26030K59924O45869l02882j376663
34659c56510p35775Q33940J282143O33910L33319L11140n41178j643224j264364
34650a146599L87015J220229N82251J10295P97360J443158Q66090k39813p19932
34641C300054p08719q17902p89721j87828M35235K78739l23165l32614M80932
34632A335011J365004J712480J541855R60172m5587j176551j818708j680106j014336
$$ plain form
34623 1179234 1054434 1902474 3379395 4404236 3843445 1834090 -33977 -343126 572645
34614 572645 1150402 523246 -683574 -1442351 -1465218 -1043034 -511887 -356185 -1123548 -2494614
34604 -2494614 -3015379 -1708726 455056 1821964 2485818 3913852 5961097 6137451 3051476
34595 3051476 -829661 -1750742 532701 2501436 1604256 -636686 -1134146 696874 2887689
34586 2887689 4011738 4445745 4638720 4023676 2413555 1051826 1055678 1704760 1621639
34577 1621639 1049803 1354098 2457067 2652861 1454920 790141 2159301 4057166 3944537
34568 3944537 1952054 677296 1502804 3033563 3543764 3226739 3110443 3033628 1974226
34559 1974226 -131225 -1927198 -1988197 -235178 1866118 2487695 1278302 6762 659722
$$ packed form
34623A179234j24800Q48040J476921J024841n60791k009355j868067l09149R15771
34614E72645N77757o27156j206820p58777k2867M22184N31147J55702p67363j371066
34604b494614n20765J306653K163782J366908O63854J428034K047245J76354l085975
34595C051476l881137r21081K283443J968735q97180k240942m97460J831020K190815
34586B887689J124049M34007J92975o15044j610121j361729L852O49082q3121
34577A621639n71836L04295J102969J95794j197941o64779J369160J897865j12629
34568C944537j992483j274758Q25508J530759N10201l17025j16296p6815j059402
34559A974226k105451j795973o0999J753019K101296O21577j209393j271540O52960
$$ plain form
34550 659722 2883547 4300684 3539021 1717732 464768 -130649 -667007 -884258 -363999
34541 -363999 203179 34562 -79070 1272951 3825212 5760430 5899065 4442381 1983875
34532 1983875 -574919 -1518640 170421 2695783 3002767 913556 -498462 515788
34524 515788 1793297 801478 -1281920 -1254340 1595949 4924936 6594200 6373094 4775722
34515 4775722 2352555 257588 -334499 221746 482849 118100 242506 1334301 2377945
34506 2377945 2533009 2135281 1434771 -59123 -2011171 -2588663 -835810 1383108 1554638
34497 1554638 55072 -280669 1900319 4620098 5142145 3123620 480846 -968663
34489 -968663 -849575 217306 1395826 1993836 1791216 1268528 1133780 1456870 1622479
$$ packed form
34550F59722K223825J417137p61663j821289j252964n95417n36358k17251N20259
34541c63999N67178j68617j13632J352021K552261J935218J38635j456684k458506
34532A983875k558794r43721J689061K525362L06984k089211j412018J014250
34524E15788J277509r91819k083398K7580K850289L328987J669264k21106j597372
34515D775722k423167k094967n92087N56245K61103l64749J24406J091795J043644
34506B377945J55064l97728p00510j493894j952048n77492J752853K218918J71530
34497A554638j499566l35741K180988K719779N22047k018525k642774j449509
34489i68663J19088J066881J178520N98010k02620n22688j34748L23090J65609
$$ plain form
34480 1622479 1344549 1312567 2345779 4120516 5373150 5405772 4729625 4008773 3142746
34471 3142746 1936153 931125 662003 606983 37013 -389985 672111 2833511 3828106
34462 3828106 2523400 698821 664017 2134613 2931806 2193587 1275661 1497509 2455556
34453 2455556 2977760 2671284 1964077 1318592 914492 704521 513203 380536 742680
34444 742680 1744823 2562603 2273368 1359010 1250097 2205663 2955200 2972667 3601694 5695637
34434 5695637 7379009 6065496 2305908 -337069 380540 2762611 3637722 2222397
34426 2222397 436874 66489 826965 1243096 582448 -485888 -888763 -437026 110663
34417 110663 222864 319006 903293 1536524 1587860 1633317 2725572 4264871 4374724 3029029
$$ packed form
34480A622479k77930l1982J033212J774737J252634L2622o76147p20852q66027
34471C142746j206593j005028k69122n5020n69970m26998J062096K161400R94595
34462C828106j304706j824579l4804J470596P97193p38219r17926K21848R58047
34453B455556N22204l06476p07207o45485m04100k09971j91318j32667L62144
34444G42680J002143Q17780k89235r14358j08913R55566P49537J7467O29027K093943
34434E695637J683372j313513l759588k642977P17609K382071Q75111j415325
34426B222397j785523l70385P60476M16131o60648j068336m02875M51737N47689
34417A10663J12201R6142N84287O33231N1336M5457J092255J539299J09853j345695
$$ plain form
34407 3029029 2800324 4983899 6835416 5149258 1386887 39805 2106520 3770190
34399 3770190 2492952 840299 2036995 4771600 5699529 4968513 5223136 6157297 4620576
34390 4620576 569588 -1567557 662248 3674850 3078867 119929 -633250 1799848
34382 1799848 4206623 4806338 5315271 6701988 6676693 3479141 -425810 -1072669 1828318
34373 1828318 4752224 4840443 2534763 -75190 -1642125 -1926821 -1286685 -562512 -556897
34364 -556897 -941753 -361562 1746154 4051834 4809824 3944303 2745463 1842427 741267
34355 741267 -535910 -845055 251848 1340526 1162077 787573 2002630 4108232 4579706
34346 4579706 2946903 1502852 1439846 991953 -973658 -2149030 -226958 2803740 3120382
$$ packed form
34407C029029k28705K183575J851517j686158l762371j347082K066715J663670
34399C770190j277238j652653J196696K734605R27929p31016K54623R34161j536721
34390D620576m050988k137145K229805L012602n95983k958938p53179K433098
34382A799848K406775N99715N08933J386717k5295l197552l904951o46859K900987
34373A828318K923906Q8219k305680k609953j566935k84696O40136P24173N615
34364e56897l84856N80191K107716K305680P57990q65521j198840r03036j101160
34355G41267j277177l09145J096903J088678j78449l74504J215057K105602M71474
34346D579706j632803j444051o3006m47893j965611j175372J922072L030698L16642
$$ plain form
34337 3120382 735847 -819839 -33379 1123609 1473747 2408864 4248924 4673976 2842122
34328 2842122 1720487 3648103 6349575 6386239 4294571 2998908 2964831 2533600 1762940
34319 1762940 2121379 3053685 2654890 1557923 2378483 5048494 6408731 5089785 3180812
34310 3180812 2121992 730093 -1158024 -932866 2400517 5356926 4608482 1993950
34302 1993950 1560640 3518341 4748702 4134184 3577472 3946739 3566989 1451175 -779233
34293 -779233 -1356444 -776541 -573479 -999486 -975808 342523 2594695 4483288 4923576
34284 4923576 4160339 3307896 2482554 517254 -2523486 -3947767 -1478219 3074032 5378358
34275 5378358 3726073 667352 -542904 738611 2992459 4445977 4019406 1894570
$$ packed form
34337C120382k384535j555686P86460J156988L50138R35117J840060M25052j831854
34328B842122j121635J927616K701472L6664k091668j295663l4077m31231p70660
34319A762940L58439R32306l98795j096967Q20560K670011J360237j318946j908973
34310C180812j058820j391899j888117K25158L333383K956409p48444k614532
34302A993950m33310J957701J230361o14518n56712L69267l79750k115814k230408
34293g79233n77211N79903K03062m26007K3678J318331K252172J888593M40288
34284D923576p63237q52443q25342j965300l040740j424281K469548M552251K304326
34275E378358j652285l058721j210256J281515K253848J453518m26571k124836
$$ plain form
34267 1894570 -337595 -1265267 -1445102 -2219725 -3023915 -1980296 671624 2226441 1435085
34258 1435085 437257 1470175 3732294 5160570 5526670 5836547 6051044 5474648 4475869
34249 4475869 3872009 3293007 2007963 821316 1234996 2951163 3987510 3330669 1984493
34240 1984493 1266509 1375040 1828857 2213492 2260484 1983981 1779888 1813530 1683022 1378089
34230 1378089 1821931 3323655 4292993 3149935 1033852 664627 2531417 4216526 3929908
34221 3929908 2809150 2825409 3950740 4571922 3761374 2165666 1250006 2194897 4801352
34212 4801352 7122700 7132505 5170503 3684513 4118575 5307822 5569454 4974579 4557557
34203 4557557 4558005 4691825 5118033 5824799 5936890 4923611 3659953 3030205 2452925 1219473
$$ packed form
34267A894570k232165r27672j79835p74623q04190J043619K651920J554817p91356
34258A435085r97828J032918K262119J428276L66100L09877K14497n76396r98779
34249D475869o03860n79002j285044j186647M13680J716167J036347o56841j346176
34240A984493p17984J08531M53817L84635M6992k76503k04093L3642j30508l04933
34230A378089M43842J501724R69338j143058k116083l69225J866790J685109k86618
34221C929908j120758J6259J125331O21182q10548j595708r15660R44891K606455
34212D801352K321348R805j962002j485990M34062J189247K61632n94875m17022
34203D557557M48J33820M26208P06766J12091j013279j263658o29748n77280j233452
$$ plain form
34193 1219473 169281 207654 266738 -936385 -2021943 -710203 1976979 2638008 906436
34184 906436 326000 2665902 5027517 4756840 3849857 5335218 7989061 8533413 7290529
34175 7290529 7342663 8899581 8970463 6788977 5216422 5729583 6065149 4615714 3526835
34166 3526835 4973524 7364517 8090031 7638861 7925531 8459284 7534321 5941265 6020996
34157 6020996 7611219 8257511 7416566 7330069 9206549 11205685 11086764 8873744 6222165
34148 6222165 4790194 5545251 7977557 9850193 9516847 8423505 9208838 11505550 12373519
34139 12373519 11124215 10504078 12130811 14044103 14485367 14995329 17330857 19909986
34131 19909986 20224931 18864464 18165096 18370107 18212813 18207801 20098474 23507332 26227959
$$ packed form
34193A219473j050192L8373N9084j203123j085558J311740K687182O61029j731572
34184I06436n80436K339902K361615k70677r06983J485361K653843N44352j242884
34175G290529N2134J556918P0882k181486j572555N13161L35566j449435j088879
34166C526835J446689K390993P25514m51170K86670N33753r24963j593056P9731
34157F020996J590223O46292q40945q6497J876480J999136j18921k213020k651579
34148F222165j431971P55057K432306J872636l33346j093342P85333K296712Q67969
34139A2373519j249304o20137J626733J913292M41264N09962K335528K579129
34131A9909986L14945j360467o99368K05011j57294n012J890673L408858K720627
$$ plain form
34122 26227959 27798205 29904227 33008450 35397155 36305857 37518220 40730720 45195601
34114 45195601 49148680 52258159 55713153 60830803 68115715 76825746 85316324 92894656
34106 92894656 101307830 113009038 127935292 143686535 159173930 176246577 196973842
34099 196973842 220899837 245772212 269346302 289277708 302600593 306967281 302082274
34092 302082274 289159271 269648693 245298199 218709313 192671913 168942126 148026972
34085 148026972 129780359 113868389 100113487 88719011 79783419 72544590 65773968
34078 65773968 59075208 53085510 48195417 43791465 39050520 33944789 29312182 26283365
34070 26283365 25307235 25137101 23446019 19540604 15748140 14555289 15040673 14257100 11758601
$$ packed form
34122B6227959J570246K106022L104223K388705R08702J212363L212500M464881
34114D5195601L953079L109479L454994N117650P284912Q710031Q490578P578332
34106I2894656Q413174J1701208J4926254J5751243J5487395J7072647K0727265
34099A96973842K3925995K4872375K3574090J9931406J3322885M366688m885007
34092C02082274j2923003j9510578k4350494k6588886k6037400k3729787k0915154
34085A48026972j8246613j5911970j3754902j1394476q935592p238829o770622
34078F5773968o698760n989698m890093m403952m740945n105731m632607l028817
34070B6283365r76130j70134j691082l905415l792464j192851M85384p83573k498499
$$ plain form
34061 11758601 10069938 10410785 10923687 10218067 9801090 11124412 12588346 11837815 9372783
34052 9372783 7502948 6907154 6510781 5890310 5593935 5666224 5827077 6541975 7991034
34043 7991034 8607211 6832520 4003497 3184277 4991839 6732777 6198186 4412869 3743390
34034 3743390 4727560 5867308 5758074 4478437 3106888 2376197 1924411 995954 -216980
34025 -216980 -622293 148322 1108494 1459749 1709678 2470530 3322288 3917812 4929149
34016 4929149 6495201 7024285 5325287 2782766 1386149 716400 -664051 -1822970
34008 -1822970 -577088 2296759 3323908 1348057 -797705 -635229 803487 1546790
34000 1546790 1731533 2197574 2285955 1301713 523476 1374224 2677078 2099772 -207109
$$ packed form
34061A1758601j688663L40847N12902p05620m16977J323322J463934p50531k465032
34052I372783j869835n95794l96373o20471k96375P2289J60853P14898J449059
34043G991034O16177j774691k829023q19220J807562J740938n34591j785317o69479
34034C743390R84170J139748j09234j279637j371549p30691m51786r28457j212934
34025b16980m05313P70615R60172L51255K49929P60852Q51758N95524J011337
34016D929149J566052N29084j698998k542521j396617o69749j380451j158919
34008a822970J245882K873847J027149j975851k145762J62476J438716P43303
34000A546790J84743M66041Q8381r84242p78237Q50748J302854n77306k306881
$$ plain form
33991 -207109 -1642231 -841769 542499 274652 -1513338 -2565362 -1242884 1511988 3112986
33982 3112986 2208470 196584 -614062 210954 1343133 2055318 2680450 2702795 684828
33973 684828 -2907481 -4850115 -2852009 1205310 3463955 2620902 564797 -814635
33965 -814635 -1525740 -2201796 -2572639 -1860232 -45930 1689190 1828881 67100 -2119580
33956 -2119580 -3074702 -2922929 -2824694 -2565917 -846220 1743624 2515500 662827 -959324
33947 -959324 77566 2084078 2093874 499780 -182617 198327 -320187 -1734609 -1928396
33938 -1928396 -720625 -466685 -1846144 -2445436 -925592 456114 -556968 -2605038
33930 -2605038 -3022926 -1948100 -1641516 -2764660 -3639127 -2860092 -933286 580276 476852
$$ packed form
33991b07109j435122Q00462J384268k67847j787990j052024J322478K754872J600998
33982C112986r04516k011886q10646Q25016J132179P12185O25132K2345k017967
33973F84828l592309j942634J998106M057319K258645q43053k056105j379432
33965h14635p11105o76056l70843P12407J814302J735120J39691j761781k186680
33956b119580r55122J51773R8235K58777J719697K589844P71876j852673j622151
33947i59324J036890K006512R796j594094o82397L80944n18514j414422j93787
33938a928396J207771K53940j379459n99292J519844J381706j013082k048070
33930b605038m17888J074826L06584j123144q74467P79035J926806J513562j03424
$$ plain form
33921 476852 -1180191 -2755877 -2289947 172283 2337016 2548525 1784101 1685299 1933085
33912 1933085 1295136 302195 750530 2804959 4550537 4597673 3529038 2479158 1732192
33903 1732192 1202052 1090787 1442680 1844816 2027072 2169210 2410221 2648418 2857250
33894 2857250 2915549 2246112 585180 -908031 -518933 1694747 3559807 3358141 1805502
33885 1805502 791606 1015268 1768164 2429379 3080718 3801234 4262216 4146397 3396060
33876 3396060 1979928 -48873 -2085814 -3020394 -2157561 -45370 1860610 2469019 1922048
33867 1922048 1111681 473823 -366489 -1644767 -2642218 -2339174 -709632 1152583 2178411
33858 2178411 2169962 1562824 841873 239528 -393921 -1383942 -2461389 -2415296 -328800 2798021
$$ packed form
33921D76852j657043j575686M65930K462230K164733K11509p64424r8802K47786
33912A933085o37949r92941M48335K054429J745578M7136j068635j049880p46966
33903A732192n30140j11265L51893M02136J82256J42138K41011K38197K08832
33894B857250N8299o69437j660932j493211L89098K213680J865060k01666j552639
33885A805502j013896K23662P52896O61215O51339P20516M60982j15819p50337
33876C396060j416132k028801k036941r34580Q62833K112191J905980O08409n46971
33867A922048q10367o37858q40312j278278r97451L03044J629542J862215J025828
33858B178411q449o07138p20951o02345o33449r90021j077447M6093K086496L126821
$$ plain form
33848 2798021 4608988 3948846 2036567 615958 -164940 -1209026 -2542795 -3131506 -2471023
33839 -2471023 -1334531 -741723 -859619 -1099280 -791651 327452 1810690 2596824 1940524
33830 1940524 400237 -614222 -546655 -497018 -1880902 -4474394 -6239251 -5260834 -1772855
33821 -1772855 1887855 3479052 2986206 2332178 2944601 4137449 4353247 3526494 3231882
33812 3231882 4342030 5484846 4601022 1699669 -756283 -429195 2369949 5055924
33804 5055924 5438268 3628667 1370274 66513 -145713 181123 546313 670449 595421
33795 595421 769050 1466103 2069555 1714689 809043 852659 2268207 3626278 3903633
33786 3903633 4173225 5547484 6630354 5274294 2372966 1280792 3090851 5013797
$$ packed form
33848B798021J810967o60142j912279j420609p80898j044086j333769n88711O60483
33839b471023J136492N92808j17896k39661L07629J119103J483238P86134o56300
33830A940524j540287j014459O7567M9637j383884k593492j764857R78417L487979
33821a772855L660710J591197m92846o54028O12423J192848K15798q26753k94612
33812C231882J110148J142816q83824k901353k455952L27088K799144K685975
33804E055924L82344j809601k258393j303761k12226L26836L65190J24136p5028
33795E95421J73629O97053O03452l54866r05646M3616J415548J358071K77355
33786C903633K69592J374259J082870j356060k901328j092174J810059J922946
$$ plain form
33778 5013797 4493218 2658166 2050941 2775807 3040077 2357006 1917122 2200481 2259111
33769 2259111 1438793 246586 -660815 -1167791 -1373574 -1606072 -2537750 -4180610 -5143988
33760 -5143988 -4235332 -2436634 -1727305 -2264631 -2622634 -2677644 -3871022 -6091828 -6798158
33751 -6798158 -4600157 -1711429 -1060724 -2402411 -3180547 -2277176 -999353 -827530 -1834958
33742 -1834958 -3154189 -3758020 -3006581 -1420788 -483792 -760509 -956380 53637 1244191
33733 1244191 1015076 -212789 -938393 -1331820 -2604007 -3992383 -3236791 -461411 1276165
33724 1276165 396294 -860116 -123553 1367838 897951 -1538052 -3568184 -3927197 -3308006
33715 -3308006 -2389062 -1244901 -431325 -564217 -818599 267282 2352562 3415087 2593322
$$ packed form
33778E013797n20579j835052o07225P24866K64270o83071m39884K83359N8630
33769B259111q20318j192207r07401n06976k05783k32498r31678j642860r63378
33760e143988R08656J798698P09329n37326l58003n5010j193378k220806p06330
33751f798158K198001K888728O50705j341687p78136R03371J277823J71823j007428
33742a834958j319231o03831P51439J585793R36996k76717j95871J010017J190554
33733A244191k29115j227865p25604l93427j272187j388376P55592K775380J737576
33724A276165q79871j256410P36563J491391m69887k436003k030132l59013O19191
33715c308006R18944J144161Q13576j32892k54382J085881K085280J062525q21765
$$ plain form
33706 2593322 1298727 1101864 1946731 2875916 3222288 2735461 1789788 1661159 3134448
33697 3134448 4644941 3612775 144446 -2550904 -2342561 -796021 -310155 -635456 -208816
33688 -208816 658328 462788 -459811 -232312 1304401 2021578 686812 -1239700 -1793220
33679 -1793220 -977935 -141829 -50184 -614461 -1768243 -3482843 -5056909 -5232304 -3395783
33670 -3395783 -497995 1603373 2003203 1651462 1769971 1752463 57836 -2683825 -3495056
33661 -3495056 -1128352 1612012 1548325 -484385 -1460954 -1125945 -1857247 -3929334 -4507006
33652 -4507006 -2163136 759172 1749704 1510120 1984046 3090445 3335699 2212837 338111
33643 338111 -1599362 -2732652 -2202877 -673281 -212493 -1453083 -2451401 -1620510 55204
$$ packed form
33706B593322j294595j96863Q44867R29185L46372m86827r45673j28629J473289
33697C134448J510493j032166l468329k695350K08343J546540M85866l25301M26640
33688b08816Q67144j95540r22599K27499J536713P17177j334766j926512n53520
33679a793220Q15285Q36106R1645n64277j153782j714600j574066j75395J836521
33670c395783K897788K101368L99830l51741J18509j7508j694627k741661q11231
33661c495056K366704K740364o3687k032710r76569L35009p31302k072087n77672
33652d507006K343870K922308R90532k39584M73926J106399K45254j122862j874726
33643C38111j937473j133290N29775J529596M60788j240590r98318Q30891J675714
$$ plain form
33634 55204 1198727 2290630 3755536 3975438 1859042 -405485 -208672 1217053 651105
33625 651105 -1906137 -3289026 -2066746 -84294 930631 1213890 1152755 486950 -318710
33616 -318710 -505155 -945100 -2904269 -4947521 -4353158 -1845985 -1241954 -3588274 -5487210
33607 -5487210 -4598302 -2906708 -2524204 -2083338 -101623 1469451 456806 -1488562 -1649692
33598 -1649692 -809628 -1278139 -2199293 -978035 1748842 2826617 1858627 1629303 3029022
33589 3029022 3526242 1638982 -598813 -1114165 -814804 -1364082 -2259489 -2078330 -1004102
33580 -1004102 -264314 -102922 155506 743632 1375369 1988951 2583230 2692926 1786495
33571 1786495 21260 -1732805 -2434080 -1522110 470403 2133120 2641785 2685925 3128199
$$ packed form
33634E5204J143523J091903J464906K19902k116396k264527J96813J425725n65948
33625F51105k557242j382889J222280J982452J014925K83259o1135o65805q05660
33616c18710j86445m39945j959169k043252N94363K507173O04031k346320j898936
33607e487210Q88908J691594L82504M40866J981715J571074j012645j945368j61130
33598a649692Q40064m68511r21154J221258K726877J077775r67990k29324J399719
33589C029022M97220j887260k237795n15352K99361n49278q95407J81159J074228
33580a004102P39788J61392K58428N88126O31737O13582N94279J09696r06431
33571A786495j765235j754065p01275R11970J992513J662717N08665M4140M42274
$$ plain form
33562 3128199 3302037 1982416 -291266 -1513793 -892698 347691 985669 975346 375482
33553 375482 -998741 -2259983 -1712801 578958 2237053 1751544 515667 270778 316812
33544 316812 -639167 -1283987 822412 4908985 6938925 4599221 222152 -2371662 -2312355
33535 -2312355 -1571587 -1630365 -2113679 -2428794 -2914734 -3742538 -3958039 -2728697 -909057
33526 -909057 -122120 -418700 -162014 1391908 2691381 2052093 339323 134042 2480035
33517 2480035 5688254 7443886 7085610 5630381 4449838 4204259 4415153 3956366 2548160
33508 2548160 1551607 2325302 4017566 4422724 3184894 2431405 3437973 4333154 2640998
33499 2640998 -961143 -3279177 -2708417 -1000867 -615581 -1648294 -2203521 -1135098 517516
$$ packed form
33562C128199J73838j319621k273682j222527O21095J240389O37978j0323n99864
33553C75482j374223j261242N47182K291759J658095m85509j235877k44889M6034
33544C16812r55979o44820K106399M086573K029940k339704m377069k593814N9307
33535b312355P40768n8778m83314l15115m85940q27804k15501J229342J819640
33526i09057P86937k96580K56686J553922J299473o39288j712770k05281K345993
33517B480035L208219J755632l58276j455229j180543k45579K10894m58787j408206
33508B548160r96553P73695J692264M05158j237830p53489J006568Q95181j692156
33499B640998l602141k318034N70760J707550L85286j032713n55227J068423J652614
$$ plain form
33490 517516 919398 -218724 -1143194 -23576 2902831 5542415 6104078 4510083 1856206
33481 1856206 -608431 -1806485 -1235745 239933 771282 -431911 -1936576 -1849474 -353550
33472 -353550 572952 -95316 -1062503 -512521 1485096 3074007 2877969 1524199 698096
33463 698096 1065414 1664150 1412168 596240 306735 784329 1195373 1016743 695429 655365
33453 655365 578136 224125 126353 636722 917471 -59987 -1781580 -2517359 -1436734 506719
33443 506719 2005432 2858652 3555431 4090553 3924026 2857971 1297492 -339024 -1921751
33434 -1921751 -3247183 -3952921 -4087147 -4225294 -4505285 -4049049 -2204161 -60901 504220
33425 504220 -514328 -900048 762317 2930077 3095463 963061 -1715445 -3606286 -4346246
$$ packed form
33490E17516M01882j138122r24470J119618K926407K639584N61663j593995k653877
33481A856206k464637j198054N70740J475678N31349j203193j504665Q7102J495924
33472c53550R26502o68268r67187N49982J997617J588911j96038j353770q26103
33463F98096L67318N98736k51982q15928k89505M77594M11044j78630l21314m0064
33453F55365p7229l54011r7772N10369K80749r77458j721593p35779J080625J943453
33443E06719J498713Q53220O96779N35122j66527j066055j560479j636516j582727
33434a921751j325432p05738j34226j38147k79991M56236J844888K143260N65121
33425E04220j018548l85720J662365K167760J65386k132402k678506j890841p39960
$$ plain form
33416 -4346246 -3284650 -16579 3652367 4637116 2443358 224762 698160 2568699
33408 2568699 2599841 69202 -2653902 -3376789 -2211337 -607946 245913 -59800 -1042365
33399 -1042365 -1441785 -329665 1628119 2673229 1911412 233601 -832259 -673386 154330
33390 154330 757930 687414 65258 -776880 -1596282 -2131543 -2027984 -1303250 -679397 -812177
33380 -812177 -1277308 -1103480 -304822 100168 -228796 -394682 156234 656000 357086 -192848
33370 -192848 -129674 391588 842004 1424755 2332520 2611448 1195312 -1203095 -2534649
33361 -2534649 -1811422 -175577 453231 -774411 -2911592 -3852870 -2204810 915366 2647679
33352 2647679 1633875 -407348 -1212467 -861921 -679704 -424480 1163345 3403660 3718309
$$ packed form
33416d346246J061596L268071L668946R84749k193758k218596M73398J870539
33408B568699L1142k530639k723104p22887J165452J603391Q53859l05713r82565
33399a042365l99420J112120J957784J045110p61817j677811j065860J58873Q27716
33390A54330O03600p0516o22156q42138q19402n35261J03559P24734O23853j32780
33380h12177m65131J73828P98658M04990l28964j65886N50916M99766k98914n49934
33370a92848O3174N21262M50416N82751R07765K78928j416136k398407j331554
33361b534649P23227J635845O28808j227642k137181r41278J648060L120176J732313
33352B647679j013804k041223q05119L50546J82217K55224J587825K240315L14649
$$ plain form
33343 3718309 1192010 -1755809 -2133347 383262 3619165 5296998 4672408 2588239
33335 2588239 485471 -943264 -2083401 -3084570 -3014645 -1392601 280943 277796 -568268
33326 -568268 21055 1922624 2327526 -119920 -3264708 -4578728 -4185170 -3370200 -2154260
33317 -2154260 -254018 1186068 1050625 366992 806789 1885047 1831460 610126 -326941
33308 -326941 -947972 -2551588 -4475989 -3862397 -54616 3323734 2931268 607452 929414
33299 929414 4641317 7575502 6522699 3312046 1554086 1614612 1255460 -52863 -495994
33290 -495994 400483 383193 -1978440 -4507943 -4098077 -987572 1555292 1310579 -799986
33281 -799986 -2498746 -2513230 -1039498 890388 2138736 2320327 2100425 2175854 2261436
$$ packed form
33343C718309k526299k947819l77538K516609L235903J677833o24590k084169
33335B588239k102768j428735j140137j001169O9925J622044J673544l147q46064
33326e68268N89323J901569M04902k447446l144788j314020L93558Q14970J215940
33317b154260J900242J440086j35443o83633M39797J078258n3587j221334r37067
33308c26941o21031j603616j924401O13592L807781L378350l92466k323816L21962
33299I29414L711903K934185j052803l210653j757960O0526l59152j308323m43131
33290d95994Q96477j7290k361633k529503M09866L110505K542864k44713k110565
33281g99986j698760j4484J473732J929886J248348J81591k19902P5429Q5582
$$ plain form
33272 2261436 1757631 946508 572870 627936 565502 330833 109226 -433812 -1391131 -1674637
33262 -1674637 -447965 942266 378109 -1815926 -3090908 -2251407 -754250 -55659 191115
33253 191115 542964 454153 -274989 -452725 737954 2149013 2054645 285835 -1795581
33244 -1795581 -2644594 -1524538 763817 2049882 1072077 -561958 -548403 385075 -255632
33235 -255632 -1830308 -830763 2885617 4444989 1017997 -3394483 -3711709 -1007991 175812
33226 175812 -862627 -1149366 141390 954022 713166 768474 774059 -839117 -2739791
33217 -2739791 -1657306 1988375 3939535 2555722 981348 1512800 2289122 1595022 1138418
33208 1138418 2326545 3088996 1570649 -251343 17292 1004394 338555 -932529 -574372
$$ packed form
33272B261436n03805q11123l73638N5066o2434k34669k21607n43038r57319k83506
33262a674637J226672J390231n64157k194035j274982Q39501J497157O98591K46774
33253A91115L51849q8811p29142j77736J190679J411059r4368j768810k081416
33244a795581q49013J120056K288355J286065r77805j634035J3555R33478o40707
33235b55632j574676R99545L716380J559372l426992m412480l17226K703718J183803
33226A75812j038439k86739J290756Q12632k40856N5308N585j613176j900674
33217b739791J082485L645681J951160j383813j574374N31452P76322o94100m56604
33208A138418J188127P62451j518347j821992K68635R87102o65839j271084L58157
$$ plain form
33199 -574372 240072 -1178005 -3833097 -4060537 -1287004 1235433 1534858 1079841 1368558
33190 1368558 1752665 1548671 1376133 1307724 224170 -1843908 -2985424 -2216924 -1039476
33181 -1039476 -1015807 -1632282 -1792106 -1676500 -1703654 -1169091 485920 2209354 2686791
33172 2686791 2238992 1881114 1292469 -567576 -3156717 -4370222 -3176599 -1041559 -163717
33163 -163717 -970827 -1952450 -1718237 -671777 -410635 -1702137 -3572418 -4573096 -4379111
33154 -4379111 -3650407 -2892855 -2264571 -2042921 -2228310 -1996540 -768330 399266 1526
33145 1526 -1318061 -1177927 1017817 2839749 2177684 135489 -904727 -675271 -545269
33136 -545269 -609497 476216 2901601 4965611 5289880 4248655 2862521 1691161 1227576
$$ packed form
33199e74372Q14444j418077k655092k27440K773533K522437K99425m55017K88717
33190A368558L84107k03994j72538o8409j083554k068078j141516P68500J177448
33181a039476K3669o16475j59824J15606k7154N34563J655011J723434M77437
33172B686791m47799l57878n88645j860045k589141j213505J193623K135040Q77842
33163a63717q07110r81623K34213J046460K61142j291502j870281j000678J93985
33154d379111P28704P57552O28284K21650j85389K31770J228210J167596l97740
33145A526j319587J40134K195744J821932o62065k042195j040216K29456J30002
33136e45269o4228J085713K425385K064010L24269j041225j386134j171360m63585
$$ plain form
33127 1227576 1936303 3189547 3402299 2072976 648266 480695 963853 825146 355456
33118 355456 845916 2267027 3142666 2795721 2221332 2292812 2415479 1739919 710159
33109 710159 427026 1089211 1996404 2681338 3176376 3524084 3910921 4909118 6513946
33100 6513946 7252607 5667353 2777883 1559901 3434489 6583675 8382971 8101078
33092 8101078 6335258 3471903 344249 -989380 607299 3160864 3909394 3370623
33084 3370623 4371513 6977266 7632952 4546722 880312 373164 2187543 2958013 2268775
33075 2268775 2618931 4505136 5135676 2787296 -448370 -1697476 -1026553 -516585 -1046811
33066 -1046811 -1731786 -1820507 -1569174 -1327438 -870709 96424 1221858 1500151 148925
$$ packed form
33127A227576P08727J253244K12752j329323j424710j67571M83158j38707m69690
33118C55456M90460J421111Q75639l46945n74389P1480J22667o75560j029760
33109G10159k83133O62185R07193O84934M95038L47708L86837R98197J604828
33100F513946P38661j585254k889470j217982J874588L149186J799296k81893
33092H101078j765820k863355l127654j333629J596679K553565P48530n38771
33084C370623J000890K605753O55686l086230l666410n07148J814379P70470o89238
33075B268775L50156J886205O30540k348380l235666j249106O70923N09968n30226
33066a046811o84975q8721K51333K41736M56729R67133J125434K78293j351226
$$ plain form
33057 148925 -2214884 -3583578 -2520990 -24278 1479135 955948 -468382 -1480000
33049 -1480000 -1791885 -1138952 1046749 3964013 5148216 3368189 576359 -654422
33041 -654422 -578563 -1302411 -3165795 -4278053 -3475871 -1691807 -164766 911808 1581798
33032 1581798 1628626 1425446 1808679 2524722 2229260 715042 -286572 541687 2180139
33023 2180139 2744856 1838264 352015 -1098431 -2273555 -2578077 -1602044 -57448 939323
33014 939323 1232921 1322227 1133690 276203 -726952 -698931 630962 2281183 3224673
33005 3224673 3077977 1805119 -85042 -1075318 242648 3183825 5279628 5108262 3768179
32996 3768179 2974285 2863382 2603879 2124811 1927080 1818290 1281146 883832 1891412
$$ packed form
33057A48925k363809j368694J062588K496712J503413n23187j424330j011618
33049a480000l11885O52933K185701K917264J184203j780027k791830j230781
33041f54422P5859p23848j863384j112258Q02182J784064J527041J076574O69990
33032A581798M6828k03180L83233P16043k95462j514218j001614Q28259J638452
33023B180139N64717r06592j486249j450446j175124l04522R76033J544596R96771
33014I39323K93598Q9306j88537q57487j003155K8021J329893J650221R43490
33005C224673j46696j272858j890161r90276J317966K941177K095803j71366j340083
32996C768179p93894j10903k59503m79068j97731j08790n37144l97314J007580
$$ plain form
32987 1891412 4243284 6091662 5844378 3882969 1873225 1084649 1713970 3038595 3696958
32978 3696958 2558000 16026 -2118822 -2645946 -2270130 -2145364 -1917436 -457448 1942788
32969 1942788 3655909 3980405 3769633 3558171 2772297 1536079 1503943 3438490 5260811
32960 5260811 4377041 1220100 -1478695 -2574879 -3453211 -4835040 -4983845 -2402871 1275583
32951 1275583 2868634 1489886 -659389 -1159871 195440 1941573 2866660 2889302 2510661
32942 2510661 1925272 769339 -1264726 -3625132 -4990030 -4409545 -2300216 -176238
32934 -176238 586961 -184669 -1365224 -1503349 -249565 1095406 774610 -1566854 -4465536
32925 -4465536 -6103261 -5902374 -4728785 -3936234 -4211720 -4929440 -4636707 -2588755 303241
$$ packed form
32987A891412K351872J848378k47284j961409k009744p88576O29321J324625O58363
32978C696958j138958k541974k134848n27124L75816J24766K27928J459988K400236
32969A942788J713121L24496k10772k11462p85874j236218l2136J934547J822321
32960E260811q83770l156941k698795j096184q78332j381829j48805K580974L678454
32951A275583J593051j378748k149275n00482J355311J746133R25087K2642l78641
32942B510661n85389j155933k034065k360406j364898N80485K109329K123978
32934a76238P63199p71630j180555j38125J253784J344971l20796k341464k898682
32925d465536j637725K00887J173589P92551k75486p17720K92733K047952K891996
$$ plain form
32916 303241 2519574 3605343 3999246 3573927 1766786 -631488 -1389859 498440 3069189
32907 3069189 3403128 888390 -2366060 -3989927 -3524638 -2410379 -2314708 -3332786 -3822203
32898 -3822203 -2491354 -370835 404371 -348333 -681239 284538 1003805 326968 -411554
32889 -411554 183857 861244 -313064 -2553241 -3410345 -2451099 -1344565 -720468 377845
32880 377845 1848070 1987176 238694 -1710679 -2367270 -2097610 -1636472 -784431 458643
32871 458643 1078428 424455 -833821 -1914492 -2840328 -3519258 -3357806 -2563919 -2353871
32862 -2353871 -2960931 -2944376 -1567682 -377378 -1041948 -2863234 -3917963 -3641492 -2729848
32853 -2729848 -1336756 879634 3264332 4294914 3345589 1422489 148723 511937
$$ packed form
32916C03241K216333J085769L93903m25319j807141k398274p58371J888299K570749
32907C069189L33939k514738l254450j623867M65289J114259R5671j018078m89417
32898c822203J330849K120519P75206p52704l32906R65777P19267o76837p38522
32889d11554N95411O77387j174308k240177q57104R59246J106534O24097J098313
32880C77845J470225J39106j748482j949373o56591K69660M61138Q52041J243074
32871D58643O19785o53973j258276j080671r25836o78930J61452P93887K10048
32862b353871o07060J6555J376694J190304o64570j821286j054729K76471R11644
32853b729848J393092K216390K384698J030582r49325j923100j273766L63214
$$ plain form
32845 511937 2210415 3725402 3599931 2101688 848444 406004 -479342 -2496760 -4133262
32836 -4133262 -3792705 -2261151 -1333029 -1031289 -256628 512983 -365206 -2535943 -3264958
32827 -3264958 -1044979 2164484 3386443 2132681 364598 -262454 75165 422947 603233
32818 603233 1146992 1905728 1514960 -1022892 -4464795 -6153584 -5066302 -2978084 -1997718
32809 -1997718 -2110896 -2143370 -1981391 -2299436 -2817756 -2556069 -1570106 -862573 -604391 90128
32799 90128 1480250 2616751 2725195 2118612 1533606 1461629 2126842 3101470 2978109 598423
32789 598423 -3236515 -6306249 -7313900 -6741861 -5535183 -4239138 -3451964 -3609122 -3923940
32780 -3923940 -2924081 -595211 1251079 1355799 555880 197060 121037 -742373 -2481595
$$ packed form
32845E11937J698478J514987j25471j498243j253244m42440q85346k017418j636502
32836d133262L40557J531554R28122L01740P74661P69611q78189k170737p29015
32827c264958K219979L209463J221959j253762j768083o27052L37619L47782J80286
32818F03233N43759P58736l90768k537852l441903j688789J087282K088218R80366
32809a997718j13178l2474J61979l18045n18320K61687R85963P07533K58182O94519
32799I0128J390122J136501J08444o06583n85006p1977O65213R74628j23361k379686
32789E98423l834938l069734j007651N72039J206678J296045P87174j57158l14818
32780c923940R99859K328870J846290J04720p99919l58820p6023q63410j739222
$$ plain form
32771 -2481595 -3870821 -3618239 -1386006 2048191 5177549 6667363 6275240 4732579
32763 4732579 2776893 776489 -805404 -1334939 -569928 1135169 3030483 3952592 2809412
32754 2809412 129759 -1553552 -402746 2097358 3022958 2165986 1967806 3207825 3562523
32745 3562523 1492184 -1048585 -1527822 -424366 55175 -774446 -2102888 -3478786 -4509528
32736 -4509528 -3902520 -1108742 1898925 2711552 1659486 718472 75851 -1500047 -3330083
32727 -3330083 -3088582 -841775 292751 -1262897 -3015518 -2202588 176322 1391009
32719 1391009 1324739 2047035 3829554 4414246 2532842 -159735 -1569700 -1872067 -2483971
32710 -2483971 -3463044 -3443963 -1797625 493098 2211182 3033352 2922042 1507684 -994333
$$ packed form
32771b481595j389226K52582K232233L434197L129358J489814l92123j542661
32763D732579j955686k000404j581893n29535P65011J705097J895314R22109j143180
32754B809412k679653j683311J150806K500104R25600q56972j98180J240019L54698
32745C562523k070339k540769m79237J103456M79541q29621j328442j375898j030742
32736d509528O07008K793778L007667Q12627j052066r41014o42621j575898j830036
32727c330083K41501K246807J134526j555648j752621Q12930K378910J214687
32719A391009o6270P22296J782519N84692j881404k692577j409965l02367o11904
32710b483971r79073J9081J646338K290723J718084Q22170j11310j414358k502017
$$ plain form
32701 -994333 -2970349 -2827245 -1138419 -94791 -502722 -608817 1271517 4047053 5101635
32692 5101635 3690185 1558155 187302 -992297 -2966128 -4962978 -5177309 -3216164
32684 -3216164 -633581 1057313 1923628 2733289 3329525 2783130 957376 -1031854 -2221874
32675 -2221874 -2913136 -3776002 -4451119 -4033054 -2801824 -2330818 -3399271 -4610168 -3878249
32666 -3878249 -986543 2054182 3208578 2448154 1376438 1177515 1399133 871914 -603860
32657 -603860 -2050149 -2655681 -2532480 -1957496 -878744 191946 -106668 -2150374 -4041832
32648 -4041832 -3789431 -2284335 -2139856 -3592575 -3802732 -988234 2742123 4023636 2328782
32639 2328782 35221 -667330 321816 1577582 1601168 133152 -1461580 -1746583 -1226480
$$ packed form
32701i94333j976016J43104J688826J043628m07931j06095J880334K775536J054582
32692E101635j411450k132030j370853j179599j973831j996850k14331J961145
32684c216164K582583J690894Q66315Q09661N96236n46395j825754j989230j190020
32675b221874o91262q62866o75117M18065J231230M71006j068453j210897P31919
32666c878249K891706L040725J154396p60424j071716j98923K21618n27219j475774
32657f03860j446289o05532J23201N74984J078752J070690k98614k043706j891458
32648d041832K52401J505096J44479j452719k10157K814498L730357J281513j694854
32639B328782k293561p02551R89146J255766K3586j468016j594732k85003N20103
$$ plain form
32630 -1226480 -1486884 -2195398 -1121010 1950272 3784767 2056536 -1014438 -1862903 -659450
32621 -659450 -194244 -952091 -841192 530517 949024 -427904 -1374489 -92444 2152814
32612 2152814 3295386 3286719 3177784 3082393 2572022 1859191 1283942 612817 -162329 -398518
32602 -398518 -102376 -501712 -2249042 -4084933 -4430609 -3470122 -2537116 -2128771 -1644373
32593 -1644373 -670596 407356 899241 453479 -469484 -662820 553146 2038996 1914670
32584 1914670 187916 -1038383 -500201 628139 999355 1355977 2937122 4761469 4521695
32575 4521695 1935988 -539056 -656160 1166901 2817089 3092963 2646442 2541036 2604387
32566 2604387 1870249 526327 230242 1660720 2880225 1778043 -570046 -1173863 438006
$$ packed form
32630a226480k60404p08514J074388L071282J834495j728231l070974q48465J203453
32621f59450M65206p57847J10899J371709M18507j376928r46585J282045K245258
32612B152814J142572q667j08935r5391n10371p12831n75249o71125p75146k36189
32602c98518K96142l99336j747330j835891l45676R60487R33006M08345M84398
32593a644373R73777J077952M91885m45762r22963j93336J215966J485850j24326
32584A914670j726754j226299N38182J128340L71216L56622J581145J824347k39774
32575D521695k585707k475044j17104J823061J650188K75874m46521j05406O3351
32566B604387p34138j343922k96085J430478J219505j102182k348089o03817J611869
$$ plain form
32557 438006 1660803 1162494 943314 2682033 4655106 4427071 2545118 1063093 -21164
32548 -21164 -2039604 -4351879 -4731788 -2866065 -888525 -253124 -304664 -247370 -386877
32539 -386877 -775954 -466591 950130 2330941 2373687 1229048 165325 175132 1115225
32530 1115225 1753330 828943 -1342404 -2739621 -1906932 180728 1486937 1474808 1061746
32521 1061746 720345 202050 -340160 -621404 -1185763 -2332315 -2594892 -469391 2629754
32512 2629754 3660777 2321960 1425685 2367830 3145064 2155338 1155495 2321891 4508588
32503 4508588 4940675 3294759 1663605 1262178 1426236 1459774 1385141 929457 -410079
32494 -410079 -2134193 -3074295 -3117780 -3228048 -3552366 -2950497 -962032 986849 1258723
$$ packed form
32557D38006J222797m98309k19180J738719J973073k28035j881953j482025j084257
32548b1164k018440k312275l79909J865723J977540O35401n1540N7294j39507
32539c86877l89077L09363J416721J380811M2746j144639j063723R807R40093
32530A115225O38105r24387k171347j397217Q32689K087660J306209j2129m13062
32521A061746l41401n18295n42210k81244n64359j146552k62577K125501L099145
32512B629754J031023j338817q96275R42145P77234r89726r99843J166396K186697
32503D508588M32087j645916j631154m01427J64058L3538p4633m55684j339536
32494d10079j724114r40102m3485j10268l24318O01869J988465J948881K71874
$$ plain form
32485 1258723 162536 -563186 -198357 5859 -1274267 -3213875 -3509198 -1477236 513859
32476 513859 -277786 -3356138 -5407094 -4366221 -1655373 89705 101533 -637787 -1381355
32467 -1381355 -2087526 -2527056 -2316035 -1739766 -1527778 -1823300 -2140841 -2255449 -2417968
32458 -2417968 -2758096 -3103906 -3310420 -3227224 -2534327 -1223209 -54599 157022 -344053
32449 -344053 -506282 135367 872041 698516 -650009 -2534535 -3856554 -3698833 -2044577
32440 -2044577 -849 1104381 1072995 1003739 1843533 2991613 2852665 934712 -1173653
32431 -1173653 -1612935 -716767 -489240 -1463589 -1670322 281827 2695606 3197106 2430347
32422 2430347 2795445 4132767 3805344 1364818 -220574 717720 1740072 312788 -2052462
$$ packed form
32485A258723j096187p25722L64829K04216j280126j939608k95323K031962J991095
32476E13859p91645l078352k050956J040873K710848J745078J1828p39320p43568
32467a381355p06171m39530K11021N76269K11988k95522l17541j14608j62519
32458b417968l40128l45810k06514Q3196O92897J311118J168610K11621n01075
32449c44053j62229O41649P36674j73525j348525j884526j322019J57721J654256
32440b044577K043728J105230l1386o9256Q39794J148080j38948j917953k108365
32431a173653m39282Q96168K27527r74349k06733J952149K413779N01500p66759
32422B430347L65098J337322l27423k440526j585392R38294J022352j427284k365250
$$ plain form
32413 -2052462 -2405213 -1007264 -234603 -309731 433419 1798140 1778049 345209 -137153
32404 -137153 1169896 2262349 1803487 1198291 1845139 2700125 2251543 1100916 830616
32395 830616 1600200 2479530 3212037 4140218 4936202 4629213 2728360 -199125 -2690110
32386 -2690110 -3111006 -1214106 927947 876388 -1019620 -1991492 -776907 771747 868922
32377 868922 446210 1078256 2177433 2338154 2001378 2388630 2809038 1658953 -376217
32368 -376217 -852388 563637 1387595 210123 -1126481 -627167 542997 -113429 -2321441
32359 -2321441 -3022758 -556995 2993246 4509245 3709737 2989765 3842492 5067762 5033839
32350 5033839 4222493 4135754 4608271 4161727 2810716 2273572 2825205 2220192 -793107
$$ packed form
32413b052462l52751J397949P72661p5128P43150J364721k0091j432840m82362
32404a37153J307049J092453m58862o05196O46848Q54986m48582j150627k70300
32395H30616P69584Q79330P32507R28181P95984l06989j900853k927485k490985
32386b690110m20896J896900K142053n1559j896008r71872J214585J548654R7175
32377H68922m22712O32046J099177J60721l36776L87252M20408j150085k035170
32368c76217m76171J416025Q23958j177472j336604M99314J170164o56426k208012
32359b321441p01317K465763L550241J515999p99508p19972Q52727J225270l3923
32350E033839q11346q6739M72517m46544j351011n37144N51633o05013l013299
$$ plain form
32341 -793107 -3742908 -3337046 -22389 2602230 2475878 996416 218889 226818 -25318
32332 -25318 -805145 -1522504 -1737417 -1509466 -1130611 -831667 -486773 321197 1565471 2407196
32322 2407196 2104312 909671 -509581 -1936133 -3114850 -3214082 -1947627 -535964 -184448
32313 -184448 -242112 605599 1991372 2540420 2271960 2152151 1732264 -111098 -2145646
32304 -2145646 -1557240 1558312 3466926 1819424 -1320577 -2986679 -3132546 -2986697 -2245684
32295 -2245684 -567209 273433 -1209611 -3115156 -2557057 -139132 1052081 195132 -744817
32286 -744817 -924397 -1681582 -3317168 -3970461 -2683951 -983589 -266024 119353 914797
32277 914797 1115554 -350667 -2558270 -3705142 -3403863 -2761858 -2880155 -3982156 -5338783
$$ packed form
32341g93107k949801M05862L314657K624619j26352j479462p77527P929k52136
32332b5318p79827p17359k14913K27951L78855K98944L44894Q07970J244274Q41725
32322B407196l02884j194641j419252j426552j178717r9232J266455J411663L51516
32313a84448n7664Q47711J385773N49048k68460j19809m19887j843362k034548
32304b145646N88406L115552J908614j647502l140001j666102j45867J45849P41013
32295b245684J678475Q40642j483044j905545N58099K417925J191213q56949r39949
32286g44817j79580p57185j635586o53293J286510J700362P17565L85377P95444
32277I14797K00757j466221k207603j146872L01279O42005j18297j102001j356627
$$ plain form
32268 -5338783 -5656535 -4302253 -2231216 -775907 160154 1255191 1658558 42641 -2326366
32259 -2326366 -2434851 -57502 1522200 427206 -1317140 -1852918 -2643132 -4899136 -6083197
32250 -6083197 -3764820 -572504 -835445 -3701603 -4407529 -1963044 -542869 -2459169
32242 -2459169 -4570203 -3680880 -1457721 -1118299 -2247183 -2135237 -326647 1326490 2022816
32233 2022816 2550386 2995673 2454240 997702 -127374 -439068 -686517 -1158316 -1052430
32224 -1052430 -16222 916252 689864 -154451 -38513 1530484 2954801 2179834 -651290
32215 -651290 -2962209 -2842575 -1589569 -1794343 -3468277 -4170730 -3079363 -2403267 -3732936
32206 -3732936 -5436830 -5486039 -4762677 -5149806 -5925152 -4937773 -2533284 -1344504 -2304212
$$ packed form
32268e338783l17752J354282K071037J455309R36061J095037M03367j615917k369007
32259b326366j08485K377349J579702j094994j744346n35778p90214k256004j184061
32250f083197K318377L192316k62941k866158p05926K444485J420175j916300
32242b459169k111034Q89323K223159L39422j128884J11946J808590J653137O96326
32233B022816N27570M45287n41433j456538j125076l11694k47449m71799J05886
32224a052430J036208R32474k26388q44315J15938J568997J424317p74967k831124
32215f51290k310919J19634J253006k04774j673934p02453J091367O76096j329669
32206c732936j703894m9209P23362l87129p75346R87379K404489J188780r59708
$$ plain form
32197 -2304212 -3537081 -3420471 -2310647 -886544 806606 2059046 1585804 -172880
32189 -172880 -946893 121630 1083074 171030 -1689562 -2657717 -2457772 -1627174 -48958
32180 -48958 1995280 2852184 1583918 -184443 -524005 -201670 -1219896 -3300215 -4338318
32171 -4338318 -3868671 -3465491 -3756107 -3651003 -2933837 -3100617 -4756497 -6353418 -6586186
32162 -6586186 -6099405 -5613824 -4293588 -1680074 282378 -726101 -4023371 -6398403
32154 -6398403 -5740670 -2853446 57143 1354060 556202 -1711467 -4036130 -5232150
32146 -5232150 -5193869 -4399274 -3035737 -1339791 -245392 -547523 -1607539 -1988383 -1351391
32137 -1351391 -698576 -702470 -851785 -476878 287381 868182 916074 467680 52737 522244
$$ packed form
32197b304212j232869J16610J109824J424103J693150J252440m73242j758684
32189a72880p74013J068523R61444r12044j860592r68155J99945Q30598J578216
32180d8958K044238Q56904j268266j768361l39562L22335j018226k080319j038103
32171d338318M69647M03180k90616J05104P17166j66780j655880j596921k32768
32162f586186M86781M85581J320236K613514J962452j008479l297270k375032
32154f398403O57733K887224K910589J296917p97858k267669k324663j196020
32146e232150L8281P94595J363537J695946J094399l02131j060016l80844O36992
32137a351391O52815l894j49315L74907P64259N80801M7892m48394m14943M69507
$$ plain form
32127 522244 1989884 3193545 2973830 2121410 2311757 3309254 3114317 1273512 -58923
32118 -58923 613481 1799625 1554374 674131 1309062 3488815 5157806 5005432 3331796
32109 3331796 799385 -1576476 -1887350 654484 3433914 2959542 -130335 -1503056
32101 -1503056 775427 3653709 3900309 2426621 1691144 1499901 300284 -1243008 -1198658
32092 -1198658 137446 744795 305983 257568 747373 464318 -439504 -142436 1663952
32083 1663952 3060775 3068969 3015114 3892821 4830509 5194577 5701553 6180988 4885202 1793683
32073 1793683 -950 1403881 3311363 2237573 -678292 -1482874 502766 2135119
32065 2135119 1723612 1089539 1689651 2121964 984687 -514479 -681090 -38576 10814
$$ packed form
32127E22244J467640J203661k19715q52420J90347R97497j94937j840805j332435
32118e8923O72404J186144k45251q80243O34931K179753J668991j52374j673636
32109C331796k532411k375861l10874K541834K779430m74372l089877j372721
32101a503056K278483K878282K46600j473688p35477j91243j199617j543292M4350
32092a198658J336104O07349m38812m8415M89805k83055r03822K97068J806388
32083A663952J396823Q194n3855Q77707R37688L64068N06976M79435j295786l091519
32073A793683j794633J404831J907482j073790k915865q04582J985640J632353
32065B135119m11507o34073O00112M32313j137277j499166j66611O42514M9390
$$ plain form
32056 10814 -306839 90889 939513 1050650 269596 -595121 -1279751 -2010505 -2337397 -1512620
32046 -1512620 52881 932671 313682 -1349689 -3006078 -3453547 -1738518 1512761 3578067
32037 3578067 2182243 -1375857 -3325834 -1984916 479151 1386199 732220 -97152 -926239
32028 -926239 -2138433 -2674200 -1124806 1528150 2638117 1607343 663784 1241416 1776684
32019 1776684 508201 -1348815 -1270890 748303 2194495 1513825 -368879 -2008765 -2985002
32010 -2985002 -3089683 -1846440 202812 1179228 83931 -1589774 -1664752 -92385 1172053
32001 1172053 743389 -758621 -1690768 -1001753 1018914 2970299 3458670 2474853 1371269
31992 1371269 1046110 767888 -399573 -1604782 -909872 2037560 5158551 6102241 4507003
$$ packed form
32056A0814l17653L97728Q48624J11137p81054q64717o84630p30754l26892Q24777
32046a512620J565501Q79790o18989j663371j656389m47469J715029L251279K065306
32037C578067j395824l558100j949977J340918K464067R07048o53979q29372q29087
32028i26239j212194n35767J549394K652956J109967j030774r43559N77632N35268
32019A776684j268483j857016P7925K019193J446192o80670j882704j639886r76237
32010b985002j04681J243243K049252R76416j095297j673705p4978J572367J264438
32001A172053m28664j502010r32147O89015K020667J951385M88371r83817j103584
31992A371269l25159k78222j167461j205209O94910K947432L120991R43690j595238
$$ plain form
31983 4507003 1817904 -475889 -1908798 -2615977 -2384107 -621081 2365584 4472398
31975 4472398 3404535 -357739 -3380710 -3056422 -591184 1012084 956460 820066 1366304
31966 1366304 1565204 1061538 1327412 3281296 5424318 5672211 3971684 1920859 634393
31957 634393 118104 109163 373907 451520 -5555 -733383 -1185579 -1105252 -488292 484915
31947 484915 1124722 532219 -1205177 -2697639 -2747918 -1728299 -958932 -1120127 -1697942
31938 -1697942 -1641112 -364381 1430444 1994634 464294 -1511219 -1388799 842248 2528133
31929 2528133 2209974 1607203 2456265 3357411 1965493 -965756 -2316199 -966158 952934
31920 952934 1325899 558329 346139 1496554 3483696 5034109 4891363 3001724 936020
$$ packed form
31983D507003k689099k293793j432909p07179K31870J763026K986665K106814
31975D472398j067863l762274l022971L24288K465238J603268n5624j36394N46238
31966A366304J98900n03666K65874J953884K143022K47893j700527k050825j286466
31957F34393n16289q941K64744P7613m57075p27828m52196Q0327O16960R73207
31947D84915O39807n92503j737396j492462n0279J019619P69367j61195n77815
31938a697942N6830J276731J794825N64190j530340j975513J22420K231047J685885
31929B528133l18159o02771Q49062R01146j391918k931249j350443J350041J919092
31920I52934L72965p67570k12190J150415J987142J550413j42746j889639k065704
$$ plain form
31911 936020 116260 -11394 -659336 -1151757 126690 2335280 2430103 -345646 -2781023
31902 -2781023 -2059418 391291 1467654 960687 867015 1309700 395030 -1876684 -2780321
31893 -2780321 -1109574 362403 -1334285 -4848040 -6188834 -4117813 -1330222 -253606
31885 -253606 -191995 430193 1203262 898899 36617 95818 853300 724750 -414861 -1006614
31875 -1006614 -690483 -1119516 -3031960 -4646171 -4356126 -3210234 -2958607 -3108228 -2005645
31866 -2005645 135052 1537345 1785762 2291770 3713864 4716682 3798280 1151717 -1704070
31857 -1704070 -3369708 -3505418 -2884927 -2401007 -1805757 -266149 1462615 1030721 -2094225
31848 -2094225 -4828800 -4025380 -571885 2200783 3003133 2920620 2331187 680109 -1043419
$$ packed form
31911I36020q19760j27654o47942m92421J278447K208590R4823k775749k435377
31902b781023P21605K450709J076363n06967r3672M42685r14670k271714r03637
31893b780321J670747J471977j696688l513755j340794K071021K787591J076616
31885b53606O1611O22188P73069l04363q62282N9201P57482j28550j139611n91753
31875a006614L16131m29033j912444j614211K90045J145892K51627j49621J102583
31866b005645K140697J402293K48417N06008J422094J002818r18402k646563k855787
31857a704070j665638j35710O20491M83920N95250J539608J728764m31894l124946
31848b094225k734575Q03420L453495K772668Q02350q2513n89433j651078j723528
$$ plain form
31839 -1043419 -927391 499677 599672 -1163279 -2291264 -1243922 501773 1272891 1331614
31830 1331614 1191506 457509 -613076 -929589 -798439 -1632245 -2799202 -2057152 54334
31821 54334 240192 -1686558 -1452420 2717386 6313856 5160624 1575766 -325129 -1482271
31812 -1482271 -4688819 -7765387 -6331903 -1698171 470165 -1146218 -2290358 -777781
31804 -777781 704262 509044 897263 2949999 3832212 1907651 161701 1290614 2997534
31795 2997534 1748078 -1473549 -2817784 -1358414 37948 -1091110 -4188557 -6929885
31787 -6929885 -7475881 -5786277 -3594726 -2622308 -2681805 -2611288 -2694887 -4006102 -5427721
31778 -5427721 -4256064 -500059 2400581 2358543 1231347 1165648 1385786 617049 -177054
$$ packed form
31839a043419J16028J427068R9995j762951j127985J047342J745695P71118N8723
31830A331614j40108p33997j070585l16513J31150q33806j166957P42050K111486
31821E4334J85858j926750K34138M169806L596470j153232l584858j900895j157142
31812a482271l206548l076568J433484M633732K168336j616383j144140J512577
31804g77781J482043j95218L88219K052736Q82213j924561j745950J128913J706920
31795B997534j249456l221627j344235J459370J396362j129058l097447k741328
31787f929885n45996J689604K191551R72418n9497P0517q3599j311215j421619
31778e427721J171657L756005K900640m2038j127196o5699K20138p68737p94103
$$ plain form
31769 -177054 99426 388507 -158973 502 1831008 2946646 1033350 -1990003 -2683187
31760 -2683187 -1259686 -456316 -715216 -415565 142571 -831770 -2658005 -2809095 -1524581
31751 -1524581 -1698188 -3709532 -4466837 -2606886 -700637 -718634 -962009 411447 2040045
31742 2040045 2031556 1298438 1479327 1659678 99387 -2214672 -2615799 -586927 1881377
31733 1881377 3207441 3340410 2463242 755588 -676720 -583923 582240 1152802 590751
31724 590751 -147961 -631563 -1682631 -3620896 -5116098 -4570562 -1984902 968462 2292804
31715 2292804 1117336 -1524132 -3407959 -3307119 -2303528 -2163007 -2861790 -3034503 -2568039
31706 -2568039 -2816242 -3819222 -3419839 -501540 2572845 2756334 593482 -560857 649214
$$ packed form
31769a77054K76480K89081n47480J59475J830506J115638j913296l023353o93184
31760b683187J423501Q03370k58900K99651N58136r74341j826235j51090J284514
31751a524581j73607k011344p57305J859951J906249j7997k43375J373456J628598
31742B040045q489p33118J80889J80351j560291k314059m01127K028872K468304
31733A881377J326064J32969q77168j707654j432308R2797J166163N70562n62051
31724E90751p38712m83602j051068j938265j495202N45536K585660K953364J324342
31715B292804j175468k641468j883827J00840J003591J40521o98783j72713M66464
31706b568039k48203j002980L99383K918299L074385J83489k162852j154339J210071
$$ plain form
31697 649214 1906913 927304 -1267863 -2103405 -1048934 156424 120030 -933203 -2200595
31688 -2200595 -3170840 -3407917 -2669456 -1443998 -410383 707384 2623085 4650918 4785815
31679 4785815 2350680 -629894 -1774964 -1170481 -600487 -682278 -412891 617759 1371160
31670 1371160 1222106 1100329 1767838 2197596 1087793 -782335 -1395235 -479833 69461
31661 69461 -978289 -2633627 -3637494 -4255191 -4843534 -4162746 -1116193 2678512 4283843
31652 4283843 3188192 1589647 1022651 985584 1113654 2032770 3175675 2498077 -33165
31643 -33165 -1211148 968062 3830323 3626668 801088 -1327520 -1694301 -1901116 -2388552
31634 -2388552 -1841545 -284789 622696 582397 820442 1167564 334139 -730771 391213
$$ packed form
31697F49214J257699r79609k195167q35542J054471J205358l6394j053233j267392
31688b200595r70245k37077P38461J225458J033615J117767J915701K027833J34897
31679D785815k435135k980574j145070O04483N69994q1791K69387J030650P53401
31670A371160j49054j21777O67509M29758j109803j870128o12900R15402N49294
31661F9461j047750j655338j003867o17697n88343O80788L046553L794705J605331
31652D283843j095651j598545n66996l7067J28070R19116J142905o77598k531242
31643c3165j177983K179210K862261k03655k825580k128608l66781k06815m87436
31634b388552N47007J556756R07485m0299K38045L47122q33425j064910J121984
$$ plain form
31625 391213 2821876 2638180 -738546 -2843877 -1121793 821504 -790817 -3633331
31617 -3633331 -3299550 -519241 597095 -422032 -312945 1792973 3064728 1956274
31609 1956274 190190 -835769 -1774791 -2596935 -1708962 884034 2573898 1788554 161103
31600 161103 -261108 294640 717617 956031 1188557 936848 343842 599123 1769150
31591 1769150 1894336 -266395 -3032269 -3856519 -2417773 -283042 1368220 2194093 1845240
31582 1845240 348584 -1126475 -1302846 -403123 322365 401511 470637 996724 1672427
31573 1672427 2132949 2442636 2626791 2328523 1352350 264498 -61895 392826 549821
31564 549821 -390819 -1659073 -1809104 -822992 -257533 -1038152 -2270853 -2803881 -2813912
$$ packed form
31625C91213K430663j83696l376726k105331J722084J943297j612321k842514
31617c633331L33781K780309J116336j019127J09087K105918J271755j108454
31609A956274j766084j025959r39022q22144Q87973K592996J689864p85344j627451
31600A61103m22211N55748M22977K38414K32526k51709n93006K55281J170027
31591A769150J25186k160731k765874q24250J438746K134731J651262Q25873l48853
31582A845240j496656j475059j76371Q99723P25488P9146O9126N26087O75703
31573A672427M60522L09687J84155k98268r76173j087852l26393M54721J56995
31564E49821r40640j268254j50031R86112N65459p80619j232701n33028j0031
$$ plain form
31555 -2813912 -3083079 -3804454 -4892560 -6255769 -6916979 -5382389 -2051131 369285 282475
31546 282475 -693965 -664621 -381511 -994090 -1163367 442015 1760476 331218 -1789804
31537 -1789804 -582054 3200733 4652034 2150468 -659589 -1034986 -441322 -361268 389826
31528 389826 2053316 2078626 -446743 -2414513 -1569882 -145460 -638505 -1508586 -504638
31519 -504638 994131 789589 157582 1225556 2473027 1178392 -1539730 -2509825 -1847555
31510 -1847555 -2088352 -3110538 -2475422 -251062 977886 800689 1385192 2976356 3176675
31501 3176675 1353959 -190269 -410216 -1137797 -3235927 -4596773 -3638196 -1837572 -1031636
31492 -1031636 -761941 -84737 247539 -688664 -2018655 -2314361 -1494826 -276547 949474
$$ packed form
31555b813912k69167p21375j088106j363209o61210J534590L331258K420416q6810
31546B82475r76440K9344K83110o12579j69277J605382J318461j429258k121022
31537a789804J207750L782787J451301k501566k810057l75397N93664Q0054P51094
31528C89826J663490K5310k525369j967770Q44631J424422m93045q70081J003948
31519e04638J498769k04542o32007J067974J247471j294635k718122r70095O62270
31510a847555k40797j022186O35116K224360J228948j77197N84503J591164K00319
31501C176675j822716j544228k19947p27581k098130j360846R58577J800624Q05936
31492a031636K69695O77204L32276r36203j329991k95706Q19535J218279J226021
$$ plain form
31483 949474 1765946 1694773 1287924 1670657 2338924 1323334 -1581808 -3835181 -3616337
31474 -3616337 -2282823 -1905547 -2284933 -2229106 -2080266 -2732822 -3271445 -1935277 968125
31465 968125 3075366 2890111 1257436 -117181 -497554 -364167 -564905 -1235676 -1295445
31456 -1295445 462289 3395138 4970224 3476791 156115 -2150931 -1957305 -83879
31448 -83879 1668005 1992320 800504 -679588 -947649 -78548 16606 -1991900 -4701855
31439 -4701855 -5335667 -3088229 -75129 1257908 834522 511767 1342086 2087487 938261
31430 938261 -1718128 -3374853 -2671585 -1381085 -1919622 -3790715 -4378932 -2972345 -1786236
31421 -1786236 -2557434 -4266714 -5233383 -5493812 -5609048 -4824635 -2457564 -23272 254888
$$ packed form
31483I49474Q16472p1173m06849L82733O68267j015590k905142k253373K18844
31474c616337J333514L77276l79386N5827J48840o52556n38623J336168K903402
31465I68125K107241j85255j632675j374617l80373J33387k00738o70771n9769
31456a295445J757734K932849J575086j493433l320676k307046J93626J873426
31448h3879J751884L24315j191816j480092k68061Q69101R5154k008506k709955
31439d701855o33812K247438L013100J333037m23386l22755Q30319P45401j149226
31430I38261k656389j656725P03268J290500n38537j871093n88217J406587J186109
31421a786236p71198j709280r66669k60429j15236P84413K367071K434292K78160
$$ plain form
31412 254888 -1376085 -2586067 -2427631 -2317151 -3157910 -3556233 -2127044 -151345 -229764
31403 -229764 -2729051 -5104818 -5011498 -2922081 -961873 38502 1097603 2784382 3780387
$$ packed form
31412B54888j630973j209982J58436J10480q40759l98323J429189J975699p8419
31403b29764k499287k375767R3320K089417J960208J000375J059101J686779R96005
$$ [...]
##END NTUPLES=NMR SPECTRUM
##END=
