##TITLE=31Pdec_LR-758-2-CR8-H
 D2O, 24 sc
 3.7.2023
##JCAMPDX= 6.0         $$ Bruker NMR JCAMP-DX V2.0
##DATA TYPE= NMR SPECTRUM
##DATA CLASS= NTUPLES
##ORIGIN= UXNMR, Bruker Analytische Messtechnik GmbH
##OWNER= root
$$ XWIN-NMR		Version 3.5
$$ Mon Jul  3 15:43:23 2023 Russian Standard Time (UT+4h)  she@DPX200
##.OBSERVE FREQUENCY= 81.013821
##.OBSERVE NUCLEUS= ^31P
##.ACQUISITION MODE= SIMULTANEOUS
##.ACQUISITION SCHEME= undefined
##.AVERAGES= 24
##.DIGITISER RES= 16
##SPECTROMETER/DATA SYSTEM= spect
##.PULSE SEQUENCE= zgpg30
##.SOLVENT NAME= CDCl3
##.SHIFT REFERENCE= (INTERNAL, CDCl3, 0, 248.564)
##AUDIT TRAIL= $$ (NUMBER, WHEN, WHO, WHERE, WHAT)
$$ ##TITLE= Audit trail, XWIN-NMR		Version 3.5
$$ ##JCAMPDX= 5.01
$$ ##ORIGIN= Bruker BioSpin GmbH
$$ ##OWNER= she
$$ F:/spectra/data/she/nmr/P31/1/pdata/1/auditp.txt
$$ ##AUDIT TRAIL=  $$ (NUMBER, WHEN, WHO, WHERE, WHAT)
(   1,<2023-07-03 15:42:21.07 +0400>,<she>,<DPX200>,
      <created by zg, POWCHK disabled, PULCHK disabled
       configuration hash MD5:
       00 E9 B6 7A A2 85 ED C7 34 08 36 98 17 FE 4E 26
       data hash MD5: 32K
       20 9B 81 C9 4C 2E EF 6F 26 73 D3 CD 53 FE 91 11>)
(   2,<2023-07-03 15:42:24.03 +0400>,<she>,<DPX200>,
      <Start of raw data processing
       efp BC_mod = 2 LB = 1 FT_mod = 6 PKNL = 1 PHC0 = -10703.44 PHC1 = 42.48483 SI = 64K 
       data hash MD5: 64K
       2F F2 9F EE 5A B9 F7 FA DB 0C 26 4D 55 51 D9 E1>)
(   3,<2023-07-03 15:42:36.76 +0400>,<she>,<DPX200>,
      <pk PHC0 = -1.568972 PHC1 = 0 
       data hash MD5: 64K
       BC AF 14 C7 B1 E1 D5 E3 0C 46 ED F8 13 5E ED D4>)
(   4,<2023-07-03 15:42:51.48 +0400>,<she>,<DPX200>,
      <abs ABSG = 5 
       data hash MD5: 64K
       DF C0 AC 72 52 3E 7A F4 13 22 01 78 ED 4F FE 1C>)
$$ ##END=
$$ 
$$ hash MD5
$$ 17 2C 69 2B EF 90 6B DB 94 74 BC A0 1A A5 51 88
##$RELAX= 
##$RELAX= 
##$RELAX= 
##$RELAX= 
##$RELAX= 
##$RELAX= 
##$RELAX= 
##$RELAX= 
##$RELAX= 
$$ Bruker specific parameters
$$ --------------------------
##$DU= <F:/spectra>
##$EXPNO= 1
##$NAME= <P31>
##$PROCNO= 1
##$TYPE= <nmr>
##$USER= <she>
##$AMP= (0..31)
100 100 100 100 100 100 100 100 100 100 100 100 100 100 100 100 100 100 
100 100 100 100 100 100 100 100 100 100 100 100 100 100 
##$AQSEQ= 0
##$AQ_mod= 1
##$AUNM= <au_zg>
##$AUTOPOS= <>
##$BF1= 81.014009
##$BF2= 200.13
##$BF3= 200.13
##$BF4= 200.13
##$BF5= 200.13
##$BF6= 200.13
##$BF7= 200.13
##$BF8= 200.13
##$BYTORDA= 1
##$CFDGTYP= 0
##$CFRGTYP= 5
##$CHEMSTR= <none>
##$CNST= (0..31)
1 1 145 1 1 1 1 1 1 1 1 1 1 1 1 1 1 1 1 1 1 1 1 1 1 1 1 1 1 1 1 1 
##$CPDPRG= <waltz16>
##$CPDPRG1= <>
##$CPDPRG2= <waltz16>
##$CPDPRG3= <>
##$CPDPRG4= <mlev>
##$CPDPRG5= <mlev>
##$CPDPRG6= <mlev>
##$CPDPRG7= <mlev>
##$CPDPRG8= <mlev>
##$CPDPRGB= <>
##$CPDPRGT= <>
##$D= (0..31)
0 1 0 0 0 0 0 0 0 0 0 0.03 2e-05 3e-06 0 0 0 0 0 0 0 0 0 0 0 0 0 0 0 0 
0 0 
##$DATE= 1688384540
##$DBL= (0..7)
120 120 120 11 120 120 24 19 
##$DBP= (0..7)
150 150 150 150 150 150 150 150 
##$DBP07= 0
##$DBPNAM0= <>
##$DBPNAM1= <>
$$ [...]
##$SUBNAM3= <"">
##$SUBNAM4= <"">
##$SUBNAM5= <"">
##$SUBNAM6= <"">
##$SUBNAM7= <"">
##$SUBNAM8= <"">
##$SUBNAM9= <"">
##$SW= 501.771253377433
##$SWIBOX= (0..15)
0 1 3 0 0 0 0 0 0 0 0 0 0 0 0 0 
##$SW_h= 40650.406504065
##$TD= 32768
##$TD0= 1
##$TE= 0
##$TE2= 300
##$TE3= 300
##$TEG= 300
##$TL= (0..7)
0 120 53 12 22 120 120 120 
##$TP= (0..7)
150 150 150 150 150 150 150 150 
##$TP07= 0
##$TPNAME0= <>
##$TPNAME1= <>
##$TPNAME2= <>
##$TPNAME3= <>
##$TPNAME4= <>
##$TPNAME5= <>
##$TPNAME6= <>
##$TPNAME7= <>
##$TPOAL= (0..7)
0.5 0.5 0.5 0.5 0.5 0.5 0.5 0.5 
##$TPOFFS= (0..7)
0 0 0 0 0 0 0 0 
##$TUNHIN= 0
##$TUNHOUT= 0
##$TUNXOUT= 0
##$USERA1= <user>
##$USERA2= <user>
##$USERA3= <user>
##$USERA4= <user>
##$USERA5= <user>
##$V9= 5
##$VALIST= <valist>
##$VCLIST= <CCCCCCCCCCCCCCC>
##$VD= 0
##$VDLIST= <DDDDDDDDDDDDDDD>
##$VPLIST= <PPPPPPPPPPPPPPP>
##$VTLIST= <TTTTTTTTTTTTTTT>
##$WBST= 1024
##$WBSW= 4
##$XGAIN= (0..3)
0 0 0 0 
##$XL= 0
##$YL= 0
##$YMAX_a= 8864
##$YMIN_a= -7313
##$ZGOPTNS= <>
##$ZL1= 120
##$ZL2= 120
##$ZL3= 120
##$ZL4= 120
##$ABSF1= 248.5645
##$ABSF2= -253.2056
##$ABSG= 5
##$ABSL= 3
##$ALPHA= 0
##$AQORDER= 0
##$ASSFAC= 0
##$ASSFACI= 0
##$ASSFACX= 0
##$ASSWID= 0
##$AUNMP= <proc_1d>
##$AZFE= 0.1
##$AZFW= 0.5
##$BCFW= 0
##$BC_mod= 2
##$BYTORDP= 0
##$COROFFS= 0
##$CY= -3
##$DATMOD= 1
##$DC= 0
##$DFILT= <>
##$DTYPP= 0
##$F1P= 0
##$F2P= 0
##$FCOR= 1
##$FTSIZE= 65536
##$FT_mod= 6
##$GAMMA= 0
##$GB= 0
##$INTBC= 1
##$INTSCL= 6.047779e-11
##$ISEN= 30
##$LB= 1
##$LEV0= 0
##$LPBIN= 0
##$MAXI= 10000
##$MC2= 0
##$MEAN= 0
##$ME_mod= 0
##$MI= 50
##$NCOEF= 0
##$NC_proc= -5
##$NLEV= 6
##$NOISF1= 182.463
##$NOISF2= 159.3651
##$NSP= 0
##$NTH_PI= 0
##$NZP= 0
##$OFFSET= 248.5645
##$PC= 4
##$PHC0= -10705.01
##$PHC1= 42.48483
##$PH_mod= 1
##$PKNL= yes
##$PPARMOD= 0
##$PSCAL= 0
##$PSIGN= 0
##$REVERSE= no
##$SF= 81.0140089999694
##$SI= 65536
##$SIGF1= 159.3651
##$SIGF2= -187.1042
##$SINO= 113.3802
##$SIOLD= 16384
##$SREGLST= <1H.CDCl3>
##$SSB= 0
##$STSI= 65536
##$STSR= 0
##$SW_p= 40650.406504065
##$SYMM= 0
##$S_DEV= 0
##$TDeff= 32768
##$TDoff= 0
##$TI= <>
##$TILT= no
##$TM1= 0
##$TM2= 0
##$TOPLEV= 0
##$USERP1= <user>
##$USERP2= <user>
##$USERP3= <user>
##$USERP4= <user>
##$USERP5= <user>
##$WDW= 1
##$XDIM= 65536
##$YMAX_p= 135496333
##$YMIN_p= -291397035
$$ End of Bruker specific parameters
$$ ---------------------------------
##NTUPLES= NMR SPECTRUM
##VAR_NAME=  FREQUENCY,     SPECTRUM/REAL,   SPECTRUM/IMAG
##SYMBOL=    X,             R,               I
##VAR_TYPE=  INDEPENDENT,   DEPENDENT,       DEPENDENT
##VAR_FORM=  AFFN,          ASDF,            ASDF
##VAR_DIM=   65536,         65536,           65536
##UNITS=     HZ,            ARBITRARY UNITS, ARBITRARY UNITS
##FACTOR=    0.620285442955139, 1,           1
##FIRST=     20137.2065510682, 0,            0
##LAST=      -20513.1999529968, 0,           0
##MIN=       -20513.1999529968, -291397035,  0
##MAX=       20137.2065510682, 135496333,    0
$$ Real data points
##PAGE= N=1
##DATA TABLE= (X++(R..R)), XYDATA
$$ [...]
##PAGE= N=2
##DATA TABLE= (X++(I..I)), XYDATA
13405e68760j9538J60541J02143q8726l91886n85519k57214M29099O58521J50516
$$ -568760 -588298 -427757 -325614 -414340 -806226 -1391745 -1648959 -1219860 -561339 -410823
13395d10823l19946j26782K72344K39962P923Q0992K99208K70997J16717M1502
$$ -410823 -730769 -857551 -585207 -345245 -337322 -256330 42878 313875 430592 472094
13385D72094k04336o91305p90594j12965O30431N74615j4886k72644o5509J01848
$$ 472094 267758 -423547 -1214141 -1327106 -696675 -122060 -136946 -409590 -475099 -373251
13375c73251J00382J78139K45525K5284k90678k97736r8192q1951k09030j66647
$$ -373251 -272869 -94730 150795 176079 -114599 -412335 -510527 -592478 -801508 -968155
13365i68155j0978m320k7994K07251N44223N67903K69291j735j13672k26056l96606
$$ -968155 -979133 -983453 -1011447 -804196 -259973 307930 577221 575486 461814 235758 -160848
13354a60848m73165k92651J63615O16189N35545j91389p42146k65241P23216Q74333
$$ -160848 -634013 -926664 -763049 -146860 388685 197296 -544850 -810091 -86875 787458
13344G87458N7340m03607P3321L64330l43906j043359n87708L82893O07935K43044
$$ 787458 844798 441191 514512 878842 534936 -508423 -1096131 -713238 -105303 137741
13334A37741K00007L51919O2673k25442K65147Q48578K39657j061272j239828
$$ 137741 337748 689667 752340 526898 792045 1640623 1880280 819008 -420820
13325d20820m2893Q06103L83859j80380J16903N11909K7129p62975p30579K0010
$$ -420820 -463713 342390 726249 545869 662772 1174681 1201810 438835 -291744 -271734
13315b71734N18243M26897J77263N8737J7330N1470J48752R2579j77099l29281
$$ -271734 246509 673406 850669 909406 926736 978206 1126958 1219537 1042438 713157
13305G13157j80749o3918k14768k45336K13234P15246N05469l59374j004705q29186
$$ 713157 532408 468490 253722 8386 221620 936866 1442335 1082961 78256 -750930
13295g50930j13247M93273O68780M88520J21373l20077p27908r44118q02135k66387
$$ -750930 -864177 -370904 297876 786396 907769 587692 -140216 -1084334 -1886469 -2152856
13285b152856M32391Q72399P76984L06385p1710p7765O6876n0083m28856n93535
$$ -2152856 -1720465 -848066 -71082 235303 163593 85828 152704 102621 -326235 -919770
13275i19770k41664L05266N54577M97098M24258L13852m3098m07961k79870K03671
$$ -919770 -1161434 -856168 -301591 195507 619765 933617 890519 482558 202688 406359
13265D06359K83755k49374o32881l01648K07280J27612l24764l67736Q2099L65190
$$ 406359 690114 440740 -192141 -493789 -286509 -158897 -483661 -851397 -769298 -404108
13255d04108J65858r6719j4511K62605L69408K00826r0473k89311k32096N9148
$$ -404108 -238250 -334969 -349480 -86875 282533 483359 392886 103575 -128521 -69373
13245f9373L19114K77948l8939l55218m35030k52155L3740K02380J78726J19079
$$ -69373 249741 527689 488750 133532 -301498 -553653 -519913 -317533 -138807 -19728
13235a9728J48602J01491j95582m74298k90402K51000N16955K07615k58671l80678
$$ -19728 128874 230365 34783 -439515 -729917 -478917 38038 245653 -13018 -393696
13225c93696j75143L6209O8517o1839k06896j38642J90496M86637N17078M54580
$$ -393696 -568839 -532630 -464113 -525952 -732848 -871490 -680994 -194357 322721 777301
13215G77301M02826r072q62508j255650m16579Q36151J026181K20059j87903J38188
$$ 777301 1180127 1171055 308547 -947103 -1363682 -527531 498650 718709 530806 668994
13205F68994M7584q29009j246282n02900L26286K99138R6335M28707N48454k09922
$$ 668994 716578 -112431 -1358713 -1861613 -1535327 -1236189 -1139854 -711147 -162693 -372615
13195c72615q35635k55411O45899M06271n51252o76350J85546Q37557P92815N61239
$$ -372615 -1208250 -1463661 -817762 -411491 -962743 -1639093 -1453547 -615990 176825 738064
13185G38064K73062l03791o75918j84345N77333M63732l26564o01415j88043J7337
$$ 738064 1011126 707335 31417 -152928 424405 888137 561573 -39842 -227885 -210548
13175b10548j61266k7375L92748K96974k61369l37015J46443K22088k98820m54306
$$ -210548 -371814 -399189 -6441 290533 29164 -307851 -161408 60680 -238140 -692446
13165f92446P6574M00692Q0219j52568J18098K51364j05015l21526q0689j7377
$$ -692446 -615872 -215180 -134961 -287529 -169431 81933 -23082 -344608 -425297 -442674
13155d42674l80372l90371K80013O84260J78250l84944q1193N26263M13875j80597
$$ -442674 -823046 -1213417 -933404 -249144 -70894 -455838 -537031 -10768 403107 222510
13145B22510k97320R3438K06958j19609k37478J25581M08535J06276m85219o51215
$$ 222510 -74810 18628 225586 105977 -131501 -5920 402615 508891 23672 -627543
13135f27543j40844M93909M95278j47898o15498l68985P9822N7597j04429K92029
$$ -627543 -768387 -274478 220800 72902 -542596 -911581 -831759 -774162 -878591 -586562
13125e86562Q73310O18594l47880p41450j19924M42790J47777l52883k44536J55195
$$ -586562 286748 905342 557462 -183988 -303912 138878 286655 -66228 -310764 -155569
13115a55569K20257J23090K07925J39658l47417o11590n6319O91718O37438j1080
$$ -155569 64688 187778 395703 535361 187944 -423646 -479965 211753 849191 838111
13105H38111k37515J07317J76523l49125o92373k25190N34232O37195m9609p64268
$$ 838111 600596 707913 884436 535311 -157062 -382252 151980 789175 739566 -24702
13095b4702q25224l33797J08511J51136j8723q1410j628Q9312J53908J46659p1477
$$ -24702 -849926 -1183723 -1075212 -924076 -942799 -1024209 -1025837 -936525 -782617 -635958 -707435
13084g07435l85361l02416L59701R56380P73445O4867l29210k03412p4023j78606
$$ -707435 -1092796 -1395212 -1035511 -79131 694314 759181 429971 226559 152536 -26070
13074b6070k24838j22932j33077k22311p6120J91005J59232j9865K19388P28966
$$ -26070 -250908 -373840 -506917 -729228 -805348 -614343 -455111 -474976 -255588 473378
13064D73378O78563o5467o10428m22448n0012m5705j38705r60P7954j18904j91845
$$ 473378 1151941 1086474 476046 53598 3586 -42119 -180824 -181784 -103830 -222734 -414579
13053d14579J13075L46955J64009m3946P3050J37591j97476m94831k61836J60756
$$ -414579 -301504 45451 209460 165514 238564 376155 178679 -316152 -577988 -417232
13043d17232J74225j11795j86993J0109J83336K37863K06867J5541k24433j53119
$$ -417232 -243007 -354802 -541795 -531686 -348350 -110487 96380 111921 -112512 -265631
13033b65631J92509K58569o4076r2196M51638P09971l397q97597p61823J77745
$$ -265631 -73122 185447 121371 29175 480813 1190784 1187387 289790 -472033 -294288
13023b94288O14104J26977l61902j37166L38759K96804k41922o21743l81398L35786
$$ -294288 319816 446793 84891 -52275 286484 583288 341366 -280377 -661775 -325989
13013c25989R52531R33571K91415l73427n09603k20775n0123k62786n58037m67354
$$ -325989 626542 1560113 1851528 1478101 968498 747723 697600 434814 -123223 -590577
13003e90577P7937N79330M47947k39784o83377l54160K44559L31337M4033Q7552
$$ -590577 -512640 66690 514637 274853 -408524 -762684 -518125 -186788 -142755 -55203
12993e5203M01298K46097l46494m31613K08870N23852r5517p34616m38164K75503
$$ -55203 346095 592192 245698 -185915 22955 546807 451290 -283326 -721490 -445987
12983d45987M25347J86658K74906M22008j29442r95421r52850J47262J040738
$$ -445987 -20640 166018 440924 862932 733490 -261931 -1214781 -1067519 -26781
12974b6781Q30654M9164l72779l05609j70655j63983j97413k07792j65725j7714
$$ -26781 803873 853037 480258 174649 3994 -159989 -357402 -565194 -730919 -748633
12964g48633J77210K45068J25315p1158k39842l36572k98895j14221Q6782J83218
$$ -748633 -571423 -326355 -201040 -272198 -512040 -848612 -1147507 -1261728 -1174946 -991728
12954i91728K29582L11435L55174K44359J1439k05806k70159p1494L26753N55081
$$ -991728 -762146 -450711 -95537 148822 160261 -45545 -315704 -387198 -60445 494636
12944D94636K83734k53891m75820k49715j2714j1333J3332K08234K89237J16008
$$ 494636 778370 524479 48659 -201056 -213770 -225103 -211771 -3537 285700 401708
12934D01708o842P9556R0867p2645m5953K55447L00510j48640m92876k64240N4197
$$ 401708 394866 474422 565289 492644 446691 702138 1002648 854008 361132 96892 151089
12923A51089j00770l41239m0177M71172M03910j55481m12482j54211Q9472O7697
$$ 151089 50319 -290920 -331097 140075 543985 388504 -23978 -178189 -88717 -21020
12913b1020O2782J30928k3117l18957k66000J75472M36365K52084M3561J15098
$$ -21020 41762 172690 149573 -169384 -435384 -259912 176453 428537 472098 587196
12903E87196J29835k12210n16851k52342L52780N33270M5610m87017m41498m1055
$$ 587196 717031 504821 -12030 -264372 88408 621678 667288 180271 -261227 -302282
12893c02282K9085l02554l39181K79841Q61082N69963l01180p06605l40804O8686
$$ -302282 -273197 -575751 -914932 -635091 225991 795954 494774 -211831 -552635 -483949
12883d83949J3489j30525L3834K30931J44150M1496K20136L83454J26953l87550
$$ -483949 -470460 -600985 -567151 -336220 -192070 -150574 69562 453016 579969 192419
12873A92419p16671p06102m24340J3008K58851m1231n33252l81123M12465P76404
$$ 192419 -524252 -1230354 -1654694 -1641686 -1382835 -1424066 -1957318 -2338441 -1925976 -1149572
12863a149572K12070l00800J43082Q47415O36290k46759o39010l46998j74339
$$ -1149572 -937502 -1238302 -1095220 -247805 388485 141726 -497284 -844282 -1018621
12854a018621l25052j55846M66167Q21819N59307J76849L1286j55900m87840m95991
$$ -1018621 -1343673 -1499519 -1033352 -211533 347774 524623 555909 400009 -87831 -583822
12844e83822J8467M89871L90615m7796l13282l10000k02395q460K55164L50326
$$ -583822 -565355 -75484 315131 267335 -45947 -355947 -558342 -566802 -311638 38688
12834C8688J07723k65493m37743l49537j61175L1529K21922L27958K13617p8134
$$ 38688 146411 -119082 -556825 -906362 -1067537 -1036008 -814086 -486128 -272511 -350645
12824c50645k35552J1045M61174N61911J43091k41309q4192K49807Q5480l90848
$$ -350645 -586197 -575152 -113978 447933 591024 349715 265523 515330 600810 209962
12814B09962l85251J02451J85928l48745n34208J56918P74540L35596o07722q66080
$$ 209962 -175289 -72838 113090 -235655 -769863 -612945 161595 497191 -110531 -976611
12804i76611l57454J28648L19995M73177M59952L4123l05297Q5631P30495N61953
$$ -976611 -1334065 -1205417 -885422 -412245 47707 81830 -223467 -137836 592659 1154612
12794A154612l72228r24044n91061o5056J12117K63809O12524O72907J30967m97825
$$ 1154612 782384 -141660 -732721 -797777 -685660 -421851 190673 863580 994547 496722
12784D96722o12046k93139Q0904L96193N94167M63393M0712k48157j97073j29839
$$ 496722 -115324 -408463 -327559 68634 662801 1126194 1166906 918749 721676 591837
12774E91837k86858l57969j3936M69671N52064J71347k29332l16402k04745j78219
$$ 591837 304979 -52990 -66926 402745 954809 1126156 896824 580422 375677 197458
12764A97458k66148k13233J24117M71047M27179N0915j58228M0855K99128K27268
$$ 197458 -68690 -281923 -157806 313241 740420 791335 633107 673962 973090 1200358
12754A200358q6454l43026m40159l48648K838M09431M06430l6447l17433j00538
$$ 1200358 1113904 770878 330719 -17929 -15091 394340 800770 764323 446890 346352
12744C46352J31089q4873l72767j73260L02934M70296K59733o7318m92965q92151
$$ 346352 477441 392568 19801 -153459 149475 619771 879504 812186 319221 -572930
12734e72930o79395K91316J012850N67124l70944m50889K84738N76302J9345m77610
$$ -572930 -1252325 -961009 51841 618965 248021 -202868 81870 658172 677517 199907
12724A99907l99410l40116o31677o00299J54785Q43661O44537m8042l41596j76381
$$ 199907 -199503 -539619 -1171296 -1771595 -1616810 -773149 -128612 -176654 -518250 -694631
12714f94631j10302k14277m8145L97865N09929k7595o29961m98469K77907P40480
$$ -694631 -804933 -1019210 -1067355 -669490 -159561 -187156 -817117 -1315586 -1037679 -297199
12704b97199L19158l40498k78251L46449N11076j8061l11625J27863M92571P3474
$$ -297199 21959 -318539 -596790 -250341 260735 242674 -68951 58912 551483 624957
12694F24957m85524l20762J26673p4410o49962n80777J30179N05229K35219j1531
$$ 624957 139433 -181329 -54656 -129066 -779028 -1359805 -1229626 -724397 -489178 -500709
12684e00709J05819J83547K6694n9335j7647j14120k42192q8859O8140k76306
$$ -500709 -394890 -211343 -184649 -243984 -261631 -375751 -617943 -706802 -638662 -914968
12674i14968p82928o32342R8485N42053M78166M76733O11595L31870k51890k87406
$$ -914968 -1697896 -2330238 -2231753 -1689700 -1211534 -734801 -123206 208664 -43226 -330632
12664c30632L17704N79538K4877n68083m63736M7327L88029M51122K58077j93985
$$ -330632 -12928 566610 591487 23404 -440332 -393005 -4976 446146 704223 510238
12654E10238m71478p8337N07928K83031n95195q30075l0987O21480K82566l22714
$$ 510238 38760 -39577 468351 751382 156187 -673888 -704875 -83395 199171 -123543
12644a23543k88889P0918O9591j36003m9940K43443M07639M12141K35369k43518
$$ -123543 -412432 -341514 -271923 -407926 -457866 -214423 193216 605357 840726 597208
12634E97208o78509m70589J42357K62934j17075m2949N46765M53746o06310j134448
$$ 597208 -81301 -551890 -409533 -146599 -263674 -306623 240142 693888 87578 -1046870
12624a046870k17481Q10954M52993n83807o96278M5807L73011N4718q7065J07453
$$ -1046870 -1264351 -453397 -404 -584211 -1280489 -1234682 -861671 -806953 -894018 -786565
12614g86565P4295j05105J88572P53075P03311j9155m88271k25433K40051L31560
$$ -786565 -712270 -817375 -628803 124272 827583 808428 320157 94724 334775 666335
12604F66335Q1088k39789m39240l60293o3948J00520N0696J93133N95239N63764
$$ 666335 747423 507634 68394 -291899 -355847 -255327 -204631 -11498 583741 1147505
12594A147505k35055r17037n77251K57543M40359l7881k70932m3497K7190k21912
$$ 1147505 912450 -4587 -581838 -324295 116064 78183 -192749 -236246 -209056 -430968
12584d30968k73126J8555K05018J28774J03618J83157R3569j05915q3618R2292
$$ -430968 -704094 -685539 -480521 -351747 -248129 -64972 28597 -77318 -160936 -68644
12574f8644Q7288k0580N2258J19678j17710k93812J06942O75192N50944j65464
$$ -68644 18644 -1936 50322 170000 52290 -241522 -134580 540612 1091556 926092
12564I26092n52678l55454k20788m22674m84887k16872k8167p12K83504P34405
$$ 926092 373414 17960 -202828 -625502 -1110389 -1327261 -1355428 -1356140 -1072636 -338231
12554c38231O51860k6256m33722j65332P8727k25618n03298j31028M65263N66584
$$ -338231 313629 287373 -146349 -311681 -232954 -458572 -961870 -1092898 -627635 -61051
12544f1051L13917K72821L95390K58747n9016j57897j02531k58842n10202l80186
$$ -61051 252866 525687 921077 1179824 1120808 962911 860380 601538 91336 -288850
12534b88850J02772L54277J29981j39116r4673J0295j44351k85526O2087O97381
$$ -288850 -186078 168199 298180 159064 64391 74686 -69665 -355191 -293104 404277
12524D04277Q34402K03816m48535l51537J76350K07892l62310o46943j72529L51744
$$ 404277 1238679 1442495 993960 642423 818773 1026665 664355 17412 -155117 196627
12514A96627J47497m20399m48269J33970N84691N07017J98034o6181l28812m96124
$$ 196627 344124 -76275 -524544 -390574 194117 701134 899168 832987 504175 8051
12504H051k97372J49870L53189K01063J24253K92196K43985l30648r46093r20557
$$ 8051 -289321 -139451 213738 414801 539054 831250 1075235 744587 -201506 -1122063
12494a122063l01398K69241M28003L81042L74094L10320M9432k15160j76910Q7292
$$ -1122063 -1423461 -1154220 -726217 -345175 28919 339239 388671 173511 -3399 83893
12484H3893J82828K2334j396K76274L33995k37802q10607m39363N61563Q13935
$$ 83893 266721 289055 287659 563933 897928 660126 -150481 -589844 -28281 785654
12474G85654p7914p96039k77336O50144O33386o9550j93280L15436K79989n56526
$$ 785654 707740 -88299 -365635 284509 917895 848345 655065 970501 1250490 693964
12464F93964r83172l43231L39422N2030n48727k55125O79616Q89138j9216q87893
$$ 693964 -289208 -632439 -293017 -240987 -789714 -1044839 -365223 523915 504699 -383194
12454c83194o78997J77532N45031J32114k96696r6175M16354M89701j74m07505
$$ -383194 -1062191 -884659 -339628 -207514 -504210 -600385 -184031 305670 305496 -102009
12444a02009k22480K66398M27966J27546k20981k92221j60214J0535K17292M33065
$$ -102009 -324489 -58091 369875 497421 276440 -15781 -175995 -165460 51832 484897
12434D84897M23635k4224p28277j113251p20137K32166R30028Q07332K01604j26712
$$ 484897 908532 884308 156031 -957220 -1677357 -1445191 -515163 292169 493773 367061
12424C67061j4348N5528r5706l9203L65747N08146k0928o33497n90466j49844
$$ 367061 352713 408241 312535 273332 639079 1147225 1126297 492800 -97666 -247510
12414b47510p0295l29612k48991K63994N32672K33578j33613j01649J26540J51657
$$ -247510 -317805 -647417 -896408 -632414 -99742 133836 223 -101426 25114 176771
12404A76771m5576k22698j54674K89634R11585J050604K78273p64177r41226j79391
$$ 176771 131195 -91503 -246177 43457 955042 2005646 2283919 1519742 578516 399125
12394C99125L36299j50694q72524p12575J46659N47999M4388n53025l86926L04226
$$ 399125 735424 584730 -287794 -1000369 -853710 -305711 -261323 -814348 -1201274 -897048
12384h97048N93119J36277l75626j58819N41241O99806n6362q13189n94953K32482
$$ -897048 -303929 -167652 -543278 -702097 -160856 538950 482588 -330601 -925554 -693072
12374f93072N19298M9675k49603R9478L58072j24127p30911n22799K30405M46326
$$ -693072 -173774 -124099 -373702 -274224 83848 -40279 -771190 -1293989 -1063584 -617258
12364f17258p1583l46417K21936R11816P50274r9442o73932n98035l81742l54221
$$ -617258 -688841 -1035258 -813322 98494 848768 749326 75394 -522641 -904383 -1258604
12354a258604j10427N93729J062569N31442n13589q07252j05886M53206J07510
$$ -1258604 -1369031 -775302 287267 818709 305120 -502132 -608018 -154812 -47302
12345d7302m03072j41783M67243M24542r6875p1245N34660O16178j83116p57771
$$ -47302 -450374 -592157 -124914 299628 202753 131508 666168 1282346 1099230 341459
12335C41459k74538M87508L68550m02415o55464n3653N52769M34950j53023n20837
$$ 341459 66921 554429 922979 520564 -134900 -188553 364216 799166 646143 125306
12325A25306l85203J1757K90784K78133Q8048q1936k11987l70795m11513r6162
$$ 125306 -259897 -248140 42644 320777 408825 326889 114902 -255893 -667406 -763568
12315g63568M17198O30821L98972J08822j5784k30881n88488n90936n0116L42683
$$ -763568 -346370 284451 683423 792245 776461 545580 -42908 -633844 -683960 -341277
12305c41277L2760l68166L916P37140O66327k27081o87201j37886M61339K14676
$$ -341277 -308517 -676683 -672767 64373 730700 503619 -183582 -321468 139871 354547
12295C54547l51115l10144J45292J94431j60549j90358K46956M85181J76059k10171
$$ 354547 3432 -306712 -161420 33011 -127538 -317896 -70940 414241 590300 380129
12285C80129k08813j2150o004j52819j64534J8099J86505J34416j61274m84093
$$ 380129 171316 159166 153162 343 -164191 -146092 40413 174829 13555 -470538
12275d70538n00085j47277J50192l7123m85563n23234O8510P53945R47860O50557
$$ -470538 -970623 -1117900 -967708 -1004831 -1490394 -2013628 -1945118 -1191173 -243313 407244
12265D07244K36324m7421j85696k66940l96011n34841m17887R0277O10069O35612
$$ 407244 643568 596147 410451 143511 -252500 -787341 -1205228 -1114951 -504882 130730
12255A30730K62086k88r4312l88208p25319m19644M69658Q29714Q5659p77667
$$ 130730 392816 392528 298216 -89992 -815311 -1234955 -765297 64417 150076 -627591
12245f27591o26104J49548L99519N7885P543M37634O18885K76870k0888j893j01321
$$ -627591 -1253695 -1104147 -704628 -646743 -639200 -201566 417319 694189 673301 671408 570087
12234E70087m53030m92972R116M10441J80364l19207n26154m77076m09532j89097
$$ 570087 117057 -375915 -366799 43642 224006 -95201 -621355 -1098431 -1507963 -1697060
12224a697060K94994O58428N15320P5201k30491l60690m49392l44304J15381O14003
$$ -1697060 -1402066 -743638 -228318 -153117 -383608 -744298 -1193690 -1537994 -1422613 -808610
12214h08610O70786L13990J4673J319k469l14688p85423q62537k04245P71358
$$ -808610 -137824 176166 190839 192158 189689 -124999 -910422 -1772959 -1977204 -1205846
12204a205846J155400N69133l20403o43886m10535k23686j84991J39607P12975
$$ -1205846 -50446 518687 198284 -445602 -856137 -1079823 -1264814 -1125207 -412232
12195d12232Q57252L04206l29775m24655j03467J72994J95619l3611l77920m43044
$$ -412232 445020 749226 419451 -5204 -108671 64323 259942 226331 -151589 -594633
12185e94633K3900N27282L41472k91672l93703J60676L72720j95998o48337k87126
$$ -594633 -570733 -43451 298021 6349 -387354 -226678 146042 -49956 -698293 -985419
12175i85419K28049J22458j53654J04218M48915R2469n48925m48015L10495O93305
$$ -985419 -757370 -634912 -788566 -684348 -235433 -142964 -691889 -1139904 -829409 -136104
12165a36104L80006L2944j1313j41641m73155n06618l0550M69009N46933L00217
$$ -136104 243902 276846 265533 123892 -349263 -855881 -886431 -417422 129511 429728
12155D29728j2359k62658k88214m610K69305J34863k44073l62850j80747r9422
$$ 429728 417369 154711 -133503 -138113 131192 266055 21982 -340868 -521615 -621037
12145f21037j82206o8635K76304L88585M5107l74030m50799k18354N4497J88319
$$ -621037 -803243 -871878 -595574 -206989 -161882 -535912 -986711 -1205065 -1150568 -962249
12135i62249J19360m8775k347M05482P59107M92360k82881p95707n48299J45462
$$ -962249 -842889 -891664 -894011 -488529 270578 762938 480057 -315650 -863949 -718487
12125g18487O45016O69092L75886K9155k48931m85053o78770o54726k47800L38066
$$ -718487 -73471 595621 971507 1000662 751731 266678 -412092 -1066818 -1314618 -976552
12115i76552O23762M21507L3273k11902k59250o6948M47549R62271Q13295q9426
$$ -976552 -352790 68717 101990 -109912 -369162 -436110 11439 973710 1787005 1697579
12105A697579q88866p92987o5109M46281L86140M8271j88965j41058J48505L06881
$$ 1697579 808713 15726 -49383 396898 783038 831309 642344 501286 649791 956672
12095I56672m8268o20027o26313j330L29836j34186n96331k16514N21880O07130
$$ 956672 908404 288377 -337936 -339266 -9430 -143616 -739947 -956461 -434581 172549
12085A72549N3254l21555k22839k6155O6584J25317L3892k69823m15654j82311
$$ 172549 225803 -95752 -318591 -344746 -278162 -152845 -118953 -388776 -804430 -986741
12075i86741j5866k30437k77828L02874Q53165N77899n2839r8001K17648L5477
$$ -986741 -1002607 -1233044 -1510872 -1207998 -354833 223066 170227 72226 289874 325351
12065C25351m18215j81507O08393Q05512J51168m38689n46927o92308r16240m96814
$$ 325351 -92864 -274371 334022 1139534 1290702 852013 305086 -387222 -1303462 -1800276
12055a800276N24071R96787M24246k23542r1784L20956K03430k89147n19483l44963
$$ -1800276 -1276205 -279418 144828 -78714 -170498 150458 353888 64741 -454742 -799705
12045g99705M80L41712M44227J15731k85863j74087K56029K23416k60468k86067
$$ -799705 -799225 -457513 -13286 102445 -183418 -357505 -101476 121940 -138528 -424595
12035d24595L59560O73723P4286n76902l61882K45803K31425l82035p30859m31866
$$ -424595 -65035 608688 682974 106072 -255810 -10007 221418 -160617 -891476 -1323342
12025a323342R0030L33636K08030k3129L3694M79968Q19329M98534k30245n92698
$$ -1323342 -1233312 -899676 -691646 -714775 -681081 -201113 618216 1116750 886505 293807
12015B93807m32872k90639l11954n0652M69281N61573R5297j59333J41000L10570
$$ 293807 -139065 -429704 -741658 -792310 -323029 238544 333841 174508 315508 626078
12005F26078p1016l48664j2679K92811j21355p45336p07195j41875K41853L51631
$$ 626078 555062 206398 193719 486530 365175 -380161 -1087356 -1229231 -987378 -635747
11995f35747N03537N46044J67546l11064l54969j00750j1541j7656J57521J95643
$$ -635747 -132210 413834 581380 270316 -84653 -185403 -196944 -214600 -57079 138564
11985A38564l31834r35331o91128L00643R19790O02356K4676n3230J55639K6110
$$ 138564 -193270 -1128601 -1819729 -1519086 -599296 3060 27736 -25494 130145 156255
11975A56255m12637n59126j77416K82412L76778K86523M39348P19090N52687j29255
$$ 156255 -256382 -815508 -992924 -710512 -333734 -47211 392137 1111227 1663914 1534659
11965A534659n97523l77134m7084l23627p89339m71128N24074J035057N75535
$$ 1534659 937136 560002 512918 189291 -600048 -1071176 -547102 487955 1063490
11956A063490n1532j46298n0569k11949l08215J569K66504k3687n03956n04129
$$ 1063490 1011958 865660 815091 603142 294927 296496 563000 539313 35357 -468772
11946d68772q3095K22388K76630K86095K19172l2217j99198o843K27641Q859m87773
$$ -468772 -551867 -329479 -52849 233246 452418 420201 221003 214160 441801 450660 -37113
11935c7113o05223j69828L04705L89617K21515J18991J09725J3168k14714l86181
$$ -37113 -642336 -812164 -507459 -117842 103673 222664 332389 345557 130843 -255338
11925b55338l07632m0240J42395J02655J4177O4511J71876K11098K76148L89820
$$ -255338 -562970 -603210 -460815 -358160 -343983 -279472 -107596 103502 379650 769470
11915G69470K31438l68125q95939p12651m52M51067L09097n9168k91127l15458
$$ 769470 1000908 632783 -263156 -975807 -976259 -525192 -216095 -275263 -566390 -881848
11905h81848m6926M77034P32570K50183n31718p38954l10382P9333K31064N27412
$$ -881848 -928774 -451740 280830 531013 -705 -739659 -1050041 -970708 -739644 -212232
11895b12232Q51539N74622j95715n25364j36748J39766j99790n56131l94824j28965
$$ -212232 639307 1213929 1018214 492850 356102 495868 296078 -260053 -654877 -783842
11885g83842k07429k67958J07933N78553O30630L35328P124k62943l56841j02657
$$ -783842 -991271 -1259229 -1151296 -572743 57887 393215 400339 137396 -219445 -322102
11875c22102K10752O5083l25718j99239M11684O05313J44813j64397Q78n5147
$$ -322102 -111350 -46267 -371985 -571224 -159540 445773 590586 426189 427067 371920
11865C71920n26511n11848K87141P19841K8768p96142o16506J24571M39523L93037
$$ 371920 -154591 -666439 -379298 340543 369311 -426831 -1043337 -918766 -479243 -86206
11855h6206M20815J88467n11244p79929L159P75666L18536o69133o71023J93590
$$ -86206 334609 523076 11832 -768097 -764938 10728 329264 -339869 -1010892 -817302
11845h17302N71068K06044O4286L84655L65221k06130n77966m26904k68588l30146
$$ -817302 -246234 -40190 24096 408751 773972 567842 -10124 -437028 -705616 -1035762
11835a035762k23664J10328K26611O4113L0645J50499N7132j80737j46226P3429
$$ -1035762 -1259426 -1149098 -922487 -858374 -827729 -677230 -620098 -800835 -947061 -873632
11825h73632M0632j28579L8848L90009L49968J4673K1354L74634M28039M9580
$$ -873632 -833000 -961579 -922731 -532722 -182754 -168081 -146727 227907 655946 705526
11815G05526j94959q4047j4241j47007j78037n0626o2783j94386j21582P4984
$$ 705526 510567 426520 412279 265272 87235 36609 -26174 -220560 -342142 -267158
11805b67158J729k66818k92231j00352p7971j27195J75558O27885N67814J9610
$$ -267158 -265429 -532247 -824478 -924830 -1002801 -1129996 -954438 -326553 241261 260871
11795B60871k80691q9705N0314j46866k95563j52907Q985M7993J61599K74171
$$ 260871 -19820 -109525 -59211 -206077 -501640 -654547 -645562 -597569 -435970 -161799
11785a61799L1032m02360l67884K03675N41857J81117l82093n13758k41471J21611
$$ -161799 -130767 -533127 -901011 -697336 -155479 25638 -356455 -870213 -1111684 -990073
11775i90073N07269Q41713Q12837L21005k29735m33793l56673k67229k30803j87245
$$ -990073 -482804 358909 1171746 1492751 1263016 829223 472550 205321 -25482 -212727
11765b12727j28589k553K94654O61036P53409L73384k38340n89508l95102J05274
$$ -212727 -341316 -343869 -49215 611821 1365230 1738614 1500274 910766 515664 620938
11755F20938L05412j00572o39751o07621q7506J39495j78891l62868L6609M59206
$$ 620938 926350 825778 186027 -421594 -509100 -369605 -548496 -911364 -874755 -415549
11745d15549K92281j17025j40292N9612l6638k97937k37538P1585K08149J88217
$$ -415549 -123268 -240293 -380585 -320973 -357611 -655548 -893086 -821501 -613352 -425135
11735d25135K45507J83874k32875n91923l81941P6930J01820k45890l67922j56917
$$ -425135 -179628 4246 -228629 -820552 -1202493 -1125563 -1023743 -1269633 -1637555 -1794472
11725a794472L3637J66156M11034N39078K71196n0869K4476K22116P3960j32076
$$ -1794472 -1760835 -1594679 -1183645 -644567 -373371 -424240 -399764 -177648 -103688 -235764
11715b35764J01726M24826J96916l00508l54154j29040k50899m52951k6626O48616
$$ -235764 -134038 290788 487704 187196 -166958 -295998 -546897 -999848 -1026474 -377858
11705c77858N37675j99438l59070K54214N31480M5376k77434P8242L07166j92758
$$ -377858 159817 -39621 -398691 -144477 387003 432379 154945 233187 540353 347595
11695C47595p30419n45796r293J99197J65837K32613K30690l9680k50505j28666
$$ 347595 -382824 -928620 -937913 -738716 -572879 -340266 -109576 -149256 -399761 -528427
11685e28427N902j36768k26355J03881N79208O89994L76004p0194m01999m54085
$$ -528427 -522525 -659293 -885648 -781767 -202559 487435 863439 793245 391246 -62839
11675f2839j80265J44621J59043m4897m7336K17248M05917L69143K54331P9938
$$ -62839 -243104 -98483 60560 15663 -31673 185575 591492 960635 1214966 1294904
11665A294904j88361k67571M3171K67780j29528p11459o01129P9771L73809N0282
$$ 1294904 1106543 838972 882143 1149923 1020395 308936 -292193 -212422 161387 211669
11655B11669j55646N4015J24776j27932j16620L03580M02953j11995m56222p4405
$$ 211669 56023 110038 234814 106882 -9738 293842 696795 584800 128578 54173
11645E4173L94703J95082l32072l96603r088J68244j52204n75808n41390J12006
$$ 54173 448876 643958 311886 -84717 -93805 74439 -77765 -653573 -1194963 -1082957
11635a082957Q68827Q74394k2346p80645m22144M82877N67141k57746p02937j43734
$$ -1082957 -214130 660264 637918 -142727 -564871 -81994 485147 227401 -475536 -619270
11625f19270N62618N99793K40489p9608m82746q64171n84125L49510Q71912L81752
$$ -619270 -56652 543141 783630 704022 221276 -642895 -1227020 -877510 -5598 376154
11615C76154l20088l46198J0789J09276P4334K00316J46652l18362n85583j95061
$$ 376154 56066 -290132 -279343 -170067 -95733 104583 251235 -67127 -652710 -847771
11605h47771J98810j17610n89277k48780O33761R27545L43763l29798n12382l61647
$$ -847771 -648961 -766571 -1355848 -1604628 -970867 -43322 300441 -29357 -541739 -903386
11595i03386j21557J61494K85938M2383k60864r4732M40725O77867L48585p0158
$$ -903386 -1024943 -863449 -577511 -535128 -795992 -890724 -449999 227868 576453 506295
11585E06295r9106J19330J38762j41502l63484j81825K65659M65009J69518k41321
$$ 506295 407189 526519 665281 523779 160295 -21530 244129 709138 878656 637335
11575F37335k80422l3985O4846l2365j4075J36973J28885k5589l2863L0648k06182
$$ 637335 356913 322928 387774 355409 341334 478307 607192 581603 548740 579388 373206
11564C73206o28093o82251l17189q4248j56751r6825J96264K27304r3160j38137
$$ 373206 -254887 -937138 -1254327 -1338575 -1495326 -1592151 -1395887 -1168583 -1261743 -1399880
11554a399880L13804N83879K50776j20997m5862m21m53221q38431m46949K98169
$$ -1399880 -1086076 -502197 -251421 -372418 -418280 -418701 -871922 -1710353 -2157302 -1859133
11544a859133M70595J00153j2022L17773M39450K0023m28031l38597J58184M85195
$$ -1859133 -1388538 -1288385 -1300407 -982634 -543184 -523161 -951192 -1289789 -1131605 -646410
11534f46410L10512j37083l39433r0451K16990J23631j85908j70004J21906P6351
$$ -646410 -335898 -472981 -812414 -902865 -685875 -562244 -748152 -918156 -796250 -719899
11524g19899l66396m23501K91464R79763P28261j81282p21177n05507n3394J15506
$$ -719899 -1086295 -1509796 -1218332 -238569 489692 308410 -412767 -918274 -971668 -856162
11514h56162J7803j02715j20588j8325J56466K76282K37797Q9511O446J55601
$$ -856162 -838359 -941074 -1061662 -1079987 -923521 -647239 -409442 -319931 -313485 -157884
11504a57884M96348O35335J37977p74107j191232o16163K77158N78033M14047
$$ -157884 338464 973799 1111776 337669 -853563 -1469726 -1192568 -614535 -200488
11495b00488M60975N75281Q3970o98272o13206M31077J028218L10018p60224q83872
$$ -200488 260487 835768 919738 221466 -391740 39337 1067555 1377573 617349 -266523
11485b66523k18540K23451J80206J44380K64363K12864o2239k38973k01775j50231
$$ -266523 -485063 -261612 -81406 62974 327337 540201 477962 238989 37214 -113017
11475a13017j75630j60406o9110k3250q2732j23831M4293M24981O69676L79214
$$ -113017 -288647 -449053 -518163 -541413 -624145 -747976 -703683 -278702 390974 770188
11465G70188k72917n63431j79025K73101J73378j89278k26166l2211L4166J76670
$$ 770188 497271 -66160 -245185 27916 201294 12016 -214150 -246361 -212195 -35525
11455c5525N76780N69966l63030j286755r32172K46484P17281K89339J09992L85825
$$ -35525 541255 1111221 748191 -538564 -1470736 -1224252 -506971 -217632 -107640 278185
11445B78185J20735p07480q21190K3654M53174p3411k94129M38076Q21860n5487
$$ 278185 398920 -308560 -1129750 -1106096 -652922 -726333 -1020462 -582386 239474 183987
11435A83987r44894n10195M66006N85458J28563J36205L93265Q6494m57881l82098
$$ 183987 -760907 -1271102 -805096 -219638 -91075 45130 438395 524889 67008 -315090
11425c15090R0819J83901L8614K40233N23939L16007o7957n9836m395m14318p78066
$$ -315090 -224271 -40370 -1756 238477 762416 1078423 1010466 950630 946235 531917 -246149
11414b46149m26068J37810J20464q8064K56293O97139L80773k67033k69200J09144
$$ -246149 -672217 -534407 -413943 -502007 -245714 451425 832198 565165 295965 405109
11404D05109m0983m39383j54996M64766K69937n57467p42380j73706L080l99587
$$ 405109 364126 -75257 -230253 234513 504450 -53017 -795397 -969103 -966023 -1365610
11394a365610k74348N94286R27598J41022n91681k77716L55154J94652n38402
$$ -1365610 -1639958 -1045672 -118074 22948 -568733 -846449 -491295 -296643 -835045
11385h35045q53437m27004L14791Q91714R60566M25857k10962k49480J64030J52109
$$ -835045 -1688482 -2115486 -1800695 -908981 51585 477442 266480 17000 181030 333139
11375C33139m45449o68974L9116Q44222P49808M4427k97870q4998R9731N866o6400
$$ 333139 -112310 -781284 -742168 102054 851862 896289 598419 513421 613152 619018 552618
11364E52618l1860j89939n26790n21519N8937O45844N58091n6403m33481k74076
$$ 552618 520758 330819 -195971 -717490 -658553 -12709 545382 488979 55498 -218578
11354b18578r2238l22004n96825l52167K37081N27174L98994K97162L57824K41530
$$ -218578 -310816 -632820 -1229645 -1581812 -1344731 -817557 -418563 -121401 236423 477953
11344D77953j04241k67397j25538o0368k08671k19199L958O8048j12231o9609
$$ 477953 373712 106315 -19223 -79591 -288262 -507461 -503503 -435455 -547686 -617295
11334f17295L19596M99786K00717q1092j7242j2954l15210m31656o4287K27597
$$ -617295 -297699 202087 402804 321712 304470 291516 -23694 -455350 -519637 -292040
11324b92040q861l12748j96318j6698j66693k20652K16002N87728L04759j34566
$$ -292040 -300901 -613649 -809967 -826665 -993358 -1214010 -998008 -410280 -105521 -240087
11314b40087N725L51777N2488p12377r79167m52935K73800O98320P47693M39389
$$ -240087 -234362 117415 169903 -542474 -1521641 -1974576 -1700776 -1002456 -254763 184626
11304A84626r711p7721L37613N35092O1917m42226k75362J20052k4147m12417
$$ 184626 174915 97194 434807 969899 1031816 589590 314228 434280 410133 -2284
11294b284k68753K04314J92253k57903l72140m1933J07052q4369j62260m9691
$$ -2284 -271037 -66723 125530 -132373 -504513 -546446 -439394 -523763 -686023 -735714
11284g35714j24049l23190j72483K69393M10081J19938r4400M1409K55094K93545
$$ -735714 -859763 -1182953 -1355436 -1086043 -675962 -556024 -650424 -609015 -353921 -60376
11274f0376J68147j00504m09602m13597J294L41513J79703j45053j20434P0460
$$ -60376 107771 7267 -402335 -815932 -814638 -473125 -293422 -438475 -558909 -488449
11264d88449j6870k23906j44848O0498K4259m4688K36771N96528M98061L2106
$$ -488449 -505319 -729225 -874073 -813575 -789316 -834004 -597233 -705 497356 529462
11254E29462l20898m33883l72567l4908L55435J14593p20015r41834M3809R36110
$$ 529462 208564 -225319 -597886 -632794 -277359 -162766 -882781 -1824615 -1780806 -844696
11244h44696L93741p11029n80722O14954J066232K60616m10272r4726L70634K04689
$$ -844696 -450955 -1161984 -1742706 -1127752 -61520 199096 -211176 -305902 64732 269421
11234B69421j01932J0485J31792j82244n12038l56880J4894J37424R0172J28937
$$ 269421 167489 177974 309766 127522 -384516 -741396 -726502 -589078 -498906 -369969
11224c69969J48341j2250j70756q6187J76028L77431L53791Q2956k50398l50683
$$ -369969 -221628 -233878 -404634 -490821 -314793 62638 416429 499385 248987 -101696
11214a01696k12891j84673l64170l55563R467K57889Q8034l3765K56390M32347
$$ -101696 -314587 -499260 -863430 -1218993 -1209526 -951637 -863603 -897368 -640978 -208631
11204b08631O339m00450M3931Q95628R65237N9668q37744r55938m15733K79879
$$ -208631 -202292 -602742 -558811 336817 1302054 1361722 523978 -431960 -847693 -567814
11194e67814O31038K79719m81557o90705N2031Q04094N47159l07723o09172j36241
$$ -567814 63224 342943 -138614 -829319 -777288 26806 573965 266242 -342930 -479171
11184d79171M09791O01729M83884M9782n07925n43951Q6607M37391j63420q82469
$$ -479171 -69380 532349 1016233 1066015 558090 14139 100746 538137 374717 -507752
11174e07752o48222J32074M10127K70387M13669N85984J24452n02904l48012K85026
$$ -507752 -1155974 -1023900 -613773 -343386 70283 656267 780719 277815 -70197 214829
11164B14829L66853m5594j42590k6193l25118o07222k0678Q45651O68885k97885
$$ 214829 581682 536088 393498 367305 42187 -565035 -585713 259938 928823 630938
11154F30938n86748j0219K27368j59554j97973K92886L78092o9748j43840J69097
$$ 630938 44190 33971 261339 101785 -96188 196698 574790 505042 361202 530299
11144E30299j07900q12881n72942O52031J126512J56034p46127m14932K24983
$$ 530299 422399 -390482 -963424 -311393 815119 971153 225026 -189906 35077
11135C5077P0682l12874l2654M60930L59772n1302j35312q1657k75384l88924
$$ 35077 105759 -207115 -239769 221161 580933 529631 394319 312662 37278 -351646
11125c51646p0678K44742N7146l50086m50324k26124R7811M09588M82613J28721
$$ -351646 -422324 -177582 -120436 -470522 -920846 -1146970 -1049159 -639571 -156958 -28237
11115b8237k42570n7267L73221K40401l22391l99194N9078J25087l80199n21697
$$ -28237 -270807 -328074 45147 285548 -36843 -436037 -376959 -251872 -632071 -1153768
11105a153768M3948M54773K01907r3870J9947R8869r4571p1994K54851K23717
$$ -1153768 -1109820 -655047 -453140 -547010 -527063 -428194 -522765 -594759 -339908 -116191
11095a16191k71253m26140p569J60264k48200m05152J24577N63324L63219J23116
$$ -116191 -387444 -813584 -821153 -660889 -909089 -1314241 -1189664 -626340 -263121 -140005
11085a40005L03468L52652o7768k89167N4228J90818l61853p56024k49168M31337
$$ -140005 163463 516115 448347 159180 213408 404226 42373 -713651 -962819 -531482
11075e31482K90431l12389l98745J7961J69035j50365m50926l77545J6707M83656
$$ -531482 -241051 -553440 -952185 -934224 -765189 -915554 -1366480 -1744025 -1727318 -1243662
11065a243662O45389K96200j25834Q436M67008L98802k30463m78016L6204N39047
$$ -1243662 -598273 -302073 -427907 -419471 47537 446339 215876 -262140 -225936 313111
11055C13111M36153J24792K5383r4014l22022k26408J83005J89686l59198n95646
$$ 313111 749264 874056 899439 805425 483403 256995 440000 629686 270488 -325158
11045c25158p3741L92744O1055n36779n08216P3678M99024M49052J00955k64520
$$ -325158 -398899 -6155 54900 -481879 -990095 -916417 -417393 31659 132614 -131906
11035a31906l62602j16481P5179j24305k73995J79653P22335M16705m04376m99583
$$ -131906 -494508 -610989 -535810 -660115 -934110 -754457 -32122 384583 -19793 -519376
11025e19376J97222M36326j60496m47337J94073P74958M24703k52746m01170k21922
$$ -519376 -322154 114172 -46324 -493661 -299588 475370 900073 647327 246157 24235
11015B4235j93471j04721K74512N13546K69016j10366k79631l62491l49410P988
$$ 24235 -169236 -273957 555 514101 783117 672751 393120 30629 -318781 -310793
11005c10793M00958J47021n41336o51044k4041L57735O8257j48502J34745L31066
$$ -310793 90165 237186 -304150 -955194 -979235 -621500 -553243 -701745 -567000 -235934
10995b35934J14158J1398K21070K06465o0284J14929O46584M98289m26744q26756
$$ -235934 -121776 -110378 110692 317157 256873 371802 1018386 1516675 1089931 263175
10985B63175j17697N80651L51308j78822k42435j62489k90460j76058K91699L27980
$$ 263175 145478 726129 1077437 898615 656180 493691 203231 27173 318872 646852
10975F46852k72584n24050N409L14735k16799o57938k41554K37497n0912m39405
$$ 646852 374268 -149782 -144373 170362 -46437 -704375 -945929 -708432 -759344 -1198749
10965a198749p2573M88678L45212j03486L4399N31011N08939q6272n44918m60214
$$ -1198749 -1271322 -782644 -437432 -540918 -506519 24492 533431 447159 -97759 -557973
10955e57973Q900M63121M10485k82732q72646n14584L70181O05241J32890k1131
$$ -557973 -549073 -85952 324533 41801 -830845 -1345429 -975248 -370007 -237117 -258248
10945b58248L09137K12197l67929l55167L72196N47632k31679p50625l71948k7491
$$ -258248 50889 263086 -104843 -460010 -87814 459818 228139 -522486 -894434 -921925
10935i21925k32100j32593N37445O17613k66411o78654J90474J008900N69182
$$ -921925 -1154025 -1286618 -749173 -131560 -397971 -1076625 -886151 122749 691931
10926F91931k91253m41236l26082o07227o47917R3452P21032M50855K3640J81426
$$ 691931 400678 -40558 -366640 -973867 -1621784 -1528332 -807300 -356445 -332805 -151379
10916a51379K65431k83939o15472r8424L13489j70084o29478j47775M87543L47242
$$ -151379 114052 -169887 -785359 -883783 -570294 -740378 -1369856 -1517631 -1030088 -682846
10906f82846P8006M50987P08571L6276p35527n72468l6121m1883j69608K06569
$$ -682846 -604840 -153853 554718 590994 -144533 -717001 -753122 -795005 -964613 -758044
10896g58044M73663M4923l11337L9150K31861l87244p38459P6681Q90458L92036
$$ -758044 -284381 -239458 -550795 -511645 -279784 -667028 -1405487 -1328806 -438348 -46312
10886d6312n19085l06066N81371O95824O9907k82442l26285n73849o45997n8796
$$ -46312 -565397 -871463 -290092 405732 475639 193197 -133088 -706937 -1352934 -1411730
10876a411730M76307K01019k30401j4329K21733k62933o59034m6830O94204L08862
$$ -1411730 -935423 -734404 -964805 -979134 -757401 -1020334 -1679368 -1726198 -1031994 -723132
10866g23132n78999n60484J65203L94344P4400J7945J94474K6787k61156j28329
$$ -723132 -1302131 -1862615 -1697412 -1303068 -1228668 -1210723 -1016249 -989462 -1250618 -1378947
10856a378947J14519m2530k51535q0401Q2977l5982R3007N46371M09822m16968
$$ -1378947 -1264428 -1306958 -1558493 -1638894 -1555917 -1591899 -1498892 -952521 -542699 -959667
10846i59667n47438N03410J114546K42890o48236j28928O90354K69978n81226
$$ -959667 -1507105 -1003695 110851 353741 -294495 -423423 266931 536909 -44317
10837d4317l59107L21716J7513p88168o65152J32722L45981N4311J63795M49168
$$ -44317 -403424 -81708 -64195 -852363 -1517515 -1384793 -1038812 -984501 -820706 -371538
10827c71538J46406l59649k90758J498o6490N415O19757Q90126K53926j97696
$$ -371538 -225132 -584781 -875539 -874041 -940531 -935116 -315359 574767 828693 630997
10817F30997L22323O65699j21727q46325l41834K78546k54428q85516k79000N21351
$$ 630997 953320 1619019 1497292 650967 309133 587679 333251 -552265 -831265 -309914
10807c09914O6382o53565q8766Q31790M27763n27570l11149M74234J78472o58450
$$ -309914 -243532 -897097 -985863 -154073 273690 -253880 -565029 -90795 87677 -570773
10797e70773m62970J80197l11468j213828o21506R38536J258713K21065k99991
$$ -570773 -1033743 -853546 -1165014 -2378842 -3000348 -2061812 -803099 -582034 -882025
10788h82025J54401L13159p2892j8556L90402J16922o22651o76718j47562j5251
$$ -882025 -727624 -414465 -487357 -505913 -115511 1411 -621240 -1297958 -1445520 -1460771
10778a460771r3371M05022R04999L53755o08263o21331k4522n8727m55495j03972
$$ -1460771 -1554142 -1149120 -244121 109634 -498629 -1119960 -1144482 -1203209 -1658704 -1762676
10768a762676O64587P07009K08607R3444J79413j12749l08677k7528j67389j019539
$$ -1762676 -1098089 -391080 -182473 -89029 90384 -22365 -331042 -358570 -525959 -1545498
10758a545498r93944N97235J575045K84824j258948o10541R16581O99685n88034
$$ -1545498 -2539442 -1942207 -367162 -82338 -1341286 -1951827 -1035246 -335561 -923595
10749i23595n75436L51594J54573p20732l32847P72055N42794n66278m73286N00574
$$ -923595 -1499031 -1147437 -992864 -1713596 -2046443 -1274388 -731594 -1297872 -1771158 -1270584
10739a270584L56776n98635l80138P23903O67926m12604n28250L59308M75771
$$ -1270584 -913808 -1512443 -1892581 -1168678 -500752 -913356 -1441606 -1082298 -606527
10730f06527k84280m84207j73930m02421m99518O73405J721139O48141j221755
$$ -606527 -890807 -1375014 -1548944 -1951365 -2450883 -1777478 -56339 591802 -629953
10721f29953j139171K93854L61787p36585n18646Q70452R63325k49023m08879
$$ -629953 -1769124 -1475270 -1113483 -1850068 -2368714 -1498262 -534937 -783960 -1192839
10712a192839N71676M85787o59454o10247O20969O73390n67449p11967N07158
$$ -1192839 -621163 -135376 -794830 -1405077 -784108 -110718 -678167 -1390134 -882976
10703h82976P18239n36277r75882J11790P77150K24496r1463L00219J98827l69356
$$ -882976 -164737 -701014 -1676896 -1565106 -787956 -563460 -654923 -354704 -155877 -525233
10693e25233j01589O11275K02395p32228l08394P92504L34214j037897p13505
$$ -525233 -626822 -15547 186848 -545380 -853774 -61270 272944 -764953 -1478458
10684a478458Q50653O79728j176992j502735L41757J355249K73646o21803J729
$$ -1478458 -627805 51923 -1125069 -2627804 -2286047 -930798 -657152 -1278955 -1277226
10675a277226N78063J97905P6116N19371K02425p71903p03976L16312M23321m03404
$$ -1277226 -699163 -501258 -425142 94229 296654 -475249 -1179225 -862913 -439592 -842996
10665h42996l78411M29134K68537o01166l29979O82809M56790m77542K2996J239767
$$ -842996 -1221407 -792273 -523736 -1124902 -1454881 -772072 -315282 -792824 -769828 469939
10655D69939O42928j081029r65521O69166P37030p75767q49331P25666R95051
$$ 469939 1112867 31838 -933683 -264517 472513 -303254 -1152585 -426919 568132
10646E68132m72586r60478L4899J69728p37745m41655P53051K34198j470829j124441
$$ 568132 95546 -864932 -830033 -660305 -1398050 -1839705 -1086654 -852456 -2323285 -3447726
10636c447726J077830J550469j82390r02061O3137O2572j020740m00473J573292
$$ -3447726 -2369896 -819427 -1001817 -1903878 -1840741 -1778169 -2798909 -3199382 -1626090
10627a626090J391060q87925j337792O04336J185239m75825r67997N36102P78924
$$ -1626090 -235030 -1122955 -2460747 -1856411 -671172 -1146997 -2114994 -1578892 -799968
10618g99968r07615j199218N47375R71077n43092o31038J130842J108254j079563
$$ -799968 -1707583 -2906801 -2359426 -1388349 -1931441 -2562479 -1431637 -323383 -1402946
10609a402946j361892R67020J605745o48168j612137K79854J183453n10953j192361
$$ -1402946 -2764838 -1797818 -192073 -840241 -2452378 -2172524 -989071 -1500024 -2692385
10600b692385O39696J386031m79094j391304K79729J166746l39174j130490J93158
$$ -2692385 -2052689 -666658 -1145752 -2537056 -2257327 -1090581 -1429755 -2560245 -2367087
10591b367087P74786k71907p0257J495599Q11930j930460k009787J001920J885763
$$ -2367087 -1592301 -1864208 -1934465 -438866 373064 -1557396 -3567183 -2565263 -679500
10582f79500o11529j462705R20888J698080q12805j782336O12365J576727q26252
$$ -679500 -1291029 -2753734 -1832846 -134766 -947571 -2729907 -2117542 -540815 -1367067
10573a367067j856901M85900J541016o30511j360203J103058J785815j071421
$$ -1367067 -3223968 -2738068 -1197052 -1827563 -3187766 -2084708 -298893 -1370314
10565a370314k054680R65758K335535o68665k591822k51350J535398k21158j141278
$$ -1370314 -3424994 -2459236 -123701 -792366 -3384188 -3635538 -2100140 -2321298 -3462576
10556c462576J071580J740077j053936k093977N46817J305423j654063k212539
$$ -3462576 -2390996 -650919 -1704855 -3798832 -3252015 -1946592 -3600655 -5813194
10548e813194J543471K727126j213133l021234O80776K849789l68929k393161
$$ -5813194 -4269723 -1542597 -2755730 -5776964 -5096188 -2246399 -2615328 -5008489
10540e008489N60586K131342j103437k575821Q67550K251265j371430k401801
$$ -5008489 -4447903 -2316561 -3419998 -5995819 -5128269 -2877004 -4248434 -6650235
10532f650235K021965L389777j535854l503513J294197L125259k231477m421741
$$ -6650235 -4628270 -1238493 -2774347 -6277860 -4983663 -1858404 -4089881 -8511622
10524h511622J347566M135130j571866m459592J528623M607599j764220n093936
$$ -8511622 -7164056 -3028926 -4600792 -9060384 -7531761 -2924162 -4688382 -9782318
10516i782318J827311N666572j777310o460082J010615O173408j399590o906860
$$ -9782318 -7955007 -2288435 -4065745 -10525827 -9515212 -3341804 -4741394 -11648254
10508a1648254P75307O138694k498893q216055J646362Q240156k758347j0404355
$$ -11648254 -10872947 -4734253 -7233146 -15449201 -13802839 -5562683 -8321030 -18725385
10500a8725385J757910J0287587l986006j4391549J958656J4085423o265064k2002153
$$ -18725385 -16967475 -6679888 -10665894 -25057443 -23098787 -9013364 -15278428 -37280581
10492c7280581L618106K3916853j4153431m7131611K7477091J59889505J75182151
$$ -37280581 -33662475 -9745622 -23899053 -71030664 -43553573 116335932 291518083
10485B91518083K4541614j25453932j21421010k2617926K0294158j3116231l0611061
$$ 291518083 316059697 190605765 69184755 46566829 66860987 53744756 23133695
10478B3133695j729630J4642295n849559j7955954j62042J1356909k456276j1689364
$$ 23133695 21404065 36046360 30196801 12240847 12078805 23435714 20979438 9290074
10470I290074N52888Q778925k043190r458678K91325P118437j851411q477088
$$ 9290074 9842962 18621887 16578697 7120019 7411344 14529781 12678370 4201282
10462D201282l61749O386847l455n379740R00803N767549p18246o242660q91220
$$ 4201282 3839533 10226380 10222925 4843185 5743988 11511537 10793291 4550631 3659411
10453C659411M425410K38726m030150n2478L498833o06429l828235M33046L590074
$$ 3659411 8084821 8323547 4293397 4240919 7739752 7133323 3305088 3738134 7328208
10444G328208p93183m218607j02432L541074R2490l164715L0222K921234k29170
$$ 7328208 6535025 2316418 2213986 5755060 5847550 2682835 2713057 5634291 5405121
10435E405121k846841M47632L127145n3669k722413K03872K457703q76260l426352
$$ 5405121 2558280 3005912 6133057 6079388 3356975 3560847 6018550 5142290 1715938
10426A715938q9342K879247O0486k783201k15996K510962K02882k209443J32969
$$ 1715938 1626596 4505843 4566329 1783128 1567132 4078094 4280976 2071533 2204502
10417B204502K328632l42066k919800n29196K096134N2801k178476J97071K710808
$$ 2204502 4533134 4191068 1271268 742072 2838206 2891007 712531 909602 3620410
10408C620410L62697k609059q87205J992495Q98598j244423P4118J925859R4726
$$ 3620410 3983107 1374048 486843 2479338 3377936 2133513 2207631 4133490 4228216
10399D228216k330269r30625J588129Q96931q52269j284J254253k10665j728731
$$ 4228216 1897947 967322 2555451 3452382 2600113 2598829 3853082 3642417 1913686
10390A913686r9679J822554N47681j371860n44199P41823m83210j719535r7517
$$ 1913686 1814007 3636561 4184242 2812382 2268183 3010006 2526796 807261 709744
10381G09744J649824M18884j270180m10311O51299o84637j725233J18940J816237
$$ 709744 2359568 2778452 1508272 1097961 1749260 1064623 -660610 -541670 1274567
10372A274567M44298j025884M35964J871917J88164j558319o0450J601552j36496
$$ 1274567 1718865 692981 1128945 3000862 3189026 1630707 1570257 3171809 3035313
10363C035313k175569m95688K038248R03532j677872j037856J342918J064615
$$ 3035313 859744 364056 2402304 3305836 1627964 590108 1933026 2997641
10355B997641r25238p34803Q44543L56126j271785o69163J197685Q42500j066376
$$ 2997641 2072403 1337600 2182143 2538269 1266484 597321 1795006 2637506 1571130
10346A571130j141750L41137M64231n33981j66919J061084P21091n93475m52160
$$ 1571130 429380 770517 1234748 700767 533848 1594932 2316023 1722548 1270388
10337A270388O25473L51666p43690m84230N96247M40528m25237j58281N34270
$$ 1270388 1895861 2247527 1503837 1019607 1615854 2056382 1631145 1472864 2007134
10328B007134j35944j241298p68683M85630M50914l67184k28013L15989j88139
$$ 2007134 1871190 629892 -138791 346839 797753 430569 202556 518545 330406
10319C30406q82274k70708O42515K65028l87885K68124J110564M17170p28789
$$ 330406 -551868 -822576 -180061 84967 -302918 -34794 1075770 1492940 764151
10310G64151m64623M03830K36088k11029L84209R55393J56092p22591j37958O18468
$$ 764151 299528 703358 939446 728417 1112626 2068019 2224111 1501520 1363562 1982030
10300A982030r2957j009720m41252M08784q3812o31654L74363J414360N61719
$$ 1982030 1889073 879353 438101 846885 763073 131419 505782 1920142 2481861
10291B481861p60698m13036M59902j63733j119536l49252R34403M39634q20776
$$ 2481861 1721163 1308127 1768029 1604296 484760 135508 1069911 1509545 688769
10282F88769m29410R07426P89723m52510o99871l6285n1129m56893J9099O72705
$$ 688769 259359 1166785 1956508 1503998 804127 767842 716713 259820 278919 951624
10272I51624J73696n12366J23070R90361L61036o84370k40479O83146O3787j107078
$$ 951624 1125320 612954 736024 1726385 2087421 1403051 1162572 1845718 1909505 802427
10262H02427n40672R98511R72215m19208q35006M518L88914Q9694K33169M49631
$$ 802427 261755 1260266 2232481 1813273 978267 982785 1371699 1461393 1694562 2144193
10252B144193m26368j494291r35740O20927J051244L58656K25801O59971K66459
$$ 2144193 1717825 223534 -712206 -91279 959965 1318621 1544422 2204393 2470852
10243B470852o94659o43131L03976N21363k31557o83918m18268m5489L66557Q77309
$$ 2470852 1776193 1133062 1437038 1958401 1726844 1042926 624658 579169 945726 1823035
10233A823035O04979p46670j470661k81906J190351Q47545l90584l30205O57075
$$ 1823035 2428014 1681344 210683 -71223 1119128 1966673 1576089 1245884 1902959
10224A902959N91923m53217p76190k61715j69880m42025q1404M76591J27000n10131
$$ 1902959 2494882 2041665 1265475 1003760 833880 391855 310451 787042 914042 403911
10214D03911j53627M95654o7172j141165q44925N29051J037703M07746M5788K17868
$$ 403911 250284 745938 678766 -462399 -1307324 -778273 259430 667176 712964 930832
10204I30832l1225n27581k11236N55214M47363l22357l80859K25886K09660m52985
$$ 930832 899607 372026 160790 716004 1163367 841010 460151 686037 895697 442712
10194D42712n19876J58639M73265J71720J34473N76071P46439L67299j21774n29206
$$ 442712 -77164 81475 554740 726460 860933 1437004 2183443 2550742 2428968 1899762
10184A899762q59524p58450j43083L00930K46740L46237P86500O31085l24010
$$ 1899762 1040238 281788 138705 439635 686375 1032612 1819112 2450197 2126187
10175B126187p49228j14351J30775p63449j147613J45839J420624Q68205l84141
$$ 2126187 1376959 1262608 1393383 629934 -517679 -371840 1048784 1916989 1532848
10166A532848m54099N5910l00455p79628J4393J111399O83503o73377j017601
$$ 1532848 1078749 1134659 834204 54576 68969 1180368 1863871 1190494 172893
10157A72893l17481N9605J8421K97002M62233j32864n39296J87186Q60557J28638
$$ 172893 -144588 -84983 -66562 230440 692673 559809 20513 207699 1068256 1196894
10147A196894q59919l98557O27035L64138o19938n40996K78906L12592j20728
$$ 1196894 336975 -61582 565453 929591 309653 -231343 47563 360155 239427
10138B39427K38557P38783l806j066579n29767J007024J329972L02822l62462
$$ 239427 477984 1216767 1212961 146382 -383385 623639 1953611 2256433 1893971
10129A893971k99490m64565o45825J3019O95469Q4223q77978l95357P93585N81135
$$ 1893971 1594481 1129916 484091 497110 1192579 1276802 398824 3467 797052 1378187
10119A378187o72114p67709L82890P96399J03597j19801L92573K34705o94873
$$ 1378187 706073 -61636 321254 1117653 1221250 1101449 1494022 1728727 1033854
10110A033854q91827j10333K84809j2468R3829O68017N78685j17852j47997N16072
$$ 1033854 142027 31694 316503 304035 397864 1065881 1644566 1526714 1378717 1894789
10100A894789N69072j77548n54914k61950j45116l37075k13813R330l10533o25744
$$ 1894789 2463861 2286313 1731399 1469449 1324333 987258 773445 782775 472242 -153502
10090a53502n6632O91603M16076k82323o6478N66801K48629n41176l53641L83153
$$ -153502 -210134 481469 897545 615222 548744 1115545 1364174 822998 469357 852510
10080H52510J60645o45877m67133L99636L53158l86872k10107P08821O84244k77621
$$ 852510 1013155 367278 -99855 299781 652939 266067 55960 764781 1449025 1171404
10070A171404n33343R2305J84943l68298k50792N44739O41338o4037l38244j04726
$$ 1171404 638061 730366 915309 547011 296219 840958 1482296 1418259 1080015 975289
10060I75289l49359p48959j27114R57270Q75698o9389j74907M32564J31584q73351
$$ 975289 625930 -123029 -250143 707127 1582825 1513436 1338529 1771093 1902677 1029326
10050A029326p86415K83713L73192o37301p04991O02538J290237N10422j66561
$$ 1029326 242911 526624 899816 262515 -442476 160062 1450299 1960721 1794160
10041A794160J56680K77930n09665j056900n73709J03371K72093L16119L52628
$$ 1794160 1950840 2228770 1719105 662205 88496 191867 463960 780079 1132707
10032A132707n0063m81402m9969P37005N54580l32691m86803N1320l1542o42602
$$ 1132707 1082644 601242 551273 1288278 1842858 1510167 1023364 1074684 1043142 400540
10022D00540m40647M22111M43343l47591m19587K99138L09053m99097o25962J15416
$$ 400540 -40107 382004 825347 477756 58169 357307 666360 167263 -458699 -343283
10012c43283L26002j29514Q1757Q70097O36372n57701p80298L00259P71405o0097
$$ -343283 -17281 -146795 -65038 805059 1441431 883730 103432 403691 1175096 1114999
10002A114999n69828L3365L93403k17514n88262n6597K84375j10516j75467N17333
$$ 1114999 545171 578536 971939 754425 166163 109566 393941 283425 107958 625291
9992F25291P52655q8079q89209p80777l17013j3294M02155P99081N83504R7920
$$ 625291 1377946 1289867 400658 -380119 -697132 -710426 -308271 490810 1074314 1172234
9982A172234J98814M53092j58685r59753m31890Q38179P80790o04505j163128
$$ 1172234 1371048 1824140 1665455 705702 273812 1111991 1892781 1288276 125148
9973A25148k19776N73623L40751Q7593K76441O6935n11555k86496O51647P99583
$$ 125148 -94628 478995 819746 907339 1183780 1250715 739160 452664 1104311 1903894
9963A903894q7657o24784l46089j57037j48616M50883J130874O08024n57016o32144
$$ 1903894 1816237 1191453 845364 688327 539711 990594 2121468 2729492 2172476 1540332
9953A540332J44445M3828p56995m76330P10185Q16658k27446m79643K79893K66542
$$ 1540332 1684777 1728605 971610 495280 1205465 2022123 1794677 1315034 1594927 1861469
9943A861469o63671p02387K90887M83618k91943k52225O59707N46551o23125p63003
$$ 1861469 1197798 495411 786298 1269916 977973 725748 1385455 1932006 1308881 545878
9933E45878L49988O65010j70560l04363M89956M39529m46762k93027P04433M82116
$$ 545878 895866 1560876 1390316 1085953 1575909 2015438 1568676 1275649 1980082 2462198
9923B462198o12329k47940J110341P11581j074552j090080O43165Q75615n84060
$$ 2462198 1849869 1601929 2712270 3423851 2349299 1259219 1902384 2777999 2193939
9914B193939n21527J173463J050458r89488j103206J016623J249691r07297j075194
$$ 2193939 1672412 2845875 3896333 2906845 1803639 2820262 4069953 3162656 2087462
9905B087462J387236J754389p49877j002666J655567J115897l247394l172543
$$ 2087462 3474698 5229087 4479210 3476544 5132111 6248008 3000614 -171929
9897a71929L267573M784876n257020j4892754j0019079L538058Q779474K826609
$$ -171929 3095644 7880520 2623500 -12269254 -22288333 -18750275 -9970801 -7144192
9889g144192j882534P88070L479429Q62247j907922k57401J907763N94606j131865
$$ -7144192 -9026726 -8238656 -4759227 -3896980 -5804902 -6062303 -4154540 -3559934 -4691799
9880d691799K22113K101674J212269n85408m21198M22868k16648j074795l09666
$$ -4691799 -4469686 -2368012 -1155743 -1741151 -2162349 -1739481 -1956129 -3030924 -3340590
9871c340590Q01510M57266l34201J8902P47598N54206M2320J61638L61991L9852
$$ -3340590 -2539080 -2081814 -2416015 -2397113 -1649515 -1095309 -1052989 -891351 -529360 -489508
9861d89508k06147r2863l50575r04434n79628N47513Q56745m803m48844K14618
$$ -489508 -695655 -788518 -1139093 -2043527 -2623155 -2075642 -1218897 -1223700 -1672544 -1457926
9851a457926P54672N11421L71754N82721J64416p96904q44007J57381N80108l2755
$$ -1457926 -703254 -191833 179921 762642 927058 130154 -713853 -556472 23636 -9119
9841i119k18182N04889O74457k83075q71657k07911N22855L18774j52961k31093
$$ -9119 -227301 277588 952045 668970 -202687 -410598 112257 431031 278070 46977
9831D6977k92265l58816J80421Q47219L38340r28082r75523L85187R80704j11311
$$ 46977 -245288 -604104 -423683 423536 761876 -166206 -1141729 -756542 224162 112851
9821A12851j050598m70480L69990J00051m43821m6063P05102O95433J54291j88050
$$ 112851 -937747 -1408227 -1038237 -938186 -1382007 -1428070 -722968 -27535 126756 -61294
9811f1294m28615p63878p21554j46924K57010J71146J92272N28739N55497J87296
$$ -61294 -489909 -1253787 -1975341 -2122265 -1865255 -1694109 -1501837 -973098 -417601 -230305
9801b30305J72927N26058L16221m50194n25321L60891Q15281J05916o42380m88037
$$ -230305 -57378 468680 784901 334707 -190614 170277 985558 1091474 449094 -38943
9791c8943j36971l22997m10789J82193O60781K30382m39255l64697J67317L03847
$$ -38943 -175914 -498911 -909700 -727507 -66726 163656 -275599 -640296 -472979 -169132
9781a69132M9147m0021J06681J74286N2916k14052n08045m08055L62828J133624
$$ -169132 -119985 -160006 -53325 120961 173877 -40175 -548220 -956275 -593447 540177
9771E40177Q81656k19144r02003o30205j78254j66081k12306Q5164M26425M85047
$$ 540177 1421833 1202689 300686 -329519 -507773 -673854 -886160 -800996 -374571 110476
9761A10476L87908K27843p2249k93171j55692K7490j68067l70759l0288L97373
$$ 110476 498384 726227 653978 360807 205115 232605 64538 -306221 -336509 60864
9751F0864J37668l87192j90733M30076L23467m09125n07088K20694N62095K2702
$$ 60864 198532 -188660 -379393 50683 374150 -34975 -542063 -321369 240726 263428
9741B63428m40131j71099K59218K87529J21619n5481l66455n42882j86485K71504
$$ 263428 -176703 -347802 -88584 198945 320564 265083 -101372 -644254 -830739 -559235
9731e59235J55701j13588K69478P87460L52066n57863n24649K57577K94721m11294
$$ -559235 -403534 -517122 -247644 539816 891882 334019 -190630 66947 361668 -49626
9721d9626l33889O28855P89045k35005p02863J31458O78999o6366p40455j73171
$$ -49626 -383515 245340 1034385 799380 96517 227975 906974 840608 100153 -73018
9711g3018N17773O7940o65132l79460L71719L88950k1767J04099M93404K87585
$$ -73018 444755 512695 -152437 -531897 -160178 228772 207005 311104 804508 1092093
9701A092093k77840l87275j27082j00801k09266k8249J93575R557k93640j89356
$$ 1092093 814253 426978 299896 199095 -10171 -38420 155155 164712 -128928 -318284
9691c18284J77514L51979K95639J33897j71273l82577k1784O59882O73535k03384
$$ -318284 -140770 211209 506848 640745 469472 86895 65111 724993 1398528 1195144
9681A195144r16024p14407j87540o4058q9480J32571K59850K8611m3853L58871
$$ 1195144 279120 -435287 -622827 -686885 -776365 -643794 -383944 -355333 -399186 -40315
9671d0315O02433J81840l60819m29141l56191n43201n57621k3176M72979L37385
$$ -40315 562118 743958 383139 -46002 -402193 -945394 -1503015 -1526191 -1053212 -715827
9661g15827L2163K11395N47303L93445o5409k78189k98502l69534j86349M64838
$$ -715827 -683664 -472269 75034 468479 403070 124881 -173621 -543155 -729504 -264666
9651b64666R28235N43113k05360l80910k1762R9134j95102l58665j35105J70789
$$ -264666 663569 1206682 1001322 620412 598650 697784 502682 144017 8912 179701
9641A79701L31800L70702J86146l11214p37065n47262J33719N24952J63282n09682
$$ 179701 511501 882203 1068349 757135 20070 -527192 -393473 131479 294761 -214921
9631b14921p11853k57323K80214L22386k695j30942O8971J62966k6968r1228J55024
$$ -214921 -926774 -1184097 -903883 -581497 -584192 -715134 -646163 -483197 -510165 -601393 -446369
9620d46369K25021j22006k45385L00936P58729K74669n63027n38512K32334N03368
$$ -446369 -221348 -343354 -588739 -287803 470926 745595 182568 -355944 -123610 379758
9610C79758j18644p34477o84458k58896J77700N77363O56427J13416n35351m62478
$$ 379758 261114 -473363 -1157821 -1416717 -1239017 -661654 -5227 108189 -427162 -889640
9600h89640J24073K90576m9058j54604L0212j55438n83903l62678M47700P19809
$$ -889640 -765567 -474991 -524049 -678653 -648441 -803879 -1387782 -1750460 -1302760 -582951
9590e82951J79673j31277K67328N28392J32330k18756k1605J48837j01642k01011
$$ -582951 -403278 -534555 -267227 261165 393495 174739 153134 301971 200329 -682
9580f82J68547L50404k4144k85827o740J78919j66274l81445O7594N46795L38845
$$ -682 167865 518269 494125 208298 201558 380477 214203 -167242 -99648 447147 785992
9569G85992j80730l12046j38416r6020j88592k62033l44323k75141J93123O44280
$$ 785992 605262 293216 154800 58780 -129812 -391845 -736168 -1011309 -818186 -173906
9559a73906L56536l50008l47642M22121P26051J27933k81669R4481K73455m11732
$$ -173906 182630 -167378 -515020 -92899 633152 761085 479416 573897 847352 435620
9549D35620r23300k75946O78302O16938j83257n31558k17091R7934J86846K59769
$$ 435620 -487680 -763626 -85324 531614 348357 -183201 -400292 -302358 -115512 144257
9539A44257K20450m6506j69228P7144K19865q2553l60228k00801l021j16890j02743
$$ 144257 364707 318201 148973 226117 445982 363429 3201 -197600 -200621 -317511 -420254
9528d20254L30467N43026L4240n53271m55682k4054K9934j24221N5978L94507
$$ -420254 -89787 453239 487479 -65792 -521474 -545528 -515594 -639815 -583837 -189330
9518a89330L79731Q0618j54621l45089n05424l01943K30437M01007o177j92844
$$ -189330 190401 271019 116398 -228691 -734115 -1036058 -805621 -404614 -410791 -603635
9508f03635K98134O66350K03626m32230l55915P0441Q2785k9486L67594Q01991
$$ -603635 -305501 360849 564475 132245 -223670 -153229 -70444 -99930 267664 1069655
9498A069655L75349n69825q38381j95475M23534L80694l8469l75522m74929k80602
$$ 1069655 1445004 875179 36798 -158677 264857 645551 607082 231560 -243369 -523971
9488e23971J17816L55404K56654J48993K45908K10374j29893k59028J62617N59775
$$ -523971 -406155 -50751 205903 354896 600804 811178 681285 422257 584874 1144649
9478A144649L37678j25525k21676j90067m80633o54837p5183P23185N85496m68217
$$ 1144649 1482327 1356802 1135126 945059 464426 -190411 -265594 457591 1043087 574870
9468E74870j143736o66379K78629O40021K97252q3501l6756K26653K25625j19695
$$ 574870 -568866 -1235245 -956616 -316595 -19343 -102844 -139600 87053 312678 192983
9458A92983l83239k53321K8500J45125K59648N48662N71714o8097p49974n68471
$$ 192983 -190256 -443577 -415077 -269952 -10304 538358 1110072 1041975 292001 -276470
9448b76470J58042L15766j71888l21754O5713J00713m00169m61980K07124N69372
$$ -276470 -118428 197338 25450 -296304 -230591 -129878 -530047 -992027 -784903 -215531
9438b15531J33193j55061K66381M88012j00784n23036O7930P97451N50197k00664
$$ -215531 -82338 -237399 28982 516994 416210 -106826 -38896 758555 1308752 1108088
9428A108088m30206l10524n16010p67105m59733R3465L08587L81250N66508L87375
$$ 1108088 677882 367358 -148652 -915757 -1375490 -1282025 -973438 -592188 -25680 361695
9418C61695k84213m59895L69422J022132M39661m52836l16363K89714J6888p83079
$$ 361695 77482 -382413 -12991 1009141 1448802 995966 679603 969317 986205 203126
9408B03126p04087K01391N79705J06905k27562m745J76207O4257L1528M4721k55103
$$ 203126 -500961 -299570 280135 387040 159478 154733 330940 395197 426725 471446 216343
9397B16343n70748l34929J48654K05792P5708L57462O09134K0524q64590p47128
$$ 216343 -354405 -689334 -540680 -334888 -259180 98282 707416 727940 -136650 -883778
9387h83778K68105P49805J71682m94851n17675k61504j23569M5311K32843J61113
$$ -883778 -615673 134132 305814 -189037 -706712 -968216 -1091785 -1046474 -813631 -652518
9377f52518M3474L48365P59577M97189k93680o19783j69526L35214L80607J93978
$$ -652518 -609044 -260679 498898 996087 702407 82624 -86902 248312 628919 822897
9367H22897j4305l11844m95536k45629J61128J87613j5706Q7630L59070K15598
$$ 822897 808592 496748 1212 -244417 -83289 104324 88618 176248 535318 750916
9357G50916k66126m81103l33925j66845N8539M76038N83653n5685p61024o09694
$$ 750916 484790 3687 -330238 -497083 -438544 37494 621147 565462 -195562 -805256
9347h05256K4286J24859j95317o0210M02943L07598k10553j84805L05541K33095
$$ -805256 -780970 -656111 -851428 -911638 -508695 -201097 -411650 -596455 -290914 -57819
9337e7819l76850l91718L00349M96718j23513m07699J06829L21781l25881o92147
$$ -57819 -434669 -826387 -526038 -29320 -152833 -560532 -453703 -131922 -457803 -1149950
9327a149950P4203R33282O31081k85865m83426P0073L53651J5049l51424l06897
$$ -1149950 -1075747 -142465 488616 202751 -280675 -210602 143049 158098 -193326 -500223
9317e00223p830K61495L46484J98986n868j4609K4095k98435q24803p86946P0711
$$ -500223 -508053 -246558 99926 298912 293044 278435 302530 4095 -820708 -1607654 -1536943
9306a536943R40769R63985L05126j97800q9721L38109M89320P9352n13951n77248
$$ -1536943 -596174 367811 672937 475137 385416 723525 1212845 1292197 778246 200998
9296B00998J6421M92560K11925l75025m62458j60758j60152m54562m30391m7967
$$ 200998 217419 709979 921904 546879 84421 -76337 -236489 -691051 -1121442 -1169409
9286a169409J31237K0948O8271K83731K54672O7499J42543K48283j38745n97980
$$ -1169409 -1038172 -1017224 -948953 -665222 -410550 -343051 -200508 47775 -90970 -688950
9276f88950k41192N94646O39005j86550n55423J0135L81636o5907l15079L60150
$$ -688950 -930142 -335496 303509 116959 -438464 -428329 -46693 -112600 -427679 -67529
9266f7529R07351K32877q43159q35238R8075N70732J37130l49417k84241P24O9298
$$ -67529 839822 1072699 229540 -605698 -507623 63109 200239 -149178 -433419 -432695 -363397
9255c63397m5580j65920j92364O142M06586N99455K10769m95288q24187m46131
$$ -363397 -408977 -574897 -767261 -761119 -354533 244922 455691 -39597 -863784 -1309915
9245a309915K61425O27615L40094k15239k94422L14769Q83370O09290k61298p38858
$$ -1309915 -1048490 -420875 -80781 -296020 -590442 -275673 607697 1216987 955689 216831
9235B16831m36062M3752Q2896k45705n29443m64994P1957P92505R11530N0621
$$ 216831 -219231 -175479 -92583 -338288 -867731 -1332725 -1260768 -468263 443267 493888
9225D93888q89355o95716L69091Q64003L28162j54583J23129M02775j8421m70606
$$ 493888 -395467 -1091183 -722092 141911 470073 315490 438619 841394 822973 352367
9215C52367j29544M67720L05429m14718o63401k49065N5331j20621k83737m0900
$$ 352367 222823 690543 995972 581254 -82147 -331212 -275881 -396502 -680239 -721139
9205g21139K96532K71700r6459m37172m47617j03676L24878M57920J68947k54972
$$ -721139 -424607 -152907 -249366 -686538 -1134155 -1237831 -912953 -455033 -286086 -541058
9195e41058m06946j50637L01727N82423M65268J15965m5754J03837K00873N185
$$ -541058 -948004 -1098641 -796914 -214491 250777 366742 320988 424825 625698 630883
9185F30883j48609N1284K49225K8133k17417J12617O12531L43531n34459q00399
$$ 630883 482274 533558 782783 810916 593499 706116 1318647 1662178 1127719 327320
9175C27320p4923M99018L093q56026q40690O4530P99008O89281O8381l58772k75842
$$ 327320 252397 751415 754508 -101518 -942208 -877678 -78670 610611 678992 320220 44378
9164D4378M4896R6956k11515l48170J00361O94897P06045J98285j82599l20750
$$ 44378 89274 186230 -25285 -373455 -273094 421803 1127848 1326133 1143534 822784
9154H22784n97819q43415m52165L24981M28160l02362o69258L9834Q80071P20510
$$ 822784 224965 -618450 -1070615 -745634 -317474 -619836 -1289094 -1249260 -369189 351321
9144C51321o6617l39832Q4574M15705J81199l01502n20011k46263L55964P29239
$$ 351321 284704 -55128 29446 445151 626350 324848 -195163 -441426 -85462 643777
9134F43777L77973l93866o93140k48753K24841J89349K8541J57490K08753k08204
$$ 643777 1021750 627884 -65256 -314009 -89168 100181 128722 286212 494965 286761
9124B86761o42195m81313M7988L18955K65334J84063M8776k31057l01634R8931
$$ 286761 -355434 -836747 -788759 -469804 -204470 -20407 28369 -202688 -504322 -405391
9114d05391M71025K27132k78403k33807L28480N65934R2563n62572p87126n10064
$$ -405391 65634 292766 14363 -219444 109036 674970 767533 204961 -582165 -1092229
9104a092229M5175O13272Q10170L77588l36432o08907k32902K05863J30722k80498
$$ -1092229 -1047054 -433782 376388 753976 417544 -191363 -424265 -218402 -87680 -368178
9094c68178m12222o6095L20215L16057Q7202J09510L93993L85464j95482p87820
$$ -368178 -780400 -846495 -526280 -210223 -123021 -13511 380482 765946 570464 -217356
9084b17356o70173L6936N49094M74333J52957k3884o6228p3502M803J31344J19818
$$ -217356 -887529 -850593 -301499 172834 325791 301907 235679 162177 166980 298324 418142
9073D18142l8400j21484l3097R1082J42103J17619K2587l2669J49842M17777K33172
$$ 418142 379742 258258 225161 316243 458346 575965 598552 565883 715725 1133502 1366674
9062A366674m54100q11043k95446L34486J32114m47950k89509M58886O51246J52191
$$ 1366674 912574 101531 -193915 140571 272685 -175265 -464774 -5888 645358 797549
9052G97549k8042L35329L05551l47781o12784j22111R7367m72881q11088k00088
$$ 797549 769507 1104836 1410387 1062606 449822 327711 425078 -47803 -858891 -1058979
9042a058979M25145J43657l32657l1075N31004M08798l8477m376J27752l61635
$$ -1058979 -633834 -490177 -822834 -853909 -322905 85893 47416 43040 170792 -190843
9032a90843q32626k13219R18767J009225L4406m60077J39774O71045J76490p29380
$$ -190843 -1023469 -1236688 -317921 691304 725710 265633 405407 1076452 1252942 523562
9022E23562j006429n67691L9169M62022N62224K63325k16495m48850l16844n3437
$$ 523562 -482867 -1050558 -1011389 -549367 12857 276182 59687 -389163 -706007 -759444
9012g59444K22131N03286N35953R1032m59600m96304n7800K46961J85757P3951
$$ -759444 -537313 -34027 501926 592958 133358 -362946 -420746 -173785 11972 85923
9002H5923K7306j95110n15234m49842Q8460N34644M60656J03104j14010j18689
$$ 85923 113229 -81881 -597115 -1046957 -958497 -423853 36803 139907 25897 -92792
8992i2792m0150Q1146K18226K77831K27370R2736j50470m24512m03850R3476O45829
$$ -92792 -132942 -51796 166430 444261 671631 764367 613897 189385 -214465 -120989 524840
8981E24840O07621l4139n97042n64219j49596R5237m7981l12358l16061j5139
$$ 524840 1132461 1098322 501280 -62939 -212535 -117298 -165279 -477637 -793698 -808837
8971h08837K11716M0646k75493j86508L11042N90811L47138N8908J43603K50524
$$ -808837 -597121 -556475 -831968 -1018476 -707434 -116623 230515 289423 433026 683550
8961F83550m2940l75246j78359K81133K60044k77947o40471m75903j17771J12381
$$ 683550 640610 265364 87005 368138 628182 350235 -290236 -766139 -883910 -771529
8951g71529K45420K89369J65293N2940J88112L07068n5103o77818p82306j92653
$$ -771529 -526109 -236740 -71447 -18507 169605 476673 421570 -256248 -1038554 -1231207
8941a231207L33471J99398k37995l19036J1525L53105M91270M80086L72173K20339
$$ -1231207 -897736 -698338 -936333 -1255369 -1243844 -890739 -399469 80617 452790 673129
8931F73129J37289R8275q1796l60558l67018K1887L20142N9782m48259m85560
$$ 673129 810418 908693 826897 466339 99321 121208 441350 501132 52873 -432687
8921d32687J6887L40637K1844m75828m58423j926K23957l3404l10574j85137J68203
$$ -432687 -415800 -75163 -53319 -529147 -987570 -989496 -765539 -798943 -1109517 -1294654 -1126451
8910a126451L81933M28403M36832L28661L3086j84007m1933K54786K51543j19180
$$ -1126451 -744518 -316115 120717 449378 482464 298457 256524 511310 762853 643673
8900F43673n03077o18938m43884o5441K74098K01128k60488m25412K04506J032745
$$ 643673 140596 -478342 -922226 -987667 -713569 -512441 -772929 -1198341 -993835 38910
8890C8910J015560J19362o31055n73524j04804J46732P6703j60440m53512n33982
$$ 38910 1054470 1173832 542777 -30747 -135551 11181 87884 -72556 -526068 -1060050
8880a060050j35383M22120M60577l9754l49935j27905J33514Q7339J23686N19634
$$ -1060050 -1195433 -773313 -312736 -352490 -702425 -830330 -696816 -609477 -485791 33843
8870C3843P71343L75368l18486o21492m06853o892L38994M83427K57273k04712
$$ 33843 805186 1180554 862068 240576 -166277 -173169 165825 649252 906525 701813
8860G01813m02931r8493L50200N11762L33815o7064n39418p09733k99151K57906
$$ 701813 298882 200389 550589 1062351 1396166 1329102 789684 79951 -219200 38706
8850C8706K44255j88155j82992L46730M78366j39244o00550k11070M20835M60223
$$ 38706 282961 94806 -88186 258544 736910 597666 -2884 -213954 206881 667104
8840F67104O5605j94520k68528k57334J4505L85980K24086m33231o07720L0034
$$ 667104 732709 538189 269661 12327 26832 412812 636898 203667 -404053 -374019
8830c74019M46873j0413m04404J42510Q10368M72748l45404m43821Q581L6728
$$ -374019 72854 62441 -341963 -199453 610915 1083663 738259 294438 303019 339747
8820C39747k58591p7431L69563K38370k49049j64162L42030K70869l76478o16683
$$ 339747 81156 3725 373288 611658 362609 198447 540477 811346 434868 -181815
8810a81815k68904j14601k78961n5439N55057O99731K56654M9014K51424J00676
$$ -181815 -450719 -565320 -844281 -899720 -344663 355068 611722 660736 912160 1012836
8800A012836m99618o31114o6863J86189l40487o89022j25838O01035N46278K4205
$$ 1012836 513218 -117896 -184759 1430 -339057 -1028079 -1153917 -552882 -6604 17601
8790A7601j64023o9415j92746m18948k88476J10508L12115K34540J56266J79238
$$ 17601 -146422 -215837 -408583 -827531 -1116007 -1005499 -693384 -458844 -302578 -123340
8780a23340K00287K04166K16239J55306p485j27583q5431O4954J91270J55181
$$ -123340 76947 281113 497352 652658 645173 517590 432159 497113 688383 843564
8770H43564j23379m64766m99866j99881m638j06538j05008J75202J84699l41479
$$ 843564 720185 255419 -244447 -444328 -448966 -555504 -660512 -485310 -300611 -642090
8760f42090o09977K4558P73486N58934j46157p8699O34517P08282o1697n34702
$$ -642090 -1252067 -1227509 -454023 104911 -41246 -119945 514572 1222854 1161157 626455
8750F26455k73964r5266k91337j00487N41969N10474m67691r67281j07268Q71483
$$ 626455 352491 257225 -34112 -134599 407370 917844 450153 -517128 -624396 247087
8740B47087N22559n76449q94711k65034K94867L68309L50241L17446j9379m40940
$$ 247087 769646 193197 -701514 -966548 -671681 -303372 46869 364315 344936 -96004
8730i6004l82809J03517L97081K30745j03830l20779l20819k1717M33765N46191
$$ -96004 -478813 -375296 21785 252530 148700 -172079 -492898 -514615 -80850 465341
8720D65341Q5453m00254k50849L45603N93116J45606n26620p42202k82810M19147
$$ 465341 550794 150540 -100309 245294 838410 984016 457396 -284806 -567616 -148469
8710a48469O20893L3572p06391p31020j14363K57075N8058n7942K94599M85380
$$ -148469 472424 505996 -200395 -931415 -1045778 -788703 -730645 -788587 -493988 -8608
8700h608m2682p21016o58923O0224O46557P43471N79994L26924L432j99213j11012
$$ -8608 -51290 -772306 -1431229 -1371005 -724448 19023 599017 925941 929373 730160 619148
8689F19148N6320R556j60738j99634j12891k1582R5560J86773K9652l25067m48863
$$ 619148 675468 685024 524286 324652 211761 190179 285739 472512 502164 177097 -271766
8678b71766k06178j1287n1051J09997O43995Q69465K53663n88830p18637k18179
$$ -271766 -477944 -489231 -540282 -430285 213710 1083175 1336838 748008 29371 -188808
8668a88808J39078J53161J97137K62213J9001l00984j00868M67386N39535j33248
$$ -188808 -49730 103431 300568 562781 581782 280798 179930 647316 1186851 1053603
8658A053603p54718o60208j62235J38388K21153L64914M98278L43726n7104l71243
$$ 1053603 298885 -361323 -523558 -385170 -164017 200897 699175 1042901 985797 614554
8648F14554l91326j73384J00601K20983P4620j81637k47399r9019n2953k46243
$$ 614554 223228 49844 150445 371428 446048 264411 17012 -82007 -134960 -381203
8638c81203l29851K2077N09109N34519Q5368j93146O2577L91615K49358j05177
$$ -381203 -711054 -688977 -179868 354651 440019 246873 309450 701065 950423 845246
8628H45246k9199M03714M36794j87499q11420q82145o63907m97230q9836P34607
$$ 845246 816047 1219761 1656555 1469056 657636 -224509 -888416 -1385646 -1475482 -740875
8618g40875J202155N02935p65470j134839k37271P42758P47956P3096m01390l94958
$$ -740875 461280 964215 198745 -936094 -1173365 -430607 317349 390445 -10945 -405903
8608d05903j80411M6513K36899K78721J06651j68418l93862m32106j31881M03877
$$ -405903 -586314 -539801 -302902 -24181 82470 -85948 -479810 -911916 -1043797 -639920
8598f39920O56479L09383j28824J9239M77842M09852j43759k75201K13532M27027
$$ -639920 16559 325942 197118 216357 694199 1104051 960292 685091 898623 1325650
8588A325650m4966l73565K0060L62830j37415q11441n46261L78641P19319J67582
$$ 1325650 1280684 907119 927179 1290009 1152594 341153 -205108 173533 892852 1060434
8578A060434l88559l81828k04061k22884j69522J64302L83291Q3325m72633o58113
$$ 1060434 671875 290047 85986 -136898 -306420 -142118 241173 324498 -148135 -806248
8568h06248k29459M60479Q47661O42980N0694m38056n11570k57043P6803L32571
$$ -806248 -1035707 -575228 272433 915413 966107 528051 16481 -240562 -163759 168812
8558A68812L86576J18071l56149o22577l83927J69351N43598M13706j19498n94665
$$ 168812 555388 673459 317310 -305267 -689194 -519843 23755 437461 317963 -276702
8548b76702n45083o621M10905K49621j51338j58204J99114L79458K99170L52969
$$ -276702 -821785 -828406 -417501 -167880 -319218 -477422 -278308 101150 400320 753289
8538G53289M77008J33568n75377p80193k32859J61615k08724o31314k74827M03655
$$ 753289 1230297 1363865 788488 8295 -224564 -62949 -271673 -902987 -1177814 -774159
8528g74159M30201j22642l82924q9948K47372L53418M00162L62242M2625l19282
$$ -774159 -343958 -466600 -849524 -939472 -692100 -338682 61480 423722 466347 147065
8518A47065k76782J3971j4644l40627l27410K01198O14484M32780l960j33609
$$ 147065 -129717 -115746 -130390 -471017 -798427 -597229 17255 450035 446075 312466
8508C12466N2065J71046O8696n0390K6649K36808K98769M7271k87417k91692O1682
$$ 312466 364531 535577 604273 553883 580532 817340 1116109 1163380 875963 584271 645953
8497F45953L04477J05153k67969l64888j65225K7797O2493o136j21467j97861
$$ 645953 950430 1055583 787614 422726 257501 285298 347791 341655 220188 22327
8487B2327j13089L0121n7595l04961k03495L61921P11086L33125k32281j89893
$$ 22327 -90762 -60641 -118236 -423197 -626692 -264771 446315 779440 547159 357266
8477C57266K30192J67065m11374o41648k10397J26675j92489o16411l91493K42265
$$ 357266 587458 754523 343149 -298499 -508896 -382221 -574710 -1191121 -1582614 -1340349
8467a340349M80836K19264J12807M36106O18406J78145m33014m17745K06523O13605
$$ -1340349 -859513 -640249 -527442 -91336 527070 705215 272201 -145544 60979 674584
8457F74584L21782k24577m03011k08951K6365K14256L31539J22737m10746o32258
$$ 674584 996366 771789 368778 159827 186192 400448 731987 854724 443978 -188280
8447a88280j26292M27339J46546n65788n39643K64973O60633J79423k49258L74
$$ -188280 -314572 112767 259313 -306475 -846118 -581145 79488 258911 9653 10027
8437A0027K36995j38986m82430j30036L18484Q6719l24483l2103O00440N79856
$$ 10027 247022 108036 -374394 -504430 -185946 -99227 -423710 -455813 144627 724483
8427G24483K1956j10765K77444L34094j76503n08581k57833P1549M3033j24217
$$ 724483 746439 635674 913118 1247212 1070709 562128 304295 375844 418877 294660
8417B94660j82518k34735k52763K7858M94065O06404J91184k97382m70595m08942
$$ 294660 112142 -122593 -375356 -347498 146567 752971 944155 646773 176178 -232764
8407b32764k55956K1701L24722L97181K54901J77228J89584K4435l29460n10614
$$ -232764 -488720 -467019 -142297 254884 509785 687013 876597 901032 571572 60958
8397F0958l18043L7670K74088K79748M2808l03614m37327k09972P1219Q3887p737
$$ 60958 -257085 -219415 54673 334421 377229 73615 -363712 -573684 -502465 -418578 -426315
8386d26315Q7939K23428J30529r459O4065P2981l10015o51872l13092L88630N36720
$$ -426315 -338376 -114948 15581 6122 70187 143168 -166847 -818719 -1131811 -743181 -206461
8375b06461O9554j40999K55816N83660L40766m8497q2341L2863q2190l04284l27188
$$ -206461 -136907 -277906 -22090 561570 902336 853839 771498 804361 722171 417887 90699
8364I0699j69530j0746O8053l1760l54493n80184l11125K36046M19756J41529
$$ 90699 -78831 -89577 -21524 -53284 -407777 -987961 -1299086 -1063040 -643284 -501755
8354e01755n6958K8503j3380k98393l20684R9468L83667J83858p537J99686L41830
$$ -501755 -558713 -530210 -543590 -841983 -1162667 -1063199 -679532 -495674 -503211 -303525 38305
8343C8305K387k79902J04404O31047L60586m82265p40496p2426N72234M19930
$$ 38305 40692 -239210 -134806 496241 856827 374562 -365934 -438360 133874 553804
8333E53804q8814j51274K00785L44912J00071j30930j37882k12366n08419n75577
$$ 553804 464990 313716 514501 859413 959484 828554 690672 478306 -30113 -605690
8323f05690L0763Q86872J014202J51247q07768r44045m25331k2208P5331K55564
$$ -605690 -574927 311945 1326147 1477394 669626 -274419 -699750 -721958 -646627 -391063
8313c91063N15902L69313j72385l62662J54334O74031M31586k49697m77931j47037
$$ -391063 124839 494152 321767 -40895 113439 787470 1219056 969359 491428 344391
8303C44391k1758m93729r54283o85495J00306N55540L36697k6710L1225L34073
$$ 344391 322633 -171096 -1125379 -1810874 -1710568 -1155028 -818331 -845041 -813816 -479743
8293d79743L36364k199k13422j31454j26889l59709l72204J77716Q32643R02326
$$ -479743 -143379 -145578 -359000 -490454 -617343 -977052 -1349256 -1171540 -338897 563429
8283E63429M00877j12128l66647m82671m43081j15244K79831L44703J43667Q8453
$$ 563429 964306 852178 485531 2860 -440221 -555465 -275634 69069 212736 301189
8273C01189K07072J41282j13087j34252J51924L00191J32198K1881J25794J2836
$$ 301189 508261 649543 536456 402204 554128 854319 986517 1008398 1134192 1147028
8263A147028n11019q20500l12095N77474Q49769K78327l29326k41593K88222M35524
$$ 1147028 636009 -184491 -496586 80888 930657 1208984 879658 638065 926287 1361811
8253A361811j07486p49450p64625k31513R5617j51215m55857k39805K47003L56548
$$ 1361811 1254325 504875 -259750 -491263 -395646 -546861 -1002718 -1242523 -995520 -638972
8243f38972P0755l4392K62421N60362N27168K56918j05344m90686n89951p8949
$$ -638972 -568217 -602609 -340188 220174 747342 1004260 898916 408230 -181721 -260670
8233b60670O67242P66574L4230o42530n27040l7926j0830m41069o13697k28615
$$ -260670 406572 1173146 1207376 564846 37806 -120 -10950 -452019 -1065716 -1294331
8223a294331K57635L84159K38286J23511O2461j11807l43484l37144j7278K45264
$$ -1294331 -1036696 -652537 -414251 -290740 -228279 -340086 -683570 -1020714 -1037992 -792728
8213g92728J27827q1298J37355O09037N50479j94206p28209m16263J04781J1910
$$ -792728 -664901 -746199 -608844 193 550672 356466 -371743 -788006 -683225 -671315
8203f71315k84621Q5472P41870N12901n08322q66595J3270R04071O85729p4546
$$ -671315 -955936 -870464 -128594 384307 -124015 -990610 -977340 -73269 612460 537914
8193E37914k63703R3969K49582L9242j94421m07461o54540n49477J68817Q79572
$$ 537914 274211 368180 617762 657004 462583 55122 -599418 -1148895 -980078 -100506
8183a00506P58048k3079n53248m55330j58376m3269l4541m022K5400P3971J41707
$$ -100506 657542 634463 81215 -374115 -532491 -575760 -610301 -614323 -588923 -514952 -373245
8172c73245M5024k65106m09329o2965M78623O98203N81244M29673K37029j29284
$$ -373245 -328221 -593327 -1002656 -1065621 -586998 111205 692449 1122122 1359151 1229867
8162A229867l72723j20701L02537K01682m23079q47083o69237j91747K63239O53591
$$ 1229867 857144 736443 1038980 1240662 817583 -29500 -698737 -890484 -627245 26346
8152B6346P50642K25514n38927n77760K60986Q35646K55705p65949r17548j53553
$$ 26346 776988 1002502 463575 -114185 146801 982447 1238152 472203 -445345 -598898
8142e98898M14534K62758K4433K02659L46730j0357m26400k93132O2312j03158
$$ -598898 -184364 78394 102827 305486 652216 641859 215459 -77673 -15361 -118519
8132a18519o26232o02015J35931O77231M48977M8699J40059L44794K3012m85250
$$ -118519 -744751 -1346766 -1210835 -533604 -84627 -35928 104131 448925 471937 -13313
8122a3313l92757J47927K81752p1451j24019L01978L85699k14007o05058p6511
$$ -13313 -406070 -258143 23609 -47842 -171861 130117 515816 301809 -303249 -379760
8112c79760O49231M81407l61762p32290k47466L69296N13362L59490K22636L6438
$$ -379760 269471 750878 389116 -343174 -590640 -221344 292018 651508 874144 910582
8102I10582k82196n03830m09538j10243J34517J72382k2281l15117l88325n7942
$$ 910582 628386 124556 -284982 -395225 -260708 -88326 -110607 -425724 -814049 -871991
8092h71991L79281M53109J81038K4535J31964J11201k31379m16818P090O24873
$$ -871991 -492710 -39601 141437 165972 297936 409137 177758 -239060 -231970 392903
8082C92903N89447j82309q25099o67616n3239K76872J95203J13160J75035J38921
$$ 392903 982350 800041 -25058 -692674 -745913 -469041 -273838 -160678 14357 153278
8072A53278Q084J35802N37925O81630K58271l26720n78500n45065m28800j01683
$$ 153278 161362 297164 835089 1516719 1774990 1448270 869770 324705 -104095 -205778
8062b05778M32040O01755M2612n98480m91383L8810n643o25592p66749l1218O96462
$$ -205778 226262 828017 870629 272149 -219234 -180424 -186067 -811659 -1578408 -1609626 -913164
8051i13164O81830L39993K80406L11672P9781j15651O6197K16760j75210p60389
$$ -913164 -231334 108659 389065 700737 780518 664867 731064 947824 772614 12225
8041A2225q11331l12389J73968M17086N54810M86292J7299n09002m76851Q9764
$$ 12225 -799106 -1111495 -937527 -520441 34369 520661 537960 28958 -447893 -358129
8031c58129N04183L62692k1513k05901j64745j11389j29857j48841j07809o3859
$$ -358129 146054 508746 487233 281332 116587 5198 -124659 -273500 -381309 -445168
8021d45168j56315l73865l84669J07447P94137R71851M70440r9176k38073j55362
$$ -445168 -601483 -975348 -1360017 -1252570 -458433 513418 983858 884682 646609 491247
8011D91247j70266j36824P9522J53146j06812k71783k5819J88528l2490k12427
$$ 491247 320981 184157 263679 416825 310013 38230 12411 200939 168449 -43978
8001d3978J67466N51359J16031p16440q05420j24648K38930p5433k16899K56762
$$ -43978 123488 674847 790878 74438 -730982 -855630 -616700 -692133 -909032 -652270
7991f52270N87329J92692l00090j33222L65389M38599Q2505k14378l66039n39197
$$ -652270 -64941 127751 -172339 -305561 59828 498427 580932 366554 515 -538682
7981e38682n27430o1979N06425N63025J44791j26420K2254K09138P2617k15393
$$ -538682 -1066112 -1128091 -621666 -58641 86150 -40270 -18016 191122 263739 48346
7971D8346k64037r894K18879J08689k31429l31154N5631N17985M39093j27297
$$ 48346 -215691 -225585 -6706 101983 -129446 -460600 -404969 113016 552109 424812
7961D24812m42655q2920M68290M94950k4852m98020m84971p7769L23540L59019
$$ 424812 -17843 -100763 367527 862477 837625 339605 -145366 -223135 100405 459424
7951D59424k2357m48944m39460K8501M62169M70169J63894j58016l60508l50801
$$ 459424 437067 -11877 -451337 -422836 39333 509502 673396 515380 154872 -195929
7941a95929m1521L16126K23644l02132n32898l6204N91479N62472M1367k36935
$$ -195929 -237450 78676 302320 188 -532710 -568914 22565 585037 626404 389469
7931C89469j42112j20639k05516J2782M16527L11969l98990q42084l83924M58664
$$ 389469 247357 126718 -78798 -66016 350511 662480 263490 -578594 -962518 -503854
7921e03854Q00704N19760R3661k13915m28124m61419k25101L9029L5952r7606
$$ -503854 296850 816610 910271 696356 268232 -193187 -418288 -379259 -343307 -440913
7911d40913j2893K57534L34592O2963k97347m17070j88950K39909N30672M10928
$$ -440913 -453806 -196272 138320 201283 -96064 -513134 -702084 -462175 68497 479425
7901D79425M7895r3714N3066J8551l49945m41908J64202Q21479O50929j30947
$$ 479425 527320 433606 486672 505223 155278 -286630 -122428 699051 1349980 1219033
7891A219033o01212n56199n37923o02444k22748N10890P77615L73880L5143P1711
$$ 1219033 617821 61622 -476301 -1078745 -1301493 -790603 -12988 360892 396035 467746
7881D67746j05008o05990n36477L73339R04267J92035p30807n41943K55117L63077
$$ 467746 362738 -243252 -779729 -406390 497877 689912 -40895 -582838 -327721 35356
7871C5356k7976J92397P78110M51954o44285r16177M409N73381m8580o12867j9206
$$ 35356 7380 199777 977887 1429841 785556 -130621 -126212 447169 398589 -214278 -233484
7860b33484P66763L92866n97795p19854Q5964N89899K96969r4014o8679R3658
$$ -233484 533279 926145 328350 -391504 -305540 284359 581328 487314 418635 512293
7850E12293R8960M6540j8936k06229l83146k87966r748J48856J64172J75792J07130
$$ 512293 611253 657793 638857 432628 49482 -238484 -248232 -99376 64796 240588 347718
7839C47718r1450j10674K38495N25664L03272j22431k12381j31480l48339o18975
$$ 347718 256268 145594 384089 909753 1213025 1090594 878213 746733 398394 -220581
7829b20581l41594K54538L33780j39873k98802J68422N13665K12041k44561l06980
$$ -220581 -562175 -307637 26143 -113730 -412532 -244110 269555 481596 237035 -69945
7819f9945k28390l75518m47500o5371M50735N74226L79173K29515R1174k08628
$$ -69945 -298335 -673853 -1121353 -1186724 -735989 -161763 217410 446925 538099 329471
7809C29471m22467k56797O177o4519k73262j59346J07005n65l20938j34387N93101
$$ 329471 -92996 -349793 -343616 -408135 -681397 -840743 -733738 -734303 -1055241 -1189628 -596527
7798e96527R85332N42003j55662m11194l41307l32631k66441L5053J61317k56413
$$ -596527 388805 930808 775146 363952 22645 -309986 -576427 -541374 -380057 -636470
7788f36470o63693k64996O08844Q13502J02533m79321j80883M25072M86508J24023
$$ -636470 -1300163 -1565159 -956315 -142813 -40280 -519601 -700484 -275412 211096 335119
7778C35119m0070K6360o9677k94604k81116m5282Q1030P3948J44310J97613K564
$$ 335119 295049 321409 251732 -42872 -323988 -369270 -288240 -214292 -69982 127631 130195
7767A30195k32546j07282K35892K86406J9877r8517N8356J43788M0594j1779k7042
$$ 130195 -102351 -209633 26259 312665 332542 234025 292381 436169 476763 464984 437942
7756D37942k57445n06320k71859K93656M43510O3202j06455K06256K82566k57724
$$ 437942 180497 -325823 -597682 -304026 139484 202686 96231 302487 585053 327329
7746C27329o35151j89070M34928L31108j82846k22124Q9672p7851o77720p54404
$$ 327329 -307822 -496892 -61964 269144 86298 -135826 -46154 -124005 -801725 -1556129
7736a556129j8767O66364O18913K27613J40195L02769K78581K9175r4818Q9342
$$ -1556129 -1574896 -908532 -289619 -62006 78189 380958 659539 688714 593896 683238
7726F83238L69404L86424J858n04658o50579l08983P4070M5737k26120k07199
$$ 683238 1052642 1439066 1440924 936266 285687 -23296 50774 96511 -129609 -336808
7716c36808K27997O23594N25123l6077o15080p12655j73216N59874P39892J22790
$$ -336808 -108811 514783 1039906 1003829 388749 -323906 -497122 62752 802644 925434
7706I25434o70521q51592l56970K19956L95624J81022j46160l32890k87935j33901
$$ 925434 254913 -596679 -953649 -733693 -338069 -157047 -303207 -636097 -924032 -1057933
7696a057933k8118J19055M60446P15472L83797l55316o11568m4895N27038L60991
$$ -1057933 -1086051 -966996 -506550 208922 592719 237403 -374165 -419060 107978 468969
7686D68969o1944Q1487N39058M76658l0053j67791J27139P2048n00562p71464
$$ 468969 407025 488512 1027570 1504228 1474175 1306384 1433523 1505571 1005009 233545
7676B33545l28161J45388M6718k14961o8763K24033J36927j52004j13729J89055
$$ 233545 -94616 50772 97490 -117471 -186234 37799 174726 22722 -91007 98048
7666I8048K36178p9040l51999l45680k07808l4582K54235N20530L76925k01040
$$ 98048 334226 255186 -96813 -442493 -650301 -684883 -430648 89882 466807 265767
7656B65767n87176k12700N82110Q34157J77617o14005n90357J59594O93058M69880
$$ 265767 -321409 -534109 48001 882158 1059775 445770 -144587 15007 708065 1177945
7646A177945j16057m80285n38319m60237k81326p6709p0127k27549j60620K32316
$$ 1177945 1061888 581603 43284 -416953 -698279 -774988 -845115 -1072664 -1233284 -1000968
7636a000968M84841K94872M0907J15270K62327J32019k6850J11537K23144j00237
$$ -1000968 -516127 -221255 -180348 -65078 197249 329268 302418 413955 637099 536862
7626E36862m82474l21104J34202K02298q83J94772O64949N19453m01529j125740
$$ 536862 54388 -266716 -132514 69784 68901 263673 928622 1448075 1046546 -79194
7616g9194r43350k86899J39311K78343L45399K71940K6864q0000J08206K54350
$$ -79194 -1022544 -1309443 -1170132 -891789 -546390 -274450 -247586 -327586 -219380 34970
7606C4970Q9263j02444M1648L51521L88052Q1471k21759k17799M9164K53848J08100
$$ 34970 124233 21789 63437 414958 803010 884481 662722 444923 494087 747935 856035
7595H56035k89933n07443l30029o3786m6294j50699j33913j23245k61536k40744
$$ 856035 566102 58659 -271370 -335156 -381450 -532149 -666062 -789307 -1050843 -1291587
7585a291587J79800N43516L29018j13655j08300J75490R1744j90513N7866O62057
$$ -1291587 -1111787 -568271 -239253 -352908 -461208 -285718 -193974 -384487 -326621 335436
7575C35436O23913j87958p10777l71846J27920J48925L1875J26008N4465l62658
$$ 335436 959349 771391 60614 -311232 -183312 -34387 -2512 123496 177961 -184697
7565a84697n16531j09414J35486l04715p34040l49760M33588P20153M90293K74782
$$ -184697 -701228 -810642 -675156 -979871 -1713911 -2063671 -1630083 -909930 -419637 -144855
7555a44855J13471j87074l19099J5279L30744N2416m42238m02639Q6649M01902
$$ -144855 -31384 -218458 -537557 -522278 -191534 -139118 -581356 -983995 -897346 -495444
7545d95444M64712N64705N15225M0188l51727j4624N71612L78016m78464q55011
$$ -495444 -30732 533973 1049198 1089386 737659 723035 1294647 1672663 1194199 339188
7535C39188l93154N2042m7756j71017R2523L18492J79121O6702K17293J55341
$$ 339188 -53966 -1924 -49680 -220697 -128174 190318 369439 436141 653434 808775
$$ [...]
##END NTUPLES=NMR SPECTRUM
##END=
