##TITLE=31Pdec_LR-758-2-CR3
 CDCl3
 24 sc
 5.3.2024
##JCAMPDX= 6.0         $$ Bruker NMR JCAMP-DX V2.0
##DATA TYPE= NMR SPECTRUM
##DATA CLASS= NTUPLES
##ORIGIN= UXNMR, Bruker Analytische Messtechnik GmbH
##OWNER= root
$$ XWIN-NMR		Version 3.5
$$ Tue Mar  5 13:52:31 2024 Russian Standard Time (UT+4h)  she@DPX200
##.OBSERVE FREQUENCY= 81.013821
##.OBSERVE NUCLEUS= ^31P
##.ACQUISITION MODE= SIMULTANEOUS
##.ACQUISITION SCHEME= undefined
##.AVERAGES= 24
##.DIGITISER RES= 16
##SPECTROMETER/DATA SYSTEM= spect
##.PULSE SEQUENCE= zgpg30
##.SOLVENT NAME= CDCl3
##.SHIFT REFERENCE= (INTERNAL, CDCl3, 0, 248.564)
##AUDIT TRAIL= $$ (NUMBER, WHEN, WHO, WHERE, WHAT)
$$ ##TITLE= Audit trail, XWIN-NMR		Version 3.5
$$ ##JCAMPDX= 5.01
$$ ##ORIGIN= Bruker BioSpin GmbH
$$ ##OWNER= she
$$ F:/spectra/data/she/nmr/P31/1/pdata/1/auditp.txt
$$ ##AUDIT TRAIL=  $$ (NUMBER, WHEN, WHO, WHERE, WHAT)
(   1,<2024-03-05 13:51:22.20 +0400>,<she>,<DPX200>,
      <created by zg, POWCHK disabled, PULCHK disabled
       configuration hash MD5:
       00 E9 B6 7A A2 85 ED C7 34 08 36 98 17 FE 4E 26
       data hash MD5: 32K
       7D 82 8B 16 C6 79 64 82 6A 1D D4 7A 9E E9 77 81>)
(   2,<2024-03-05 13:51:31.18 +0400>,<she>,<DPX200>,
      <Start of raw data processing
       efp BC_mod = 2 LB = 10 FT_mod = 6 PKNL = 1 PHC0 = -12732.05 PHC1 = -289.1166 SI = 64K 
       data hash MD5: 64K
       8C C9 78 4B A1 2C 96 A7 64 0A 40 DD 7C E4 6F 55>)
(   3,<2024-03-05 13:51:53.60 +0400>,<she>,<DPX200>,
      <pk PHC0 = 113.3669 PHC1 = -226.2 
       data hash MD5: 64K
       D4 5A 07 DF BB 8D DD F3 15 76 70 A4 2A E4 B5 56>)
(   4,<2024-03-05 13:51:57.39 +0400>,<she>,<DPX200>,
      <abs ABSG = 5 
       data hash MD5: 64K
       A9 89 64 3A 36 D7 E9 61 D2 9D 31 54 8A 06 63 F6>)
$$ ##END=
$$ 
$$ hash MD5
$$ 84 78 F6 22 D3 CF 2D 01 FC 19 F3 CA 3D 44 28 30
##$RELAX= 
##$RELAX= 
##$RELAX= 
##$RELAX= 
##$RELAX= 
##$RELAX= 
##$RELAX= 
##$RELAX= 
##$RELAX= 
$$ Bruker specific parameters
$$ --------------------------
##$DU= <F:/spectra>
##$EXPNO= 1
##$NAME= <P31>
##$PROCNO= 1
##$TYPE= <nmr>
##$USER= <she>
##$AMP= (0..31)
100 100 100 100 100 100 100 100 100 100 100 100 100 100 100 100 100 100 
100 100 100 100 100 100 100 100 100 100 100 100 100 100 
##$AQSEQ= 0
##$AQ_mod= 1
##$AUNM= <au_zg>
##$AUTOPOS= <>
##$BF1= 81.014009
##$BF2= 200.13
##$BF3= 200.13
##$BF4= 200.13
##$BF5= 200.13
##$BF6= 200.13
##$BF7= 200.13
##$BF8= 200.13
##$BYTORDA= 1
##$CFDGTYP= 0
##$CFRGTYP= 5
##$CHEMSTR= <none>
##$CNST= (0..31)
1 1 145 1 1 1 1 1 1 1 1 1 1 1 1 1 1 1 1 1 1 1 1 1 1 1 1 1 1 1 1 1 
##$CPDPRG= <waltz16>
##$CPDPRG1= <>
##$CPDPRG2= <waltz16>
##$CPDPRG3= <>
##$CPDPRG4= <mlev>
##$CPDPRG5= <mlev>
##$CPDPRG6= <mlev>
##$CPDPRG7= <mlev>
##$CPDPRG8= <mlev>
##$CPDPRGB= <>
##$CPDPRGT= <>
##$D= (0..31)
0 1 0 0 0 0 0 0 0 0 0 0.03 2e-05 3e-06 0 0 0 0 0 0 0 0 0 0 0 0 0 0 0 0 
0 0 
##$DATE= 1709632281
##$DBL= (0..7)
120 120 120 11 120 120 24 19 
##$DBP= (0..7)
150 150 150 150 150 150 150 150 
##$DBP07= 0
##$DBPNAM0= <>
##$DBPNAM1= <>
$$ [...]
##$SUBNAM3= <"">
##$SUBNAM4= <"">
##$SUBNAM5= <"">
##$SUBNAM6= <"">
##$SUBNAM7= <"">
##$SUBNAM8= <"">
##$SUBNAM9= <"">
##$SW= 501.771253377433
##$SWIBOX= (0..15)
0 1 3 0 0 0 0 0 0 0 0 0 0 0 0 0 
##$SW_h= 40650.406504065
##$TD= 32768
##$TD0= 1
##$TE= 0
##$TE2= 300
##$TE3= 300
##$TEG= 300
##$TL= (0..7)
0 120 53 12 22 120 120 120 
##$TP= (0..7)
150 150 150 150 150 150 150 150 
##$TP07= 0
##$TPNAME0= <>
##$TPNAME1= <>
##$TPNAME2= <>
##$TPNAME3= <>
##$TPNAME4= <>
##$TPNAME5= <>
##$TPNAME6= <>
##$TPNAME7= <>
##$TPOAL= (0..7)
0.5 0.5 0.5 0.5 0.5 0.5 0.5 0.5 
##$TPOFFS= (0..7)
0 0 0 0 0 0 0 0 
##$TUNHIN= 0
##$TUNHOUT= 0
##$TUNXOUT= 0
##$USERA1= <user>
##$USERA2= <user>
##$USERA3= <user>
##$USERA4= <user>
##$USERA5= <user>
##$V9= 5
##$VALIST= <valist>
##$VCLIST= <CCCCCCCCCCCCCCC>
##$VD= 0
##$VDLIST= <DDDDDDDDDDDDDDD>
##$VPLIST= <PPPPPPPPPPPPPPP>
##$VTLIST= <TTTTTTTTTTTTTTT>
##$WBST= 1024
##$WBSW= 4
##$XGAIN= (0..3)
0 0 0 0 
##$XL= 0
##$YL= 0
##$YMAX_a= 5312
##$YMIN_a= -5060
##$ZGOPTNS= <>
##$ZL1= 120
##$ZL2= 120
##$ZL3= 120
##$ZL4= 120
##$ABSF1= 248.5645
##$ABSF2= -253.2056
##$ABSG= 5
##$ABSL= 3
##$ALPHA= 0
##$AQORDER= 0
##$ASSFAC= 0
##$ASSFACI= 0
##$ASSFACX= 0
##$ASSWID= 0
##$AUNMP= <proc_1d>
##$AZFE= 0.1
##$AZFW= 0.5
##$BCFW= 0
##$BC_mod= 2
##$BYTORDP= 0
##$COROFFS= 0
##$CY= -3
##$DATMOD= 1
##$DC= 0
##$DFILT= <>
##$DTYPP= 0
##$F1P= 0
##$F2P= 0
##$FCOR= 1
##$FTSIZE= 65536
##$FT_mod= 6
##$GAMMA= 0
##$GB= 0
##$INTBC= 1
##$INTSCL= 6.047779e-11
##$ISEN= 30
##$LB= 10
##$LEV0= 0
##$LPBIN= 0
##$MAXI= 10000
##$MC2= 0
##$MEAN= 0
##$ME_mod= 0
##$MI= 50
##$NCOEF= 0
##$NC_proc= -9
##$NLEV= 6
##$NOISF1= 182.463
##$NOISF2= 159.3651
##$NSP= 0
##$NTH_PI= 0
##$NZP= 0
##$OFFSET= 248.5645
##$PC= 4
##$PHC0= -12618.68
##$PHC1= -515.3166
##$PH_mod= 1
##$PKNL= yes
##$PPARMOD= 0
##$PSCAL= 0
##$PSIGN= 0
##$REVERSE= no
##$SF= 81.0140089999694
##$SI= 65536
##$SIGF1= 159.3651
##$SIGF2= -187.1042
##$SINO= 113.3802
##$SIOLD= 16384
##$SREGLST= <1H.CDCl3>
##$SSB= 0
##$STSI= 65536
##$STSR= 0
##$SW_p= 40650.406504065
##$SYMM= 0
##$S_DEV= 0
##$TDeff= 32768
##$TDoff= 0
##$TI= <>
##$TILT= no
##$TM1= 0
##$TM2= 0
##$TOPLEV= 0
##$USERP1= <user>
##$USERP2= <user>
##$USERP3= <user>
##$USERP4= <user>
##$USERP5= <user>
##$WDW= 1
##$XDIM= 65536
##$YMAX_p= 462326795
##$YMIN_p= -20869843
$$ End of Bruker specific parameters
$$ ---------------------------------
##NTUPLES= NMR SPECTRUM
##VAR_NAME=  FREQUENCY,     SPECTRUM/REAL,   SPECTRUM/IMAG
##SYMBOL=    X,             R,               I
##VAR_TYPE=  INDEPENDENT,   DEPENDENT,       DEPENDENT
##VAR_FORM=  AFFN,          ASDF,            ASDF
##VAR_DIM=   65536,         65536,           65536
##UNITS=     HZ,            ARBITRARY UNITS, ARBITRARY UNITS
##FACTOR=    0.620285442955139, 1,           1
##FIRST=     20137.2065510682, 0,            0
##LAST=      -20513.1999529968, 0,           0
##MIN=       -20513.1999529968, -20869843,   0
##MAX=       20137.2065510682, 462326795,    0
$$ Real data points
##PAGE= N=1
##DATA TABLE= (X++(R..R)), XYDATA
$$ [...]
42654 1355343 1249906 1076969 834457 523543 145613 -297187 -797722 -1338722 -1890983
42645 -1890983 -2417577 -2882908 -3262005 -3545247 -3736765 -3848638 -3895064 -3889572 -3845201 -3775172
42635 -3775172 -3692228 -3607315 -3529460 -3467059 -3428875 -3423421 -3457492 -3535376 -3659102 -3828992 -4043970
42624 -4043970 -4301741 -4598755 -4929484 -5284923 -5651208 -6009350 -6336352 -6607173 -6796998
42615 -6796998 -6883613 -6849700 -6684715 -6386186 -5960854 -5426201 -4811866 -4159207 -3517261 -2935271
42605 -2935271 -2453797 -2096652 -1865031 -1735516 -1664565 -1600494 -1498913 -1333780 -1098749 -801032
42595 -801032 -455117 -81398 291809 627919 886349 1030095 1032951 883599 585992 157296
42585 157296 -374595 -972807 -1593175 -2187793 -2711500 -3130010 -3426498 -3603729 -3681029 -3687943
42575 -3687943 -3657346 -3619477 -3596679 -3598575 -3619096 -3638039 -3628228 -3565905 -3439578 -3253223 -3022916
42564 -3022916 -2769390 -2510807 -2259002 -2019655 -1794130 -1580488 -1372998 -1161578 -932826
42555 -932826 -673200 -373524 -33210 337439 718110 1082739 1406031 1669920 1867519 2003585
42545 2003585 2092727 2157159 2224099 2321237 2469877 2678750 2942509 3245479 3566837 3883313
42535 3883313 4169621 4399889 4552139 4614019 4585961 4479147 4308817 4086304 3814394 3488760
42525 3488760 3104278 2661569 2169531 1643368 1100990 560620 40124 -443142 -872862
42516 -872862 -1234700 -1517866 -1717726 -1839286 -1899518 -1925990 -1950954 -2003198 -2101659 -2253412
42506 -2253412 -2455374 -2697041 -2962362 -3231267 -3482204 -3695658 -3856899 -3956658 -3990626 -3959775
42496 -3959775 -3872178 -3744616 -3601513 -3470290 -3374620 -3328640 -3334649 -3384768 -3464782 -3557964 -3648291
42485 -3648291 -3724165 -3782986 -3834379 -3898717 -3999890 -4155447 -4369239 -4630125 -4916430 -5203110
42475 -5203110 -5468294 -5697597 -5886363 -6040149 -6172883 -6302165 -6442914 -6602488 -6779598
42466 -6779598 -6966525 -7152217 -7325090 -7476445 -7605131 -7721441 -7846853 -8008424 -8230194
42457 -8230194 -8525621 -8893661 -9318922 -9774781 -10227847 -10642184 -10982797 -11219155 -11329789
42448 -11329789 -11307395 -11162061 -10920181 -10618634 -10296288 -9986086 -9710490 -9481221 -9301961
42439 -9301961 -9171303 -9083959 -9030624 -8998883 -8976989 -8959292 -8949515 -8958577 -8997583 -9070178 -9168443
42428 -9168443 -9273077 -9355778 -9382206 -9316060 -9125043 -8787610 -8298012 -7668095 -6926114 -6113331
42418 -6113331 -5279140 -4475878 -3754598 -3161459 -2732799 -2488063 -2423577 -2511981 -2709248 -2966114
42408 -2966114 -3238339 -3491790 -3701854 -3849765 -3919654 -3898882 -3780669 -3565430 -3258627 -2867342
42398 -2867342 -2399691 -1867919 -1291462 -696054 -109110 445066 947481 1384276 1745942
42389 1745942 2026979 2225953 2345511 2391895 2373530 2298753 2173606 2001211 1783750 1526546
42379 1526546 1241906 950002 675840 444224 275670 184288 176020 245641 373597 525753
42369 525753 657852 723421 682158 506438 185123 -275275 -851844 -1508541 -2201220 -2884069
42359 -2884069 -3516690 -4070043 -4529255 -4892558 -5167471 -5366223 -5501818 -5585357 -5624853 -5625724
42349 -5625724 -5592574 -5531435 -5451788 -5367868 -5298605 -5265178 -5286005 -5370939 -5517896 -5714307 -5942748
42338 -5942748 -6187192 -6435906 -6679541 -6906366 -7098362 -7230992 -7277163 -7213933 -7029375 -6726950
42328 -6726950 -6325596 -5855736 -5353096 -4852408 -4382253 -3961657 -3599271 -3295397 -3045535
42319 -3045535 -2842888 -2678455 -2539799 -2410691 -2272618 -2107697 -1902450 -1652282 -1365585
42310 -1365585 -1064826 -782367 -551756 -398131 -331561 -345065 -417348 -519548 -624041 -711527
42300 -711527 -772810 -805368 -808962 -784524 -736173 -672191 -601672 -528000 -444028 -333035 -175482
42289 -175482 42504 323715 659526 1033016 1422688 1805343 2158199 2460498 2694428 2845598
42279 2845598 2903881 2864773 2730200 2507718 2208408 1844744 1429453 975443 496132 5183
42269 5183 -485370 -968340 -1443972 -1919207 -2402806 -2898701 -3401554 -3897188 -4367144 -4793959
42259 -4793959 -5163854 -5466200 -5691829 -5832779 -5884366 -5848594 -5736904 -5570390 -5376516 -5183013
42249 -5183013 -5010926 -4868739 -4748852 -4627780 -4471995 -4249544 -3943285 -3558792 -3122547
42240 -3122547 -2672225 -2245133 -1869730 -1561349 -1320741 -1134675 -979414 -827802 -658339
42231 -658339 -462099 -243952 -18294 196755 383050 523801 604845 616956 557880 432506
42221 432506 251219 27721 -222776 -485046 -745218 -992059 -1218080 -1420313 -1600337 -1763053
42211 -1763053 -1914217 -2057473 -2191950 -2311190 -2403952 -2457012 -2459398 -2406330 -2300679 -2151041
42201 -2151041 -1967879 -1760269 -1534506 -1293721 -1037408 -761379 -459288 -125204 244960
42192 244960 654090 1104574 1596526 2123770 2670511 3211003 3711945 4136475 4449708 4626111
42182 4626111 4656906 4553893 4347065 4076834 3784155 3501591 3246726 3018590 2798537 2557255
42172 2557255 2267376 1917268 1519199 1106867 722899 402419 160824 -8910 -129673
42163 -129673 -229562 -333231 -458008 -613380 -801138 -1015676 -1245861 -1479025 -1705314 -1919906
42153 -1919906 -2122320 -2313919 -2495196 -2663940 -2814881 -2940841 -3034692 -3091010 -3106609 -3079906
42143 -3079906 -3009975 -2896695 -2742863 -2557173 -2355091 -2155644 -1975717 -1825924 -1710662 -1630967
42133 -1630967 -1586951 -1578122 -1602524 -1656424 -1735212 -1835129 -1954941 -2096554 -2263457 -2456635 -2669165
42122 -2669165 -2882540 -3068077 -3194508 -3238766 -3194000 -3069968 -2885995 -2661663 -2411443 -2146054
42112 -2146054 -1878307 -1628319 -1423466 -1291989 -1253552 -1312346 -1456900 -1666133 -1917494 -2192844
42102 -2192844 -2480635 -2775380 -3075553 -3380264 -3685247 -3979983 -4247940 -4470248 -4630822
42093 -4630822 -4720043 -4735318 -4679176 -4557277 -4378210 -4154523 -3902375 -3637996 -3372182 -3106592
42083 -3106592 -2834830 -2548264 -2243640 -1928512 -1621602 -1347887 -1131219 -988221 -925513 -939641
42073 -939641 -1018385 -1143093 -1292154 -1444937 -1585019 -1702570 -1796580 -1876692 -1962626 -2079448
42063 -2079448 -2249424 -2483877 -2778605 -3114406 -3461673 -3786962 -4059621 -4257425 -4370447
42054 -4370447 -4402521 -4370182 -4299709 -4223011 -4172425 -4174260 -4242071 -4372167 -4544055 -4726757 -4888820
42043 -4888820 -5007432 -5071991 -5080726 -5033780 -4928428 -4759649 -4524428 -4225905 -3875316 -3492408
42033 -3492408 -3105097 -2747678 -2456497 -2263705 -2191077 -2245657 -2418159 -2684899 -3013605 -3371820
42023 -3371820 -3734434 -4087014 -4424302 -4746294 -5054968 -5353084 -5644384 -5933840 -6226981
42014 -6226981 -6528223 -6839059 -7157250 -7477445 -7792268 -8092381 -8365348 -8594993 -8763246
42005 -8763246 -8854420 -8859455 -8777438 -8614003 -8378665 -8083420 -7742791 -7373490 -6992102 -6611584
41995 -6611584 -6238982 -5876054 -5522293 -5178306 -4847858 -4538053 -4257987 -4016332 -3818445
41986 -3818445 -3663822 -3545092 -3449570 -3363388 -3276584 -3186416 -3096636 -3012956 -2937679 -2867472 -2796351
41975 -2796351 -2722342 -2653528 -2609168 -2614426 -2690743 -2846093 -3069160 -3329705 -3585209 -3791987
41965 -3791987 -3917076 -3946059 -3882612 -3739673 -3527726 -3248359 -2897644 -2476259 -1998164 -1491548
41955 -1491548 -992314 -535492 -149764 143923 332480 412547 393987 301562 171161 40477
41945 40477 -61863 -123481 -148818 -154006 -159335 -182751 -236079 -323283 -439140 -567951 -684050
41934 -684050 -756322 -756880 -671066 -504582 -284778 -55824 130016 222045 179616 -21563 -386202
41923 -386202 -900314 -1536299 -2260251 -3038406 -3840450 -4639367 -5408909 -6120719 -6743372 -7244897
41913 -7244897 -7598318 -7787703 -7811765 -7683342 -7425106 -7063719 -6625340 -6133966 -5611261 -5075098
41903 -5075098 -4536042 -3994679 -3443593 -2874679 -2288079 -1697370 -1127760 -608133 -161102
41894 -161102 204015 492756 722216 915469 1095892 1282950 1490597 1728558 2004607 2324608
41884 2324608 2688698 3085852 3491329 3870054 4184926 4405541 4512548 4495894 4349885 4070658
41874 4070658 3659657 3131066 2516548 1861506 1213079 606181 55411 -443100 -901719
41865 -901719 -1328800 -1719648 -2054860 -2306664 -2450518 -2476575 -2395356 -2235282 -2034555 -1832578
41855 -1832578 -1664289 -1556979 -1527584 -1580464 -1707676 -1892576 -2114756 -2353451 -2588748 -2801920
41845 -2801920 -2976058 -3096989 -3154409 -3143430 -3066016 -2930746 -2750329 -2538565 -2308798 -2073701
41835 -2073701 -1844345 -1627670 -1423952 -1226400 -1023408 -802462 -554455 -276957 25116
41826 25116 341835 661457 971681 1258717 1506912 1700883 1828304 1879772 1845555 1713540
41816 1713540 1472586 1120282 669070 145406 -418134 -992683 -1559306 -2109459 -2641431
41807 -2641431 -3155904 -3652680 -4129216 -4580988 -5003119 -5391437 -5740525 -6038577 -6262855
41798 -6262855 -6381224 -6361666 -6185472 -5856708 -5403249 -4870049 -4308750 -3767708 -3284880 -2884759
41788 -2884759 -2579417 -2372290 -2262155 -2245197 -2314947 -2461249 -2669159 -2917765 -3179499 -3421705
41778 -3421705 -3611763 -3724118 -3745375 -3675004 -3522937 -3306857 -3050491 -2782083 -2532096 -2330115
41768 -2330115 -2200907 -2159381 -2205284 -2320410 -2471216 -2617038 -2720606 -2756153 -2712211 -2589716
41758 -2589716 -2398403 -2154124 -1877107 -1589354 -1310156 -1051431 -816066 -601104 -404208
41749 -404208 -229285 -87800 4542 32947 -12287 -132770 -319138 -549157 -790072 -1007105
41739 -1007105 -1175211 -1287715 -1356957 -1406792 -1461022 -1533280 -1622707 -1716374 -1795810 -1843567 -1847795
41728 -1847795 -1805279 -1723349 -1619316 -1516271 -1436658 -1396821 -1404271 -1457016 -1544181 -1648484 -1750841
41717 -1750841 -1835237 -1891309 -1914101 -1902709 -1859274 -1788367 -1696916 -1595892 -1503882 -1449555 -1468713
41706 -1468713 -1595004 -1848498 -2228239 -2711958 -3261667 -3831497 -4374566 -4847788 -5215495
41697 -5215495 -5453239 -5551621 -5518028 -5374153 -5149774 -4875766 -4579167 -4281028 -3996333 -3735214
41687 -3735214 -3504689 -3309426 -3150355 -3022291 -2913976 -2813015 -2713889 -2623760 -2561623 -2550897
41677 -2550897 -2609919 -2745414 -2951491 -3213140 -3511488 -3828273 -4148220 -4458868 -4747999 -4999897
41667 -4999897 -5193075 -5302107 -5303815 -5184816 -4946493 -4605294 -4188905 -3730202 -3261238 -2809270
41657 -2809270 -2395595 -2035714 -1738501 -1504035 -1322475 -1176070 -1043279 -901815 -729009
41648 -729009 -501022 -193895 211680 722687 1326646 1989612 2661695 3287998 3819850 4222359
41638 4222359 4477774 4585819 4561573 4430967 4224956 3974009 3703876 3432573 3168864 2912852
41628 2912852 2658778 2399010 2127930 1845052 1556737 1275616 1017076 793989 612593
41619 612593 472288 369585 303014 274616 285848 330235 388385 430289 425209 354079 217033
41608 217033 31493 -177611 -389286 -593400 -791161 -991380 -1205839 -1445727 -1719318 -2030447
41598 -2030447 -2377407 -2752304 -3141051 -3523889 -3876146 -4169361 -4373981 -4464426 -4425077 -4253653
41588 -4253653 -3959483 -3557991 -3065627 -2498640 -1875743 -1221866 -569769 42191 575553
41579 575553 998030 1288072 1436816 1448400 1339340 1135949 868430 562890 235497 -107781
41569 -107781 -466924 -843674 -1240734 -1662871 -2116003 -2602681 -3116761 -3641666 -4154117 -4631005
41559 -4631005 -5054809 -5414049 -5698856 -5895555 -5985473 -5950587 -5783840 -5498344 -5129820 -4730106
41549 -4730106 -4354057 -4045377 -3827373 -3702099 -3657126 -3675698 -3745261 -3861161 -4025075 -4239938
41539 -4239938 -4504263 -4808498 -5134726 -5459219 -5756577 -6004510 -6188848 -6307679 -6372380 -6403393
41529 -6403393 -6421165 -6436073 -6442924 -6423493 -6356009 -6226635 -6037136 -5805348 -5558739 -5324706
41519 -5324706 -5122792 -4962582 -4847163 -4778099 -4757325 -4784851 -4855329 -4957426 -5076983 -5201259
41509 -5201259 -5320923 -5428883 -5518087 -5581161 -5612714 -5612752 -5588791 -5555483 -5531867 -5536916 -5584122 -5676632
41497 -5676632 -5805145 -5949840 -6085528 -6187756 -6238201 -6229061 -6166115 -6068663 -5964242 -5878448
41487 -5878448 -5824250 -5796666 -5775814 -5736267 -5657454 -5530417 -5358912 -5155471 -4934809 -4707851
41477 -4707851 -4479006 -4247079 -4008322 -3759964 -3503419 -3246448 -3002988 -2790418 -2625784
41468 -2625784 -2522656 -2488449 -2521454 -2608802 -2728028 -2852439 -2956815 -3019748 -3022902 -2950392 -2790445
41457 -2790445 -2538439 -2199238 -1787944 -1329169 -855059 -401929 -5675 303022 502307
41448 502307 580531 535902 376035 118361 -209967 -575236 -944090 -1291456 -1605307 -1886157
41438 -1886157 -2142294 -2383620 -2616858 -2843975 -3064118 -3277166 -3485450 -3691112 -3890358
41429 -3890358 -4069366 -4206387 -4280314 -4281196 -4216859 -4112738 -4006083 -3937808 -3944446 -4051034 -4265358
41418 -4265358 -4575068 -4949644 -5347581 -5726261 -6050828 -6299784 -6467288 -6562416 -6604939 -6617596
41408 -6617596 -6617380 -6609917 -6589510 -6543768 -6459691 -6328814 -6151060 -5937687 -5712903 -5512622 -5379068
41397 -5379068 -5351473 -5455155 -5692442 -6038795 -6446333 -6854683 -7206230 -7460410 -7601798 -7639416
41387 -7639416 -7598434 -7507877 -7388881 -7247825 -7077189 -6863574 -6598454 -6285763 -5942719 -5594393
41377 -5594393 -5265532 -4973797 -4727478 -4527967 -4374020 -4263365 -4190164 -4141789 -4100103 -4048215
41367 -4048215 -3977716 -3890466 -3793927 -3694399 -3593199 -3487396 -3373236 -3249198 -3116578 -2977569
41357 -2977569 -2833076 -2683159 -2530680 -2385274 -2263411 -2182883 -2154151 -2173334 -2220941 -2267419
41347 -2267419 -2282834 -2245986 -2149000 -1996592 -1801918 -1581542 -1351286 -1123989 -909636 -717260
41337 -717260 -556884 -439516 -374421 -364372 -401095 -463749 -522576 -547315 -517176 -427942 -293258
41326 -293258 -139963 123 98278 133725 94115 -27204 -234356 -529770 -911347 -1367351
41316 -1367351 -1872686 -2390162 -2877484 -3297046 -3624506 -3853640 -3996915 -4081725 -4142415 -4209254
41306 -4209254 -4297494 -4400926 -4493492 -4539290 -4507043 -4382279 -4171918 -3900692 -3603380 -3317452
41296 -3317452 -3078195 -2915879 -2853858 -2907278 -3082238 -3375131 -3771932 -4247922 -4768962 -5295259
41286 -5295259 -5787339 -6212337 -6548043 -6783277 -6915349 -6946858 -6883612 -6733942 -6508895 -6222827
41276 -6222827 -5894010 -5544349 -5197098 -4872619 -4583721 -4332662 -4111114 -3903163 -3690290
41267 -3690290 -3456542 -3192154 -2895222 -2572216 -2237761 -1912647 -1618971 -1373662 -1183572
41258 -1183572 -1044604 -944834 -869931 -808750 -756822 -715904 -690104 -682001 -692345 -723394 -782329
41247 -782329 -881030 -1031465 -1239184 -1498511 -1792063 -2094475 -2377645 -2614732 -2782809 -2866628
41237 -2866628 -2864750 -2795108 -2694437 -2608500 -2575981 -2613604 -2709694 -2828564 -2922668 -2946873 -2870196
41226 -2870196 -2682790 -2397407 -2044910 -1664308 -1290138 -942381 -623723 -324822 -33339
41217 -33339 258996 553729 845746 1123685 1370822 1568027 1698987 1755505 1740540 1668091
41207 1668091 1560263 1442406 1337889 1264367 1232575 1247235 1309050 1416855 1569070 1763588
41197 1763588 1996078 2257639 2532882 2799172 3028206 3191119 3266251 3245795 3137680 2962709
41187 2962709 2749854 2531708 2339503 2197144 2116181 2094710 2121297 2181984 2266839 2372911
41177 2372911 2502308 2657077 2834544 3026028 3218888 3399483 3555044 3674320 3747851 3768881
41167 3768881 3735526 3654034 3541187 3422744 3326529 3272664 3266132 3295373 3336661 3361380 3343184
41156 3343184 3263324 3113141 2893537 2612113 2279376 1904947 1494205 1046577 557462 24276
41146 24276 -546417 -1135810 -1716311 -2259283 -2742118 -3151543 -3483427 -3741103 -3933595 -4074178
41136 -4074178 -4179311 -4267701 -4358535 -4467771 -4602979 -4759628 -4922359 -5071698 -5192404 -5278007
41126 -5278007 -5329364 -5349802 -5341461 -5305435 -5244951 -5168829 -5092503 -5035284 -5015238 -5045041 -5131488
41115 -5131488 -5277566 -5483240 -5742712 -6040258 -6348765 -6632782 -6854357 -6978922 -6979732 -6840634
41105 -6840634 -6557320 -6137450 -5600091 -4974477 -4297473 -3609253 -2947670 -2342525 -1811076
41096 -1811076 -1355847 -965280 -617040 -283270 63042 441774 861376 1318241 1799179
41087 1799179 2284354 2748581 3161872 3491640 3707532 3787469 3722637 3519495 3197635 2783864
41077 2783864 2305449 1786586 1249232 715144 204843 -267045 -696376 -1089682 -1459046
41068 -1459046 -1814575 -2158685 -2484704 -2779240 -3025902 -3208598 -3314255 -3335474 -3273096 -3138220
41058 -3138220 -2953426 -2752692 -2578720 -2476711 -2485847 -2631623 -2921631 -3344972 -3874292 -4470279
41048 -4470279 -5089100 -5691850 -6252276 -6758417 -7206549 -7590822 -7894923 -8090967 -8146386 -8035418
41038 -8035418 -7750039 -7306082 -6742407 -6113431 -5477520 -4885184 -4370996 -3951624 -3629781
41029 -3629781 -3401167 -3260291 -3202440 -3222206 -3311214 -3457223 -3644847 -3856781 -4075075 -4282766
41019 -4282766 -4466053 -4616015 -4728268 -4799908 -4825256 -4793399 -4689948 -4502790 -4229027 -3879492
41009 -3879492 -3478319 -3057302 -2647090 -2269135 -1932347 -1635994 -1376747 -1155124 -976966
41000 -976966 -848848 -770674 -731243 -710907 -690407 -660376 -625905 -604365 -618758 -690275 -833095
40989 -833095 -1052782 -1347703 -1711017 -2130899 -2589371 -3062442 -3523524 -3948791 -4320970 -4629449
40979 -4629449 -4867780 -5031737 -5120503 -5140875 -5111165 -5060453 -5021395 -5019423 -5063993 -5145951 -5241199
40968 -5241199 -5318112 -5346125 -5303663 -5183569 -4994136 -4754980 -4489521 -4217550 -3951192 -3695441
40958 -3695441 -3452100 -3224684 -3021939 -2857988 -2747895 -2699611 -2706345 -2744767 -2781274 -2782867 -2726135
40947 -2726135 -2600402 -2406041 -2151346 -1850066 -1519748 -1180476 -853770 -561180 -322001
40938 -322001 -150337 -52771 -27729 -66835 -157838 -288176 -447664 -628816 -824813 -1026903
40928 -1026903 -1222806 -1395894 -1524183 -1579917 -1532103 -1353191 -1027795 -559414 27793 692570
40918 692570 1383974 2050414 2647875 3145405 3527015 3790190 3941870 3993545 3957806 3848177
40908 3848177 3681284 3477875 3259670 3042850 2832504 2622111 2398554 2149506 1869120
40899 1869120 1559763 1230103 891363 553452 222220 -101054 -417382 -726240 -1023107
40890 -1023107 -1300309 -1549756 -1764152 -1935292 -2051946 -2100825 -2071073 -1959391 -1772392 -1525337
40880 -1525337 -1238797 -935385 -637790 -367795 -145134 14669 103229 121716 81420 1875
40870 1875 -93067 -180119 -241041 -265827 -254446 -217402 -175052 -154935 -186238 -291882 -480814
40859 -480814 -744301 -1058224 -1389452 -1702232 -1962215 -2139338 -2211506 -2168695 -2015088 -1767950
40849 -1767950 -1454231 -1106452 -758733 -443296 -187833 -13557 66576 49361 -58520 -241996
40839 -241996 -479640 -745264 -1009783 -1244498 -1425291 -1535692 -1567695 -1521180 -1403411 -1228871
40829 -1228871 -1018348 -796039 -584139 -396236 -232432 -79379 83843 276321 506542
40820 506542 767924 1040060 1294458 1501768 1637728 1687159 1647277 1530985 1368299 1202911
40810 1202911 1083067 1049742 1126646 1314788 1591481 1912854 2220090 2450054 2549015 2485159
40800 2485159 2255054 1881743 1405950 874076 327108 -206319 -711128 -1182206 -1619184
40791 -1619184 -2023008 -2395553 -2740762 -3064421 -3370922 -3658444 -3916227 -4126824 -4272548
40782 -4272548 -4342424 -4336433 -4266603 -4155766 -4033944 -3931945 -3873589 -3869878 -3917362 -4000126 -4093642
40771 -4093642 -4169974 -4204769 -4184990 -4113928 -4010158 -3900267 -3808882 -3750873 -3728813 -3735562 -3759624
40760 -3759624 -3790606 -3823125 -3858451 -3903734 -3969426 -4066335 -4203892 -4389848 -4630053 -4926795
40750 -4926795 -5275585 -5661989 -6060731 -6438590 -6761152 -7001601 -7148065 -7206007 -7194522 -7138795
40740 -7138795 -7062700 -6984282 -6914627 -6859422 -6822199 -6807740 -6823628 -6879068 -6982417 -7139802 -7355590
40729 -7355590 -7633414 -7976347 -8386136 -8862055 -9399560 -9988758 -10613097 -11248520 -11862973
40720 -11862973 -12416594 -12864260 -13161865 -13275324 -13188646 -12907344 -12455870 -11870937 -11194426
40711 -11194426 -10468747 -9734601 -9028726 -8380318 -7808302 -7322820 -6930834 -6641491 -6467010
40702 -6467010 -6418850 -6502087 -6710714 -7025105 -7412513 -7831321 -8238576 -8598502 -8889118 -9104800
40692 -9104800 -9254292 -9355083 -9426491 -9484128 -9537803 -9593117 -9654641 -9726913 -9810898 -9898178 -9968766
40681 -9968766 -9996420 -9958917 -9846578 -9664389 -9428393 -9159891 -8880410 -8608747 -8360069 -8145977
40671 -8145977 -7974031 -7846405 -7758835 -7700847 -7656830 -7607413 -7531726 -7411411 -7235565 -7004146
40661 -7004146 -6727809 -6424064 -6111359 -5803924 -5510073 -5234978 -4985999 -4776929 -4628284
40652 -4628284 -4563454 -4602990 -4760061 -5038574 -5432763 -5925812 -6487255 -7072550 -7628792 -8106258
40642 -8106258 -8470415 -8708415 -8827996 -8851215 -8807002 -8725331 -8633865 -8556488 -8512887 -8518654 -8585716
40631 -8585716 -8722420 -8932326 -9211298 -9544051 -9902412 -10247557 -10537044 -10734766 -10819568 -10788284
40621 -10788284 -10652398 -10431680 -10149276 -9829729 -9497815 -9175408 -8876263 -8601446 -8338745
40612 -8338745 -8067223 -7765251 -7418666 -7025901 -6598337 -6156336 -5723323 -5321067 -4967616
40603 -4967616 -4676659 -4455970 -4304590 -4211150 -4155885 -4116079 -4072080 -4011060 -3927515 -3821307
40593 -3821307 -3694736 -3550208 -3389164 -3212034 -3018645 -2809111 -2585295 -2351377 -2111172
40584 -2111172 -1861736 -1587052 -1257614 -838499 -301736 365277 1161096 2079421 3118486
40575 3118486 4283638 5582160 7015023 8571062 10226009 11945613 13690428 15419794
40567 15419794 17093674 18672866 20119094 21395405 22466003 23295725 23852123 24112709
40559 24112709 24075050 23763084 23224654 22521744 21719194 20876285 20041793 19251464 18527515
40550 18527515 17880057 17309417 16808197 16363550 15961289 15592209 15257947 14972337 14756259
40541 14756259 14627886 14592753 14637627 14730226 14824859 14872380 14831085 14674383 14392457 13988197
40531 13988197 13470456 12848838 12133137 11337161 10482710 9598399 8712349 7844057 7002080
40522 7002080 6188980 5408706 4670383 3986193 3365068 2806045 2295747 1812823 1337878
40513 1337878 863279 397259 -38863 -418081 -717004 -924729 -1047599 -1106143 -1124738 -1120517
40503 -1120517 -1099233 -1060036 -1003846 -937891 -873263 -818578 -775059 -736031 -689701 -622910 -524714
40492 -524714 -389886 -221504 -30631 167788 361163 544118 719339 894289 1076009 1266956
40482 1266956 1463518 1656738 1833776 1979464 2078525 2118777 2094190 2006001 1861055 1668486
40472 1668486 1437286 1177110 902623 638385 419244 283092 258150 351670 546713 808453
40462 808453 1095536 1370183 1603331 1774961 1871704 1884057 1805557 1635602 1385154 1081298
40452 1081298 766004 487902 290592 203050 235773 382582 625043 936119 1282182 1625677
40442 1625677 1931025 2173059 2343791 2453828 2528255 2599368 2698430 2847915 3056279 3317619
40432 3317619 3616593 3935860 4261902 4586597 4905171 5213518 5507884 5787285 6056052
40423 6056052 6323466 6600260 6894940 7212700 7556436 7926842 8319813 8723154 9116589
40414 9116589 9476996 9786520 10038623 10238655 10399329 10534572 10655565 10770664 10887756
40405 10887756 11015660 11161800 11326716 11499360 11657580 11774889 11830538 11818033 11748431 11647187
40395 11647187 11545347 11467581 11421432 11393171 11353521 11270782 11123795 10907670 10631197 10310455
40385 10310455 9963074 9604002 9241823 8876381 8499675 8100161 7667976 7198535 6694055
40376 6694055 6163577 5621395 5083255 4560935 4057621 3566960 3077053 2578094 2070179
40367 2070179 1567286 1094805 680931 345792 94138 -84079 -205849 -285512 -329499 -337360
40357 -337360 -305968 -232688 -115772 46736 257586 519715 834876 1201993 1615108 2060884
40347 2060884 2516730 2951732 3331786 3627558 3821463 3910223 3902742 3816226 3673434 3501103
40337 3501103 3327046 3174721 3057774 2978711 2932783 2913278 2913678 2925911 2937922 2933609 2895380
40326 2895380 2807558 2659045 2444567 2164843 1826890 1445378 1043757 652013 299320 4182
40316 4182 -232339 -426142 -602537 -785372 -987500 -1205991 -1423110 -1611443 -1740040 -1779033
40306 -1779033 -1702457 -1490841 -1134907 -639745 -27269 664765 1386979 2084365 2703063 3197643
40296 3197643 3537804 3711913 3725107 3592729 3332906 2962114 2494661 1944243 1325351 653936
40286 653936 -52208 -773249 -1487806 -2174266 -2811991 -3381828 -3866861 -4254699 -4540461 -4727313
40276 -4727313 -4822762 -4833269 -4762334 -4614290 -4400430 -4141672 -3865171 -3597436 -3358689 -3161318
40266 -3161318 -3011962 -2914650 -2872208 -2884216 -2942225 -3025540 -3102004 -3135650 -3098372 -2979357 -2787091
40255 -2787091 -2543594 -2275180 -2005293 -1752240 -1530554 -1352736 -1229023 -1165232 -1160224 -1204267
40245 -1204267 -1279018 -1359115 -1414912 -1415668 -1333184 -1146553 -847866 -446484 31088 546513 1057921
40234 1057921 1528207 1931199 2254011 2494450 2654755 2736033 2737426 2659346 2506288 2285819
40224 2285819 2004888 1666875 1271291 815650 298677 -275746 -894985 -1536479 -2170295
40215 -2170295 -2764409 -3289903 -3723680 -4048391 -4251171 -4323126 -4260106 -4063745 -3741469 -3305557
40205 -3305557 -2772562 -2163735 -1505055 -825020 -150505 496377 1097993 1638508 2102336
40196 2102336 2475741 2750236 2924972 3007015 3010670 2957141 2874195 2794389 2750838 2770920 2869349
40185 2869349 3042531 3266493 3500554 3697269 3815702 3832221 3744288 3567522 3330085 3067291
40175 3067291 2815997 2607533 2460683 2377968 2346640 2342766 2336154 2295098 2190610 1999678 1707968
40164 1707968 1313176 828949 286239 -271725 -800873 -1268928 -1662660 -1986691 -2255594
40155 -2255594 -2483508 -2675420 -2823406 -2909846 -2916666 -2835667 -2673386 -2447347 -2176685 -1873710
40145 -1873710 -1541151 -1175266 -771909 -332218 134508 612014 1081777 1528592 1943981
40136 1943981 2325844 2675043 2990743 3266619 3489803 3643674 3713644 3692969 3585234 3402242
40126 3402242 3159063 2869421 2543874 2191251 1822089 1451761 1101095 793610 550548
40117 550548 386069 304212 297974 350779 441068 549756 667198 794868 939957 1106302
40107 1106302 1287534 1465734 1614586 1704297 1707024 1603312 1389567 1084269 728733 379041
40097 379041 90037 -102134 -189789 -190146 -131151 -36045 84335 229463 402042 602289 826433
40086 826433 1068334 1321863 1582626 1848626 2119954 2397540 2681289 2968417 3252971 3526825
40076 3526825 3781063 4006338 4192635 4330906 4417981 4461789 4481243 4498289 4526501 4564376
40066 4564376 4598195 4612025 4597584 4557670 4502140 4440540 4377107 4311410 4243317 4177855 4125758
40055 4125758 4098927 4103815 4137048 4185471 4229440 4246781 4216062 4119602 3946515 3694850 3371676
40044 3371676 2991248 2572511 2137071 1707831 1307952 959479 680711 481997 361555
40035 361555 304513 287259 285592 282295 270471 252568 237464 237344 264092 324913 418978 537857
40023 537857 670152 807200 945967 1088130 1237435 1397616 1570997 1756483 1946822 2126997
40013 2126997 2275911 2371306 2395352 2337975 2196980 1976439 1685489 1338488 955588 561778
40003 561778 183675 -154378 -432163 -632560 -740167 -742895 -636816 -431046 -148958 175338
39993 175338 503829 802226 1045871 1222139 1329351 1373965 1367706 1324619 1257270 1172439 1068044
39982 1068044 933205 752628 515003 222675 -102358 -420241 -682702 -845873 -881384 -782578
39972 -782578 -564673 -259320 93902 455167 788436 1062248 1249637 1328982 1285848 1114955
39962 1114955 821476 421089 -61431 -594897 -1144999 -1677585 -2161540 -2571491 -2890467
39953 -2890467 -3111667 -3237320 -3273616 -3223986 -3085923 -2854995 -2534351 -2143365 -1719021 -1308497
39943 -1308497 -957031 -697391 -544670 -495460 -528452 -606027 -679380 -698513 -623993 -434867
39933 -434867 -129648 278206 766590 1309629 1879864 2448524 2986172 3465748 3867672 4184496
39923 4184496 4422599 4600033 4741103 4869148 5000013 5138818 5280769 5414073 5522523
39914 5522523 5587710 5592703 5528061 5397947 5222476 5033606 4865304 4741795 4669013 4633241
39904 4633241 4607685 4564153 4484667 4367896 4228044 4087458 3967015 3878638 3822620 3789927
39894 3789927 3767690 3745130 3717644 3688107 3665521 3661686 3686887 3746217 3838216 3955992 4089334
39883 4089334 4226343 4354733 4463436 4543795 4588664 4589649 4535364 4413255 4214335 3937745
39873 3937745 3593279 3202299 2797509 2420188 2113510 1913254 1839585 1892908 2054416 2290657
39863 2290657 2561127 2826766 3056022 3226300 3322133 3333579 3256600 3094114 2855834 2556844
39853 2556844 2216229 1856352 1501997 1178441 908291 708081 586468 545163 581313 688335
39843 688335 854210 1060468 1285874 1513998 1738702 1962669 2190576 2422905 2654666 2878491
39833 2878491 3088956 3285714 3474333 3664536 3866388 4085943 4321978 4564452 4794553
39824 4794553 4986569 5112031 5145922 5073390 4894914 4628085 4305166 3966998 3655825 3410228
39814 3410228 3263284 3241508 3361191 3622114 4003177 4465019 4960133 5445588 5892051 6285982
39804 6285982 6626379 6919837 7176913 7410139 7631942 7850829 8066819 8269283 8439625
39795 8439625 8557561 8606554 8574921 8453521 8234375 7913593 7497171 7004711 6467233 5919962
39785 5919962 5394360 4912836 4486165 4112084 3775122 3449884 3108947 2732971 2318235
39776 2318235 1878173 1439081 1032471 686634 419504 234979 124096 70239 55324 64010
39766 64010 85009 110066 131452 138978 118190 51609 -76575 -274157 -535738 -841007 -1156970
39755 -1156970 -1442925 -1656534 -1760463 -1730290 -1563255 -1284340 -944730 -610898 -348370 -207333
39745 -207333 -215117 -375565 -671831 -1069416 -1519159 -1962344 -2339512 -2601015 -2714744 -2667998
39735 -2667998 -2465028 -2124391 -1678004 -1169656 -649664 -165714 246084 565503 786790
39726 786790 914338 958625 933146 850977 720740 544135 317353 35575 -302964 -695992
39716 -695992 -1138550 -1623812 -2141659 -2676201 -3205012 -3701803 -4141426 -4504351 -4778577 -4959503
39706 -4959503 -5049648 -5058883 -5003746 -4904238 -4778443 -4637425 -4483454 -4313347 -4125972 -3930085
39696 -3930085 -3747870 -3611777 -3556115 -3607059 -3774423 -4047324 -4394995 -4773211 -5134872 -5441158
39686 -5441158 -5668917 -5811510 -5873694 -5864044 -5788859 -5649378 -5441635 -5158082 -4791081 -4338182
39676 -4338182 -3807253 -3218747 -2604230 -2002873 -1457446 -1009562 -693092 -526587 -508071 -615676
39666 -615676 -814419 -1065486 -1332995 -1585986 -1797849 -1947212 -2021565 -2021137 -1959494 -1859868 -1748953
39655 -1748953 -1650552 -1580557 -1544167 -1536133 -1544494 -1556905 -1566990 -1577277 -1596590 -1632850 -1685084 -1739137
39643 -1739137 -1769629 -1747383 -1648723 -1462128 -1189742 -844621 -446660 -19060 414739 833968
39633 833968 1222459 1568575 1863425 2098623 2264545 2350101 2345245 2246355 2061794 1813470
39623 1813470 1532648 1252418 1001189 800242 665220 608900 641943 770288 991225 1291712
39613 1291712 1650405 2041658 2439140 2818632 3160775 3453891 3696025 3895248 4067240
39604 4067240 4229325 4391826 4550702 4686377 4770696 4778866 4700378 4543653 4332833 4099420
39594 4099420 3873936 3681544 3541463 3467075 3464320 3528816 3644036 3782570 3911042 3997028
39584 3997028 4014415 3944347 3772534 3487279 3081438 2556930 1927581 1217879 458791 -316527
39574 -316527 -1075256 -1785429 -2415857 -2937556 -3327733 -3574724 -3680736 -3660858 -3539618 -3347365
39564 -3347365 -3117431 -2883908 -2680063 -2537597 -2485833 -2548860 -2739485 -3051615 -3455179 -3897622
39554 -3897622 -4313021 -4635873 -4814565 -4820252 -4649492 -4321104 -3869211 -3335151 -2761072 -2186433
39544 -2186433 -1646517 -1170801 -779976 -482198 -270862 -126512 -24233 55360 116797 147795
39534 147795 126497 34009 -134863 -368134 -641126 -925313 -1196486 -1439092 -1646622 -1819972
39524 -1819972 -1965538 -2093624 -2216959 -2348971 -2501558 -2682049 -2889980 -3115404 -3340466
39515 -3340466 -3544195 -3708097 -3819715 -3872874 -3865712 -3798731 -3674449 -3498679 -3282091 -3040600
39505 -3040600 -2793986 -2563024 -2365660 -2212889 -2105775 -2035718 -1988957 -1953434 -1923913 -1902211
39495 -1902211 -1892743 -1896383 -1905987 -1905620 -1873894 -1790212 -1640986 -1422422 -1138263 -794440 -394775
39484 -394775 58931 562598 1104784 1665200 2218751 2743147 3225439 3663913 4065225 4439485
39474 4439485 4795833 5139078 5466985 5768780 6026795 6222262 6343338 6390694 6376771 6318826
39464 6318826 6230260 6115359 5969493 5783296 5548509 5263984 4940681 4603607 4288903 4036297
39454 4036297 3879495 3837774 3911167 4080321 4310843 4560420 4786190 4950431 5024422 4991141
39444 4991141 4846522 4597874 4259119 3845668 3373768 2866266 2360305 1908683 1570788
39435 1570788 1397972 1422947 1658118 2099117 2726622 3504445 4378308 5280592 6141776 6904325
39425 6904325 7533232 8019300 8374888 8625219 8799468 8924328 9020211 9099382 9165948 9217887
39415 9217887 9250296 9258102 9237035 9183216 9092801 8963039 8794784 8594757 8374839 8147325
39405 8147325 7918714 7686827 7443887 7183204 6904229 6612918 6318605 6030572 5756033
39396 5756033 5499272 5261711 5043333 4845032 4669708 4520170 4394827 4284611 4173899
39387 4173899 4045097 3884367 3685998 3453848 3199344 2936792 2678656 2433766 2208931
39378 2208931 2011188 1847375 1720937 1629346 1565354 1522015 1497885 1498863 1535648 1618631 1752613
39367 1752613 1932780 2142559 2354496 2535474 2656026 2700183 2670522 2585199 2468847 2343195
39357 2343195 2222736 2116384 2031429 1975033 1951509 1958048 1983575 2013032 2034648 2044747 2046322
39346 2046322 2042562 2030416 1999130 1934721 1827130 1675233 1486940 1275179 1052635 827798
39336 827798 603335 376880 143921 -98262 -347527 -596170 -832680 -1045056 -1224681 -1369328
39326 -1369328 -1483043 -1571876 -1637955 -1676858 -1681011 -1646735 -1579982 -1497474 -1423147 -1381524 -1390186
39315 -1390186 -1454192 -1564905 -1703734 -1848765 -1981188 -2089160 -2168180 -2218841 -2244255 -2248978
39305 -2248978 -2239013 -2220956 -2199844 -2177812 -2155596 -2135769 -2124090 -2126367 -2141804 -2156632 -2142097 -2058612
39293 -2058612 -1864808 -1528169 -1033961 -390258 372379 1207229 2062336 2891751 3662188
39284 3662188 4352975 4951156 5445302 5820861 6058984 6140115 6051913 5798114 5403310 4910505
39274 4910505 4372573 3841681 3360696 2958378 2648094 2428959 2288644 2207572 2164014 2138679
39264 2138679 2116864 2087490 2040716 1967000 1858976 1715107 1543063 1361361 1198255 1086767
39254 1086767 1055823 1120380 1275560 1498330 1755973 2016780 2257678 2465961 2635915 2763723
39244 2763723 2844232 2871201 2840403 2753786 2622503 2466753 2311807 2182284 2098013 2072719
39234 2072719 2113443 2218370 2373840 2553582 2721902 2839911 2872571 2794822 2595270 2276541
39224 2276541 1852856 1346671 785655 199773 -381864 -933301 -1431990 -1857588 -2191862
39215 -2191862 -2421452 -2542296 -2562336 -2499851 -2378042 -2218943 -2039382 -1849302 -1651258 -1440860
39205 -1440860 -1209111 -946841 -649585 -320554 29666 386643 737602 1076315 1404188
39196 1404188 1726444 2045926 2358866 2655067 2921610 3147616 3328046 3465431 3569291
39187 3569291 3653909 3735547 3829529 3946973 4091741 4259462 4439930 4621914 4797756 4965833
39177 4965833 5130419 5299177 5478934 5671595 5873151 6077115 6279754 6481803 6683655
39168 6683655 6877020 7040233 7142441 7155066 7063571 6872816 6604479 6289755 5961587 5648661
39158 5648661 5371316 5139111 4950316 4793761 4652809 4510175 4352132 4171285 3967960
39149 3967960 3749917 3529558 3318824 3124464 2947367 2786775 2645633 2532122 2455939 2421978
39139 2421978 2425288 2449798 2472104 2470229 2434310 2373356 2313478 2288556 2328890 2452924 2663438
39128 2663438 2947227 3277739 3620480 3939691 4203488 4385737 4465560 4427125 4261653 3971292
39118 3971292 3572471 3095879 2581640 2070767 1596239 1177317 818952 515385 255550
39109 255550 28224 -174175 -353922 -509135 -637421 -740074 -824188 -901228 -982384 -1072613
39099 -1072613 -1166314 -1247765 -1297247 -1299731 -1250667 -1155556 -1025041 -869838 -698306 -516019 -325484
39088 -325484 -125650 87314 316778 561276 812576 1058465 1288033 1494133 1670334 1805680
39078 1805680 1883434 1886174 1803731 1638497 1405682 1129859 840538 568559 343597 191791
39068 191791 132437 174114 312123 528930 797321 1084365 1354676 1572872 1706206 1728314
39058 1728314 1623835 1391985 1046354 610008 108513 -434575 -997391 -1556807 -2087377
39049 -2087377 -2565015 -2974173 -3314321 -3601367 -3862351 -4125606 -4411050 -4724533 -5057014
39040 -5057014 -5387092 -5685595 -5922057 -6072211 -6123968 -6079417 -5952827 -5766784 -5548077 -5323292
39030 -5323292 -5113737 -4930912 -4774491 -4634015 -4493686 -4338380 -4158385 -3950688 -3716681
39021 -3716681 -3458764 -3179396 -2883948 -2585199 -2305310 -2072419 -1912364 -1839437 -1851167 -1929904
39011 -1929904 -2049599 -2183502 -2309696 -2414578 -2495524 -2561914 -2631948 -2724503 -2849470 -3002089
39001 -3002089 -3164496 -3313173 -3427848 -3497841 -3524186 -3518105 -3496898 -3478190 -3473700 -3484556 -3500353
38990 -3500353 -3503106 -3474929 -3406335 -3301538 -3178628 -3065097 -2991008 -2982047 -3053714 -3207693 -3432071
38979 -3432071 -3706550 -4010954 -4332475 -4667013 -5013604 -5365669 -5705096 -6003379 -6229584
38970 -6229584 -6360609 -6388172 -6319126 -6169657 -5957160 -5694830 -5392365 -5061508 -4720510 -4391521
38960 -4391521 -4090863 -3819085 -3558275 -3277839 -2943826 -2526624 -2005945 -1374531 -641131
38951 -641131 168239 1011878 1837400 2590334 3224997 3713822 4050375 4244261 4311069 4263222
38941 4263222 4106034 3839471 3463247 2982116 2409482 1768806 1093124 422556 -200266
38932 -200266 -736209 -1155283 -1440283 -1587734 -1606291 -1512863 -1327255 -1067172 -745899 -373771
38922 -373771 37526 470265 898255 1288554 1607420 1828498 1939842 1946912 1870900 1744075
38912 1744075 1604895 1494688 1455689 1528334 1745954 2127250 2669621 3346997 4114059 4916007
38902 4916007 5700892 6430222 7083979 7658817 8162116 8606589 9008148 9385663 9759158
38893 9759158 10144702 10547569 10957056 11345920 11675696 11906775 12009454 11970914 11795382 11499524
38883 11499524 11107827 10650579 10162530 9678830 9228024 8825627 8472086 8155984 7860417
38874 7860417 7569958 7276561 6983376 6705240 6464445 6281623 6164700 6101588 6061657 6006205
38864 6006205 5902610 5735178 5508659 5244788 4974807 4730883 4538125 4407946 4333419 4288392
38854 4288392 4232484 4122410 3926166 3633999 3260973 2840374 2411718 2009186 1655185 1360194
38844 1360194 1126750 954002 840428 784269 782574 830205 920209 1046486 1207796 1410086
38834 1410086 1663974 1977479 2348280 2761144 3192610 3619392 4024552 4398302 4735144
38825 4735144 5030948 5281448 5481710 5626574 5713022 5743956 5730481 5690268 5642830 5604739
38815 5604739 5586746 5592834 5620958 5665783 5722987 5792849 5880442 5991889 6129031 6286288 6452143
38804 6452143 6614560 6766785 6909839 7050393 7195565 7347215 7498294 7633359 7734200
38795 7734200 7788724 7798395 7779976 7760797 7769998 7828627 7940598 8087228 8229047 8316571 8306556
38784 8306556 8176344 7930273 7597227 7222532 6857934 6552174 6343822 6257422 6302533 6474067
38774 6474067 6753046 7108794 7503676 7899295 8261394 8562160 8781177 8906779 8937180 8879430
38764 8879430 8745784 8549967 8306070 8029873 7739261 7450911 7174268 6907236 6637241
38755 6637241 6347444 6024739 5666142 5281683 4892885 4526506 4205037 3937498 3714524
38746 3714524 3509937 3288732 3019243 2685328 2293506 1871859 1461684 1105946 838600
38737 838600 677200 620401 651404 746458 884680 1054442 1253742 1485504 1751156 2046028
38727 2046028 2358605 2673602 2976770 3258369 3512943 3735652 3918390 4049500 4117818 4117633
38717 4117633 4050471 3923108 3744772 3526056 3279022 3016396 2749437 2486206 2231933 1991447
38707 1991447 1771962 1584201 1440867 1353509 1329954 1373449 1482468 1649644 1860289 2092720
38697 2092720 2321624 2523050 2678517 2777108 2816213 2802012 2749900 2683776 2632394 2621701 2665032
38686 2665032 2756298 2871275 2977381 3046635 3064866 3033732 2966680 2881714 2793574 2707648 2618088
38675 2618088 2511249 2372782 2194951 1981271 1747116 1515790 1310298 1143146 1008751
38666 1008751 883048 731441 521607 235214 -126112 -541520 -976406 -1390379 -1746654
38657 -1746654 -2021645 -2212002 -2336066 -2429104 -2534427 -2692938 -2932886 -3262485 -3669062 -4126356
38647 -4126356 -4606187 -5087574 -5558961 -6014743 -6450210 -6857862 -7225579 -7536178 -7768217
38638 -7768217 -7898156 -7903729 -7768032 -7483590 -7055968 -6506627 -5874119 -5211713 -4579675 -4032925
38628 -4032925 -3607986 -3314475 -3134530 -3030074 -2954801 -2866749 -2737897 -2558701 -2336990 -2092147
38618 -2092147 -1846914 -1619974 -1421425 -1251374 -1100782 -954289 -795162 -611423 -400734
38609 -400734 -172066 55802 257517 405083 472244 438827 294186 39653 -309303 -721500
38599 -721500 -1151645 -1548321 -1867881 -2088564 -2217178 -2284644 -2333211 -2402209 -2518246 -2692031
38589 -2692031 -2920427 -3190808 -3485202 -3783313 -4064912 -4312027 -4510388 -4649814 -4724441 -4733849
38579 -4733849 -4684371 -4588306 -4459996 -4310499 -4143863 -3956735 -3741022 -3488072 -3192562 -2854620
38569 -2854620 -2479826 -2077824 -1660398 -1239099 -822346 -412674 -5817 407055 833916
38560 833916 1275476 1721442 2152679 2549097 2899097 3204914 3480718 3744718 4009702 4276728
38550 4276728 4534278 4762128 4937552 5041878 5066220 5014908 4904759 4760202 4606908 4466991
38540 4466991 4356324 4282889 4246175 4238747 4249360 4264720 4268177 4237933 4149229 3982109 3731518
38529 3731518 3414371 3069679 2751030 2513785 2401385 2435403 2612014 2904928 3273100 3671010
38519 3671010 4059058 4411365 4718932 4988065 5235614 5482794 5748706 6044537 6370026
38510 6370026 6713527 7055701 7375125 7653489 7878281 8042061 8139526 8165198 8114170 7985498
38500 7985498 7785644 7529811 7241203 6948842 6683670 6472637 6332284 6264716 6257963 6290473
38490 6290473 6337717 6378042 6395317 6378137 6318286 6211715 6061745 5880435 5685010 5491434
38480 5491434 5310474 5148983 5013745 4913400 4857368 4854211 4911515 5036086 5232102 5497490
38470 5497490 5821174 6182970 6555071 6903543 7190725 7380934 7449636 7392404 7228398 6995444
38460 6995444 6738156 6494444 6286563 6119924 5988002 5878772 5779506 5679964 5575019 5466155
38450 5466155 5359953 5263184 5177017 5094250 5001802 4887147 4744537 4576809 4391547 4194422
38440 4194422 3984764 3756956 3506958 3239045 2967562 2712332 2491057 2313498 2180016
38431 2180016 2084157 2017517 1974567 1955021 1962842 2003548 2082420 2203851 2369602 2574718 2802944
38420 2802944 3024886 3200601 3286596 3246304 3061640 2741208 2320996 1856781 1411477 1041853
38410 1041853 787677 664688 662450 748313 877977 1010401 1121254 1208273 1286269 1376017
38400 1376017 1494032 1647495 1834208 2045797 2272562 2507845 2749315 2996122 3243947
38391 3243947 3481583 3691458 3854094 3954484 3987417 3959574 3888069 3796956 3713173 3662304
38381 3662304 3664229 3729430 3856788 4033429 4237246 4442855 4630019 4790332 4927478 5050610
38371 5050610 5166104 5273964 5370557 5453967 5527267 5598046 5675446 5766554 5873129 5989483
38361 5989483 6102776 6196438 6255875 6274009 6253987 6207573 6149902 6093646 6046550 6014016 6004178
38350 6004178 6030458 6108708 6250961 6460839 6733939 7062160 7437747 7853774 8301112 8764604
38340 8764604 9221003 9639448 9984394 10221162 10323725 10282259 10106765 9824752 9474218 9094904
38330 9094904 8720204 8371352 8055483 7768484 7501455 7247344 7004247 6774097 6558540
38321 6558540 6355383 6158527 5961414 5760929 5557881 5352909 5140690 4907301 4633631
38312 4633631 4303554 3912454 3471853 3008492 2559005 2162503 1853268 1655158 1578543 1619540
38302 1619540 1760471 1970814 2209047 2426415 2572671 2602746 2482836 2195209 1741549 1144296
38292 1144296 444612 -304053 -1045726 -1731188 -2322871 -2794779 -3130694 -3324177 -3380177 -3315122
38282 -3315122 -3153486 -2922462 -2647761 -2351566 -2051206 -1757252 -1471755 -1188206 -893888
38273 -893888 -573665 -214174 191861 641222 1116819 1587874 2015579 2363299 2607112 2741841
38263 2741841 2780224 2746371 2666513 2560289 2435490 2288536 2110756 1897179 1652735 1392567
38253 1392567 1137240 906621 716233 577878 503525 508992 613217 831460 1165345 1595557
38243 1595557 2081822 2570878 3009673 3359002 3602397 3746816 3815537 3837496 3838345 3836515 3844882
38232 3844882 3876239 3948924 4088455 4323391 4677664 5163444 5777296 6500212 7301145 8143134
38222 8143134 8989654 9808517 10572667 11259947 11854019 12346621 12739544 13044407 13278761
38213 13278761 13458869 13592590 13677674 13707667 13681668 13610859 13517799 13429909 13371452 13357730 13393401
38202 13393401 13475127 13596549 13752102 13937058 14144544 14363194 14578754 14779629 14962787
38193 14962787 15135709 15312733 15507986 15728877 15973105 16229874 16484168 16721614 16930815
38184 16930815 17101477 17220267 17269064 17228650 17086179 16841436 16508195 16110516 15676468 15231679
38174 15231679 14794565 14374708 13975745 13602278 13267136 12993248 12806760 12724637 12745186 12848606
38164 12848606 13006905 13195668 13400054 13613322 13831892 14051964 14269469 14481619 14687282
38155 14687282 14884951 15069458 15229906 15351003 15418352 15425618 15379398 15297892 15203242 15112126
38145 15112126 15030605 14955511 14879688 14796780 14703807 14602494 14500181 14409411 14344989 14319582 14340920
38134 14340920 14412732 14538061 14721162 14965627 15270042 15624406 16009134 16396164 16751570
38125 16751570 17040165 17232179 17309708 17269355 17119424 16873613 16545401 16146661 15691201 15200717
38115 15200717 14708667 14258736 13897720 13665593 13586139 13660916 13868922 14173330 14533629 14917416
38105 14917416 15305109 15685111 16043680 16357446 16594379 16723194 16725859 16606211 16390046 16116282
38095 16116282 15823082 15534986 15256538 14974709 14668176 14318637 13919240 13477641 13014342
38086 13014342 12558965 12146992 11817379 11609229 11555641 11675568 11967417 12408095 12958002
38077 12958002 13569131 14192834 14785207 15309700 15737542 16047533 16227267 16276428 16209920 16057144
38067 16057144 15855958 15644093 15452901 15305945 15220771 15210134 15280537 15429272 15642773 15898323
38057 15898323 16169026 16430318 16665621 16869228 17045801 17207451 17370120 17550338 17762131
38048 17762131 18013667 18304575 18626084 18965355 19312579 19666921 20037367 20437019 20873198
38039 20873198 21338625 21809193 22250482 22629915 22928028 23143414 23290128 23390033 23463974 23525308
38029 23525308 23578477 23623187 23661549 23703517 23767169 23874404 24045790 24298412 24647543 25109398
38019 25109398 25700695 26432887 27303370 28288918 29345501 30414788 31434844 32352083 33131641
38010 33131641 33763148 34259525 34649248 34965679 35238128 35487597 35727286 35965422 36207392
38001 36207392 36456033 36711680 36974118 37245900 37534188 37849654 38204226 38609939 39078562
37992 39078562 39619885 40238516 40931401 41687675 42490171 43317464 44146840 44958753 45741195
37983 45741195 46490976 47210484 47901937 48563088 49187502 49769629 50311863 50829239 51348772
37974 51348772 51903767 52526312 53241187 54062559 54993377 56027482 57154446 58365822 59659865
37965 59659865 61042590 62525693 64123642 65850984 67718557 69727605 71864023 74097177
37957 74097177 76385839 78689145 80977683 83240668 85487782 87746210 90054315 92453593
37949 92453593 94980323 97657481 100487754 103450203 106504198 109601740 112703979 115794156
37941 115794156 118881065 121993166 125168376 128444881 131854897 135420430 139150232 143039017
37933 143039017 147070816 151226587 155493735 159873934 164386406 169065363 173952354 179086207
37925 179086207 184494573 190190444 196174272 202439261 208976360 215776821 222832721 230137372
37917 230137372 237686886 245482003 253527723 261829389 270387107 279192497 288230100 297481509
37909 297481509 306927775 316547665 326313552 336188625 346127154 356076582 365979537 375775381
37901 375775381 385401684 394795544 403893818 412631658 420939559 428739978 435945536 442461092
37893 442461092 448190179 453042918 456941246 459820132 461627598 462326795 461900010 460351796
37885 460351796 457709333 454020416 449350146 443776807 437387560 430275109 422535602 414266744
37877 414266744 405565347 396525242 387236711 377786557 368256486 358718984 349232912 339842033
37869 339842033 330577814 321465095 312527886 303792900 295289852 287049408 279100706 271469584
37861 271469584 264176743 257234453 250642355 244385368 238436463 232763704 227337900 222137493
37853 222137493 217150180 212372769 207810344 203474316 199378594 195534407 191945913 188609345
37845 188609345 185516805 182662668 180048330 177681985 175574184 173732786 172160439 170854755
37837 170854755 169809550 169015571 168459862 168123551 167979288 167991216 168119722 168329469 168595534
37828 168595534 168902925 169239734 169589242 169927002 170224941 170459456 170618485 170704007 170729141
37819 170729141 170710573 170658208 170565759 170407007 170140444 169720259 169107824 168278175 167219473
37810 167219473 165927304 164398150 162626674 160609253 158352050 155878498 153231340 150467993
37802 150467993 147652016 144844834 142100180 139460876 136955989 134597286 132376277 130264215
37794 130264215 128216410 126180251 124105352 121953878 119708275 117373548 114973317 112542500
37786 112542500 110120943 107750019 105470534 103318815 101319667 99478127 97773982 96162588
37778 96162588 94582647 92968370 91262075 89424367 87440900 85325125 83115806 80868176
37770 80868176 78639937 76476697 74403254 72425034 70538128 68740932 67039772 65446004
37762 65446004 63968419 62607015 61351219 60181318 59070420 57985983 56892441 55756798
37754 55756798 54557165 53291535 51982757 50676355 49430295 48299478 47320954 46506635
37746 46506635 45846560 45319495 44903184 44577751 44321498 44103918 43882179 43604728 43221378
37737 43221378 42695888 42015830 41195610 40271398 39289925 38295512 37320086 36379416 35476009
37728 35476009 34606423 33769221 32969882 32220754 31536978 30931763 30414428 29991795 29670216
37719 29670216 29454687 29344189 29325808 29371900 29443099 29497137 29500417 29437728 29315725 29158132
37709 29158132 28994193 28845227 28715409 28590814 28446407 28256771 28005468 27690153 27323336
37700 27323336 26929977 26542915 26196864 25921882 25737479 25648545 25644042 25699231 25781727 25860627
37690 25860627 25916099 25945391 25961756 25986522 26038904 26129545 26260259 26427357 26624149 26840855
37680 26840855 27063576 27274755 27455566 27588830 27661001 27662697 27588191 27434535 27200771 26887233
37670 26887233 26494608 26022852 25470871 24838223 24129136 23357149 22547354 21734076 20954761
37661 20954761 20243529 19627691 19127579 18757073 18522434 18419733 18433370 18537560 18700579
37652 18700579 18890215 19078794 19246618 19382848 19483581 19548117 19575369 19562200 19504335 19399167
37642 19399167 19248748 19060839 18846784 18617205 18378705 18134317 17887017 17642286 17406228
37633 17406228 17180367 16958324 16728377 16480627 16213462 15935017 15659772 15403461 15179562
37624 15179562 14998626 14869835 14802504 14804876 14879563 15018537 15202128 15403707 15597119 15762191
37614 15762191 15886322 15963385 15991971 15973851 15913182 15817189 15697912 15572301 15458072 15366377
37604 15366377 15296309 15235473 15166300 15074087 14953187 14809854 14661084 14529036 14432433 14379202
37594 14379202 14364383 14373747 14389616 14395175 14376363 14322737 14228601 14094057 13924721 13729793 13519889
37583 13519889 13306466 13102854 12924816 12788775 12708342 12691183 12737481 12839820 12984536 13154974
37573 13154974 13335786 13515894 13688676 13850736 14001534 14144234 14286125 14437366 14608428
37564 14608428 14806902 15034191 15282947 15537138 15776005 15981278 16144997 16274752 16393830
37555 16393830 16535641 16734156 17014001 17383982 17836159 18350051 18899366 19457855 20001963
37546 20001963 20510108 20960153 21327194 21583686 21703240 21667681 21474342 21139549 20696075
37537 20696075 20185737 19650767 19127569 18644657 18223413 17877933 17611312 17410611 17246410
37528 17246410 17080661 16879752 16625417 16318346 15974774 15619753 15280934 14984865 14755561
37519 14755561 14613199 14571019 14631417 14784648 15012290 15293365 15608505 15939603 16266905 16567835
37509 16567835 16820353 17009590 17133612 17204454 17243618 17274382 17314261 17370184 17437743 17504880
37499 17504880 17558720 17592590 17609884 17623153 17649079 17701303 17783481 17885126 17982334 18043573 18038235
37488 18038235 17944587 17754950 17477445 17134251 16756449 16376712 16022544 15712508 15455485
37479 15455485 15251083 15090022 14955490 14827112 14687435 14528343 14354073 14179071 14021770
37470 14021770 13897734 13815530 13776298 13775436 13804683 13854535 13917429 13990908 14079019 14191547 14342314
37459 14342314 14547564 14823782 15183926 15632690 16163054 16756293 17385794 18022861 18641533
37450 18641533 19220575 19743628 20200165 20587923 20913914 21190480 21426984 21622336 21763870
37441 21763870 21833659 21818515 21718189 21548100 21335983 21114386 20911823 20745448 20617836 20519384
37431 20519384 20435348 20353571 20268529 20180767 20094775 20018860 19967111 19960340 20023465 20179906 20445874
37420 20445874 20826862 21316749 21898446 22545251 23223340 23896642 24534185 25117579 25645062
37411 25645062 26130296 26597223 27073707 27585431 28150253 28773582 29446591 30148685 30853477
37402 30853477 31535584 32175335 32760006 33282308 33738264 34126634 34450418 34719049 34949108
37393 34949108 35162182 35380019 35618903 35886220 36181483 36501278 36844486 37214205 37616112
37384 37616112 38056427 38542652 39087048 39709461 40435430 41288155 42277764 43394618 44611796
37375 44611796 45895705 47218173 48563397 49928097 51317937 52744136 54221931 55769813
37367 55769813 57406956 59147246 60991328 62920947 64899618 66880082 68815434 70669598
37359 70669598 72423924 74078538 75649225 77162327 78650053 80146613 81684522 83291263
37351 83291263 84987563 86787213 88696878 90715441 92834964 95044763 97336053 99702406
37343 99702406 102134881 104616571 107122483 109625675 112104749 114546680 116942899 119281362
37335 119281362 121539703 123683618 125671744 127464864 129034950 130369400 131468110 132334878
37327 132334878 132967994 133355630 133478957 133321240 132877663 132160480 131197193 130023389 128674252
37318 128674252 127178501 125556315 123820080 121975748 120023759 117960569 115782207 113489625
37310 113489625 111093472 108615890 106088406 103546558 101022865 98540660 96111958 93741115
37302 93741115 91432499 89197243 87054376 85025216 83124104 81350420 79685662 78096386
37294 78096386 76541104 74978674 73376319 71715983 69997206 68235001 66453338 64677642
37286 64677642 62930120 61229092 59590402 58028023 56552289 55166580 53864706 52631468
37278 52631468 51447148 50294354 49164218 48059160 46990917 45974369 45019765 44127474
37270 44127474 43288471 42490031 41722404 40982163 40271139 39592723 38947370 38328558 37720925
37261 37720925 37102614 36451702 35753504 35005082 34215890 33405806 32601513 31831064 31117355
37252 31117355 30472809 29897750 29382782 28913282 28473370 28047676 27621371 27180888 26717533
37243 26717533 26232929 25742028 25270220 24845496 24490307 24217212 24029198 23923216 23894856
37234 23894856 23942214 24067313 24274470 24566515 24940707 25385940 25882272 26403184 26920316
37225 26920316 27409524 27856286 28258349 28624062 28966799 29297915 29621608 29933760 30224589
37216 30224589 30483581 30705023 30892622 31061591 31236899 31447454 31717792 32060169 32470228
37207 32470228 32928113 33404455 33868680 34296467 34673947 34997537 35270019 35495345 35675299
37198 35675299 35809459 35897231 35939695 35940589 35907252 35851710 35790166 35739351 35711055 35708487 35726797
37187 35726797 35756140 35783765 35793808 35767349 35685903 35538108 35325320 35061552 34766377 34453757
37177 34453757 34121983 33749565 33299282 32729060 32005530 31114797 30065964 28886177 27610324
37168 27610324 26271329 24895334 23501614 22104157 20713360 19338769 17993344 16696978
37160 16696978 15476342 14360618 13375118 12534997 11840772 11277648 10820012 10439583 10112587
37151 10112587 9821894 9554180 9296104 9033882 8757479 8466679 8174305 7903608 7680988
37142 7680988 7528329 7459098 7479327 7591559 7798592 8104619 8513099 9022682 9623279 10293854
37132 10293854 11002522 11709396 12372629 12956931 13441592 13823749 14114348 14328268 14473813
37123 14473813 14547642 14538168 14435226 14239855 13968133 13647120 13305981 12967636 12644975 12342324
37113 12342324 12059874 11797635 11556251 11334270 11123991 10909169 10666527 10370183 9996462
37104 9996462 9527439 8953523 8275928 7508462 6677113 5816788 4966341 4163848 3443280
37095 3443280 2832582 2352714 2017061 1830948 1791052 1884771 2089965 2375843 2705759 3041827
37085 3041827 3350166 3605010 3790464 3900152 3936366 3910428 3844268 3770702 3729345 3757780
37075 3757780 3881622 4108481 4428473 4820334 5260029 5728145 6212669 6705880 7197733
37066 7197733 7670714 8099857 8457497 8719465 8869666 8901995 8820022 8635346 8365396 8031331
37056 8031331 7656319 7264009 6876300 6509446 6168883 5845413 5515732 5147703 4707855
37047 4707855 4168837 3516977 2760032 1931893 1089229 298594 -381306 -914676 -1295648
37038 -1295648 -1545995 -1705510 -1818911 -1923789 -2043200 -2184337 -2342868 -2511234 -2687638
37029 -2687638 -2881447 -3111940 -3401271 -3765745 -4209441 -4721668 -5277818 -5842827 -6376285
37020 -6376285 -6837890 -7192408 -7414497 -7493788 -7438847 -7277076 -7048727 -6796286 -6553006 -6334672
37010 -6334672 -6137337 -5941513 -5720821 -5451216 -5117190 -4713562 -4244044 -3718594 -3150892
37001 -3150892 -2556112 -1948942 -1342152 -746728 -174333 358639 828182 1203920 1455370
36992 1455370 1560783 1514648 1331031 1042341 694844 342277 38006 -173983 -268099 -243405
36982 -243405 -124232 46254 218012 347604 408593 395805 323344 218353 112656 33664
36972 33664 -3727 -1369 24259 49755 53785 22747 -48203 -156550 -293252 -442224 -580278
36961 -580278 -680042 -716442 -674462 -554359 -371602 -151480 79274 300339 501952 684164
36951 684164 852684 1014230 1173161 1329087 1474890 1596154 1673844 1690286 1635908 1513366
36941 1513366 1337241 1129930 915969 717433 552122 434288 375881 386113 468840 619329
36931 619329 822670 1054960 1286650 1486860 1627766 1688341 1656374 1528010 1305418 994534
36921 994534 604257 146834 -361446 -899465 -1440273 -1951101 -2396591 -2746044 -2981858 -3104106
36911 -3104106 -3127975 -3075670 -2967904 -2819055 -2635873 -2417283 -2154531 -1833737 -1442137 -975317
36901 -975317 -440496 146594 768936 1414495 2077374 2752871 3429409 4083049 4679815 5185949
36891 5185949 5580048 5859085 6034801 6124026 6140028 6089541 5974935 5797834 5561415 5271275
36881 5271275 4935880 4566718 4177617 3783392 3399010 3039948 2722876 2465314 2283972
36872 2283972 2192408 2198173 2299040 2478901 2706194 2938078 3130681 3251134 3285337 3237899
36862 3237899 3125659 2969495 2789003 2602076 2428161 2291775 2222766 2251872 2402845 2684227
36852 2684227 3084318 3572062 4104448 4637519 5135690 5575073 5940516 6219786 6399353
36843 6399353 6464680 6405240 6221327 5928110 5554238 5136313 4712676 4318074 3978380 3705287
36833 3705287 3493563 3323579 3168829 3005241 2818890 2610090 2393204 2192557 2036000
36824 2036000 1948132 1944872 2030497 2197689 2430247 2707162 3006504 3308206 3595266 3853313
36814 3853313 4069433 4232199 4334197 4375641 4365640 4318649 4247250 4155338 4036078 3876228
36804 3876228 3664197 3396834 3081167 2731439 2364652 1997110 1641783 1305690 988415
36795 988415 684356 389226 107160 -147022 -352514 -490674 -550643 -529738 -431086 -262348
36785 -262348 -36197 230040 517757 812611 1109430 1414058 1741300 2109485 2533143 3015901
36775 3015901 3545649 4093460 4617008 5068391 5404748 5598413 5642809 5551913 5354009 5082948
36765 5082948 4770522 4441944 4114419 3797948 3497608 3216521 2958313 2728099 2531983
36756 2531983 2375484 2260917 2184057 2132134 2086131 2028177 1950702 1861943 1784376 1746649 1772739
36745 1772739 1873128 2041658 2258976 2500141 2742157 2968124 3167317 3332985 3460476
36736 3460476 3547312 3594671 3608338 3597912 3574942 3551362 3538076 3542327 3563730 3591356 3604840
36725 3604840 3580019 3496478 3343415 3121711 2842603 2524817 2191599 1867434 1573666 1323556
36715 1323556 1119270 953088 812379 685439 565127 449384 339842 240447 157105 97560
36705 97560 70093 81059 133583 229261 371283 565030 814458 1117214 1462884 1835754
36695 1835754 2219915 2603876 2983032 3359288 3737958 4123594 4516953 4913928 5305200
36686 5305200 5675530 6003543 6263632 6430396 6484414 6417565 6236259 5961329 5624692 5264629
36676 5264629 4921783 4636254 4444310 4373496 4436738 4627829 4921193 5277795 5655903 6021832
36666 6021832 6354986 6645462 6887926 7077244 7207976 7275704 7277568 7211993 7079375 6884300
36656 6884300 6637670 6356603 6061664 5772682 5504675 5264698 5050237 4850110 4648577
36647 4648577 4431910 4194748 3943026 3691769 3458719 3256783 3088361 2943102 2799343
36638 2799343 2628903 2404758 2109790 1743472 1323559 881830 455306 75535 -240901
36629 -240901 -497319 -714850 -923833 -1152606 -1418744 -1725674 -2064159 -2416250 -2759715 -3072266
36619 -3072266 -3335171 -3535069 -3662603 -3708217 -3657959 -3492889 -3193549 -2747692 -2157562 -1443425
36609 -1443425 -641982 199645 1032271 1812681 2509214 3103334 3586682 3954982 4202222
36600 4202222 4318606 4293087 4118132 3793882 3330815 2751288 2089695 1390118 701123 68809
36590 68809 -470110 -893408 -1194918 -1381398 -1465689 -1459477 -1369084 -1195421 -936640 -591405
36580 -591405 -161358 347951 927498 1565348 2245890 2948164 3646255 4314178 4933445 5497754
36570 5497754 6010861 6479367 6905954 7286956 7613743 7875452 8061885 8166845 8191307 8144555
36560 8144555 8042080 7901373 7738160 7564551 7388742 7215227 7045590 6880644 6723357
36551 6723357 6579963 6456993 6355438 6266394 6171606 6048616 5877453 5646369 5355505 5017371
36541 5017371 4653061 4284897 3928873 3590758 3267431 2952361 2642764 2345906 2082044
36532 2082044 1882101 1780155 1803266 1962503 2248535 2633046 3074911 3528574 3952189 4314061
36522 4314061 4596669 4797643 4927253 5003188 5044895 5070044 5093955 5130338 5190487 5279533 5391681
36511 5391681 5508539 5603446 5650351 5632287 5544978 5395056 5195598 4961923 4708954 4450555
36501 4450555 4200937 3977209 3800639 3694403 3677973 3760703 3937396 4187279 4476548 4763814
36491 4763814 5007217 5171556 5234102 5188006 5042016 4815657 4531316 4207099 3853944 3477100
36481 3477100 3079437 2664445 2238670 1813407 1404118 1025890 685941 377424 79317
36472 79317 -235980 -590685 -991687 -1427640 -1873647 -2300086 -2681178 -3000557 -3253054 -3443318
36462 -3443318 -3582669 -3685590 -3766411 -3836152 -3900288 -3958819 -4008865 -4047683 -4073740 -4086179 -4085232
36451 -4085232 -4074832 -4065241 -4072406 -4113421 -4201037 -4340804 -4531683 -4768012 -5040488 -5336176 -5639340
36440 -5639340 -5933795 -6205089 -6440492 -6627403 -6753107 -6807680 -6788533 -6703046 -6566779 -6397474
36430 -6397474 -6207681 -6000281 -5770175 -5511381 -5224212 -4916782 -4600331 -4283657 -3972142
36421 -3972142 -3671081 -3387940 -3129394 -2895031 -2673838 -2447365 -2197529 -1913488 -1594044
36412 -1594044 -1246542 -884904 -527269 -191693 110009 376925 618333 847365 1072771
36403 1072771 1293191 1495807 1658886 1756979 1767776 1679452 1496446 1241315 951208 669554
36393 669554 435477 274148 190816 170382 183262 196254 184403 138755 66985 -11874 -74492
36382 -74492 -98404 -64411 42300 230230 498276 833113 1210509 1602080 1984528 2345320
36372 2345320 2680392 2985420 3247396 3443137 3546210 3537820 3415158 3193095 2899279 2565426
36362 2565426 2218106 1871769 1526429 1171417 794200 390064 -32529 -453491 -847563
36353 -847563 -1191181 -1466181 -1659699 -1761808 -1763300 -1655835 -1435271 -1106133 -683314 -188976
36343 -188976 352855 919385 1488105 2034628 2532971 2958975 3295081 3534799 3685532 3767689
36333 3767689 3808358 3831506 3850430 3867300 3878963 3883235 3880044 3866558 3830578 3748534 3591804
36322 3591804 3339173 2988284 2559208 2089085 1622457 1202635 865753 636230 522955
36313 522955 517683 597483 731377 889293 1050481 1208422 1370303 1551480 1767754 2028810
36303 2028810 2334422 2673260 3024257 3360943 3658219 3898688 4075144 4188323 4242536 4242912
36293 4242912 4196068 4113167 4012917 3922064 3871587 3888111 3982949 4144457 4339517 4524896
36283 4524896 4662327 4728699 4717368 4633015 4484985 4282130 4030226 3732765 3394959 3028217
36273 3028217 2651127 2285665 1951194 1659964 1415970 1217143 1059876 943876 874697 862605
36263 862605 919160 1053915 1272291 1574012 1952072 2393581 2883599 3411060 3973643 4577963
36253 4577963 5233367 5941638 6688520 7442711 8163089 8809199 9348447 9757300 10018972
36244 10018972 10122037 10062095 9844981 9488441 9020442 8474495 7883645 7274870 6665584
36235 6665584 6063440 5469252 4881111 4297440 3718179 3144992 2581865 2036582 1522083
36226 1522083 1055816 655953 336121 102354 -45493 -109844 -93172 801 164475 384861
36216 384861 643863 919981 1191803 1443105 1667206 1867335 2052598 2232810 2415605 2606078
36206 2606078 2806335 3013341 3216593 3398872 3541302 3630068 3660564 3636919 3568312 3465069
36196 3465069 3336506 3191054 3038416 2892317 2771198 2694612 2676088 2716562 2802893 2912813
36186 2912813 3023657 3120379 3199627 3269374 3345650 3447901 3593774 3794009 4048859 4347631
36176 4347631 4671726 4999779 5312493 5594724 5833728 6014919 6118862 6122979 6008093 5766116
36166 5766116 5404334 4944297 4416629 3854460 3287473 2737175 2213632 1714489 1227903
36157 1227903 739988 244649 -248871 -714915 -1117508 -1420457 -1596852 -1634522 -1536242 -1315653
36147 -1315653 -991290 -581676 -103394 428031 996344 1583718 2171458 2741926 3281116
36138 3281116 3781259 4242229 4670665 5076859 5470883 5859453 6243981 6619695 6975880
36129 6975880 7297521 7568251 7773892 7905571 7961558 7947498 7875428 7762088 7626125 7483502
36119 7483502 7341841 7196585 7031580 6823844 6549801 6190494 5735052 5182739 4544138
36110 4544138 3841823 3109817 2389781 1722836 1139869 656336 275168 -4851 -181491
36101 -181491 -246404 -187392 6283 337174 793407 1345586 1948951 2550436 3098043 3549522
36091 3549522 3878636 4078385 4160626 4151232 4081114 3976415 3853079 3718719 3579167 3443774
36081 3443774 3325480 3236827 3186054 3176286 3207615 3279717 3392764 3546182 3737049 3960301
36071 3960301 4211213 4488304 4794319 5134526 5513357 5931094 6382263 6856831 7343955
36062 7343955 7836199 8331316 8830302 9333259 9836149 10330384 10804847 11248706 11654096
36053 11654096 12018799 12348886 12659989 12975313 13319659 13710939 14152340 14628406 15107037
36044 15107037 15546971 15908167 16161330 16293192 16305857 16211048 16023096 15755703 15424720 15054209
36034 15054209 14679945 14346499 14098600 13970206 13975051 14102056 14318547 14581530 14852620 15109434
36024 15109434 15348691 15581552 15825407 16095828 16400621 16736977 17092435 17449090 17788339
36015 17788339 18093169 18347531 18535340 18641719 18656182 18575014 18401045 18141804 17808050 17413350
36005 17413350 16974028 16509246 16041445 15596604 15202638 14884828 14659346 14527693 14474557
35996 14474557 14469715 14472570 14437117 14316436 14067552 13657585 13070122 12309103 11398650 10379690
35986 10379690 9305071 8233597 7222622 6319716 5555269 4937983 4454824 4076519 3768044
35977 3768044 3500218 3256451 3031284 2823415 2629675 2444391 2262892 2084504 1911662
35968 1911662 1745758 1583354 1416145 1235167 1036463 824430 611125 412557 244112
35959 244112 116336 31568 -17887 -49193 -85978 -153401 -271762 -449758 -680451 -943560
35949 -943560 -1214045 -1471703 -1705384 -1910324 -2082772 -2217091 -2306921 -2348361 -2342173 -2292918
35939 -2292918 -2204859 -2076975 -1901077 -1665526 -1362833 -996136 -580479 -138502 306503 736564
35929 736564 1141429 1516748 1859446 2163189 2416422 2603470 2707358 2712928 2609656 2393940
35919 2393940 2070267 1650784 1153560 600369 14517 -581260 -1166458 -1723302 -2235981
35910 -2235981 -2689741 -3071121 -3369098 -3575531 -3683956 -3688106 -3583257 -3372124 -3072937 -2723869
35900 -2723869 -2378724 -2094295 -1915675 -1866739 -1948562 -2143714 -2423009 -2752867 -3102163 -3446851
35890 -3446851 -3770804 -4063183 -4314353 -4512756 -4644491 -4696297 -4660598 -4539022 -4341149 -4079089
35880 -4079089 -3762319 -3396990 -2989729 -2552395 -2104304 -1671018 -1280937 -961429 -735547
35871 -735547 -619519 -620702 -735669 -948734 -1231943 -1547947 -1856490 -2123183 -2326987 -2462566
35861 -2462566 -2536884 -2563277 -2557264 -2535071 -2512317 -2500462 -2502241 -2509825 -2507874 -2479475 -2410942 -2293360
35849 -2293360 -2122467 -1899504 -1633151 -1339781 -1039804 -751383 -485436 -244914 -27791
35840 -27791 169270 349402 516416 675823 833382 990967 1142785 1275604 1373771 1426032
35830 1426032 1430223 1393873 1331262 1258745 1190429 1136130 1102134 1093062 1111942 1156841 1215478 1261670
35818 1261670 1257710 1164341 955402 630233 216982 -235074 -670148 -1040920 -1318994 -1498774
35808 -1498774 -1594855 -1634757 -1650340 -1670832 -1718170 -1803591 -1925276 -2068614 -2210458 -2326515
35798 -2326515 -2398974 -2421636 -2400986 -2353223 -2298334 -2253334 -2226941 -2217395 -2214134 -2202907 -2172681 -2121554
35786 -2121554 -2059043 -2003904 -1979124 -2006886 -2105030 -2284167 -2543838 -2868169 -3224318 -3566712
35776 -3566712 -3846216 -4019820 -4057234 -3944121 -3683386 -3294336 -2808170 -2260160 -1681835 -1096656
35766 -1096656 -520029 38028 569445 1064902 1511938 1896141 2206458 2442860 2621263
35757 2621263 2770515 2920660 3088041 3265903 3426013 3530284 3546295 3460093 3282399 3047670
35747 3047670 2807316 2618779 2532412 2579350 2764919 3070762 3463794 3905286 4354258 4766193
35737 4766193 5093586 5293028 5336491 5219875 4964011 4608775 4203998 3800243 3440791 3155513
35727 3155513 2957518 2843013 2794079 2783505 2780445 2755370 2683195 2544753 2328310 2032613
35717 2032613 1670557 1270109 869404 506561 209181 -10573 -152920 -222636 -222538 -152205
35707 -152205 -11128 197670 466652 785340 1142017 1523507 1913298 2290390 2631278 2915160
35697 2915160 3129612 3273115 3352660 3377861 3354881 3283101 3155215 2959430 2682187 2311346
35687 2311346 1840879 1276988 642914 -21254 -665436 -1241155 -1713877 -2071834 -2328250
35678 -2328250 -2516063 -2677387 -2852209 -3070228 -3346891 -3682494 -4063117 -4463147 -4849163
35669 -4849163 -5184331 -5432037 -5557881 -5530326 -5321621 -4910998 -4290811 -3473780 -2497633 -1423724
35659 -1423724 -328313 711347 1631113 2388936 2966495 3365254 3600079 3692410 3664177
35650 3664177 3534651 3321983 3047778 2739465 2426361 2130447 1857300 1593006 1309676
35641 1309676 977604 578342 112320 -401508 -931476 -1440216 -1891441 -2257625 -2528142
35632 -2528142 -2713805 -2843551 -2953499 -3073807 -3219760 -3389991 -3570281 -3739658 -3876559
35623 -3876559 -3964100 -3993418 -3963827 -3880027 -3749018 -3579512 -3383881 -3179864 -2989457 -2834878
35613 -2834878 -2733621 -2694891 -2718629 -2796730 -2914725 -3052294 -3183063 -3276253 -3302153 -3240241
35603 -3240241 -3086133 -2853808 -2572165 -2277555 -2005378 -1783891 -1631989 -1560317 -1573265 -1669817
35593 -1669817 -1843500 -2083380 -2377250 -2715497 -3092505 -3503817 -3941191 -4390063 -4831956
35584 -4831956 -5249679 -5630630 -5966276 -6250367 -6479128 -6652950 -6776025 -6852464 -6881998 -6859744
35574 -6859744 -6780828 -6645937 -6463095 -6244353 -6000286 -5736933 -5457799 -5169332 -4884781 -4621927
35564 -4621927 -4395099 -4207409 -4050027 -3910225 -3782832 -3676768 -3611867 -3608284 -3675463 -3806668
35554 -3806668 -3980573 -4167504 -4336916 -4463338 -4529070 -4523498 -4440910 -4279261 -4040547 -3731413
35544 -3731413 -3362792 -2948819 -2505669 -2050249 -1598889 -1167265 -772161 -432871 -168887
35535 -168887 6582 93337 106249 70886 15108 -38979 -78949 -100658 -103483 -85930 -44562
35524 -44562 23653 117963 232398 357843 486739 617113 752539 897587 1052225 1209490
35514 1209490 1357858 1485884 1585665 1653557 1689054 1693402 1668545 1615767 1533507 1415238 1249524
35503 1249524 1023796 731347 379056 -7591 -385284 -700910 -905034 -965734 -877040 -659150
35493 -659150 -351729 -3875 335848 627029 841247 961910 981575 899626 722508 465879
35483 465879 155194 -178547 -507135 -812646 -1089080 -1337787 -1560942 -1757847 -1925339 -2060222
35473 -2060222 -2160776 -2225983 -2253211 -2236292 -2165793 -2031659 -1826899 -1550582 -1209077 -815344
35463 -815344 -386962 55832 491096 895665 1247182 1528880 1735824 1879280 1986116 2091978
35453 2091978 2229554 2416100 2646182 2893693 3121872 3295284 3388043 3386872 3291011 3110410
35443 3110410 2862034 2564475 2233459 1881367 1521206 1171773 859562 614953 463790
35434 463790 418077 470308 594676 755263 917674 1058871 1171284 1260650 1339868 1422111
35424 1422111 1516048 1624624 1746698 1878987 2016099 2149131 2265457 2351436 2396579 2395936
35414 2395936 2348928 2255776 2114381 1919992 1668469 1362136 1015587 657902 329052 71454
35404 71454 -79370 -101327 11061 244906 568164 932612 1283435 1573555 1775997 1888072
35394 1888072 1926422 1916888 1884326 1846108 1811272 1784931 1774429 1791954 1850414 1954662 2094175
35383 2094175 2242802 2366302 2433203 2423028 2328680 2153830 1907928 1600978 1239710 826967
35373 826967 365102 -138630 -668882 -1203894 -1720851 -2201185 -2632692 -3008136 -3322603 -3572643
35363 -3572643 -3758158 -3884287 -3959565 -3990275 -3975761 -3909071 -3781710 -3587323 -3321627 -2981110
35353 -2981110 -2564166 -2074982 -1527510 -947194 -369441 165757 622883 980729 1238018
35344 1238018 1411300 1526333 1607960 1673240 1729675 1777556 1814202 1837998 1850742 1857912 1867343
35333 1867343 1887298 1924651 1983446 2063971 2162518 2271760 2381498 2479825 2554991 2597842 2603694
35322 2603694 2572339 2505995 2406527 2273818 2106502 1904783 1673296 1421117 1157526 885786
35312 885786 599774 286752 -65201 -459904 -889864 -1337590 -1779734 -2192447 -2557064 -2864919
35302 -2864919 -3119427 -3333909 -3525482 -3707590 -3884798 -4052174 -4198745 -4312108 -4381278 -4396767
35292 -4396767 -4349096 -4227708 -4021830 -3723644 -3332770 -2859930 -2328051 -1770631 -1228544 -746062
35282 -746062 -365551 -120597 -29386 -91562 -290265 -597975 -983057 -1414896 -1867147 -2319316
35272 -2319316 -2756804 -3169782 -3551906 -3899945 -4214481 -4500704 -4767793 -5026068 -5282574
35263 -5282574 -5537263 -5782322 -6005829 -6198366 -6359085 -6497570 -6630395 -6774770 -6943210
35254 -6943210 -7141536 -7369236 -7619737 -7879542 -8127583 -8337150 -8481205 -8538958 -8499673 -8360913
35244 -8360913 -8122823 -7783780 -7341768 -6800579 -6175448 -5493520 -4789390 -4099567 -3459119
35235 -3459119 -2900259 -2450388 -2128208 -1939896 -1878947 -1930819 -2079028 -2307901 -2600933 -2938374
35225 -2938374 -3298092 -3659802 -4008833 -4335924 -4632946 -4887973 -5084003 -5203330 -5235488 -5183926
35215 -5183926 -5067465 -4916046 -4763151 -4637830 -4558678 -4531370 -4550378 -4603899 -4679738 -4769835
35205 -4769835 -4871850 -4987267 -5117055 -5257478 -5398765 -5527517 -5631431 -5704097 -5747896 -5773563
35195 -5773563 -5796011 -5828045 -5875194 -5934090 -5994203 -6040966 -6058897 -6034745 -5960747 -5836808 -5670043
35184 -5670043 -5471538 -5252286 -5020719 -4782540 -4541859 -4302320 -4067811 -3842673 -3631057
35175 -3631057 -3435255 -3253708 -3079730 -2901522 -2703635 -2470184 -2189532 -1858594 -1484293
35166 -1484293 -1081568 -670027 -271836 88671 385423 592995 691579 673169 546278 336198
35156 336198 79493 -185661 -429394 -636412 -806794 -952074 -1088801 -1231687 -1387541 -1551236
35146 -1551236 -1705586 -1826594 -1892763 -1893907 -1834542 -1730419 -1601184 -1464000 -1331093 -1210682
35136 -1210682 -1108828 -1030334 -978767 -956333 -963232 -995274 -1040084 -1074727 -1068065 -988377 -813184
35125 -813184 -536944 -173915 243851 671847 1060156 1361195 1537154 1565786 1443394 1184602
35115 1184602 818997 384867 -79239 -542543 -986300 -1402640 -1789871 -2147489 -2472765
35106 -2472765 -2758860 -2994355 -3165029 -3258076 -3267193 -3195774 -3056370 -2866602 -2643621 -2399709
35096 -2399709 -2140669 -1867083 -1577325 -1270974 -951467 -627374 -312562 -26233 207038
35087 207038 358882 402302 319815 110711 -206831 -599815 -1028051 -1451469 -1834795 -2149599
35077 -2149599 -2375158 -2499122 -2517638 -2433811 -2254561 -1987698 -1641557 -1227474 -763112 -273753
35067 -273753 210079 658098 1046373 1360927 1596683 1752545 1826138 1812055 1704638 1502752
35057 1502752 1212805 848450 428476 -24703 -485637 -927401 -1325839 -1665530 -1944747
35048 -1944747 -2177436 -2392090 -2627630 -2925306 -3316533 -3810201 -4385933 -4997778 -5586910
35039 -5586910 -6096909 -6485371 -6729044 -6823263 -6777754 -6610849 -6343415 -5993454 -5572778 -5087410
35029 -5087410 -4542156 -3946772 -3319319 -2684133 -2065785 -1482756 -943679 -447394 12934
35020 12934 442495 837249 1180220 1443975 1598026 1617725 1491421 1224084 836794 362569
35010 362569 -160102 -694197 -1209839 -1687255 -2116319 -2493336 -2817012 -3085281 -3293407 -3433495
35000 -3433495 -3496384 -3476796 -3379746 -3223636 -3036586 -2847728 -2679210 -2543272 -2443988 -2380406
34990 -2380406 -2349079 -2346370 -2370582 -2422132 -2500330 -2598382 -2700660 -2784866 -2828010 -2812846 -2731970
34979 -2731970 -2588808 -2396074 -2172694 -1940139 -1718854 -1525357 -1370402 -1258639 -1190006 -1162472
34969 -1162472 -1175139 -1230288 -1333333 -1490868 -1707827 -1984926 -2316943 -2692057 -3092727 -3498092
34959 -3498092 -3886916 -4239672 -4539352 -4771882 -4926860 -4998366 -4985301 -4891398 -4725504 -4502248
34949 -4502248 -4242298 -3970791 -3712844 -3486863 -3298986 -3142794 -3005350 -2875886 -2751770
34940 -2751770 -2639123 -2549313 -2493690 -2478153 -2498829 -2540510 -2578940 -2586579 -2540448 -2430037 -2262419
34929 -2262419 -2061516 -1860800 -1692858 -1581062 -1536257 -1557730 -1636386 -1758968 -1912454 -2086928
34919 -2086928 -2275415 -2471382 -2666549 -2850986 -3015162 -3152312 -3260156 -3341887 -3406143 -3465140
34909 -3465140 -3531034 -3612389 -3713002 -3833208 -3971323 -4123199 -4280713 -4431856 -4563325 -4663362
34899 -4663362 -4722058 -4728961 -4670136 -4526900 -4277039 -3898947 -3378610 -2717649 -1938561 -1083572
34889 -1083572 -206352 640761 1419591 2114065 2729692 3284513 3796053 4270835 4700676
34880 4700676 5065746 5341549 5506344 5545910 5454023 5229806 4875522 4397310 3807690 3126704
34870 3126704 2380559 1599556 816821 66737 -618809 -1215824 -1712393 -2109615 -2419879
34861 -2419879 -2664263 -2869386 -3062677 -3265928 -3489245 -3728541 -3967995 -4186049 -4361803
34852 -4361803 -4479226 -4528599 -4506281 -4414134 -4259011 -4051387 -3802076 -3517315 -3194612 -2822699
34842 -2822699 -2387192 -1880139 -1308825 -699621 -95313 452793 895741 1198410 1348683
34833 1348683 1360743 1270380 1123918 965673 828528 729316 668315 631987 598568 545515 456726
34822 456726 327501 165894 -10325 -181211 -334366 -471822 -609632 -770551 -975004 -1235509
34812 -1235509 -1555657 -1931475 -2353444 -2809115 -3286312 -3775421 -4268801 -4756892 -5222946
34803 -5222946 -5639850 -5972121 -6183543 -6247216 -6153040 -5909479 -5539982 -5076505 -4552601 -3998057
34793 -3998057 -3436650 -2887207 -2366058 -1888241 -1466500 -1109260 -819238 -593495 -424979
34784 -424979 -305283 -227706 -189186 -189861 -229907 -304669 -400314 -492765 -551254 -545135 -450655 -255175
34772 -255175 41782 429834 890299 1398656 1926015 2440393 2909832 3307791 3617820 3833660
34762 3833660 3954606 3980799 3913456 3760127 3539384 3278802 3005443 2734933 2467002 2190474
34752 2190474 1893554 1572422 1234072 894385 574741 299252 92118 -26835 -49207 14643
34742 14643 133115 260060 349722 372797 324921 223648 97324 -27018 -131497 -209974
34732 -209974 -266639 -311577 -354606 -400414 -448484 -498112 -554415 -630229 -742038 -902476 -1113761
34721 -1113761 -1365410 -1637099 -1904820 -2147139 -2349046 -2502985 -2607834 -2666604 -2683401 -2660868
34711 -2660868 -2599642 -2500268 -2366419 -2207647 -2040512 -1888010 -1777746 -1739278 -1800426 -1982287
34701 -1982287 -2293879 -2728886 -3266614 -3876952 -4526976 -5186845 -5833639 -6452426 -7034296
34692 -7034296 -7572629 -8060179 -8489103 -8853800 -9154189 -9396565 -9590477 -9742754 -9852375
34683 -9852375 -9910355 -9905745 -9834291 -9703926 -9533324 -9344605 -9155186 -8973776 -8801657 -8636201
34673 -8636201 -8472916 -8305236 -8124012 -7918430 -7678039 -7394883 -7065407 -6692151 -6284509
34664 -6284509 -5857688 -5430083 -5020165 -4643691 -4311686 -4029602 -3798060 -3614583 -3474945
34655 -3474945 -3373148 -3300687 -3246772 -3200785 -3156309 -3114393 -3083819 -3078139 -3111080 -3192183 -3323841
34644 -3323841 -3500559 -3711230 -3943883 -4190408 -4448314 -4718625 -5001579 -5292684 -5581031
34635 -5581031 -5850744 -6085229 -6272302 -6407059 -6490314 -6523334 -6502271 -6415988 -6248590 -5985107
34625 -5985107 -5617513 -5148746 -4593532 -3975441 -3320541 -2649823 -1973897 -1292918 -601833
34616 -601833 101910 812134 1511833 2175368 2772956 3275205 3656740 3899186 3993856 3943875
34606 3943875 3765251 3486224 3143952 2778323 2425113 2112244 1860665 1686824 1602571 1611888
34596 1611888 1708168 1875364 2092243 2336033 2582693 2804710 2970517 3049434 3021842 2889195
34586 2889195 2677051 2428444 2190608 2000765 1875722 1808287 1771618 1730061 1652142 1520587
34576 1520587 1336248 1115565 882949 660751 460351 277712 94543 -116262 -383531
34567 -383531 -731215 -1173474 -1711801 -2334222 -3016671 -3726597 -4428305 -5088705 -5681918 -6191912
34557 -6191912 -6613018 -6948555 -7207857 -7402319 -7541351 -7628983 -7661760 -7628711 -7514346 -7304937
34547 -7304937 -6996608 -6601891 -6150916 -5685309 -5246791 -4865731 -4555314 -4313689 -4131957
34538 -4131957 -4002861 -3925535 -3904668 -3945511 -4047452 -4198579 -4373408 -4535750 -4646807 -4675293
34528 -4675293 -4604738 -4435465 -4182564 -3872396 -3538403 -3215977 -2937350 -2728285 -2606889 -2583159
34518 -2583159 -2658362 -2824820 -3066910 -3363142 -3688870 -4019378 -4332413 -4608499 -4828729 -4972303
34508 -4972303 -5016837 -4942220 -4736250 -4399649 -3948673 -3414024 -2835616 -2254560 -1705286 -1210209
34498 -1210209 -777803 -403974 -76231 221006 502564 781522 1069801 1378053 1714245
34489 1714245 2081801 2477530 2888805 3291315 3650875 3931358 4105688 4163661 4112302 3969678
34479 3969678 3756239 3487785 3172630 2813771 2414917 1987097 1552090 1140722 786728
34470 786728 518653 352583 288037 308374 385810 489431 593121 680384 744826 787891 816346
34459 816346 840376 871036 916389 978400 1053837 1139545 1238329 1360399 1518662 1720631 1961878
34448 1961878 2224595 2481749 2704758 2871494 2971492 3006437 2986052 2922008 2823387 2695772
34438 2695772 2543084 2369849 2182232 1987672 1793290 1603163 1415086 1218669 996513
34429 996513 728547 397787 -4596 -475990 -1001028 -1552402 -2094066 -2586743 -2994705 -3292385
34419 -3292385 -3469543 -3533850 -3509465 -3430669 -3331818 -3237461 -3156645 -3083244 -3001555 -2895317 -2757325
34408 -2757325 -2595656 -2432764 -2297455 -2214347 -2196744 -2245568 -2352962 -2507415 -2698012 -2916776
34398 -2916776 -3159209 -3424036 -3712946 -4030119 -4380610 -4767404 -5188318 -5634277 -6089782
34389 -6089782 -6535311 -6950623 -7317536 -7620820 -7847069 -7982672 -8012557 -7921064 -7695592 -7332512
34379 -7332512 -6843232 -6257014 -5618279 -4979003 -4389250 -3888641 -3500088 -3226252 -3049688
34370 -3049688 -2937382 -2848887 -2745864 -2600887 -2403896 -2164544 -1908290 -1666052 -1461028 -1298817
34360 -1298817 -1165382 -1032994 -870799 -655735 -380273 -54594 297428 646615 967527
34351 967527 1244658 1474293 1662830 1823221 1970650 2117479 2267872 2414152 2537901 2616782
34341 2616782 2634439 2588675 2494278 2379597 2278274 2219107 2217853 2273873 2371935 2487526 2594384
34330 2594384 2673575 2721996 2755865 2805949 2905973 3080006 3334717 3658885 4028698 4415099
34320 4415099 4789784 5128667 5414255 5638434 5804757 5927376 6025395 6115148 6204928 6295018
34310 6295018 6381993 6463447 6539719 6612105 6680040 6739758 6784592 6805212 6788885 6718812 6575263
34299 6575263 6339049 5996465 5543975 4990828 4358601 3678242 2986071 2319743 1714316
34290 1714316 1199059 796106 520803 381554 377581 496241 713335 997256 1314206 1631638
34280 1631638 1920371 2157595 2330863 2440120 2495027 2508380 2489707 2442891 2368452 2267811
34270 2267811 2145919 2010380 1867800 1719909 1562188 1386586 1187715 969754 750376
34261 750376 559275 431648 399467 484033 692199 1016732 1439690 1936916 2481990 3048824
34251 3048824 3613139 4153766 4654396 5105506 5505264 5858427 6172929 6454378 6699250
34242 6699250 6889022 6989424 6958358 6761475 6388655 5862703 5235741 4575695 3949799 3411812
34232 3411812 2996109 2717801 2575708 2555121 2629437 2761884 2909176 3027627 3080475 3044154
34222 3044154 2911273 2689230 2395279 2050474 1675146 1287038 901343 531148 187125
34213 187125 -123581 -398483 -639394 -849622 -1029758 -1175095 -1277520 -1331634 -1341340 -1322061
34203 -1322061 -1296330 -1284984 -1299266 -1338422 -1393261 -1452252 -1506367 -1551372 -1588211 -1621769 -1657716
34192 -1657716 -1698481 -1740806 -1776495 -1795535 -1789680 -1755808 -1698894 -1633352 -1580653 -1562705 -1593377
34181 -1593377 -1671960 -1781410 -1891918 -1968311 -1978635 -1901580 -1731345 -1479291 -1171616 -842686
34171 -842686 -525379 -241881 1186 211266 403107 590859 783836 987810 1208628 1452581
34161 1452581 1721554 2007116 2289719 2544845 2751936 2900150 2987950 3017952 2991148 2904539
34151 2904539 2753711 2538361 2267048 1958756 1641423 1348512 1113881 964982 915742 961862
34141 961862 1080888 1237770 1394788 1523050 1611472 1669535 1722939 1804802 1946717 2172592
34131 2172592 2495438 2915673 3419986 3981525 4562748 5121001 5614680 6007473 6270264
34122 6270264 6382568 6335099 6132945 5797646 5367046 4892557 4433409 4047885 3783575 3670493
34112 3670493 3719702 3926476 4274499 4738355 5284504 5872811 6460398 7007559 7483560 7869622
34102 7869622 8157705 8346034 8434214 8420947 8305540 8091765 7790923 7421677 7006696 6568165
34092 6568165 6124229 5687157 5263104 4853248 4455669 4066967 3683034 3299542 2913148
34083 2913148 2523389 2134267 1754808 1398455 1081185 818014 618485 483152 403385 364789
34073 364789 351994 351463 350517 334234 284343 183466 23772 -185085 -414273 -622234 -766813
34062 -766813 -818105 -767233 -627722 -428998 -205050 16083 217366 391808 538962 662450
34052 662450 768927 866450 961249 1054573 1141861 1214535 1262896 1278986 1259276 1206599 1130055
34041 1130055 1042124 953925 870199 785420 682739 537980 329207 48118 -293410 -666114
34031 -666114 -1033874 -1365641 -1642667 -1859092 -2017890 -2125510 -2187809 -2208600 -2190956 -2140038
34021 -2140038 -2065062 -1978689 -1894255 -1823041 -1772908 -1747725 -1746527 -1762903 -1786006 -1803617 -1805835 -1787481
34009 -1787481 -1748320 -1691634 -1622611 -1548189 -1478921 -1431266 -1427263 -1489898 -1635839 -1869750 -2183369
33998 -2183369 -2558951 -2973835 -3403397 -3822204 -4205085 -4529218 -4776753 -4936807 -5006017 -4987541
33988 -4987541 -4888984 -4720381 -4493399 -4221538 -3919712 -3602265 -3280766 -2963667 -2658272 -2373084
33978 -2373084 -2118385 -1903893 -1733818 -1601397 -1486693 -1360669 -1194375 -967858 -674030
33969 -674030 -317629 87056 517301 943110 1330835 1649596 1878370 2011261 2059725 2051695
33959 2051695 2027738 2033984 2112158 2288898 2568257 2930901 3340262 3751895 4120674 4403084
33949 4403084 4556808 4542919 4333767 3923684 3335356 2616526 1827768 1027258 258870 -452940
33939 -452940 -1101600 -1692547 -2236057 -2741095 -3211155 -3642170 -4022768 -4337245 -4570986 -4716731
33929 -4716731 -4779264 -4776418 -4735608 -4687216 -4657937 -4667168 -4727270 -4845685 -5025682 -5263804 -5544869
33918 -5544869 -5837953 -6097288 -6269920 -6307954 -6180328 -5879246 -5419696 -4834134 -4165862 -3463488
33908 -3463488 -2776402 -2149610 -1616938 -1193869 -873446 -628507 -421008 -215603 7729
33899 7729 247130 481027 678016 810212 864347 845688 773184 668677 546102 406182
33889 406182 238459 28419 -234735 -553936 -925769 -1346054 -1814700 -2335321 -2909623 -3531254
33879 -3531254 -4183849 -4843774 -5484548 -6080653 -6610687 -7060087 -7422082 -7695788 -7883036
33870 -7883036 -7987443 -8017387 -7990217 -7932498 -7873085 -7831007 -7804717 -7769727 -7687363 -7521015 -7252209
33859 -7252209 -6889419 -6466738 -6034223 -5644308 -5339072 -5142007 -5056112 -5067947 -5155119 -5293701
33849 -5293701 -5462585 -5643556 -5818086 -5963435 -6051105 -6049626 -5931247 -5679688 -5295374 -4796100
33839 -4796100 -4213509 -3586803 -2954948 -2348727 -1785035 -1266198 -785089 -333514 90371
33830 90371 478792 815829 1082114 1260227 1338463 1312047 1182908 959862 659658 307357
33820 307357 -65993 -428671 -754776 -1029189 -1249035 -1421404 -1558774 -1673995 -1775985 -1866567
33810 -1866567 -1939353 -1982085 -1982917 -1938489 -1859674 -1771169 -1703719 -1681355 -1709227 -1768272 -1820243 -1821404
33798 -1821404 -1738916 -1562889 -1309241 -1012263 -710350 -431714 -187025 28474 226629 418062
33788 418062 608431 799562 992600 1189904 1394223 1606146 1821831 2032165 2222940 2375271
33778 2375271 2466584 2473268 2375204 2160268 1826142 1378730 829743 197034 -491990 -1198198
33768 -1198198 -1874604 -2476282 -2970847 -3344050 -3599352 -3753745 -3831586 -3857012 -3846574 -3805123
33758 -3805123 -3726752 -3599339 -3409768 -3148304 -2812293 -2409201 -1957730 -1485644 -1024278 -601443
33748 -601443 -235097 70248 323706 544991 758806 987657 1245177 1532783 1841165 2155334
33738 2155334 2460230 2744659 3002916 3234023 3438494 3613748 3750969 3836104 3854738 3797621
33728 3797621 3663577 3458967 3195108 2884948 2539445 2164059 1757138 1312282 824970
33719 824970 300474 -241545 -768759 -1243281 -1630129 -1902831 -2044816 -2048325 -1913614 -1649828
33709 -1649828 -1276755 -825913 -340120 128491 522263 784197 866314 738201 393117 -149963
33699 -149963 -848374 -1641400 -2459116 -3232883 -3904640 -4432517 -4792965 -4981642 -5013964 -4923254
33689 -4923254 -4753949 -4550720 -4347927 -4163887 -4001059 -3850293 -3696752 -3525930 -3328573
33680 -3328573 -3103399 -2857428 -2604511 -2362558 -2149278 -1977093 -1850028 -1765536 -1720645 -1717297
33670 -1717297 -1761731 -1857882 -2000124 -2171018 -2345401 -2498102 -2611490 -2679922 -2709288 -2711552
33660 -2711552 -2696951 -2668190 -2619435 -2539308 -2415283 -2237908 -2004567 -1721700 -1403636 -1068023
33650 -1068023 -731009 -405652 -103323 165520 393856 582294 740833 885986 1034927
33641 1034927 1200261 1387678 1596007 1818038 2041217 2249221 2425676 2559468 2648800 2701201
33631 2701201 2729485 2746518 2761710 2779954 2802017 2825629 2847385 2865111 2879288 2892127 2904725
33620 2904725 2914785 2917406 2909103 2892276 2876538 2875464 2900924 2958592 3046584 3156249 3273216
33609 3273216 3378255 3448883 3462178 3397719 3239224 2975052 2599118 2113433 1531519 880116
33599 880116 196757 -477085 -1105065 -1663862 -2147377 -2566191 -2942586 -3302578 -3667556 -4048490
33589 -4048490 -4444202 -4842782 -5224309 -5564309 -5838683 -6030072 -6133363 -6157313 -6121437 -6050320
33579 -6050320 -5968847 -5900227 -5866191 -5887138 -5980627 -6158186 -6421733 -6761041 -7153383 -7566233
33569 -7566233 -7963077 -8310675 -8584642 -8770841 -8862876 -8858599 -8758729 -8568537 -8301138 -7979509
33559 -7979509 -7634779 -7300313 -7003762 -6760804 -6573327 -6432238 -6322979 -6231267 -6146868 -6064009
33549 -6064009 -5978518 -5883874 -5769345 -5621803 -5430094 -5189526 -4904925 -4592006 -4276693 -3991418
33539 -3991418 -3767941 -3628273 -3576882 -3597592 -3656889 -3712912 -3726781 -3671928 -3538541 -3333334
33529 -3333334 -3076782 -2799328 -2536492 -2322645 -2184821 -2138841 -2189172 -2331760 -2557746 -2855985
33519 -2855985 -3213649 -3615701 -4044698 -4481692 -4907930 -5306838 -5666246 -5980457 -6250581
33510 -6250581 -6481224 -6673709 -6819256 -6896949 -6879590 -6746210 -6495479 -6152534 -5764529 -5386665
33500 -5386665 -5065976 -4830340 -4685519 -4618045 -4600346 -4596470 -4568923 -4486789 -4333203 -4108504
33490 -4108504 -3826995 -3509214 -3174595 -2838206 -2511233 -2202209 -1916740 -1655912 -1415003
33481 -1415003 -1184043 -951212 -708624 -458112 -213464 2877 166997 260402 273087 202258
33471 202258 49326 -181396 -480691 -830668 -1202786 -1560070 -1863077 -2076883 -2176692 -2151175
33461 -2151175 -2003905 -1753239 -1430378 -1074945 -727936 -423293 -180931 -4255 116570
33452 116570 197451 253283 294388 326998 355421 383158 412070 440544 461785 462761 424535 325337
33440 325337 146739 -119358 -466844 -877068 -1324800 -1784799 -2235833 -2661440 -3048714 -3387017
33430 -3387017 -3667958 -3887085 -4046427 -4156037 -4232772 -4296196 -4363195 -4443422 -4536773 -4633119
33420 -4633119 -4714199 -4757287 -4739997 -4645587 -4468194 -4216655 -3914292 -3592947 -3283087 -3004674
33410 -3004674 -2762615 -2547497 -2340782 -2123562 -1886393 -1635261 -1389782 -1175089 -1012848
33401 -1012848 -915264 -882039 -899669 -944330 -988838 -1010550 -995889 -940363 -846646 -723025 -581870
33390 -581870 -436866 -299062 -173551 -58935 49229 152169 242530 303889 316004 262636
33380 262636 137700 -52246 -288790 -544561 -787441 -985350 -1110807 -1144447 -1076823 -908153
33370 -908153 -646795 -308129 85199 503105 910507 1273034 1563221 1763813 1867372 1874222
33360 1874222 1790893 1629464 1407129 1145812 871568 612694 395462 238529 149266 124492
33350 124492 154963 230435 342157 481489 635558 783279 896470 948551 927390 843894
33340 843894 729168 620747 546276 514703 519402 549346 599396 673016 777660 918759 1097560
33329 1097560 1312820 1562375 1841843 2141476 2444173 2726315 2961259 3124736 3201462 3191095
33319 3191095 3110068 2986170 2846641 2705347 2556476 2378683 2147328 1847819 1482920 1070944
33309 1070944 636955 202793 -218696 -623554 -1012961 -1388749 -1749473 -2087478 -2388518
33300 -2388518 -2635650 -2816313 -2928277 -2980621 -2989803 -2974253 -2950597 -2932202 -2929037 -2947855 -2992132
33289 -2992132 -3061393 -3149977 -3245823 -3330259 -3379366 -3367366 -3272240 -3083009 -2806081 -2466759 -2103414
33278 -2103414 -1756211 -1455801 -1217036 -1039018 -909421 -810294 -723394 -633616 -529843 -403996
33268 -403996 -250316 -66098 147228 384603 639573 906099 1177956 1446118 1696560 1910447
33258 1910447 2066648 2145062 2129554 2010387 1786299 1465498 1064372 603605 103215 -420832
33248 -420832 -956542 -1492652 -2014950 -2505403 -2945463 -3321583 -3629546 -3875678 -4075713 -4252555
33238 -4252555 -4432751 -4640624 -4890730 -5181324 -5491770 -5785314 -6016915 -6144378 -6139583 -5996013
33228 -5996013 -5730096 -5376662 -4980587 -4586730 -4229995 -3927696 -3676508 -3455018 -3230929
33219 -3230929 -2970894 -2650576 -2262127 -1816073 -1336205 -849603 -376974 71523 493079
33210 493079 884129 1232706 1516457 1708120 1785609 1740998 1583938 1338839 1038241 715425
33200 715425 398314 105830 -152855 -376894 -571608 -746597 -913805 -1084883 -1268110 -1466047
33190 -1466047 -1674877 -1885642 -2086826 -2267427 -2419771 -2541828 -2639046 -2724998 -2819503 -2943775
33180 -2943775 -3114767 -3341858 -3627041 -3966479 -4350648 -4762531 -5175621 -5553878 -5855013
33171 -5855013 -6037582 -6071013 -5945625 -5678295 -5310638 -4899650 -4503986 -4170587 -3926125 -3775691
$$ [...]
##END NTUPLES=NMR SPECTRUM
##END=
