##TITLE=31Pdec_LR-755-i4-P2
 , 24 sc
 23.11.2022
##JCAMPDX= 6.0         $$ Bruker NMR JCAMP-DX V2.0
##DATA TYPE= NMR SPECTRUM
##DATA CLASS= NTUPLES
##ORIGIN= UXNMR, Bruker Analytische Messtechnik GmbH
##OWNER= root
$$ XWIN-NMR		Version 3.5
$$ Wed Nov 23 16:16:18 2022 Russian Standard Time (UT+4h)  she@DPX200
##.OBSERVE FREQUENCY= 81.013821
##.OBSERVE NUCLEUS= ^31P
##.ACQUISITION MODE= SIMULTANEOUS
##.ACQUISITION SCHEME= undefined
##.AVERAGES= 24
##.DIGITISER RES= 16
##SPECTROMETER/DATA SYSTEM= spect
##.PULSE SEQUENCE= zgpg30
##.SOLVENT NAME= CDCl3
##.SHIFT REFERENCE= (INTERNAL, CDCl3, 0, 248.564)
##AUDIT TRAIL= $$ (NUMBER, WHEN, WHO, WHERE, WHAT)
$$ ##TITLE= Audit trail, XWIN-NMR		Version 3.5
$$ ##JCAMPDX= 5.01
$$ ##ORIGIN= Bruker BioSpin GmbH
$$ ##OWNER= she
$$ F:/spectra/data/she/nmr/P31/1/pdata/1/auditp.txt
$$ ##AUDIT TRAIL=  $$ (NUMBER, WHEN, WHO, WHERE, WHAT)
(   1,<2022-11-23 16:15:04.87 +0400>,<she>,<DPX200>,
      <created by zg, POWCHK disabled, PULCHK disabled
       configuration hash MD5:
       00 E9 B6 7A A2 85 ED C7 34 08 36 98 17 FE 4E 26
       data hash MD5: 32K
       1E 35 6B 23 62 E3 80 97 CD 43 3A DA D2 81 4C BC>)
(   2,<2022-11-23 16:15:17.01 +0400>,<she>,<DPX200>,
      <Start of raw data processing
       efp BC_mod = 2 LB = 1 FT_mod = 6 PKNL = 1 PHC0 = -10394.18 PHC1 = -410.7443 SI = 64K 
       data hash MD5: 64K
       E4 9B 31 95 9A 7F 7C 0D 0E C1 2D 6D A4 5B 9D A2>)
(   3,<2022-11-23 16:15:40.81 +0400>,<she>,<DPX200>,
      <pk PHC0 = -217.8646 PHC1 = 520.6004 
       data hash MD5: 64K
       6B D4 B1 FF 25 78 BD 57 D2 31 6B 08 02 B6 F4 DE>)
(   4,<2022-11-23 16:15:44.07 +0400>,<she>,<DPX200>,
      <abs ABSG = 5 
       data hash MD5: 64K
       37 D5 2E 54 8C 51 19 D0 68 59 BB 3D 6C E9 35 21>)
$$ ##END=
$$ 
$$ hash MD5
$$ 5A CA 33 A5 7D 7B 1D C6 27 CA 97 19 CA 51 EC 75
##$RELAX= 
##$RELAX= 
##$RELAX= 
##$RELAX= 
##$RELAX= 
##$RELAX= 
##$RELAX= 
##$RELAX= 
##$RELAX= 
$$ Bruker specific parameters
$$ --------------------------
##$DU= <F:/spectra>
##$EXPNO= 1
##$NAME= <P31>
##$PROCNO= 1
##$TYPE= <nmr>
##$USER= <she>
##$AMP= (0..31)
100 100 100 100 100 100 100 100 100 100 100 100 100 100 100 100 100 100 
100 100 100 100 100 100 100 100 100 100 100 100 100 100 
##$AQSEQ= 0
##$AQ_mod= 1
##$AUNM= <au_zg>
##$AUTOPOS= <>
##$BF1= 81.014009
##$BF2= 200.13
##$BF3= 200.13
##$BF4= 200.13
##$BF5= 200.13
##$BF6= 200.13
##$BF7= 200.13
##$BF8= 200.13
##$BYTORDA= 1
##$CFDGTYP= 0
##$CFRGTYP= 5
##$CHEMSTR= <none>
##$CNST= (0..31)
1 1 145 1 1 1 1 1 1 1 1 1 1 1 1 1 1 1 1 1 1 1 1 1 1 1 1 1 1 1 1 1 
##$CPDPRG= <waltz16>
##$CPDPRG1= <>
##$CPDPRG2= <waltz16>
##$CPDPRG3= <>
##$CPDPRG4= <mlev>
##$CPDPRG5= <mlev>
##$CPDPRG6= <mlev>
##$CPDPRG7= <mlev>
##$CPDPRG8= <mlev>
##$CPDPRGB= <>
##$CPDPRGT= <>
##$D= (0..31)
0 1 0 0 0 0 0 0 0 0 0 0.03 2e-05 3e-06 0 0 0 0 0 0 0 0 0 0 0 0 0 0 0 0 
0 0 
##$DATE= 1669205704
##$DBL= (0..7)
120 120 120 11 120 120 24 19 
##$DBP= (0..7)
150 150 150 150 150 150 150 150 
##$DBP07= 0
##$DBPNAM0= <>
##$DBPNAM1= <>
$$ [...]
##$SUBNAM3= <"">
##$SUBNAM4= <"">
##$SUBNAM5= <"">
##$SUBNAM6= <"">
##$SUBNAM7= <"">
##$SUBNAM8= <"">
##$SUBNAM9= <"">
##$SW= 501.771253377433
##$SWIBOX= (0..15)
0 1 3 0 0 0 0 0 0 0 0 0 0 0 0 0 
##$SW_h= 40650.406504065
##$TD= 32768
##$TD0= 1
##$TE= 0
##$TE2= 300
##$TE3= 300
##$TEG= 300
##$TL= (0..7)
0 120 53 12 22 120 120 120 
##$TP= (0..7)
150 150 150 150 150 150 150 150 
##$TP07= 0
##$TPNAME0= <>
##$TPNAME1= <>
##$TPNAME2= <>
##$TPNAME3= <>
##$TPNAME4= <>
##$TPNAME5= <>
##$TPNAME6= <>
##$TPNAME7= <>
##$TPOAL= (0..7)
0.5 0.5 0.5 0.5 0.5 0.5 0.5 0.5 
##$TPOFFS= (0..7)
0 0 0 0 0 0 0 0 
##$TUNHIN= 0
##$TUNHOUT= 0
##$TUNXOUT= 0
##$USERA1= <user>
##$USERA2= <user>
##$USERA3= <user>
##$USERA4= <user>
##$USERA5= <user>
##$V9= 5
##$VALIST= <valist>
##$VCLIST= <CCCCCCCCCCCCCCC>
##$VD= 0
##$VDLIST= <DDDDDDDDDDDDDDD>
##$VPLIST= <PPPPPPPPPPPPPPP>
##$VTLIST= <TTTTTTTTTTTTTTT>
##$WBST= 1024
##$WBSW= 4
##$XGAIN= (0..3)
0 0 0 0 
##$XL= 0
##$YL= 0
##$YMAX_a= 6882
##$YMIN_a= -6470
##$ZGOPTNS= <>
##$ZL1= 120
##$ZL2= 120
##$ZL3= 120
##$ZL4= 120
##$ABSF1= 248.5645
##$ABSF2= -253.2056
##$ABSG= 5
##$ABSL= 3
##$ALPHA= 0
##$AQORDER= 0
##$ASSFAC= 0
##$ASSFACI= 0
##$ASSFACX= 0
##$ASSWID= 0
##$AUNMP= <proc_1d>
##$AZFE= 0.1
##$AZFW= 0.5
##$BCFW= 0
##$BC_mod= 2
##$BYTORDP= 0
##$COROFFS= 0
##$CY= -3
##$DATMOD= 1
##$DC= 0
##$DFILT= <>
##$DTYPP= 0
##$F1P= 0
##$F2P= 0
##$FCOR= 1
##$FTSIZE= 65536
##$FT_mod= 6
##$GAMMA= 0
##$GB= 0
##$INTBC= 1
##$INTSCL= 6.047779e-11
##$ISEN= 30
##$LB= 1
##$LEV0= 0
##$LPBIN= 0
##$MAXI= 10000
##$MC2= 0
##$MEAN= 0
##$ME_mod= 0
##$MI= 50
##$NCOEF= 0
##$NC_proc= -6
##$NLEV= 6
##$NOISF1= 182.463
##$NOISF2= 159.3651
##$NSP= 0
##$NTH_PI= 0
##$NZP= 0
##$OFFSET= 248.5645
##$PC= 4
##$PHC0= -10612.04
##$PHC1= 109.8561
##$PH_mod= 1
##$PKNL= yes
##$PPARMOD= 0
##$PSCAL= 0
##$PSIGN= 0
##$REVERSE= no
##$SF= 81.0140089999694
##$SI= 65536
##$SIGF1= 159.3651
##$SIGF2= -187.1042
##$SINO= 113.3802
##$SIOLD= 16384
##$SREGLST= <1H.CDCl3>
##$SSB= 0
##$STSI= 65536
##$STSR= 0
##$SW_p= 40650.406504065
##$SYMM= 0
##$S_DEV= 0
##$TDeff= 32768
##$TDoff= 0
##$TI= <>
##$TILT= no
##$TM1= 0
##$TM2= 0
##$TOPLEV= 0
##$USERP1= <user>
##$USERP2= <user>
##$USERP3= <user>
##$USERP4= <user>
##$USERP5= <user>
##$WDW= 1
##$XDIM= 65536
##$YMAX_p= 386740894
##$YMIN_p= -70562808
$$ End of Bruker specific parameters
$$ ---------------------------------
##NTUPLES= NMR SPECTRUM
##VAR_NAME=  FREQUENCY,     SPECTRUM/REAL,   SPECTRUM/IMAG
##SYMBOL=    X,             R,               I
##VAR_TYPE=  INDEPENDENT,   DEPENDENT,       DEPENDENT
##VAR_FORM=  AFFN,          ASDF,            ASDF
##VAR_DIM=   65536,         65536,           65536
##UNITS=     HZ,            ARBITRARY UNITS, ARBITRARY UNITS
##FACTOR=    0.620285442955139, 1,           1
##FIRST=     20137.2065510682, 0,            0
##LAST=      -20513.1999529968, 0,           0
##MIN=       -20513.1999529968, -70562808,   0
##MAX=       20137.2065510682, 386740894,    0
$$ Real data points
##PAGE= N=1
##DATA TABLE= (X++(R..R)), XYDATA
$$ [...]
51175a172272O63708L95949m34706m17051M89687Q14598L553o31595j41947M10194
$$ -1172272 -508564 -112615 -547321 -964372 -474685 339913 343466 -288129 -430076 -19882
51165a9882k56202j384277j225435L15164J562784J379484L25920m87364o47952
$$ -19882 -276084 -1660361 -2885796 -2570632 -1007848 371636 697556 210192 -437760
51156d37760l55430Q3727L57107K45560j17500l44366k44259j091Q5143j01847
$$ -437760 -793190 -709463 -352356 -106796 -224296 -568662 -812921 -814012 -728869 -830716
51146h30716l96030n02208l65069k92313m27817l08694M68456J278032J036858
$$ -830716 -1226746 -1728954 -2094023 -2386336 -2814153 -3122847 -2654391 -1376359 -339501
51137c39501j40526q57948l93137K84591R4729n34725n53300l946K67657J18391
$$ -339501 -480027 -1337975 -1731112 -1446521 -1351792 -1886517 -2439817 -2443763 -2176106 -2057715
51127b057715J73221O14725R31344P94301L53765k17283p16272o68439Q2641P64750
$$ -2057715 -1884494 -1269769 -338425 455876 809641 592358 -123914 -792353 -709712 55038
51117E5038N45027k00373m36903p8751N6919k25975k94848p6518k79181q81282
$$ 55038 600065 399692 -37211 -115962 -59043 -285018 -579866 -656384 -935565 -1816847
51107a816847p77102M12763J421044J123924K21183P0271O46532Q44751K95354
$$ -1816847 -2593949 -2181186 -760142 363782 584965 655236 1301768 2146519 2441873
51098B441873l15659n00516m49340l12859J4848L21258J45184m15041p10944n49260
$$ 2441873 2126214 1625698 1176358 863499 878347 1199605 1344789 929748 218804 -330456
51088c30456m63885p11266p24544o7298O42800M68878m26774q22040p651J221108
$$ -330456 -794341 -1505607 -2230151 -2297449 -1654649 -1185771 -1612545 -2434585 -2442236 -1221128
51078a221128J489736M87025p36242j073873n45885J9780J27513n308q1593j90847
$$ -1221128 268608 755633 19391 -1054482 -1600367 -1580587 -1453074 -1458382 -1539975 -1730822
51068a730822m44245n37097n6538Q66458J493371J158854l089j036043j010004
$$ -1730822 -2175067 -2712164 -2768702 -1902244 -408873 749981 746892 -289151 -1299155
51059a299155l9020P32051M43865l80637n38956J94401Q22221O13860K2691k40548
$$ -1299155 -1338175 -606124 -162259 -542896 -1081852 -887451 -65230 548630 571321 330773
51049C30773k47255l36038k40630L99313J080965R42598N9150o44759p19888n79489
$$ 330773 83518 -252520 -493150 -93837 987128 1929726 1988876 1344117 624229 44740
51039D4740n51615m41585j95761j13044j10193L42615J133268J249654K55009
$$ 44740 -506875 -948460 -1144221 -1257265 -1367458 -1024843 108425 1358079 1613088
51030A613088p83654p04258N2632J96233m00904o72785k35730L3377l78659o42291
$$ 1613088 829434 125176 177808 374041 -26863 -699648 -935378 -902001 -1280660 -1922951
51020a922951M0190J014557J106788L94895k4150K11866K93400l57221j190185
$$ -1922951 -1882761 -868204 238584 633479 609329 821195 1114595 757374 -432811
51011d32811j353514p01458L39402J248700J416164M11713j175384j820255p54861
$$ -432811 -1786325 -2487783 -2148381 -899681 516483 928196 -247188 -2067443 -2822304
51002b822304Q78235J379943O27804q6980q9466j4948l88810p16656m78517n9146
$$ -2822304 -1944069 -564126 63678 -23302 -112768 -127716 -516526 -1233182 -1711699 -1770845
50992a770845j5659j49016j5115K24659K01523J10942L11905N18632K00150m41921
$$ -1770845 -1786504 -1935520 -1950635 -1725976 -1524453 -1413511 -1101606 -582974 -382824 -824745
50982h24745o90324l86249k0759J98550N87189J194807J509478J197773N73444
$$ -824745 -1515069 -1901318 -1922077 -1723527 -1136338 58469 1567947 2765720 3339164
50973C339164O8739k92413o32597q34269p17218l62050l9632M1366j48281m23906
$$ 3339164 3407903 3115490 2482893 1648624 931406 569356 529724 571090 422809 -1097
50963a097m79134k05555J48329L32737M14737M44688J10051p45941j483572j242375
$$ -1097 -480231 -685786 -537457 -204720 210017 654705 764756 18815 -1464757 -2707132
50953b707132j30099Q40819J049750Q11717N35861J34900m14333o41454k16170
$$ -2707132 -2837231 -1996412 -946662 -134945 400916 535816 121483 -519971 -736141
50944g36141M56010P17468M22025o3550k80490O3205P94348J098349K72660j103418
$$ -736141 -280131 437337 859362 795812 515322 578527 1372875 2471224 2743884 1640466
50934A640466j515754m80218O36499M62222m45643n17444M37101R80515K13353
$$ 1640466 124712 -355506 280993 743215 297572 -219872 217229 1197744 1411097
50925A411097r41748j077110j48017O66601N88024O8206l6075L60111N67098J60240
$$ 1411097 469349 -607761 -755778 -89177 498847 567053 530978 891089 1458187 1618427
50915A618427m25619n51320k49886n574Q0237K71187M49449J55134n16435q35014
$$ 1618427 1192808 641488 391602 386028 466265 737452 1186901 1342035 825600 -9414
50905i414n12988j07006j2349J28408N36465O64669J38306m28567l70342p0440
$$ -9414 -522402 -629408 -641757 -513349 23116 687785 826091 397524 27182 -43258
50895d3258k34900o40536n83087j11990J84869K46126L87643M61706K04766M2406
$$ -43258 -278158 -918694 -1501781 -1613771 -1428902 -1182776 -795133 -333427 -128661 -86255
50885h6255M20358P38722K53443l52030J25811J161687J015030m15927j282169
$$ -86255 334103 1072825 1326268 974238 1100049 2261736 3276766 2860839 1578670
50876A578670q01196m41353j123754j395680j4137J498425J074446l98158l38203
$$ 1578670 777474 336121 -787633 -2183313 -2197450 -699025 375421 -22737 -360940
50867c60940J334120J921381R2967k119202k345868r38478K66134P23030J106269
$$ -360940 973180 2894561 2987528 868326 -1477542 -2416020 -2149886 -1426856 -320587
50858c20587J384199P74832n28333j150881m48772N02397M36614l99579q41378
$$ -320587 1063612 1838444 1310111 159230 -289542 212855 649469 249890 -591488
50849e91488n46333j68967J0262N07293J364446J505641K22199j354742j420637
$$ -591488 -1137821 -1306788 -1296526 -789233 575213 2080854 2303053 948311 -472326
50840d72326L3970J098511N13275p22766q99852J04549R28468O63771j76057n48931
$$ -472326 -438356 660155 1173430 450664 -449188 -344639 583829 1247600 1071543 522612
50830E22612j24143M70756L77295n16989j313444j094606j45358M02351K17157
$$ 522612 398469 869225 1246520 729531 -583913 -1678519 -1823877 -1421526 -1204369
50821a204369J76046P40652R81033R9956r65991p36876N42965J222545O42641
$$ -1204369 -1028323 -287671 693362 793318 -172673 -909549 -366584 855961 1498602
50812A498602j80012l46673j87938k31751l04406k11285k42892l75708L1937J008575
$$ 1498602 1318590 971917 783979 552228 247822 36537 -206355 -582063 -550126 458449
50802D58449J396067M55538p71762q57281j21453j4810o67830o42349N92690J453892
$$ 458449 1854516 2310054 1538292 681011 559558 544748 -123082 -765431 -172741 1281151
50792A281151M50365j426883j843682k93010J236896J023569j61471m24085M47352
$$ 1281151 1731516 304633 -1539049 -1832059 -595163 428406 266935 -157150 290202
50783B90202Q38743j31001j251542r96579L54137J303508J205369O41355O4215
$$ 290202 1128945 997944 -253598 -1250177 -896040 407468 1612837 2254192 2318407
50774B318407o84919j415328j337227k61658Q27519R90203M87892J81549L10524
$$ 2318407 1633488 218160 -1119067 -1380725 -553206 436997 924889 1106438 1416962
50765A416962M32390J79681m08370r84632j001486j68460Q92209J044836J08305
$$ 1416962 1849352 2029033 1620663 636031 -365455 -533915 358294 1403130 1511435
50756A511435p46565n99570k5513Q427k79528n8034N41981O47976J31325l49022
$$ 1511435 764870 165300 139787 148214 -131314 -189348 352633 1000609 1131934 782912
50746G82912o01470r31967j012764j53134J126662J289554O3960q66112k44843
$$ 782912 181442 -750525 -1763289 -1916423 -789761 499793 563753 -302359 -547202
50737e47202R15072R10861k11020r91179o91080R5195O11362O71821L88420n39
$$ -547202 367870 1278731 1067711 76532 -614548 -519353 92009 763830 1152250 1151711
50727A151711j55226r8140l48581j012865j263283n09526M71286N76537N5284
$$ 1151711 996485 898345 549764 -463101 -1726384 -2235910 -1764624 -1188087 -1132803
50718a132803m1044L07459K04786l78386m79817O2784K49134k61653m88905Q2643
$$ -1132803 -1173847 -866388 -661602 -1039988 -1519805 -1457021 -1207887 -1469540 -1958445 -1875802
50708a875802N35707K21288J7672P11130J356811P32560m95061p08064J20739
$$ -1875802 -1340095 -1118807 -1101135 -390005 966806 1699366 1204305 496241 616980
50699F16980N12620j10282p42896o11270j77596k2922k0944l4506k90349o13289
$$ 616980 1129600 1019318 276422 -334848 -512444 -535366 -556310 -590816 -881165 -1494454
50689a494454l54818M30121P73104K98606j17701J34953L20982k76277r08785
$$ -1494454 -1849272 -1419151 -646047 -347441 -465142 -330189 -9207 -285484 -1194269
50680a194269n19132L86470M60435k58687l73563N64236J253136O36022n28396
$$ -1194269 -1713401 -1326931 -866496 -1125183 -1498746 -934510 318626 954648 426252
50671D26252q69299k84681L05589M89456O12495P52406M91943j57604m89584j31976
$$ 426252 -443047 -727728 -422139 67317 679812 1432218 1924161 1766557 1276973 1144997
50661A144997L29709K46254j31466k05796r8889l27432o48008k69237O61507Q85351
$$ 1144997 1474706 1720960 1589494 1383698 1284809 957377 309369 40132 701639 1586990
50651A586990j31043j172277r36327O8848L90309j56770m53518l6301L24700J66911
$$ 1586990 1455947 283670 -652657 -583809 -193500 -350270 -803788 -840089 -515389 -348478
50641c48478J01871N56791R07768N32681j96795o33321p29443n71690O3092R40152
$$ -348478 -246607 310184 1217952 1750633 1553838 920517 191074 -380616 -317524 622628
50631F22628J061544N6739r23630p28066J21451L99117R3134J4120R3379l39607
$$ 622628 1684172 1740911 817281 89215 210666 609783 702917 717037 810416 470809
50621D70809r02857m97568O86983J175578M66127l23670m68262o15001j060955
$$ 470809 -432048 -929616 -242633 932945 1399072 1075402 607140 -7861 -1068816
50612a068816p61893P40510J824545Q27246j279962j928806l54545J520445J661031
$$ -1068816 -1830709 -1090199 734346 1561592 281630 -1647176 -2001721 -481276 1179755
50603A179755J94272j169932j163029n7461Q09799M32682p44764j248563l42879
$$ 1179755 1374027 204095 -958934 -1016395 -206596 226086 -518678 -1767241 -2110120
50594b110120J013189J406726P04870j07866m18313m30361l06597J49167P93884
$$ -2110120 -1096931 309795 1014665 906799 488486 58125 -248472 -99305 694579
50585F94579R59512L32209n24013q51873n28924J5141L44708K59273j77661n89116
$$ 694579 1654091 1986300 1462287 610414 81490 96631 441339 700612 522951 -66165
50575f6165n04617J10878O90858O62890J58891p9431M07751J124898J084734K8985
$$ -66165 -570782 -459904 230954 893844 1052735 973304 1381055 2505953 3590687 3619672
50565C619672j121558j357554q29792m39453m00248r9941N35451O34122j60709
$$ 3619672 2498114 1140560 310768 -128685 -528933 -628874 -93423 540699 379990
50556C79990q44452m88395L30225N42560K91933L94021O58177K09245p52842j040765
$$ 379990 -464462 -952857 -622632 -80072 211861 605882 1264059 1473304 720462 -320303
50546c20303l92337J72556J47862K08146O22715N31846l78471q84023o3692R90404
$$ -320303 -712640 -540084 -392222 -184076 438639 970485 592014 -292009 -355701 634703
50536F34703O91417n91778j109231l52957M13449K43016k63513j69470M41914
$$ 634703 1326120 734342 -374889 -727846 -314397 -71381 -334894 -504364 -62450
50527f2450Q67692Q01284M12433p9785m32207l42052J53747M62018M0164q44149
$$ -62450 805242 1606526 2018959 1939174 1506967 1164915 1318662 1780680 1820844 976695
50517I76695j306860q70502m7172K90139k381j95654K72849R86897J147038O97171
$$ 976695 -330165 -1200667 -1247839 -957700 -960081 -1155735 -882886 104011 1251049 1948220
50507A948220K64734Q5944k50448q38150j033007m28329M01638O65957L32503
$$ 1948220 2212954 2298898 2048450 1210300 177293 -251036 150602 816559 1149062
50498A149062j82372p32394j215362j178687m32558L70066N69044N02016Q01235
$$ 1149062 966690 234296 -981066 -2159753 -2592311 -2222245 -1653201 -1151185 -349950
50489c49950J130793P33707n9985j70101M27604N86016j17967p28132n89958l67571
$$ -349950 780843 1514550 1454565 1284464 1712068 2298084 2180117 1451985 862027 494456
50479D94456o84984r53902m86323K14507L29211J07507K75349O62726N55482p009
$$ 494456 -190528 -1144430 -1630753 -1416246 -1087035 -979528 -704179 -41453 514029 507020
50469E07020l71872l87607l50991j63727L72787P13194K23344n07817l31500N25586
$$ 507020 135148 -252459 -603450 -767177 -394390 318804 542148 34331 -297169 228417
50459B28417O43030k75743q23276j82208N24608J34425o22962l94435N47194Q15358
$$ 228417 871447 595704 -227572 -409780 114828 249253 -373709 -768144 -220950 594408
50449E94408J53418l30085m3486L43787K30884m464J39762L92903K20032l00107
$$ 594408 747826 417741 374255 718042 948926 944462 1084224 1477127 1697159 1397052
50439A397052o02997l95848L9216K28125R0138J08788O98889J361742J024985
$$ 1397052 794055 398207 437423 665548 755686 864474 1563363 2925105 3950090
50430C950090m06848j505571j060796K03517O65078J25313j85507K43979N35615
$$ 3950090 3543242 2037671 976875 1180392 1845470 1970783 1785276 2029255 2564870
50421B564870J27029l19888k81402l07721p94277r93185k44499P57324R76925
$$ 2564870 2691899 2372011 2090609 1782888 988611 -4574 -249073 508251 1485176
50412A485176N30233J26898k26795q25985j207567p26213K40746P93214Q01989
$$ 1485176 2015409 2142307 1915512 1089527 -118040 -844253 -603507 189707 991696
50403I91696O48945K42302m86072p26846O6591P35898r9637j496252j225615O59762
$$ 991696 1640641 1882943 1396871 670025 736616 1472514 1372877 -123375 -1348990 -689228
50393f89228J629549N21374p75252m66132N46933O65907K22207K47506K24004
$$ -689228 940321 1461695 686443 220311 767244 1433151 1655358 1902864 2126868
50384B126868p75052j822552j307122K70009Q95806J57559l94467O032L46788
$$ 2126868 1351816 -470736 -1777858 -1507849 -612043 -454484 -848951 -842919 -496131
50375d96131m3484l34866J27522O20473M02246m8939q1096l4437l85586o58876
$$ -496131 -539615 -874481 -746959 -126486 275760 226821 145725 111288 -274298 -933174
50365i33174k42469L97776L79896j60096l00416K10414O31951L85288j79463l55675
$$ -933174 -1175643 -777867 -397971 -558067 -858483 -648069 -16118 369170 189707 -165968
50355a65968P432L83803K20448l91818p45625l20228N16558Q60209K99734o88861
$$ -165968 -158536 225267 445715 53897 -691728 -1011956 -495398 364811 664545 -24316
50345b4316j334805j205664l22346Q55849J526850J184934L24383j4574M05787
$$ -24316 -1359121 -2564785 -2887131 -2031282 -504432 680502 1004885 990311 1396098
50336A396098O86680J16264p36011p84709M9020P01460L47295n59737q79899k46502
$$ 1396098 2082778 2199042 1463031 678322 727342 1428802 1776097 1216360 336461 89959
50326H9959M41125K09518o00388p70236l4231M48736q0309o83378k31726O46919
$$ 89959 531084 740602 140214 -630022 -664253 -215517 -295826 -979204 -1210930 -564011
50316e64011N60232k45724k47630O75054Q74894k84327j176495m12083J010789
$$ -564011 -3779 -249503 -497133 177921 1052815 768488 -408007 -820090 190699
50307A90699J315134M39327m39746q37187r63543o36495K73900R09305M61727
$$ 190699 1505833 1945160 1505414 668227 -295316 -931811 -657911 251394 713121
50298G13121k88443p004R50454R83907j43140q63956k70501N78510M32892l75865
$$ 713121 424678 417674 1368128 2352035 2208895 1344939 1074438 1652948 2085840 1709975
50288A709975p47449m38153m2979O920k74163p07506r89546q11038k96331M4054
$$ 1709975 962526 524373 481394 488314 214151 -493355 -1482901 -2293939 -2590270 -2546216
50278b546216L7896P6620L96788O67460N96174M27010M41415L95837p8403p72700
$$ -2546216 -2508320 -2431700 -2034912 -1367452 -771278 -344268 97147 492984 414581 -358119
50268c58119j040028n90303J21186L78044L6942k43922J56131Q36827Q05087L1647
$$ -358119 -1398147 -1988450 -1867264 -1489220 -1452278 -1696200 -1540069 -703242 101845 133492
50258A33492k73812M95203J163270M74085q26139j040699j46050L42074m9588
$$ 133492 -140320 354883 1518153 1992238 1166099 125400 -20650 321424 271836
50249B71836k00923L42260N30294r8452l80788L58703Q81061J03070q97478o05690
$$ 271836 70913 413173 943467 845015 464227 822930 1703991 1807061 909583 303893
50239C03893L98119M91435k66537m57271J31663K84668l77125q02083m13210O1075
$$ 303893 702012 1193447 926910 469639 601302 885970 508845 -293238 -706448 -645373
50229f45373N1907l5145O9212m7676l74064j46600O94235R72071N6852r16309
$$ -645373 -593466 -628611 -559399 -607075 -981139 -1127739 -433504 538567 595419 -320890
50219c20890o31545M66507R20378L48508l11800l06163J74736N65137M56410k86684
$$ -320890 -952435 -485928 434450 782958 471158 164995 339731 904868 1361278 1074594
50209A074594j239631j449399m90575O83826P55297j71446o63629N6900J110467
$$ 1074594 -165037 -1614436 -2105011 -1421185 -665888 -837334 -1500963 -1444063 -333596
50200c33596J277672N41349k44919o39564q22652q07533k59297P70699J533329
$$ -333596 944076 1485425 1240506 600942 -221710 -1029243 -1288540 -517841 1015488
50191A015488J355328M23723n07868r74761j022570p62225k35570K03977m8364
$$ 1015488 2370816 2794539 2286671 1311910 289340 -472885 -708455 -504478 -552842
50182e52842r96868j623857r14024P72110J910629J528079K54803n41471k87879
$$ -552842 -1549710 -3173567 -4087591 -3315481 -1404852 123227 378030 -163441 -451320
50173d51320M29816P48905L89224k71945o52221m42864J80435P32110Q07682L15367
$$ -451320 -21504 727401 1116625 844680 192459 -250405 -69970 662140 1469822 1785189
50163A785189n46358j338819j494389p49021M19165J105854R20258L31420q5423
$$ 1785189 1238831 -99988 -1594377 -2343398 -1924233 -818379 101879 433299 347876
50154C47876l41739o20581n80065K48389J426869J696378M50622j274310j756799
$$ 347876 6137 -614444 -1194509 -946120 480749 2177127 2627749 1353439 -403360
50145d03360m87670J227062J686443O26753o08776p17426Q3422N12691o8885r59018
$$ -403360 -891030 336032 2022475 2649228 2040452 1323026 1406448 1919139 1850254 891236
50135H91236j186701o90035p1925L22232N24277M64517M9456l85285l60540k9210
$$ 891236 -295465 -985500 -1057425 -735193 -210916 253601 303057 -82228 -442768 -471978
50125d71978l6559m74191o23849n8732N71948L59445n99277j258651q30403M13739
$$ -471978 -508537 -982728 -1606577 -1665309 -1093361 -733916 -1333193 -2591844 -3422247 -3008508
50115c008508J471242J526899O67887j64998j30574N07431O69382q0232q68380
$$ -3008508 -1537266 -10367 657520 492522 361948 869379 1538761 1458529 590149
50106E90149p25458K2324K46565l71535r99739q90831k23823M13665P18987O24981
$$ 590149 -135309 -112985 133580 -237955 -1237694 -2128525 -2352348 -1938683 -1219696 -594715
50096e94715J53013l73661m63653j15336J20928K4459P8025N25889O94018N006
$$ -594715 -441702 -815363 -1279016 -1394352 -1273424 -1248965 -1170940 -645051 48967 53973
50086E3973p89644m17270R57935J672385P91692n59470p85761k5864K33496n47358
$$ 53973 -735671 -1152941 -195006 1477379 2269071 1709601 923840 897976 1131472 584114
50076E84114j220191p72508J46373L00405j97353j37696P34227J136598J74089
$$ 584114 -636077 -1408585 -1262212 -961807 -1159160 -1296856 -562629 573969 748058
50067G48058j155111j252990r4266R60633J196067J139231J090363M48133q85066
$$ 748058 -407053 -1660043 -1754309 -793676 402391 1541622 2631985 3080118 2195052
50058B195052j636915q03559O10882P72761m22911j289537q13300J58456N35744
$$ 2195052 558137 -245422 365460 1138221 715310 -574227 -1387527 -1229071 -693327
50049f93327N23118P66701R52055L59582o81578j037734l93788L42635M12025
$$ -693327 -170209 596492 1548547 1908129 1226551 188817 -204971 137664 549689
50040E49689J32809J10052K22200j6034m89792n47996M1519P27278Q66443M25679
$$ 549689 682498 792550 1014750 998716 508924 -39072 2447 729725 1596168 2021847
50030B021847j50600n02028n89167n29830m02216j88755J49830M87192M53328
$$ 2021847 1871247 1369219 780052 250222 -151994 -340749 -190919 296273 749601
50021G49601k03915j077519j254142l43127Q61948J202336N58393p9064k736L29289
$$ 749601 545686 -531833 -1785975 -2129102 -1267154 -64818 493575 414511 411775 741064
50011G41064J17829n54340q48604l20112N40801R12507M88527k80786o34248k77623
$$ 741064 858893 304553 -544051 -864163 -323362 589145 1077672 796886 162638 -114985
50001a14985K17305P3829n32866n25486M91352J340323P47150p54768j457548
$$ -114985 102320 176149 -356717 -882203 -390851 949472 1696622 941854 -515694
49992e15694q46332j11239j28001k42084L08537R39097P24586L0683r8344K91484
$$ -515694 -1362026 -1473265 -1601266 -1843350 -1534813 -595716 128870 159553 61209 352693
49982C52693K25148m13342o11386N079M01156k22243j009611o25512P30626J522353
$$ 352693 577841 164499 -446887 -441808 -40652 -262895 -1272506 -1898018 -1167392 354961
49972C54961R27706k49451q53072p34864m22690p1865N19784J082704Q99208q8999
$$ 354961 1282667 1033216 180144 -554720 -977410 -1049275 -529491 553213 1452421 1363422
49962A363422q42465m55963N45987Q72510K95734p3653M28471Q99251K45773j001801
$$ 1363422 520957 64994 610981 1483491 1779225 1705572 2134043 3033294 3279067 2277266
49952B277266j292947k29791R18496R69794J64105n43082p12743n19743k56856
$$ 2277266 984319 754528 1673024 2642818 2806923 2263841 1551098 1031355 774499
49943G74499j90981m25387n89354k10763L79505K99449l95600n13736L34387P82527
$$ 774499 583518 158131 -431223 -641986 -262481 36968 -358632 -872368 -537981 244546
49933B44546j68373j186860m53041J275736J521448j57325j464765q31271N27925
$$ 244546 76173 -1110687 -1563728 -287992 1233456 1076131 -388634 -1219905 -691980
49924f91980Q96162M98265L92540M96603K20856j33992j18466k53713r24311j151564
$$ -691980 204182 702447 1094987 1591590 1812446 1678454 1559988 1306275 381964 -769600
49914g69600r9371J120713R61165m2844k56894K20432l5812r38195r36154Q9321
$$ -769600 -868971 251742 1212907 1170063 913169 1133601 1097789 159594 -776560 -687239
49904f87239N10966r5249k00069P74839J261788L11463p27883n86032m3036j27607
$$ -687239 -176273 -271522 -471591 303248 1565036 1876499 1148616 562584 519548 391941
49894C91941l30376j18625k60539r72352p56025R59715K007406O40978j316771
$$ 391941 61565 -57060 -317599 -1289951 -2045976 -1086261 921145 1562123 245352
49885B45352j174398L57571O31423m28171o37104L22275N74579k71359m98595
$$ 245352 -929046 -571475 59948 -368223 -1005327 -683052 -108473 -379832 -878427
49876h78427L41187N96644l16595q62031k80933K29008R0457L53234J134841Q39603
$$ -878427 -537240 59404 -257191 -1119222 -1400155 -1171147 -1080690 -727456 407385 1246988
49866A246988q07494j657514n60262P03959N58052R5496N00115N99719o27251
$$ 1246988 439494 -1218020 -1778282 -1074323 -516271 -420775 79340 679059 51808
49857E1808j475187k52493J351973P41781j200420j454468L16825J557813J074587
$$ 51808 -1423379 -1675872 -323899 417882 -782538 -2237006 -1920181 -362368 712219
49848G12219L56748M63665M48185m17790j154332p50634L05402R60635Q84004
$$ 712219 1068967 1532632 1980817 1563027 408695 -341939 -36537 924098 1808102
49839A808102L56201j62654j87512K11058J50267q10711j611274j061171K55427
$$ 1808102 2164303 2001649 1814137 2025195 2175462 1364751 -246523 -1307694 -1052267
49830a052267Q42983N54759M12645N97332L63912k69010m92371k58698k05053
$$ -1052267 -209284 345475 758120 1355452 1719364 1450354 957983 699285 494232
49821D94232j93094L60480R13418M42938n01083m44624L64668K24604r46972j263279
$$ 494232 301138 661618 1575036 2017974 1516891 1072267 1436935 1661539 714567 -548712
49811e48712j32848O26913q6458p77555L7150J364004J479772N18061l20533q06886
$$ -548712 -681560 -54647 -141105 -918660 -881510 482494 1962266 2480327 2159794 1352908
49801A352908j291834j333111l61420R25361J230258L58921p07742j052127m84522
$$ 1352908 61074 -1272037 -1633457 -708096 522162 881083 173341 -878786 -1363308
49792a363308M91183R15663K60724o59140o00533J67740K18607n11151m01404
$$ -1363308 -872125 43538 304262 -354878 -955411 -787671 -569064 -1080215 -1481619
49783a481619R67778J665670M21156j113810q49948N37977R05712M796n68783
$$ -1481619 -513841 1151829 1572985 459175 -390773 147204 1052916 1057712 488929
49774D88929j26048M31832M07063N8135l46285q10399j021102o39829m5511J71255
$$ 488929 362881 794713 1201776 1259911 913626 103227 -917875 -1557704 -1603215 -1431960
49764a431960J42287K73727L75329J67305L8419L06592M26566n500k69824K49883
$$ -1431960 -1289673 -1015946 -640617 -473312 -434893 -128301 298265 292765 22941 272824
49754B72824P30235K02713o52915n86494J07583K71575J0347K57539P40417L95738
$$ 272824 1003059 1205772 552857 -33637 73946 345521 355868 613407 1353824 1749562
49744A749562m92304o30143m3542K6500m64127k66272O32292O79546m71666j102828
$$ 1749562 1257258 627115 583573 610073 145946 -120326 511966 1191512 719846 -382982
49734c82982k46628O89903L13167n40227m02025M36626O56894M3731n10336m74506
$$ -382982 -629610 60293 373460 -166767 -568792 -132166 524728 568459 58123 -416383
49724d16383n9176L13595J40222q37576j770980j175020Q82437K200880J262054
$$ -416383 -475559 -161964 -21742 -859318 -2630298 -3805318 -2922881 -722001 540053
49715E40053m28091m02263J108731J532949j29841j762620j202006P15407J459710
$$ 540053 111962 -290301 818430 2351379 2221538 458918 -743088 -27681 1432029
49706A432029L22029q74157n34322O00836P94656j45765q06408l44435N17191
$$ 1432029 1754058 879901 345579 946415 1741071 1595306 788898 444463 961654
49697I61654Q65492P62132M84965k35041j318642j706550q14093K06136J0641
$$ 961654 1827146 2589278 3074243 2839202 1520560 -185990 -1000083 -793947 -783306
49688g83306q28967q15711k9530K05943j61954J75860J352845J821208R12346
$$ -783306 -1612273 -2427984 -2457514 -2251571 -2413525 -2237665 -884820 936388 1848734
49679A848734o9676r4299R4402k97048o09151j65204K98004j3742m36704p9356
$$ 1848734 1779058 1684759 1779161 1482113 872962 707758 1005762 992020 555316 475960
49669D75960N21556L81930k11853l51353j01255j26406l91721m52871m03464m19056
$$ 475960 997516 1379446 1167593 816240 714985 588579 196858 -256013 -659477 -1078533
49659a078533r3341O46434Q17599j47992j076902o43749M99175P64623J19957
$$ -1078533 -1171874 -525440 292159 144167 -932735 -1576484 -1077309 -312686 -192729
49650a92729j81558J61453L33462J60426K35197M39437R1113n01592l77298K06533
$$ -192729 -374287 -212834 120628 281054 516251 955688 1046801 545209 167911 374444
49640C74444N2796p36648p29255L19195Q85819K19151m53226j30808L16718j41157
$$ 374444 427240 -309408 -1038663 -719468 166351 385502 -67724 -198532 118186 -22971
49630b2971q57563p10385K9828L78230K86490L30956M43250J82223k06312j17767
$$ -22971 -880534 -1590919 -1561091 -1182861 -896371 -565415 -122165 60058 -146254 -264021
49620b64021L17323L96994p4222n73877n72210M351P61464J007936L78200n15189
$$ -264021 53302 450296 376074 -197803 -770013 -765662 -4198 1003738 1381938 866749
49610H66749o79849j56161M8617l30721l48491L95786Q42608K02184o27716n28712
$$ 866749 186900 30739 79356 -251365 -599856 -204070 638538 840722 213006 -315706
49600c15706L4306K5617k74978M6889O46741L85342o38605j101956m23066O35688
$$ -315706 -281400 -255783 -530761 -483872 162869 548211 -90394 -1192350 -1615416 -979728
49590i79728J250961J196362M06981q18296j382319n45918O57739O44837k73458
$$ -979728 271233 1467595 1874576 1056280 -326039 -871957 -214218 430619 157161
49581A57161l85641N44585R12334Q8672n26529j9699N17868J10434l46401J03757
$$ 157161 -228480 316105 1228439 1317111 790582 770883 1288751 1399185 1052784 1156541
49571A156541N62442j05064j067910q45729J53194L61545l53144p66219n37400
$$ 1156541 1718983 1613919 546009 -299720 -146526 215019 -138125 -904344 -1441744
49562a441744m36095n08557N8093J127910J452088O34325l04441o65687q63243
$$ -1441744 -1877839 -2386396 -2328303 -1200393 251695 886020 581579 -84108 -947351
49553i47351j082268p03945L34009J050418R84513Q58316R48619L35447j160764
$$ -947351 -2029619 -2733564 -2399555 -1349137 -364624 493692 1442311 1777758 616994
49544F16994j819156l54052J733088J954805L06278r45100o39464L9596r4532
$$ 616994 -1202162 -1556214 176874 2131679 2437957 1492857 853393 892989 798457
49535G98457m73149j01082P20851J012091O10569Q6200l33274q36221j247475
$$ 798457 325308 224226 945077 1957168 2567737 2653937 2320663 1484442 236967
49526B36967j015856j09943O46849M75583l40618o99757l5534Q69533Q30370r4280
$$ 236967 -778889 -888832 -241983 233600 -107018 -806775 -842309 27224 857594 763314
49516G63314n98178l2510N29308o8571j055180o97355R19051J665866L96424j293174
$$ 763314 165136 132626 661934 593363 -461817 -1159172 -240121 1425745 1822169 528995
49506E28995j336618n3729O66513K60463j22662J29075K49841j73910l00003L37166
$$ 528995 -807623 -861352 -194839 65624 -57038 72037 321878 147968 -152035 185131
49496A85131O82210j90725j322288j152804J00421Q38580N11208R2237J53109
$$ 185131 867341 676616 -645672 -1798476 -1698055 -859475 -348267 -256030 -102921
49487a02921P9826m09967n09317J67348O44875J59497m41983o8108P53821P60813
$$ -102921 -23095 -433062 -942379 -775031 -130156 29341 -412642 -480750 273071 1033884
49477A033884O8090j14094M29625O49926O3180n92754p69046q39458j016784p62973
$$ 1033884 1101974 987880 1417505 2067431 2130611 1537857 768811 -70647 -1087431 -1850404
49467a850404J32966R23276R87329O74083M73242K31553j54134j69887L57432
$$ -1850404 -1717438 -794162 193167 867250 1340492 1572045 1417911 1248024 1605456
49458A605456N39314l35353j434115j346115r1182Q94181P06815k5740k47781
$$ 1605456 2144770 1809417 375302 -970813 -1061995 -167814 539001 513261 265480
49449B65480J52558M13180k178o81463p19957P5310P12237K18510q77090j110521
$$ 265480 418038 831218 829040 147577 -572380 -497070 215167 433677 -443413 -1553934
49439a553934j83876N74092K45443l36493o3398O85215Q47579M36017K39028L30198
$$ -1553934 -1737810 -1163718 -918275 -1254768 -1318166 -632951 214628 650645 889673 1219871
49429A219871J75482j17249M0493M53753K90338m79454r22719n70475k1585P2570
$$ 1219871 1395353 1278104 1318597 1772350 2062688 1583234 660515 90040 68455 141025
49419A41025j99559m03203k69708K35758P77975P39041P1266l02843K23876P41741
$$ 141025 -58534 -461737 -731445 -495687 282288 1021329 1092595 789752 1013628 1755369
49409A755369O9819j197025j361567k26758N96423J94038m62507l50319J12245
$$ 1755369 1825188 628163 -733404 -960162 -363739 -169701 -632208 -982527 -870282
49400h70282K00454J80698M84139O46147J47376m60815l13789M10068P98951N02746
$$ -870282 -669828 -489130 -4991 641156 788532 327717 13928 423996 1222947 1725693
49390A725693k6592k94531j76953J51399K70176j78661r14257j163828o60530
$$ 1725693 1699101 1404570 1227617 1379016 1649192 1470531 556274 -607554 -1268084
49381a268084M492K80496L07971L71287L58618J65248L6996J12736J60886O9381
$$ -1268084 -1263592 -983096 -675125 -303838 54780 220028 257024 369760 530646 600027
49371F00027J1803q4339m93796q89904m99012N54355J034667L11342o23521n63698
$$ 600027 611830 527491 33695 -856209 -1355221 -800866 233801 545143 -78378 -642076
49361f42076K79100Q12690N62795j07323o94433p91012j55316Q43950J343019
$$ -642076 -362976 449714 1012509 905186 210753 -580259 -735575 108375 1451394
49352A451394J007005L82796q0888n71760j121077j253663r20789p36923p42336
$$ 1451394 2458399 2841195 2760307 2188547 1067470 -186193 -1106982 -1843905 -2586241
49343b586241j33561J077225J494621M21524q18430q36141j78805j4309q7831
$$ -2586241 -2719802 -1642577 -147956 273568 -544862 -1381003 -1559808 -1574117 -1661948
49334a661948L72235Q45627M78800p4319K50922P62997P5714j234537j323900
$$ -1661948 -1289713 -444086 34714 -39605 211317 974314 1050028 -184509 -1508409
49325a508409j57528M59345n5773l33954K77596O37450R3163k68051L84708J172926
$$ -1508409 -1665937 -1206592 -1262365 -1596319 -1318723 -681273 -588110 -856161 -471453 701473
49315G01473J094579N28903J45875k70531q76330r71557k57829K86063p9377n17570
$$ 701473 1796052 2324955 2470830 2200299 1323969 352412 94583 380646 301269 -216301
49305b16301K5334J031729J209149M01635m39145p01208n46141k99878k09077
$$ -216301 -190967 840762 2049911 2451546 2012401 1311193 765052 465174 256097
49296B56097l91807m31017L55320J624163J852197L66666j319783j385919k51809
$$ 256097 -135710 -566727 -211407 1412756 3264953 3631619 2311836 925917 674108
49287F74108J35634p88723j514883p74148P75440J630835J260493L11406l49163
$$ 674108 809742 21019 -1493864 -2268012 -1492572 138263 1398756 1710162 1360999
49278A360999l13242K01056M74639o5512j018593j222250j90541J025981J018120
$$ 1360999 1047757 1248813 1723452 1657940 639347 -582903 -773444 252537 1270657
49269A270657j12429q35885l15108M27346J27694o91089n50254M30545M68585
$$ 1270657 1158228 322343 7235 434581 562275 -128814 -679068 -248523 220062
49260B20062r70544j903991o42603J516631K091623R63631J13262K78580J50652
$$ 220062 -750482 -2654473 -3297076 -1780445 311178 1274809 1388071 1666651 1817303
49251A817303q92237j473770n19695Q94877J166709L64411l30751l99645j33535
$$ 1817303 925066 -548704 -1068399 -173522 993187 1357598 1026847 627202 493667
49242D93667K07642M27904K35238j86976j49445L58017L54510n09704j070051
$$ 493667 701309 1129213 1364451 1177475 1028030 1386047 1740557 1230853 160802
49233A60802m05701N34293L61390n13959n72957L83267J034706O02618k95792
$$ 160802 -244899 289394 650784 136825 -436132 -52865 981841 1584459 1288667
49224A288667q92413j133597j123074p33756l2078O49768J145344J333822Q05652
$$ 1288667 396254 -737343 -1860417 -2594173 -2626251 -1976483 -831139 502683 1308335
49215A308335m87274j469468r38914O59828J577293J040560P7148k49318k54032
$$ 1308335 821061 -648407 -1587321 -927493 649800 1690360 1767508 1518190 1264158
49206A264158o41741j100256q25115J12180Q40176R04488O57727M96280L48595
$$ 1264158 622417 -477839 -1302954 -1190774 -350598 553890 1211617 1707897 2056492
49197B056492M6155k56646k94728j30605j35334n06465r40413r35847m24535Q7663
$$ 2056492 2102647 1846001 1551273 1420668 1285334 778869 -161544 -1097391 -1521926 -1434263
49187a434263J22185k01132l80252j83599J55837L42988L71056M14981N07837
$$ -1434263 -1312078 -1513210 -1893462 -2077061 -1921224 -1578236 -1207180 -792199 -284362
49178b84362M11358j33463r54286j354401p58022N00673J333502J010211p8000
$$ -284362 126996 -6467 -960753 -2315154 -3073176 -2572503 -1239001 -228790 -306790
49169c06790q75171o90487K69480J131856J071967R9248q30779q19617j04698
$$ -306790 -1181961 -1872448 -1602968 -471112 600855 700103 -130676 -950293 -1054991
49160a054991L37360K08857J76147N82558P62873J73376n34672l55826N74531
$$ -1054991 -717631 -508774 -332627 249931 1012804 1186180 651508 295682 870213
49151H70213J105595N41475o12391j319904j023417n5519O83994N74917q0073
$$ 870213 1975808 2517283 1904892 584988 -438429 -493948 190046 764963 684890
49142F84890m90344m26101l30665l85739k21683K57737O12970P25514R66332J136599
$$ 684890 194546 -231555 -562220 -947959 -1169642 -911905 -298935 426579 1392911 2529510
49132B529510M19944r74699j467485m37680M47839l07066j474258r44959P63927
$$ 2529510 2949454 1974755 507270 69590 517429 210363 -1263895 -2208854 -1444927
49123a444927J196892j45677j083594k70465R09476Q42956P9215l7510M43847
$$ -1444927 -248035 -393712 -1477306 -1747771 -838295 4661 83876 46366 490213
49114D90213O76827O31256O84196M79740l76235j110518o79936N04785J076875
$$ 490213 1167040 1798296 2482492 2962232 2585997 1475479 795543 1300328 2377203
49105B377203P09008L03111K53090q9317r11371j207141k84008R24269R88537
$$ 2377203 3086211 3389322 3642412 3553095 2641724 1434583 1150575 2074844 3063381
49096C063381p3551r10406o87238N2836M14602K13803k52904p64254j023467n72779
$$ 3063381 2989830 2079424 1392186 1445022 1859624 2073427 1820523 1056269 32802 -539977
49086e39977M74713J089390N21452m83129n99856J43341M79314m1035m23630n0324
$$ -539977 -65264 1024126 1545578 1062449 462593 605934 1085248 1044213 620583 570259
49076E70259K30815l51061j022025o66415L40759P24070J78578n07519p83088
$$ 570259 801074 450013 -572012 -1238427 -897668 -173598 4980 -502539 -1285627
49067a285627o74022j50651P09364J175507N97047m67855q74962m65189P97K34186
$$ -1285627 -1959649 -2110300 -1400936 -225429 371618 -96237 -971199 -1436388 -1435591 -1201405
49057a201405N85066R52124P52833M9277l93952k91969j26018k14643l93278n42662
$$ -1201405 -616339 335785 1088618 1137895 743943 451974 325956 111313 -281965 -824627
49047h24627n61173p4665Q51170J179183L20720m93777J19639J207026P18969
$$ -824627 -1385800 -1460465 -609295 569888 890608 396831 516470 1723496 2442465
49038B442465j027043j564290j57131J112909Q04652P4978Q8068P129q55565j207006
$$ 2442465 1415422 -148868 -305999 806910 1611562 1686540 1774608 1781737 926172 -280834
49028b80834p0113J049592M85339p40751p01424K10123L32753j24929K78765J162908
$$ -280834 -350947 698645 1183984 443233 -258191 -48068 284685 159756 438521 1601429
49018A601429P50849q32928j437502l31377P27963M53880k11184j55329J03166
$$ 1601429 2352278 1519350 81848 -249529 478434 932314 721130 565801 668967
49009F68967j89785m86611j02746L25583r3243q24036o13584N43257J313058Q56657
$$ 668967 479182 -7429 -110175 215408 122165 -701871 -1315455 -772198 540860 1397517
48999A397517j18443l74134K72532P69533K26882q36169j074429j11146R00809
$$ 1397517 1279074 904940 1177472 1947005 2173887 1337718 263289 152143 1052952
48990A052952P96132k01794j088210j398906j242776o55276K34404Q83134R87262
$$ 1052952 1849084 1647290 559080 -839826 -2082602 -2737878 -2503474 -1620340 -633078
48981f33078R62728J052271O96183k89788q17413q4686Q16782M25832o71239p82892
$$ -633078 329650 1381921 2078104 1788316 970903 886217 1702999 2128831 1457592 674700
48971F74700N2105K64924m17940n97441J79651O63176K41044j17648N2111j79331
$$ 674700 726805 991729 573789 -23652 155999 819175 1060219 942571 994682 815351
48961H15351j012328j031163K90046J186094K99887r65071o44135O78851J008536
$$ 815351 -196977 -1228140 -938094 248000 547887 -417184 -1061319 -382468 626068
48952F26068J13466n70562n28542n36613p43201l71182O08418J199672R78579
$$ 626068 739534 168972 -359570 -896183 -1639384 -2010566 -1402148 -202476 776103
48943G76103N61554L30271N787l67011l27369r4068m25530j077272p89080O18682
$$ 776103 1337657 1667928 1673715 1306704 979335 885267 459737 -617535 -1406615 -787933
48933g87933J490654O13649q51178r45336K77795R35685J20867r08130p39633
$$ -787933 702721 1316370 465192 -480144 -202349 733336 854203 -53927 -793560
48924g93560J79336M58631l9267j67880M69878P86428L07r59739p88236K28010
$$ -793560 -614224 -155593 -194860 -362740 107138 893566 893873 -65866 -854102 -626092
48914f26092P41297L72661r2775l15784p46732j240391q41243N16586J425004
$$ -626092 115205 487866 395091 79307 -667425 -1907816 -2749059 -2232473 -807469
48905h07469Q95332k24412n37328R0647P82490Q92755K75615q49598j596364r14058
$$ -807469 87863 -136549 -673877 -583230 199260 1092015 1367630 518032 -1078332 -1992390
48895a992390Q04334J618392N01459j089966j207994P251J006769J143445Q14459
$$ -1992390 -1188056 430336 931795 -158171 -1366165 -1358914 -352145 791300 1605759
48886A605759J11863r56796j448008m72040J072744J472219P27009L58202P52223
$$ 1605759 1717622 760826 -687182 -1159222 -86478 1385741 2112750 2470952 3223175
48877C223175O24268n59207j495261j102820j39480J19262l51537p35827o55948
$$ 3223175 3847443 3288236 1792975 690155 550675 669937 318400 -417427 -1073375
48868a073375k68684K55509P41770R73113R58313P82438K08013q62674j629053
$$ -1073375 -1342059 -1086550 -344780 628333 1586646 2369084 2577097 1714423 85370
48859H5370j080307M93908J661322J606307P82052j53346r12139j086458l76567
$$ 85370 -994937 -501029 1160293 2766600 3548652 3395306 2483167 1396709 1020142
48850A020142N28028N38401k31979p11387o71258p38401o71457L88882J721109
$$ 1020142 1548170 2086571 1854592 1143205 471947 -266454 -937911 -549029 1172080
48841A172080J376293n74157j529682k37304J188080O78823o43056p66561j48377
$$ 1172080 2548373 1974216 444534 207230 1395310 2074133 1431077 664516 516139
48832E16139k78007o07260K13571J248753N34665j217043j341744M20582J370411
$$ 516139 238132 -369128 -155557 1093196 1627861 410818 -930926 -510344 860067
48823H60067J19030j451460j434495n48480j95057k0397Q68262J782877J382804
$$ 860067 979097 -472363 -1906858 -2455338 -2650395 -2670792 -1802530 -19653 1363151
48814A363151j08160j163838j027995l45827M0825K195j18788m6593J63146K01505
$$ 1363151 1254991 91153 -936842 -1282669 -1241844 -1239649 -1358437 -1405030 -1241884 -1040379
48804a040379l5449j44411K22623O21349K90673o50351j203994p69458K61790
$$ -1040379 -1075828 -1220239 -997616 -376267 -85594 -735945 -1939939 -2709397 -2447607
48795b447607J205583J639739J281695J96557p94565q19050j81989K5389l82972
$$ -2447607 -1242024 397715 1679410 1875967 1081402 262352 80363 105752 -277220
48786b77220m77512J17799N76484L42733O6486L80527P57012M05230m45058r33673
$$ -277220 -754732 -636933 -60449 282284 348770 729297 1486309 1891539 1446481 512808
48776E12808o93134n60O64632P95863K06762m64085l29355L88278N06517k72186
$$ 512808 -180326 -180886 483746 1279609 1486371 1022286 692931 1081209 1587726 1315540
48766A315540q25347m72024p2052l87537o38611N8340R03517N92095m73925p73475
$$ 1315540 490193 18169 -53883 -441420 -1080031 -1021691 -118174 473921 -4 -773479
48756g73479l3656N91985N34126M36559O93574Q06309N13155L09556L98341K05966
$$ -773479 -807135 -215150 318976 755535 1449109 2255418 2768573 3078129 3476470 3682436
48746C682436n05207r57145m56765M77788P77375K29109l72299l30488J31683
$$ 3682436 3177229 2220084 1763319 2241107 3018482 3247591 2875292 2544804 2676487
48737B676487K06433m89904j320948j209111O3439J390115J501378M06656p00530
$$ 2676487 2882920 2393016 1072068 -137043 -73604 1316511 2817889 3224545 2524015
48728B524015q32543j00143O71718P96889K31686m33591n26767o4845K16195j44916
$$ 2524015 1691472 1591329 2263047 3059936 3291622 2858031 2331264 2266419 2482614 2337698
48718B337698o48872n64209p459K70899m2983n57256q19007o52963j0230Q91272
$$ 2337698 1688826 1124617 1117158 1388057 1345074 787818 -31189 -684152 -694382 196890
48708A96890J368674Q85894j11661n83734j95675L11229J56512n43528j004539
$$ 196890 1565564 2451458 2339797 1756063 1560388 1871617 2028129 1484601 480062
48699D80062o14958M54110J221051O96385q83616j939937j259327M62935J491316
$$ 480062 -134896 319214 1540265 2236650 1353034 -586903 -1846230 -1383295 108021
48690A08021J169692K92676l79264p94004p82473Q2067J341841J608008M22818
$$ 108021 1277713 1570389 1191125 397121 -385352 -303285 1038556 2646564 3069382
48681C069382q34362p91360N3051L70379J12601J76320M21466k45560j624945
$$ 3069382 2235020 1443660 1496711 1867090 1979691 2156011 2577477 2331917 706972
48672G06972j787469J97041K399079K296843J91955j243073o64798M24815L30138
$$ 706972 -1080497 -883456 1515623 3812466 4004421 2761348 2096550 2521365 2851503
48663B851503l78144k89547K75116k2848q93844o57908P53427J225743k70244
$$ 2851503 2473359 2183812 2458928 2436080 1542236 884328 1637755 2863498 2593254
48654B593254j799061j258572N21476J281145P49941M36306O99993M08509n53716
$$ 2593254 794193 -464379 57097 1338242 2088183 2524489 3224482 3632991 3079275
48645C079275p89204Q9077N60793k55780j016914l73475P49501O34649n48705
$$ 3079275 2290071 2379148 2939941 2684161 1667247 1293772 2043273 2677922 2129217
48636B129217j186766o99612n872J86742J18715M9854j51938l59997j74874K45752
$$ 2129217 942451 242839 236967 423709 542424 592278 440340 80343 -94531 151221
48626A51221K54600j69370k40216L70717Q78951M93518l94652p06918p1048P57111
$$ 151221 405821 236451 -3765 366952 1245903 1739421 1344769 637851 566803 1323914
48616A323914P86354j56232j214377j272097r6451J260832J476962M45230n95422
$$ 1323914 2110268 1954036 739659 -532438 -628889 631943 2108905 2554135 1958713
48607A958713n71385J97961O21818L09477j54855k55111j69234j93098j61225
$$ 1958713 1387328 1585289 2207107 2516584 2361729 2106618 1937384 1744286 1583061
48598A583061J48735M70188M18270J27766j0364l1963k20201m15596k41094L5839
$$ 1583061 1731796 2201984 2620254 2748020 2737656 2705693 2485492 2069896 1828802 1864641
48588A864641k63122r86061j083711j58270Q44065J038690P77236O72297L86345
$$ 1864641 1601519 615458 -468253 -626523 217542 1256232 2033468 2705765 3092110
48579C092110n32516j361223j073125o5102L44392o6869k60846K47555P57777
$$ 3092110 2559594 1198371 125246 60144 404536 337667 76821 324376 1082153
48570A082153P04712L59680l839m53801o93777k42187M38245L06075m56509m75435
$$ 1082153 1786865 2146545 2142706 1688905 995128 752941 1191186 1497261 1040752 565317
48560E65317N07230R92805J96235n19009J15530J127320R68010P2242o9800N03071
$$ 565317 1072547 2065352 2261587 1742578 1858108 2985428 3953438 4025680 3955880 4458951
48550D458951N26579j21753l34637J09901K28248k63719m77697r7464M0319l96872
$$ 4458951 4985530 4863777 4529140 4639041 4867289 4603570 4125873 4028409 4068728 3671856
48540C671856n32278O8933M30122k38217j121527j050082k87605P7789o9681R6592
$$ 3671856 3139578 3208511 3638633 3400416 2278889 1228807 941202 1018991 949310 1045902
48530A045902P44944R69190J82585q88044j045685r1422R54323J058325L36799
$$ 1045902 1790846 2760036 2942621 2054577 1008892 917470 1871793 2930118 3266917
48521C266917j94688K8619M27458K25970l10542k59829M46983P39949p0343j183750
$$ 3266917 3072229 3100848 3528306 3754276 3443734 3183905 3630888 4370837 4300494 3116744
48511C116744j274882j75003R77436J118919L42024l88371k95312M73162J035108
$$ 3116744 1841862 1666859 2644295 3763214 4105238 3716867 3421555 3894717 4929825
48502D929825P19524j68951o87812l74869K47654M05432R052l83386l33717K7452
$$ 4929825 5649349 5480398 4792586 4417717 4665371 5070803 5079855 4696469 4362752 4390204
48492D390204K43489L1662m18894n74183j07976O20047Q73656M47264m4177k8668
$$ 4390204 4633693 4665355 4246461 3672278 3564302 4184349 5058005 5505269 5461092 5432424
48482E432424K11568N5681l66354k95549L72216O84583j9708r59584q87768P1416
$$ 5432424 5643992 5699673 5333319 5037770 5409986 6094569 6074861 5115277 4227509 4298925
48472D298925N29520j14385p40535j86457R72821J254812M17346l11685p7614
$$ 4298925 4828445 4714060 3973525 3787068 4759889 6014701 6432047 6120362 6042748
48463F042748N84495P99547M83136N362m71927p65736m51525M57982J117986Q45451
$$ 6042748 6627243 7426790 7909926 7915288 7443361 6677625 6226100 6684082 7802068 8647519
48453H647519J43964K1593N53849Q82506N22581r2975m27987n09511n54327m64743
$$ 8647519 8791483 8813076 9366925 10249431 10772012 10679037 10251050 9741539 9187212 8722469
48443H722469m7344N39046Q63476P03147L06490J30832K96585M11284J56678o7702
$$ 8722469 8675125 9214171 10077647 10780794 11087284 11218116 11514701 11925985 12082663 12014961
48433A2014961M07988J355338J618713O80645l85671k47624Q44925J438968R12917
$$ 12014961 12422949 13778287 15397000 16077645 15691974 15444350 16289275 17728243 18641160
48424A8641160J62525J25697N36602O21558L85608N07143J168765J656032J309597
$$ 18641160 18803685 18929382 19465984 20087542 20473150 20980293 22149058 23805090 25114687
48415B5114687M80874J33409N81817J122575J119540R13105J103650J415356J192013
$$ 25114687 25595561 25728970 26310787 27433362 28552902 29466007 30569657 31985013 33177026
48406C3177026P53622J031278J799617J735290P18411M99072K055695L757594
$$ 33177026 33930648 34961926 36761543 38496833 39215244 39714316 41770011 45527605
48398D5527605L672655K539439K559894L992280N060325M971351M848494N468696
$$ 45527605 49200260 51739699 54299593 58291873 63352198 68323549 73172043 78640739
48390G8640739O144132O429467P074444Q426397R504138R675237R872906J1066790
$$ 78640739 84784871 91214338 98288782 106715179 116219317 125894554 135767460 146834250
48382A46834250J2754835J4122319J5556873J7687705J9853580K0976199K1302160
$$ 146834250 159589085 173711404 189268277 206955982 226809562 247785761 269087921
48375B69087921K1822028K2385762K1822781J9672447J6324873J1486447M138635
$$ 269087921 290909949 313295711 335118492 354790939 371115812 382602259 386740894
48368C86740894n367734j4393591k0181245k2468245k3208802k3971963k4383314
$$ 386740894 381373160 366979569 346798324 324330079 301121277 277149314 252766000
48361B52766000k3277057k0711061j8102402j6417509j5101853j3354234j1683884
$$ 252766000 229488943 208777882 190675480 174257971 159156118 145801884 134118000
48354A34118000j1070901j0999723r904022p746191o443460o938108p465211o123079
$$ 134118000 123047099 112047376 102143354 94397163 87953703 81015595 73550384 67427305
48346F7427305l896429l271696m531839n442340m560876k985676k381478k804302
$$ 67427305 63530876 60259180 55727341 50285001 45724125 42738449 40356971 37552669
48338C7552669l200533k940035k101484j040370l28673n04421j351141j946365
$$ 37552669 34352136 31412101 29310617 28270247 27941574 27437153 26086012 24139647
48330B4139647j796083j350417j103291r16154o62873p54441j350456j683517
$$ 24139647 22343564 20993147 19889856 18973702 18310829 17556388 16205932 14522415
48322A4522415r84016K96124R58693N70322j65220m56548k81413j91351o48726
$$ 14522415 13538399 13834523 14793216 15363538 15198318 14741770 14460357 14269006 13620280
48313A3620280j524851k026326j364044J78879J181843O00268q98130j696680
$$ 13620280 12095429 10069103 8705059 8883938 10065781 10666049 9767919 8071239
48305H071239j170652k06698J74931k9096k46832k69813l03579m46396n61709
$$ 8071239 6900587 6693889 6868820 6839724 6592892 6323079 6019500 5573104 5011395
48296E011395n42906m18038k46321o7763Q5753J71983P9356k90617o85909m81198
$$ 5011395 4468489 4050451 3804130 3736367 3822120 3994103 4073459 3782842 3096933 2615735
48286B615735N25724J424807J031471m34058j310383n96939O54004P81706k48477
$$ 2615735 3141459 4566266 5597737 5163679 3853296 3256357 3910361 4692067 4443590
48277D443590j047158r00414m93794m82432m96446k7754N97148P75716N42916
$$ 4443590 3396432 2496018 2002224 1519792 1023346 995592 1592740 2368456 2911372
48268B911372K88684K7725m08973p91314p35294l38663k4816J02796K56422M38620
$$ 2911372 3200056 3227781 2818808 2027494 1292200 953537 928721 1031517 1287939 1726559
48258A726559M01906Q1217l16005n79014n55035j40259M30650N50343k2699o26817
$$ 1726559 2128465 2209682 1893677 1314663 759628 619369 1050019 1600362 1577663 950846
48248I50846m76526K00360M81377J27923j28094K01713O34442N59083J72670M7827
$$ 950846 474320 674680 1156057 1283980 1155886 1357599 1992041 2551124 2723794 2771621
48238B771621J81877Q7275l16271m83562o3775M54996K76831o06514j237060q27812
$$ 2771621 2953498 3040773 2724502 2240940 2177165 2632161 2908992 2302478 1065418 237606
48228B37606J93943O98585K79064l98893o93359p22637p27746m42585L18334J006576
$$ 237606 431549 1130134 1409198 1010305 316946 -405691 -1133437 -1576022 -1257688 -251112
48218b51112R74629M04224k8075q3477K2010J45748J53232k28935q31443q53676
$$ -251112 723517 1127741 1099666 1016189 1038199 1183947 1337179 1108244 276801 -576875
48208e76875m5131N53947N6694p35660n14635L93336O11730M8966j25257L00450
$$ -576875 -622006 -68059 -11365 -747025 -1261660 -868324 -256594 -207628 -332885 -32435
48198c2435L17399j94062j26989O14747O19751m73449r61315J93420J479370J167175
$$ -32435 284964 90902 -36087 578660 1198411 724962 -236353 -42933 1436437 2603612
48188B603612r1401o52901m79868n39054p38535l72102K10532K13291k838L34918
$$ 2603612 2512211 1859310 1379442 840388 101853 -270249 -59717 153574 150736 485654
48178D85654P43057L46601k71802l1459M64571j15399j160043q57432N16217P16867
$$ 485654 1228711 1575312 1303510 1272051 1736622 1621223 461180 -396252 119965 836832
48168H36832o99054j446639k71849R42632L20010r68680p45771P20997J444098
$$ 836832 137778 -1308861 -1580710 -638078 -318068 -1286748 -2032519 -1311522 132576
48159A32576Q73473K41979K54537L10758n5172m85862o55625o55704m60443K6653
$$ 132576 1006049 1248028 1502565 1813323 1758151 1272289 616664 -39040 -499483 -472830
48149d72830M10724K07625k28725j06652M71965N45450j92732q46990o27878Q2764
$$ -472830 -62106 145519 -83206 -189858 282107 827557 634825 -212165 -840043 -757279
48139g57279M46122L35666K24781K87584K22467j04739l29081o4164N07300P39567
$$ -757279 -311157 24509 249290 536874 759341 654602 325521 261357 768657 1508224
48129A508224K45541o10804j071614p96643j59052K59171K48593J032j86071r9486
$$ 1508224 1753765 1142961 71347 -725296 -884348 -625177 -376584 -375552 -561623 -661109
48119f61109K67330O07608N08258o0729o36013p95826o09086l90545k54270j41273
$$ -661109 -393779 213829 722087 661358 25345 -770481 -1379567 -1770112 -2024382 -2165655
48109b165655n1996L8512K84143O60266P71159L84824k4781J66590O83322N41860
$$ -2165655 -2217651 -2179139 -1894996 -1234730 -463571 -78747 -103528 63062 746384 1288244
48099A288244m92797j321024q93210L19036R49107N64898K6540J0494J10402k00000
$$ 1288244 795447 -525577 -1418787 -1099751 -150644 414254 440794 451288 561690 361690
48089C61690n38412k82222K86358L98277Q3607Q0292M88773N07164k30480r33648
$$ 361690 -176722 -458944 -172586 225691 309298 389590 878363 1385527 1155047 221399
48079B21399p53870N9746O23441N17390o6218p82369j214020r29700k5917P22530
$$ 221399 -532471 -472725 150716 668106 601888 -180481 -1394501 -2324201 -2350118 -1627588
48069a627588P52257L99604K29620J43680k06165n36227k83009L58338N50898
$$ -1627588 -875331 -475727 -246107 -102427 -308592 -844819 -1127828 -769490 -218592
48060b18592j0029o69483o54530O5356P84077P06068k30807j041985o70888N17609
$$ -218592 -228621 -898104 -1552634 -1487278 -703201 2867 -227940 -1269925 -1940813 -1423204
48050a423204R74688J29954o70340j97799P46755P23453L0541J5029O17528N47154
$$ -1423204 -448516 -318562 -988902 -1186701 -439946 283507 314048 329077 946605 1493759
48040A493759l14858p29856m26302n06993j113689q66133N23793J213490J02194
$$ 1493759 1178901 449045 22743 -484250 -1597939 -2464072 -1940279 -726789 -624595
48031f24595j171673p50902N64606Q88725L38144L30392P59597L37869o76176
$$ -624595 -1796268 -2547170 -1982564 -1093839 -755695 -425303 334294 672163 -4013
48022d013o25459N46874Q85719l52989j301188m23541J029693J055616k8379l69013
$$ -4013 -629472 -82598 803121 450132 -851056 -1274597 -244904 810712 782333 413320
48012D13320L98819Q37154K02072n36134m81366j17927j58561k73140R7236N06348
$$ 413320 812139 1649293 1851365 1315231 833865 715938 557377 284237 381473 887821
48002H87821K09686l78898j69059P69072J088831J57903r74735j171518p55781
$$ 887821 1097507 718609 549550 1318622 2407453 2565356 1590621 419103 -336678
47993c36678o24747o50424j03244Q14546J098531M92109j95912l73103k84136
$$ -336678 -961425 -1611849 -1715093 -900547 197984 690093 494181 121078 -163058
47984a63058k57544k68430l75695o73793p00668R3798J127643J083401j34943
$$ -163058 -420602 -689032 -1064727 -1738520 -2439188 -2345390 -1217747 -134346 -269289
47975b69289j035843o66335Q8937R0428l01463p1078P22899J168451Q83260K25065
$$ -269289 -1305132 -1971467 -1882530 -1792102 -2093565 -2164643 -1441744 -273293 609967 835032
47965H35032m03145o57820k06087O52598R07128J47978p10212q11506o23831q23960
$$ 835032 431887 -225933 -432020 220578 1127706 1275684 565472 -246034 -869865 -1693825
47955a693825q42693J19585J350849J455224M76512l38339n49197p04096p76433
$$ -1693825 -2536518 -2416933 -1066084 389140 865652 527313 -21884 -725980 -1502413
47946a502413j73727P06707P00169j46606n23810o8756J40077k75725k60709N31126
$$ -1502413 -1676140 -969433 -269264 -415870 -939680 -1008436 -868359 -1144084 -1404793 -873667
47936h73667P87961j44610q11688K083J064615O57797n29695n82053M17351O48766
$$ -873667 -85706 -230316 -1042004 -1039921 24694 682491 152796 -429257 -11906 636860
47926F36860k59586o49199K76227J107100N68552n36184q14852l94216k91032
$$ 636860 377274 -271925 4302 1111402 1679954 1143770 328918 -65298 -356330
47917c56330n95354n82576j24361K05889K06508K14288L09173K45069J10867K05914
$$ -356330 -951684 -1534260 -1658621 -1452732 -1246224 -1031936 -722763 -477694 -366827 -160913
47907a60913K94057j10142o81790n44644K09639M13946k89654o87798L2450P56917
$$ -160913 133144 23002 -658788 -1203432 -993793 -579847 -869501 -1557299 -1524849 -767932
47897g67932K05535p74051m43350Q76157J180104O3491o22693O6354O09605k09585
$$ -767932 -562397 -1336448 -1779798 -903641 276463 339954 -282739 -216385 393220 183635
47887A83635j032757j93520J343395J448354J80236n81897k58061k8647l69582
$$ 183635 -849122 -1042642 300753 1749107 1929343 1347446 1089385 1060738 691156
47878F91156l81295K05804M27995l4211k36382J78360K56440m20650q27168k88886
$$ 691156 309861 515665 943660 909449 673067 851427 1107867 687217 -139951 -428837
47868d28837L40686K38507q1454M326J01521n7372K09627R93810R15920o78384
$$ -428837 -88151 150356 68902 73228 174749 117377 327004 1320814 2236734 1558350
47858A558350j993655j115626R59761J647228M35483q31964r38372m59852k6939
$$ 1558350 -435305 -1550931 -591170 1056058 1491541 659577 -278795 -738647 -765586
47849g65586N13089R05471L40690r29061j413547n03932N78134O43917J24979
$$ -765586 -252497 652974 993664 64603 -1348944 -1852876 -1274742 -630825 -505846
47840e05846J3929K86175K92354m0006k83692l18495l46475l83489k34313J81211
$$ -505846 -491917 -205742 86612 46606 -237086 -555581 -902056 -1285545 -1519858 -1338647
47830a338647O83738Q50759K91741p09080j102961k92702Q38923R89108K72250
$$ -1338647 -654909 195850 487591 -221489 -1324450 -1617152 -778229 210879 483129
47821D83129r7111K03719K73774k62435o22822l59761r8658k52579l18755o7842
$$ 483129 386018 589737 863511 601076 -21746 -381507 -480165 -732744 -1051499 -1119341
47811a119341j07224n47890m71877M14618R72231M82672p6871J92383M76140j36826
$$ -1119341 -1226565 -1774455 -2246332 -1831714 -859483 -376811 -453682 -261299 214841 78015
47801G8015p50961j86134P22717M20411n94378n35374N97148J025361J80400n87739
$$ 78015 -672946 -859080 -136363 284048 -310330 -845704 -248556 776805 957205 369466
47791C69466m93567l37038n77727m43007L27961P04662J88532k34357J34277N09732
$$ 369466 -124101 -461139 -1038866 -1481873 -1153912 -449250 -260718 -495075 -360798 148934
47781A48934J49573l67039l80864k99311m59049j97855P70141J327135N84318
$$ 148934 298507 -68532 -449396 -748707 -1207756 -1405611 -635470 691665 1275983
47772A275983n89000r59651p61656p89754p63568j15832N60579M65420J33112
$$ 1275983 686983 -272668 -1034324 -1824078 -2587646 -2703478 -2142899 -1677479 -1544367
47763a544367L88312O40090L1132n73226J22399J223444P59859q68731j213562
$$ -1544367 -1156055 -515965 -484833 -1058059 -935660 287784 1047643 178912 -1034650
47754a034650K54306J203892K32755r73071n63309O14254P73612P6939j35207
$$ -1034650 -780344 423548 656303 -316768 -880077 -265823 507789 584728 449521
47745D49521K25824K41440j10622o5302L39459L14399k56460p19890q20941q64628
$$ 449521 675345 916785 806163 740861 1080320 1394719 1138259 418369 -402572 -1267200
47735a267200q61134n03027J11601N57184P08116O09230J15908n74239n82800
$$ -1267200 -2128334 -2631361 -2519760 -1962576 -1254460 -645230 -529322 -1103561 -1686361
47726a686361M53541J360598Q13256o09591j095594j64356Q39770Q59821K96850
$$ -1686361 -1232820 127778 941034 331443 -764151 -928507 -88737 771084 1067934
47717A067934j94344o44690r62572n15119O56910J279662M74235q44403j172167
$$ 1067934 873590 228900 -733672 -1248791 -591881 687781 1162016 317613 -854554
47708h54554m17385K84362L05483M3470p2339p7133M1821M48550Q50397N66425
$$ -854554 -1271939 -987577 -682094 -638624 -710963 -788096 -746275 -297725 552672 1119097
47698A119097m23628j103121o14419N17023R30554J32403q77055q71951Q0940
$$ 1119097 695469 -407652 -1022071 -505048 425506 557909 -319146 -1191097 -1110157
47689a110157P88105N00718j98268l06017K27051N51075J85580l88267n45302
$$ -1110157 -322052 178666 -19602 -325619 -98568 452507 638087 249820 -295482
47680b95482l58700k40939j65104J75509O06526N48265r863k38437L84530J096061
$$ -295482 -654182 -895121 -1060225 -884716 -278190 270075 260212 21775 406305 1502366
47670A502366P06919o90409j656394j247172j65483L99891L53173K99229J76964
$$ 1502366 2209285 1518876 -137518 -1384690 -1550173 -1150282 -797109 -497880 -320916
47661c20916m90932j197008p66585O16233J160825K1696j215809p70913O89892
$$ -320916 -811848 -2008856 -2775441 -2159208 -998383 -976687 -2192496 -2963409 -2273517
47652b273517J168662L70725j63619K80569O64529K04977l83085l10028J6500
$$ -2273517 -1104855 -734130 -897749 -617180 47349 252326 -130759 -440787 -424287
47643d24287l6086k27959j91909k60980o10180n01028N21448J437927R94100l62145
$$ -424287 -460373 -688332 -880241 -1141221 -1751401 -2252429 -1730981 -293054 701046 338901
47633C38901j020992m31386L86940M76300K2710k69073j1488P22086J360387J018733
$$ 338901 -682091 -1113477 -726537 -250237 -227527 -496600 -508088 213998 1574385 2593118
47623B593118m77066j865020j674068j46883J033965R34188J90893m07882q44264
$$ 2593118 2116052 251032 -1423036 -1569919 -535954 398234 589127 181245 -663019
47614f63019j017484l73335Q69210J369316N22512m13866j82311N03950K61836
$$ -663019 -1680503 -2053838 -1184628 184688 707200 293334 111023 614973 876809
47605H76809n41862m49056M44987N06207o35436j259625k40495J122655J073908
$$ 876809 334947 -114109 330878 837085 201649 -1057976 -1298471 -175816 898092
47596H98092q3259p78122n87977l76034m66200j94548O47008J179564O80149l53711
$$ 898092 814833 36711 -551266 -927300 -1393500 -1588048 -941040 238524 918673 564962
47586E64962q31722k93813P64756J419509J029930j89497j209832j172705l76802
$$ 564962 -266760 -560573 204183 1623692 2653622 2464125 1254293 81588 -295214
47577b95214J41417K036j48788J87033N19813J86738n01854o10447Q5039P41820
$$ -295214 -153797 -151761 -300549 -113516 406297 593035 91181 -519266 -434227 307593
47567C07593N64370j66956m91936j9419N82347M62886k95965p74954l84637M55071
$$ 307593 871963 705007 213071 193652 775999 1238885 942920 167966 -216671 238400
47557B38400R28785P34046J55695l67687m47776M8858O11002M01383n26552r58190
$$ 238400 1167185 1901231 2056926 1689239 1241463 1290321 1901323 2302706 1776154 817964
47547H17964k21484N59170Q8758q53159m80375R36857J166934m28624j629422
$$ 817964 596480 1155650 1244408 391249 -89126 847731 2014665 1586041 -43381
47538d3381p43636P39665N88285o89729r70155o8058K70957m63530q36306j31269
$$ -43381 -787017 -47352 540933 -148796 -1118951 -1187009 -916052 -1379582 -2215888 -2347157
47528b347157N02068K22036j07863L43195Q28762L97924l96512m30188J80128
$$ -2347157 -1845089 -1623053 -1730916 -1387721 -558959 -161035 -557547 -987735 -807607
47519h07607M20047L2682k63649J589M48222M23985k73387j121099j156538K4171
$$ -807607 -387560 -354878 -618527 -616938 -168716 255269 -18118 -1139217 -2295755 -2271584
47509b271584J428745J549109L24311o87888n14998l6852l06896p90256m88233
$$ -2271584 -842839 706270 1030581 342693 -172305 -209157 -516053 -1306309 -1794542
47500a794542J50300J7806n38270j54299J127195J637340N96253p18594r13004
$$ -1794542 -1644242 -1626436 -2164706 -2319005 -1191810 445530 1041783 323189 -589815
47491e89815k38381L51313P11003J078311J073766L04315n90144o34923J6633
$$ -589815 -828196 -476883 234120 1312431 2386197 2690512 2100368 1465445 1482078
47482A482078L44154K0268l21345l85683p01329j446137j712333o47546J159557
$$ 1482078 1826232 1846500 1525155 1139472 438143 -1007994 -2720327 -3367873 -2208316
47473b208316K148372J519326J3285r97444q34765L9053N80251J51659q08703
$$ -2208316 -59944 1459382 1472667 475223 -359542 -320489 259762 411421 -397282
47464c97282j137545k21649J144350J550811O42409m72940o69232j49299R7165
$$ -397282 -1534827 -1756476 -612126 938685 1581094 1108154 438922 289623 386788
47455C86788k06048l58377J26553P56741P61608J04477n46758o01343l1933O84998
$$ 386788 180740 -177637 -51084 705657 1467265 1571742 1024984 423641 391708 1076706
47445A076706Q63959J13001j110073j655979q46190N97275J255634P00852j3602
$$ 1076706 1940665 2053666 943593 -712386 -1558576 -961301 294333 995185 981583
47436I81583K05907J008916J079344n3884j293811j296706j12115R19212P64299
$$ 981583 1187490 2196406 3275750 3221866 1928055 631349 519234 1438446 2202745
47427B202745k41627r83242q18163l7075O24511O23602p0480r61078j373706j070333
$$ 2202745 1961118 977876 159713 122638 747149 1370751 1300271 339193 -1034513 -2104846
47417b104846m70149o3750K24843P40634J297991J222362L21452o60354q56685
$$ -2104846 -2574995 -2638745 -2413902 -1673268 -375277 847085 1168537 508183 -348502
47408c48502k53272M29665N93062K19414l22853o19866m56019J2020L61732L54172
$$ -348502 -601774 -172109 420953 640367 317514 -302352 -758371 -746351 -384619 -30447
47398c0447J80295J07116P4027q5876k06712J0794M07409M48315K3058k97994
$$ -30447 149848 256964 330991 245115 38403 49197 456606 904921 927979 629985
47388F29985j03945J60125j63500q34557r15751j56124N13650K64042m06924l82185
$$ 629985 526040 686165 522665 -311892 -1227643 -1383767 -870117 -606075 -1012999 -1395184
47378a395184M48338J069629Q30634K29415m1193p0805k54404m42617k49993J46950
$$ -1395184 -946846 122783 953417 1182832 1141639 1070834 816430 373813 123820 270770
47368B70770K27884j8651j14814Q4011J95743q289k73968l48317l38582l97743
$$ 270770 498654 480003 365189 449200 644943 636654 362686 14369 -324213 -721956
47358g21956l91336r9286M16406P86961O61919J04925l52572k82148K2984o7288
$$ -721956 -1113292 -1212578 -796172 -9211 652708 757633 405061 122913 145897 78609
47348G8609m65148m00495K18220M20371j91343m51077N70905J663928J006593
$$ 78609 -386539 -787034 -568814 -148443 -339786 -790863 -219958 1443970 2450563
47339B450563q82289j640059n28369N86420K42369n41530k37382P22985Q55844
$$ 2450563 1568274 -71785 -600154 -13734 228635 -312895 -550277 172708 1028552
47330A028552k5593p62364n80028K24146Q96535P42577m25463j687134j586306
$$ 1028552 1002959 240595 -339433 -115287 781248 1523825 1098362 -588772 -2175078
47321b175078q131J380936J351237P09752O49939P01935j35385j186245r50585
$$ -2175078 -2183209 -802273 548964 1258716 1908655 2610590 2475205 1288960 338375
47312C38375L04282P78086p9908q70314n74539R7958J81217j76959m36072n64588
$$ 338375 642657 1420743 1340835 470521 -104018 -6060 175157 -1802 -437874 -1002462
47302a002462n95210k68554L11417N18796J67730j65137j30750o1962j13307R6598
$$ -1002462 -1597672 -1866226 -1554809 -1036013 -868283 -1033420 -1164170 -1226132 -1339439 -1242841
47292a242841N60618N77488p6611n69330k26325M81545P93342P27031O23945L74651
$$ -1242841 -682223 -104735 -181346 -750676 -977001 -495456 297886 1024917 1648862 2023513
47282B023513j24273l79497j5292L97519P5409p32869j041950n14992J47167J81576
$$ 2023513 1899240 1519743 1504451 1901970 1977379 1244510 202560 -312432 -165265 16311
47272A6311l94658r43105q65295j17605P19955R42763L92470m54339r97087q91279
$$ 16311 -378347 -1321452 -2186747 -2304352 -1584397 -641634 -249164 -703503 -1700590 -2591869
47262b591869j27461Q17546J126623N79741J23895O39502J342404O65846j172940
$$ -2591869 -2719330 -1901784 -775161 -195420 -71525 567977 1910381 2576227 1403287
47253A403287k013103p70247Q62847Q19942m61668j002757k72240M41521L10375
$$ 1403287 -609816 -1380063 -517216 302726 -158942 -1161699 -1433939 -992418 -682043
47244f82043k5648R6472K86023J0580l59906j16653O40682J029780N09492l63842
$$ -682043 -707691 -611219 -325196 -314616 -674522 -791175 -150493 879287 1388779 1024937
47234A024937n10350L30755J121995P55334m67279j227399r71713m24483k21650
$$ 1024937 514587 845342 1967337 2722671 2255392 1027993 56280 -368203 -589853
47225e89853r4170K13032L20984J24451K24462P03187O30756k43029n69540M80653
$$ -589853 -684023 -470991 -150007 -25556 198906 902093 1532849 1289820 720280 1200933
47215A200933J387653L74678j566318j889877l21400Q13390J79398q72139p84340
$$ 1200933 2588586 2963264 1396946 -492931 -814331 -941 178457 -693682 -1478022
47206a478022J0174L46132K05352J98361K95406J56233o2785r7662j20218k40369
$$ -1478022 -1467848 -1121716 -916364 -718003 -422597 -266364 -329149 -426811 -547029 -787398
47196g87398j47183J89914K03649l04636o19541j63659N56790O79800J30861m59420
$$ -787398 -934581 -744667 -541018 -845654 -1465195 -1628854 -1072064 -392264 -261403 -720823
47186g20823m97329K25345J339759J862908J104930k19901p05433k28718m9611
$$ -720823 -1218152 -992807 346952 2209860 3314790 3094889 2389456 2160738 2111127
47177B111127o79515j099487o90769l83368q88052j240441m28906P33582Q52489
$$ 2111127 1431612 332125 -358644 -742012 -1630064 -2870505 -3299411 -2565829 -1713340
47168a713340J28110k18743N4264K77073L11406M65191M82952K7932l18368R3233
$$ -1713340 -1585230 -1803973 -1749709 -1472636 -1161230 -696039 -213087 -185155 -503523 -410290
47158d10290O61363M67056p0111P701L65354O6082m78840j98045M35564M6280
$$ -410290 251073 718129 648018 655719 1021073 1087155 608315 410270 845834 892114
47148H92114j011983r96385J69872O10787l15674r68975l11723M90395L80152
$$ 892114 -119869 -1116254 -946382 -335595 -651269 -1620244 -1931967 -1441572 -1061420
47139a061420J17819M16247M16592m82093j090860l56231P45929Q57999L47054
$$ -1061420 -943601 -527354 -110762 -592855 -1683715 -2039946 -1294017 -436018 -88964
47130h8964J66845M1235n13895p31321Q811O04049p354p38003j13859J002903
$$ -88964 77881 119116 -394779 -1126100 -1117289 -513240 -520594 -1258597 -1372456 -369553
47120c69553Q06618k73103l41464O44790R80348L01796r6388K5798m87720j579809
$$ -369553 437065 163962 -177502 467288 1447636 1749432 1653044 1678842 1191122 -388687
47110c88687j652843l73495O42003N80244M88576Q62382O34630m23122p12453
$$ -388687 -2041530 -2415025 -1773022 -1192778 -704202 158180 792810 369688 -342765
47101c42765M50099J324493N21300p20236p09718M2196J41261l05223m40147l75372
$$ -342765 107334 1431827 1953127 1232891 523173 565369 706630 401407 -38740 -414112
47091d14112l85581J94605J419483J568200l22547k136924j367526R50903J694106
$$ -414112 -799693 -605088 814395 2382595 2060048 -76876 -1444402 -493499 1200607
47082A200607L15830q05808m22836J13042k61897o76838l20927J84645K80359
$$ 1200607 1516437 710629 287793 400835 138938 -537900 -858827 -674182 -393823
47073c93823M03950O29369K08166p01886o77700O04583J375712L43312j248998
$$ -393823 10127 639496 847662 145776 -531924 72659 1448371 1791683 542685
47064E42685j446865k40009R04307J143238O67702j24620p40366o24494j5198
$$ 542685 -904180 -1144189 -239882 903356 1571058 1446438 706072 81578 66380
47055F6380N6069n81937o78908L80654J231406N68133o67317q00883j33524j89565
$$ 66380 122449 -459488 -1138396 -757742 473664 1041797 374480 -426403 -559927 -749492
47045g49492r28000q63128K14482P78434J01386o64267m98122N9015K22884K79615
$$ -749492 -1677492 -2540620 -2326138 -1547704 -1446318 -2110585 -2608707 -2549692 -2326808 -2047193
47035b047193O95987J054744P89530J33377m16272q02056r47169m49749N61060
$$ -2047193 -1351206 -296462 493068 626445 210173 -591883 -1539052 -1988801 -1427741
47026a427741J103014O47577l8643j42532l5148l09973m81708J02551P68399M29603
$$ -1427741 -324727 322850 284207 141675 106527 -203446 -685154 -582603 185796 615399
47016F15399m35912l78750N75431Q45645o9669o92715m7387O61048R4851q79349
$$ 615399 179487 -199263 376168 1221813 1152144 459429 412042 1073090 1167941 288592
47006B88592n82345O43136R22201j29639q40707k16821N83540L08554l74970j62828
$$ 288592 -293753 349383 1271584 1141945 301238 84417 667957 976511 601541 438713
46996D38713O50856P00888j92204p68237l00945M62387O15950K90242N7109k6220
$$ 438713 1089569 1790457 1598253 830016 529071 991458 1607408 1897650 1954759 1928539
46986A928539j79185k92382j76639l8294j71597m65876o69452q26277r72146p53766
$$ 1928539 1749354 1456972 1280333 1242039 1070442 604566 -64886 -891163 -1863309 -2617075
46976b617075J5982O89378M51530m03102o90030Q578P23907N43749n6952j9847
$$ -2617075 -2601093 -1911715 -1460185 -1863287 -2553317 -2544739 -1820832 -1277083 -1334035 -1353882
46966a353882O35344Q29523L6282r38526j063580l89217K05429K47454J01573
$$ -1353882 -718538 110985 147267 -791259 -1854839 -2244056 -2038627 -1791173 -1689600
46957a689600J93197L44122J98320m7348P3879L14642k35171j655246k416168
$$ -1689600 -1496403 -1152281 -953961 -1001309 -927430 -612788 -847959 -2503205 -4919373
46948d919373j072106J483859K667883J422207l94186n79859N15818R08052N1171
$$ -4919373 -5991479 -4507620 -1839737 -417530 -811716 -1391575 -875757 32295 83466
46939H3466o38296k16788M88142M64659O550j57417j43786l89414o07823k28945
$$ 83466 -554830 -771618 -283476 181183 187733 30316 -113470 -502884 -1110707 -1339652
46929a339652N73860J085982R53966L29553m56309q96784n87041O210j69245j086967
$$ -1339652 -765792 320190 1274156 1603709 1147400 250616 -336425 -330215 -499460 -1586427
46919a586427j250746J25655J612143J516094L62827j91316q3801m75566j172355
$$ -1586427 -2837173 -2711518 -1099375 416719 779546 588230 504429 28863 -1143492
46910a143492p63847O17356J066358j1696q35428j82774O95422L71833l92901
$$ -1143492 -1907339 -1289983 -223625 -235321 -1070749 -1253523 -558101 -186268 -579169
46901e79169j85278N96265N48087m37349j256949j274515o03812N33264J506041
$$ -579169 -764447 -168182 379905 -57444 -1314393 -2588908 -3192720 -2659456 -1153415
46892a153415J198292m27655j538589o56012J111155J608215O69622j09699m9982
$$ -1153415 44877 -382778 -1921367 -2577379 -1466224 141991 811613 701914 651932
46883F51932N4075k34415m51953m69573n82532m12917N87086J565523J029776
$$ 651932 706007 471592 19639 -449934 -1032466 -1445383 -858297 707226 1737002
46874A737002o70022j495591p27445Q0892k24829o74330j32197O94194N52976
$$ 1737002 1066980 -428611 -1156056 -1075164 -1299993 -1974323 -2106520 -1412326 -859350
46865h59350k85170o76930m66941l24038k62597L44230J415126J901100J068009
$$ -859350 -1144520 -1821450 -2288391 -2612429 -2875026 -2530796 -1115670 785430 1853439
46856A853439n48568j654658j448447l41539N23006N23327J46648J24606L90714
$$ 1853439 1304871 -349787 -1798234 -2139773 -1616767 -1093440 -946792 -822186 -431472
46847d31472M14862J56488o0505k62486n52318m97752J78846O83678J74344o28995
$$ -431472 -16610 139878 79373 -183113 -735431 -1233183 -1054337 -370659 -196315 -825310
46837h25310l59260O47651O78627n55051j329634o13484M83056P44212N95255
$$ -825310 -1184570 -536919 141708 -413343 -1742977 -2356461 -1873405 -1129193 -533938
46828e33938P74044Q33830K49280k75778J8670M57624m8644j211148j765868j135128
$$ -533938 240106 1073936 1323216 1047438 1066108 1523732 1475088 263940 -1501928 -2637056
46818b637056K06847J437579J741598P25645p90057j219117j84233Q23904M87064
$$ -2637056 -2430209 -992630 748968 1474613 684556 -534561 -718794 105110 592174
46809E92174o08514j084286o24543J57159P65977Q82972K99011m39473l20500
$$ 592174 -16340 -1100626 -1725169 -1568010 -802033 80939 379950 -59523 -380023
46800c80023N34987P89929O2883l64583J43847L95124l15564o86899J80208Q63918
$$ -380023 154964 944893 1007776 643193 787040 1182164 866600 179701 359909 1223827
46790A223827J35944n70528K99794J234375M7319j944078j638217P11464J748585
$$ 1223827 1359771 789243 1089037 2323412 2370731 426653 -1211564 -500100 1248485
46781A248485L29447j027977n68219K10735l43576j307224j078790J18740J042994
$$ 1248485 1577932 549955 -18264 192471 -151105 -1458329 -2537119 -2418379 -1375385
46772a375385J134759M30608p18678j198005o5809J545656J368790o09499j826594
$$ -1375385 -240626 189982 -528696 -1726701 -1792510 -246854 1121936 512437 -1314157
46763a314157r46243L40491L87894P4843O59760J333815Q49212j51485m30946
$$ -1314157 -2260400 -1919909 -1532015 -1457172 -797412 536403 1385615 1234130 803184
46754H03184l31507o65888p54130K76736J283667N20931j330884j820905k67977
$$ 803184 471677 -194211 -948341 -671605 612062 1132993 -197891 -2018796 -2286773
46745b286773J392611J474585M94943j64857j32606O4948P3183L5892K13008N51952
$$ -2286773 -894162 580423 1075366 910509 777903 842851 916034 951926 1164934 1716886
46735A716886N73267j00402r68756r63226Q8279R55186N59967n55050j039927
$$ 1716886 2290153 2189751 1220995 257769 346048 1301234 1861201 1306151 266224
46726B66224n33868J27316J84537k75111o65933n26424O8291M83062K04331l86916
$$ 266224 -267644 -140328 44209 -230902 -896835 -1423259 -1354968 -871906 -667575 -1054491
46716a054491m47181J08284N57334N55574M08067J25324n54248j046450l51541
$$ -1054491 -1501672 -1393388 -836054 -280480 127587 252911 -301337 -1347787 -1699328
46707a699328R86473J075777m29109j457839o32893O37574O65920K14033O98403
$$ -1699328 -712855 362922 -66187 -1524026 -2156919 -1519345 -853425 -639392 59011
46698E9011J281318K84667j527637j801904l18941P21316J65544p03384n72268
$$ 59011 1340329 1624996 97359 -1704545 -2023486 -1302170 -1136626 -1840010 -2412278
46689b412278J92268P55087R64432P67471J4209p20335n57387J29156P4712o81022
$$ -2412278 -2220010 -1464923 -500491 266980 281189 -439146 -996533 -867377 -792665 -1473687
46679a473687o38857O38596J573458R28167m12028r43429n28353P2773N02789
$$ -1473687 -2112544 -1473948 99510 1027677 615649 -327780 -856133 -783360 -280571
46670b80571O85019L93925j59941k16703K94872L85793l56986q72731l24141M28154
$$ -280571 404448 798373 638432 421729 716601 1102394 745408 -127323 -451464 -23310
46660b3310K62469k85842j2281P69113O68241m61851j255920r34055k24308Q9138
$$ -23310 239159 -46683 -58964 710149 1378390 916539 -339381 -1273436 -1497744 -1408606
46650a408606K22969M67518L46297m64349j159869p33069M88765J162572P27515
$$ -1408606 -1185637 -718119 -371822 -836171 -1996040 -2729109 -2240344 -1077772 -350257
46641c50257L1520m4500K02127J3731m66424m01424L40969R06162P29384K42626
$$ -350257 -318737 -363237 -161110 -147379 -613803 -1015227 -674258 231904 961288 1203914
46631A203914o1189m15949r97808j138497k71920Q52923R81786J23940n36949
$$ 1203914 1142725 726776 -271032 -1409529 -1681449 -828526 153260 277200 -259749
46622b59749l74512Q6363K72795J77674j99831r03245j321152o17313P87482J346523
$$ -259749 -634261 -547898 -275103 -97429 -297260 -1200505 -2521657 -3138970 -2351488 -1004965
46612a004965N16249m28110l95303p3543m93349j077760n44165Q78852J646392
$$ -1004965 -488716 -916826 -1312129 -1385672 -1879021 -2956781 -3500946 -2622094 -975702
46603i75702J135666L32097J69707L79159L34346O9045p2812j15631k31518k82068
$$ -975702 159964 492061 661768 1040927 1375273 1444318 1371506 1255875 1024357 742289
46593G42289p4582J97202J90941o8222k71671l39382m91075p59476p50806j29625
$$ 742289 667707 864909 1055850 987628 715957 376575 -114500 -873976 -1624782 -1754407
46583a754407P85079J205202P26189k17847q61957q62292l97567J94777N85685
$$ -1754407 -969328 235874 962063 744216 -117741 -980033 -1377600 -1182823 -597138
46574e97138N05815N1175k07029J32340O39460N23311k82553j021866j116773
$$ -597138 -91323 -40148 -247177 -114837 524623 1047934 765381 -256485 -1373258
46565a373258p36301l01719L2339K61626L76695M68879O00457N61064K10722m3405
$$ -1373258 -2109559 -2411278 -2378939 -2117313 -1740618 -1271739 -671282 -110218 100504 57099
46555E7099K34680O08788K38480p19760j155060o30463P4352L57218N85874R93330
$$ 57099 291779 900567 1139047 419287 -735773 -1366236 -1291884 -934666 -348792 644538
46545F44538R84903L07584k24270q3542N993m76443o21235K72665R47534o7009
$$ 644538 1629441 1937025 1712755 1629213 1635206 1158763 537528 810193 1757727 1690718
46535A690718j727340j659290K00181J391493N93157o69260o55633J87017N02270
$$ 1690718 -36622 -1695912 -1495731 -104238 488919 -180341 -835974 -648957 -146687
46526a46687J30583k71779n12112n86304j26414P74172J114104M45379j70425
$$ -146687 -16104 -287883 -799995 -1386299 -1512713 -738541 375563 820942 650517
46517F50517J58123N27981k23419j243993p85639Q58977J554635N18961o12000
$$ 650517 808640 1336621 1113202 -130791 -916430 -57453 1497182 2016143 1404143
46508A404143m06058M05232M45677k24213o29392m97147k58046r6669J7043j51157
$$ 1404143 998085 1403317 1848994 1624781 995389 498242 240196 143527 160570 9413
46498I413o52371q29469r1318J070089J588075J113364J68678o59942j027972
$$ 9413 -642958 -1472427 -1563745 -493656 1094419 2207783 2376461 1716519 688547
46489F88547p19718K141L01993j54015m61989J83518R09549L26459r84844r32206
$$ 688547 -31171 -29030 272963 118948 -343041 -159523 750026 1076485 91641 -840565
46479h40565Q46944K063737R85056j072994j768184r27247j11654L0377J19917
$$ -840565 6379 2070116 3055172 1982178 213994 -713253 -824907 -794530 -674613
46470f74613K81684m4981o02414m40291K48299J49570q82987j283831k60600Q14905
$$ -674613 -392929 -437910 -1040324 -1480615 -1232316 -1082746 -1965733 -3249564 -3510164 -2695259
46460b695259N96865r7658K18950J182521J233069J48551p81561q53905o06184
$$ -2695259 -2098394 -2196052 -1977102 -794581 438488 587039 -194522 -1048427 -1654611
46451a654611l76329K15705J025939J065472N0621q76670p35351r4540m0162m83055
$$ -1654611 -2030940 -1815235 -789296 276176 326797 -549873 -1285224 -1379764 -1419926 -1902981
46441a902981m68509K38470Q45521P39164K25759n8371N4406K45249J81280j49464
$$ -1902981 -2371490 -2133020 -1287499 -548335 -322576 -380947 -326541 -81292 99988 -49476
46431d9476m35862l38285J19357M93581L69658j73953o36321n86311l4957O17045
$$ -49476 -485338 -823623 -704266 -210685 158973 -14980 -651301 -1237612 -1272569 -655524
46421f55524R48746Q55886N17224P7396m34725q34078p93519l68010r9288k05488
$$ -655524 293222 1149108 1666332 1743728 1309003 474925 -318594 -686604 -785892 -991380
46411i91380j33850M71494Q71572K57075p12393o79160K07325M05527m06370n67633
$$ -991380 -1125230 -653736 217836 474911 -237482 -916642 -709317 -303790 -710160 -1277793
46401a277793Q45299K175897J506515m15780j311918o26420J95094K35121L308
$$ -1277793 -432494 1743403 3249918 2834138 1522220 895800 1090894 1326015 1329323
46392A329323j17853m68256q84482n53469M47131R36860M60803o4413l8511m9714
$$ 1329323 1211470 743214 -141268 -694737 -247606 689254 1150057 1085644 1047133 997419
46382I97419m18661l98816K72272N02915l23662j008526l98471O09821N24761
$$ 997419 578758 179942 452214 955129 631467 -377059 -775530 -165709 359052
46373C59052k50916j93360P06658R89661J96696n31211m56345k17635m16624o07711
$$ 359052 108136 -85224 621434 1611095 1807791 1276580 820235 602600 185976 -421735
46363d21735k58547L21995N71694M57677K80780K58984M80152P56759N74097k28762
$$ -421735 -680282 -358287 213407 671084 951864 1210848 1691000 2447759 3021856 2793094
46353B793094r35014q36489l39812k84620n15812k78501K58738K44164k17030
$$ 2793094 1858080 1021591 681779 397159 -118653 -397154 -138416 105748 -111282
46344a11282j54489M78333O56676J31621j70223P9533J07730k32641k7190P31552
$$ -111282 -265771 212562 869238 1000859 830636 910169 1017899 785258 758068 1489620
46334A489620O47612o11613j278916k71113Q48935M28828m53933J04177J437137
$$ 1489620 2137232 1525619 246703 -24410 824525 1253353 799420 903597 2340734
46325B340734J314732m14140j699725j527878q94614n23229Q6356R44948J020935
$$ 2340734 3655466 3241326 1541601 13723 -880891 -1404120 -1317764 -372816 648119
46316F48119R3685n91927k70857K62143K27694M5949J51118M3595n06797o02368
$$ 648119 741804 149877 -120980 141163 368857 414806 565924 609519 102722 -499646
46306d99646K87064J048719M54967q08925j034072l01P52314J73363r01833r67296
$$ -499646 -212582 836137 1291104 482179 -551893 -552194 200120 373483 -528350 -1495646
46296a495646K37858J504235J599110N72739m73068p55978n91532o31229p86030
$$ -1495646 -1257788 246447 1845557 2418296 1945228 1189250 597718 -33511 -819541
46287h19541m97775J72705N09408K08478k41120l49113j19836L33670R15457J126380
$$ -819541 -1317316 -1144611 -635203 -426725 -667845 -1016958 -1136794 -803124 112333 1238713
46277A238713L66735r87406j606487q17918M44767Q38368K14401n22108o88339
$$ 1238713 1605448 618042 -988445 -1806363 -1361596 -523228 -308827 -830935 -1519274
46268a519274l37378K21019Q04883J266848J368947Q89295r0030r76112j068647
$$ -1519274 -1856652 -1635633 -830750 436098 1805045 2694340 2604310 1628198 559551
46259E59551m76291k05406p79263j281356o62909M95717Q07996L40399M03372
$$ 559551 83260 -122146 -901409 -2182765 -2845674 -2349957 -1541961 -1201562 -798190
46250g98190J073814Q74640n22431j281678k13265J194640J078216J6899k77299
$$ -798190 275624 1150264 627833 -653845 -867110 327530 1405746 1422645 1145346
46241A145346J33670n4331p42078o11951L13071N40967k90752p55362o7159O86079
$$ 1145346 1279016 1224685 482607 -129344 183727 724694 433942 -321420 -388579 297500
46231B97500M91212k3655P0615M11720J72094m85654q02454n73763o4137N86745
$$ 297500 788712 765057 835672 1247392 1419486 933832 131378 -442385 -506522 80223
46221H0223J116933R54311N8676o46439m66282K1779o6063n11592n27895j98790
$$ 80223 1197156 2151467 2210143 1563704 1097422 1119201 1053138 541546 13651 -185139
46211a85139k38391n86680m62400J94909N21130J68389j64902j5431J08164j61568
$$ -185139 -423530 -1010210 -1472610 -1277701 -756571 -588182 -753084 -768515 -660351 -821919
46201h21919k37038K77421N33859k92762j313808r44250N90673J326425M04438
$$ -821919 -1058957 -781536 -247677 -540439 -1854247 -2798497 -2207824 -881399 -476961
46192d76961o93547m81783L91316N60575L20803Q41341J645944R80738j141738
$$ -476961 -1170508 -1652291 -1260975 -700400 -379597 461744 2107688 3088426 1946688
46183A946688k293124q96363J448238K132369Q61452n95034j112459j052999q19841
$$ 1946688 -346436 -1242799 205439 2337808 3199260 2604226 1491767 438768 -381073
46174c81073k61033L77337L65218k41680m28050J99451P09048L24618l32962k55804
$$ -381073 -642106 -264769 100449 -141231 -569281 -369830 339218 663836 330874 75070
46164G5070M32940Q23531N73725Q2174l42332o79856p86778n30699k04798j47496
$$ 75070 508010 1331541 1905266 1987440 1645108 965252 178474 -352225 -557023 -704519
46154g04519j12907K86444O96967M27596l35463o61728l08178o200q0082Q9586
$$ -704519 -817426 -530982 165985 593581 258118 -403610 -711788 -717988 -798070 -708484
46144g08484P04473Q34855k7834p61088k01777Q76530Q95214K4822j79589M74414
$$ -708484 -4011 830844 803010 41922 -159855 716675 1611889 1636711 1457122 1931536
46134A931536M29492q86983j893391j296007p318N21575L86525K97540m6923r82364
$$ 1931536 2361028 1474045 -419346 -1715353 -1722671 -1201096 -814571 -517031 -563954 -1546318
46124a546318j421294l12314J228751J267282J3144o24247q6589M40253N44001
$$ -1546318 -2967612 -3279926 -2051175 -783893 -770749 -1394996 -1481585 -1041332 -497331
46115d97331J057000J739939J040310j031968k172541j120506L95608M54116k83549
$$ -497331 559669 2299608 3339918 2307950 135409 -985097 -589489 -135373 -418922
46106d18922k50378L37378L93913J45729L86868O67595J94966m17875k38229Q4644
$$ -418922 -669300 -331922 61991 207720 594588 1262183 1457149 1039274 801045 885689
46096H85689m63544j056175l16782R23199O96650o83302r78799K27055R04690
$$ 885689 422145 -634030 -950812 -27613 669037 -14265 -993064 -766009 138681
46087A38681J02638o15438r3534N83226L64515P5402N29380P82024q3209j088874
$$ 138681 241319 -374119 -467653 115573 480088 555490 1084870 1866894 1783685 694811
46077F94811j014561m97421o82792j004714k82718Q78416Q71189k12622o71608
$$ 694811 -319750 -817171 -1499963 -2504677 -2787395 -1908979 -1037790 -1250412 -1922020
46068a922020J19544R43804Q39432L40395J94337K00543n5226l28635k50281k4290
$$ -1922020 -1802476 -858672 -19240 321155 515492 716035 660809 332174 81893 57603
46058E7603J4610L8111L46693O73464M36247l55282r00648n43657L13037O18784
$$ 57603 72213 110324 457017 1130481 1566728 1211446 310798 -232859 80178 698962
46048F98962L8318n95864n22878j73763l32167o56643j80265Q56907J044933k9553
$$ 698962 737280 141416 -381462 -555225 -887392 -1544035 -1724300 -867393 177540 147987
46038A47987r96844p12474J61134M26395J28247L4992K22489K89639L14418N14311
$$ 147987 -848857 -1561331 -1400197 -973802 -845555 -810563 -588074 -298435 15983 530294
46028E30294N08119o6186p13313q14720o34919o39736m82582K32885Q65668O65239
$$ 530294 1038413 972227 258914 -555806 -1190725 -1830461 -2313043 -2080158 -1214490 -549251
46018e49251J46655J72689L06418l25632j077344n73473P96007J192962K41220
$$ -549251 -402596 -229907 76511 -249121 -1326465 -1899938 -1103931 89031 330251
46009C30251l99090K12502R03650M90147m44979q15034o52336m93411l18823j1093
$$ 330251 -68839 143663 1047313 1537460 1092481 277447 -374889 -868300 -1187123 -1198216
45999a198216J27386L8606J16997K45844j92400q79173o05056O16773J166092
$$ -1198216 -1070830 -1032224 -915227 -669383 -861783 -1740956 -2346012 -1729239 -563147
45990e63147M33615l9278O86922J031025m02759j962376j227771J068344K068069
$$ -563147 -129532 -168810 518112 1549137 1146378 -815998 -2043769 -975425 1092644
45981A092644J039508j14098l13936m95893j103638j062646k6310O52759K19884
$$ 1092644 2132152 2018054 1704118 1208225 104587 -958059 -984369 -331610 -111726
45972a11726j79851L65490Q66142K37927o88956m83935N77390R75869J11550j167259
$$ -111726 -291577 73913 940055 1177982 489026 5091 582481 1558350 1669900 502641
45962E02641j778296j299875r5384Q31890O69890m6780R1456J267358J889923
$$ 502641 -1275655 -2575530 -2670914 -1839024 -1169134 -1215914 -1124458 142900 2032823
45953B032823Q97708n55164q09608q4340J85834l51201p67336n45224j34656J2329
$$ 2032823 2930531 2375367 1565759 1481419 1667253 1316052 548716 3492 -131164 -118835
45943a18835j08495m10050o67625m31672K36983M90784K8579o0856J027702K100868
$$ -118835 -227330 -637380 -1305005 -1736677 -1499694 -1008910 -980331 -1041187 -13485 2087383
45933B087383J497482k52473j127463o77470l85772q93890r53486K49853J556280
$$ 2087383 3584865 3332392 2204929 1527459 1141687 247797 -705689 -455836 1100444
45924A100444J548511M26454p13124j297742j202440l97828N16666M90323m71953
$$ 1100444 2648955 3075409 2362285 1064543 -137897 -535725 -19059 471264 -689
45915f89j004051l49545M53068K40202n14277o68144j80455K48019M99960Q16586
$$ -689 -1004740 -1354285 -901217 -661015 -1175292 -1843436 -2023891 -1775872 -1275912 -459326
45905d59326R05627M46448m8302L0941L02117Q7268l50089l57672j27938j89583
$$ -459326 446301 892749 844447 875388 1177505 1264773 914684 557012 429074 239491
45895B39491j93506M58163J168402P88463m51794j087243n36692K39685L57187
$$ 239491 45985 504148 1672550 2461013 2009219 921976 385284 624969 982156
45886I82156N3865j43834k14222k65606k44304k52884m12003l82387J42560N72093
$$ 982156 1036021 892187 677965 412359 168055 -84829 -496832 -879219 -736659 -164566
45876a64566P8220r39621j222700n28692J17456J84200K73892O89714P93506L46476
$$ -164566 -86346 -1025967 -2248667 -2777359 -2659903 -2475703 -2201811 -1512097 -718591 -372115
45866c72115J25054M83545N94523l0568n07083q4019M54539Q9842o96869q04750
$$ -372115 -247061 236484 831007 800439 293356 209337 663876 753718 56849 -747901
45856g47901l45335j83597k31444K85117J141236J216639L40552l22587l9124
$$ -747901 -1093236 -1276833 -1508277 -1223160 -81924 1134715 1475267 1152680 1113556
45847A113556M64986K16381o06420j045976o46340J00437L82416p1033o72573
$$ 1113556 1578542 1794923 1188503 142527 -503813 -403376 -20960 -91993 -764566
45838g64566n86050K27446Q52936N63545k78898q59600r63258p99308k71152P24089
$$ -764566 -1350616 -1123170 -270234 293311 14413 -845187 -1808445 -2607753 -2878905 -2154816
45828b154816J565029J433302N10993k05143k68499j32316j57229j81690j63549
$$ -2154816 -589787 843515 1354508 1149365 880866 748550 591321 409631 246082
45819B46082l09970l89492J18532R03865Q74577j91482j025170n87435M34936
$$ 246082 -63888 -453380 -334848 569017 1443594 1252112 226942 -360493 74443
45810G4443P00321J05948l45885j29736L25511N15027L38763j71365p99423r05538
$$ 74443 774764 880712 534827 405091 730602 1245629 1584392 1413027 613604 -291934
45800b91934o0460J057098J207536J86819q65858r87524n08892k95601m97866
$$ -291934 -352394 704704 1912240 2099059 1233201 245677 -263215 -558816 -1056682
45791a056682n65175j18314O56985J258732J209751M15595n69110r56206o57533
$$ -1056682 -1621857 -1740171 -1083186 175546 1385297 1800892 1231782 275576 -381957
45782c81957m06665o45397p98225j76560Q52272J321978J016334N60357K81070
$$ -381957 -788622 -1434019 -2232244 -2408804 -1556532 -234554 781780 1342137 1623207
45773A623207j41967p67239r85714m08779M57529Q41976N63890m6368n97770o96111
$$ 1623207 1481240 714001 -271713 -680492 -222963 619013 1182903 1136535 538765 -157346
45763a57346r6061P81647R98417K54510n84889o48574k15165m5569j12382Q4906
$$ -157346 -253407 528240 1526657 1781167 1196278 547704 332539 286970 174588 259494
45753B59494L48984P3660m43606k47323N41490N40626p71938j914561j319153
$$ 259494 608478 682138 238532 -8791 532699 1073325 301387 -1613174 -2932327
45744b932327M30974J392708Q32307j35987l37899J31394N41742N62153K48548
$$ -2932327 -2501353 -1108645 -276338 -412325 -750224 -618830 -77088 485065 733613
45735G33613l23549r00262r61448l10290M86239O88025K74454j31478j23248R9346
$$ 733613 410064 -490198 -1451646 -1761936 -1275697 -587672 -313218 -444696 -567944 -468598
45725d68598J73517J4193k58610m84597m36261L3550O32193P49945K18093l57196
$$ -468598 -295081 -280888 -539498 -1024095 -1460356 -1426806 -794613 -44668 173425 -183771
45715a83771l68319k0782R1439m3037L8936L20707K65407j62011k90624Q8404
$$ -183771 -552090 -572872 -481433 -524470 -485534 -164827 100580 -61431 -352055 -263651
45705b63651J99581m58616j087344o85328L73766Q89447O42974N10822Q07721
$$ -263651 -64070 -522686 -1610030 -2295358 -1921592 -1032145 -389171 121651 929372
45696I29372P35140j58684j041059r87042l30112k1648j65559q6063L75294N57231
$$ 929372 1664512 1505828 464769 -522273 -852385 -874033 -1039592 -1125655 -750361 -193130
45686a93130J03739l84490k39808K55674L37988Q25M0813P32830J168324M53416
$$ -193130 -89391 -473881 -713689 -458015 -120027 -119202 -78389 654441 1822765 2276181
45676B276181q98854j543202j083665m14944k43786k34041M3916K80380J71488
$$ 2276181 1377327 -165875 -1249540 -1664484 -1908270 -2142311 -2098395 -1818015 -1646527
45667a646527J57195N95349Q99895M54604k01340j85521J98338j0524o39044n06019
$$ -1646527 -1489332 -893983 5912 460516 259176 73655 271993 261469 -377575 -883594
45657h83594N89426J337650P61514m90825j179279r48167l11231J47375J55583
$$ -883594 -294168 1043482 1804996 1314171 134892 -813275 -1124506 -977131 -821548
45648h21548j33713j91687K55187O93546N45714J83331K95871N16259l7769r39024
$$ -821548 -955261 -1146948 -891761 -198215 347499 530830 826701 1342960 1305191 366167
45638C66167p51050N71142J255098L44254q36326q08977r6884k3040n37567o37684
$$ 366167 -384883 186259 1441357 1785611 949285 140308 43424 20384 -517183 -1154867
45628a154867j41611K83755L26179J65286j02581k86995M5184P24568P55044j80826
$$ -1154867 -1296478 -1012723 -686544 -521258 -623839 -910834 -865650 -141082 613962 433136
45618D33136q85769l60239N79082O11647n4111l35286j26849J2401K50998Q81753
$$ 433136 -452633 -812872 -233790 377857 323746 -11540 -138389 -125988 125010 1006763
45608A006763J009083k64232j801375j622258N4617J027295M03002m24769l65186
$$ 1006763 2015846 1751614 -49761 -1672019 -1617402 -590107 -187105 -611874 -977060
45599i77060n7786j02804R2794P68493R17997O1248o61787l65894M4802m45437
$$ -977060 -1034846 -1137650 -1044856 -276363 641634 702882 41095 -324799 -279997 -725434
45589g25434j036878m31201Q73846J267305M56043l44407l91439j65232j42555
$$ -725434 -1762312 -2193513 -1319667 -52362 403681 59274 -332165 -497397 -639952
45580f39952n7256L79636R17717J179547J025880M12908n51461j346438j371269
$$ -639952 -697208 -317572 600145 1779692 2805572 3218480 2667019 1320581 -50688
45571e0688o61593J13425M15205K61722p4986l88954m91312j94749M58885J078177
$$ -50688 -712281 -598856 -183651 78071 3085 -385869 -877181 -1071930 -613045 465132
45561D65132J159820N16985m50867r97765p70245k77710l10711q81332j168721
$$ 465132 1624952 2141937 1691070 693305 -76940 -354650 -665361 -1546693 -2715414
45552b715414o49520J90859N70153M20181K61118L43941M25600L30738K63109
$$ -2715414 -3364934 -3174075 -2603922 -2183741 -1922623 -1578682 -1153082 -822344 -559235
45543e59235M09498N42801K97961k35231m89284j33366M10158M76360O5474k10619
$$ -559235 -149737 393064 691025 455794 -33490 -166856 243302 719662 785136 574517
$$ [...]
##END NTUPLES=NMR SPECTRUM
##END=
