##TITLE=31Pdec_LR-755-i3-C1
 , 24 sc
 19.10.2022
##JCAMPDX= 6.0         $$ Bruker NMR JCAMP-DX V2.0
##DATA TYPE= NMR SPECTRUM
##DATA CLASS= NTUPLES
##ORIGIN= UXNMR, Bruker Analytische Messtechnik GmbH
##OWNER= root
$$ XWIN-NMR		Version 3.5
$$ Wed Oct 19 16:05:53 2022 Russian Standard Time (UT+4h)  she@DPX200
##.OBSERVE FREQUENCY= 81.013821
##.OBSERVE NUCLEUS= ^31P
##.ACQUISITION MODE= SIMULTANEOUS
##.ACQUISITION SCHEME= undefined
##.AVERAGES= 24
##.DIGITISER RES= 16
##SPECTROMETER/DATA SYSTEM= spect
##.PULSE SEQUENCE= zgpg30
##.SOLVENT NAME= DMSO
##.SHIFT REFERENCE= (INTERNAL, DMSO, 0, 248.564)
##AUDIT TRAIL= $$ (NUMBER, WHEN, WHO, WHERE, WHAT)
$$ ##TITLE= Audit trail, XWIN-NMR		Version 3.5
$$ ##JCAMPDX= 5.01
$$ ##ORIGIN= Bruker BioSpin GmbH
$$ ##OWNER= she
$$ F:/spectra/data/she/nmr/P31/1/pdata/1/auditp.txt
$$ ##AUDIT TRAIL=  $$ (NUMBER, WHEN, WHO, WHERE, WHAT)
(   1,<2022-10-19 16:04:03.25 +0400>,<she>,<DPX200>,
      <created by zg, POWCHK disabled, PULCHK disabled
       configuration hash MD5:
       00 E9 B6 7A A2 85 ED C7 34 08 36 98 17 FE 4E 26
       data hash MD5: 32K
       05 07 B6 BC 4F 73 BA 27 46 A1 14 A3 01 59 10 60>)
(   2,<2022-10-19 16:04:12.48 +0400>,<she>,<DPX200>,
      <Start of raw data processing
       efp BC_mod = 2 LB = 1 FT_mod = 6 PKNL = 1 PHC0 = -10262.84 PHC1 = 93.65658 SI = 64K 
       data hash MD5: 64K
       AB 6A 5C FE 67 68 7A 92 6E 5C 70 75 15 3B F9 96>)
(   3,<2022-10-19 16:04:43.95 +0400>,<she>,<DPX200>,
      <pk PHC0 = 16.97545 PHC1 = -12.6 
       data hash MD5: 64K
       66 FD 1F 5D EB A4 F5 B3 67 4E 61 93 0F 56 C4 47>)
$$ ##END=
$$ 
$$ hash MD5
$$ C0 23 BE 4C 41 A9 82 E8 B7 A1 B0 05 6A E3 2D 70
##$RELAX= 
##$RELAX= 
##$RELAX= 
##$RELAX= 
##$RELAX= 
##$RELAX= 
##$RELAX= 
##$RELAX= 
##$RELAX= 
$$ Bruker specific parameters
$$ --------------------------
##$DU= <F:/spectra>
##$EXPNO= 1
##$NAME= <P31>
##$PROCNO= 1
##$TYPE= <nmr>
##$USER= <she>
##$AMP= (0..31)
100 100 100 100 100 100 100 100 100 100 100 100 100 100 100 100 100 100 
100 100 100 100 100 100 100 100 100 100 100 100 100 100 
##$AQSEQ= 0
##$AQ_mod= 1
##$AUNM= <au_zg>
##$AUTOPOS= <>
##$BF1= 81.014009
##$BF2= 200.13
##$BF3= 200.13
##$BF4= 200.13
##$BF5= 200.13
##$BF6= 200.13
##$BF7= 200.13
##$BF8= 200.13
##$BYTORDA= 1
##$CFDGTYP= 0
##$CFRGTYP= 5
##$CHEMSTR= <none>
##$CNST= (0..31)
1 1 145 1 1 1 1 1 1 1 1 1 1 1 1 1 1 1 1 1 1 1 1 1 1 1 1 1 1 1 1 1 
##$CPDPRG= <waltz16>
##$CPDPRG1= <>
##$CPDPRG2= <waltz16>
##$CPDPRG3= <>
##$CPDPRG4= <mlev>
##$CPDPRG5= <mlev>
##$CPDPRG6= <mlev>
##$CPDPRG7= <mlev>
##$CPDPRG8= <mlev>
##$CPDPRGB= <>
##$CPDPRGT= <>
##$D= (0..31)
0 1 0 0 0 0 0 0 0 0 0 0.03 2e-05 3e-06 0 0 0 0 0 0 0 0 0 0 0 0 0 0 0 0 
0 0 
##$DATE= 1666181042
##$DBL= (0..7)
120 120 120 11 120 120 24 19 
##$DBP= (0..7)
150 150 150 150 150 150 150 150 
##$DBP07= 0
##$DBPNAM0= <>
##$DBPNAM1= <>
##$DBPNAM2= <>
##$DBPNAM3= <>
##$DBPNAM4= <>
##$DBPNAM5= <>
##$DBPNAM6= <>
##$DBPNAM7= <>
##$DBPOAL= (0..7)
0.5 0.5 0.5 0.5 0.5 0.5 0.5 0.5 
##$DBPOFFS= (0..7)
$$ [...]
##$SUBNAM2= <"">
##$SUBNAM3= <"">
##$SUBNAM4= <"">
##$SUBNAM5= <"">
##$SUBNAM6= <"">
##$SUBNAM7= <"">
##$SUBNAM8= <"">
##$SUBNAM9= <"">
##$SW= 501.771253377433
##$SWIBOX= (0..15)
0 1 3 0 0 0 0 0 0 0 0 0 0 0 0 0 
##$SW_h= 40650.406504065
##$TD= 32768
##$TD0= 1
##$TE= 0
##$TE2= 300
##$TE3= 300
##$TEG= 300
##$TL= (0..7)
0 120 53 12 22 120 120 120 
##$TP= (0..7)
150 150 150 150 150 150 150 150 
##$TP07= 0
##$TPNAME0= <>
##$TPNAME1= <>
##$TPNAME2= <>
##$TPNAME3= <>
##$TPNAME4= <>
##$TPNAME5= <>
##$TPNAME6= <>
##$TPNAME7= <>
##$TPOAL= (0..7)
0.5 0.5 0.5 0.5 0.5 0.5 0.5 0.5 
##$TPOFFS= (0..7)
0 0 0 0 0 0 0 0 
##$TUNHIN= 0
##$TUNHOUT= 0
##$TUNXOUT= 0
##$USERA1= <user>
##$USERA2= <user>
##$USERA3= <user>
##$USERA4= <user>
##$USERA5= <user>
##$V9= 5
##$VALIST= <valist>
##$VCLIST= <CCCCCCCCCCCCCCC>
##$VD= 0
##$VDLIST= <DDDDDDDDDDDDDDD>
##$VPLIST= <PPPPPPPPPPPPPPP>
##$VTLIST= <TTTTTTTTTTTTTTT>
##$WBST= 1024
##$WBSW= 4
##$XGAIN= (0..3)
0 0 0 0 
##$XL= 0
##$YL= 0
##$YMAX_a= 3964
##$YMIN_a= -3930
##$ZGOPTNS= <>
##$ZL1= 120
##$ZL2= 120
##$ZL3= 120
##$ZL4= 120
##$ABSF1= 0
##$ABSF2= 0
##$ABSG= 0
##$ABSL= 0
##$ALPHA= 0
##$AQORDER= 0
##$ASSFAC= 0
##$ASSFACI= 0
##$ASSFACX= 0
##$ASSWID= 0
##$AUNMP= <proc_1d>
##$AZFE= 0.1
##$AZFW= 0.5
##$BCFW= 0
##$BC_mod= 2
##$BYTORDP= 0
##$COROFFS= 0
##$CY= -3
##$DATMOD= 1
##$DC= 0
##$DFILT= <>
##$DTYPP= 0
##$F1P= 0
##$F2P= 0
##$FCOR= 1
##$FTSIZE= 65536
##$FT_mod= 6
##$GAMMA= 0
##$GB= 0
##$INTBC= 1
##$INTSCL= 6.834604e-11
##$ISEN= 30
##$LB= 1
##$LEV0= 0
##$LPBIN= 0
##$MAXI= 10000
##$MC2= 0
##$MEAN= 0
##$ME_mod= 0
##$MI= 50
##$NCOEF= 0
##$NC_proc= -7
##$NLEV= 6
##$NOISF1= 182.463
##$NOISF2= 159.3651
##$NSP= 0
##$NTH_PI= 0
##$NZP= 0
##$OFFSET= 248.5645
##$PC= 4
##$PHC0= -10245.86
##$PHC1= 81.05658
##$PH_mod= 1
##$PKNL= yes
##$PPARMOD= 0
##$PSCAL= 0
##$PSIGN= 0
##$REVERSE= no
##$SF= 81.0140089999694
##$SI= 65536
##$SIGF1= 159.3651
##$SIGF2= -187.1042
##$SINO= 113.3802
##$SIOLD= 16384
##$SREGLST= <1H.CDCl3>
##$SSB= 0
##$STSI= 65536
##$STSR= 0
##$SW_p= 40650.406504065
##$SYMM= 0
##$S_DEV= 0
##$TDeff= 32768
##$TDoff= 0
##$TI= <>
##$TILT= no
##$TM1= 0
##$TM2= 0
##$TOPLEV= 0
##$USERP1= <user>
##$USERP2= <user>
##$USERP3= <user>
##$USERP4= <user>
##$USERP5= <user>
##$WDW= 1
##$XDIM= 65536
##$YMAX_p= 467650031
##$YMIN_p= -30801718
$$ End of Bruker specific parameters
$$ ---------------------------------
##NTUPLES= NMR SPECTRUM
##VAR_NAME=  FREQUENCY,     SPECTRUM/REAL,   SPECTRUM/IMAG
##SYMBOL=    X,             R,               I
##VAR_TYPE=  INDEPENDENT,   DEPENDENT,       DEPENDENT
##VAR_FORM=  AFFN,          ASDF,            ASDF
##VAR_DIM=   65536,         65536,           65536
##UNITS=     HZ,            ARBITRARY UNITS, ARBITRARY UNITS
##FACTOR=    0.620285442955139, 1,           1
##FIRST=     20137.2065510682, 0,            0
##LAST=      -20513.1999529968, 0,           0
##MIN=       -20513.1999529968, -30801718,   0
##MAX=       20137.2065510682, 467650031,    0
$$ Real data points
##PAGE= N=1
##DATA TABLE= (X++(R..R)), XYDATA
$$ [...]
51041B503997j75843K0468R4445j620009k783854j163615Q58856K48333j141510
51032c158732J76202K884208K900016K42532j396004r00196l63436j91532J069950
51023A263008K276089O18004k576986k606989Q94035K581672k37548l169579j694599
51014b652893J979127K850134N06691j542376j667647j205403q89389J60239J946740
51005e14777K757662J314806j593449l789767l462270p68288J892201K112271
50997b051611L61136n72658O10873K053574J567657m94468k189688k406681j332111
50988d453977K78000J374472J259566O31854Q09862J492540R15835j115187k254163
50979a061198q77778J308059J472106n92003k373109j758051P78990K827732K452633
$$ y = [2503997, 2328154, 2348622, 2443067, 823058, -1960796, -3124411, -2265555, -2017222, -3158732, -2982530, -98322, 2801694, 3044226, 1648222, 748026, 384590, 193058, 1263008, 3539097, 4157101, 1580115, -1026874, -132839, 2448833, 2211285, -958294, -2652893, -673766, 2176368, 2683059, 1140683, -526964, -1732367, -2621756, -2461517, -514777, 2242885, 3557691, 1964242, -1825525, -5287795, -6056083, -4163882, -2051611, -1690475, -2263133, -1652260, 401314, 1968971, 1474503, -715185, -3121866, -4453977, -4175977, -2801505, -1541939, -910085, -100223, 1392317, 2308152, 1192965, -1061198, -1938976, -630917, 841189, 249186, -2123923, -3881974, -3102984, -275252, 2177381]
50970B177381K33271j303955q23036J38498j61195o65224M72493K000448J041470
50961C110151j869175k970776r54769J315151J667590J323730J348042M30523
50953C400467j694850k442132n95329J119182M55658p28345k61346M00547m94184
50944h40332j145631K23291J169309q39422k921061q78959L273211L834645L47904
50935B222955k051714r81092M86981R1948l63794M99642J000074J91641j03173
50926I93468Q87336J018498o76521j714995l16089J443703J016743q87110k165052
50917d00019k323945j615386K23455K342305K456700K50978j333488k72954J520702
50908H48348J472127J35086o12180p43628r34170n09043P85729J108674n69416
$$ y = [2177381, 2410652, 1106697, 283661, 422159, 260964, -404260, 68233, 2068681, 3110151, 1240976, -1729800, -2684569, -1369418, 298172, 1621902, 2969944, 3400467, 1705617, -736515, -1331844, -212662, 242996, -485349, -746695, -346148, -840332, -1985963, -1762672, -593363, -1432785, -4353846, -5232805, -1959594, 1875051, 2222955, 171241, -809851, -322870, -230922, -594716, -95074, 905000, 1096641, 993468, 1880804, 2899302, 2222781, 507786, 191697, 1635400, 2652143, 1765033, -400019, -2723964, -4339350, -4115895, -1773590, 683110, 934088, -399400, -672354, 848348, 2320475, 2455561, 1843381, 1099753, 165583, -343460, 442269, 1550943, 981527]
50899I81527j930338o98878J371998J253276l28227l87665R67827P99444j370587
50890F58377k536691j024897J118841J582028Q04429K94203J78858j73442o54171
50881B47535p50979l94691K58381J048669J432667P68339o91463j828252j862853
50872a772647r71578J89114R87650J100856Q25599P06092N16077m94420j858218
50863g71475j769456K86609K174471J773445k05085j536981j423379n56905M73020
50854a555736J127694N93949o62978n26220J528246K621274N84726j985952j334701
50845C90302J267850J282588j740546l329675j180966J520438J460947j01214
50837d30276k69174R57000J573707Q47388m58717j563503j842679j001771m2394
$$ y = [981527, -948811, -1647689, -275691, 977585, 649358, 261693, 1229520, 2028964, 658377, -1878314, -2903211, -1784370, -202342, 602087, 896290, 1075148, 901706, 247535, -503444, -898135, -639754, 408915, 1841582, 2609921, 1918458, 90206, -1772647, -2744225, -2555111, -1567461, -466605, 358994, 1065086, 1581163, 1086743, -771475, -2540931, -2254322, -79851, 1693594, 1488509, -48472, -1471851, -2028756, -1555736, -428042, 165907, -497071, -1023291, 504955, 3126229, 3710955, 1725003, 390302, 1658152, 2940740, 1200194, -2129481, -3310447, -1790009, -329062, -430276, -699450, 257550, 1831257, 2678645, 2219928, 656425, -1186254, -2188025, -2230419]
50828b230419k90498q56094N17428L279845L764130N76135k708373k425678K05762
50819a67762J534620P10594l18067m57452l80080o82595j235894j647957j096679
50810c741272R66693K960045K208290q17792k092553J48164K323038J036010j575588
50801A415035j816154o93585j304912k344806j66251L782791M034661J1723k454215
50792D64287k11778K493116J285570j542367j542045N55388P38372j495047k930399
50783b184903k062184n48827L93268J346438K194557J539440n06449j555594k35862
50774a620116J663382J716831J62636q36613m21287J14710l52014j072073p53119
50765a397663L41594P80888J66488l30489J19739P96785P68456K80212j01699
$$ y = [-2230419, -2520917, -3377011, -2859583, 420262, 4184392, 4760527, 2052154, -373524, -167762, 1366858, 2077452, 1759385, 1301933, 921853, 239258, -996636, -2644593, -3741272, -2774579, 185466, 2393756, 1575964, -516589, -368425, 1954613, 2990623, 1415035, -401119, -1094704, -2399616, -4744422, -4910673, -1127882, 2906779, 2918502, 464287, 252509, 2745625, 4031195, 2488828, 946783, 1502171, 2240543, 745496, -2184903, -4247087, -4795914, -4402646, -3056208, -861651, 677789, 171340, -1384254, -1620116, 43266, 1760097, 1922733, 1086120, 664833, 779543, 427529, -644544, -1397663, -1056069, -275181, -108693, -439182, -319443, 477342, 1245798, 1526010, 1424311]
50756A424311n87772j206135r34057N67500J434595m0410k291968k265285k497
50747c901718J378228N16031l70335N85621J993358J807422M80185l41783m12667
50738A734342l46969q3169L43348j1216j286810j803217n86430O73919K68321
50729a097881n72716J01936J271170N74949j326711j507883L71821J527804P46590
50720H9079Q5324Q25016J132763m16628j966604j460981k06616m99385j504176
50711c922208p92106J068641J079531j083923k130891k93740J834116J468706
50703b771874m8420K16079J833157J916374J49579p21896K54145N28188j281946
50694G3386k328455O0985L315970K696193j603039m391737k767250L25582J112254
$$ y = [1424311, 836539, -369596, -1303653, -736153, 698442, 658032, -1633936, -3899221, -3901718, -2523490, -2007459, -2377794, -1792173, 201185, 2008607, 2488792, 2147009, 1734342, 1387373, 1304204, 1647552, 1636336, 349526, -1453691, -2040121, -1366202, -1097881, -1670597, -1568661, -297491, 277458, -1049253, -2557136, -2185315, -657511, 89079, 174403, 999419, 2132182, 1715554, -251050, -1712031, -1918647, -2418032, -3922208, -4714314, -3645673, -2566142, -3650065, -5780956, -6074696, -4240580, -2771874, -2820294, -2604215, -771058, 1145316, 1294895, 572999, 827144, 1355332, 73386, -2255069, -2194084, 1121886, 3818079, 2215040, -2176697, -4943947, -4618365, -3506111]
50685c506111J78415K91618J544862J725898L16565q04442m18002N96034J020598
50676I45435P24532J25645l64539k74791L54912N07017m50752j331049o87923
50667d51513N15897p3110k321708l087355n41213K995476M019804K184946J1310
50658C252534p08657m04445q4521N6454J97029K54239P8931l24619q86855j338030
50648I2060j129001m8248J188601J523385P14107m68590j076036p22828J76445
50639B49895N57270l95517j964215k178312k70733J769462J426178q57763k042228
50630c705963n55150J671861K005903M86239q39159q75312k43003L60567R59970
50621g34047J473315J436912Q43503K65292j08487o92372j560675k133485k018317
$$ y = [-3506111, -3327696, -3036078, -1491216, 234682, 551247, -253195, -671197, -75163, 945435, 1669967, 1795612, 1431073, 1156282, 1511194, 2018211, 1567459, 236410, -451513, 64384, -8726, -2330434, -5417789, -5959002, -2963526, 1056278, 3241224, 3252534, 2543877, 2139432, 2054911, 2111365, 2308394, 2562633, 2641564, 2316945, 1430090, 92060, -1036941, -1085189, 103412, 1626797, 2340904, 1872314, 796278, 73450, 249895, 807165, 411648, -1552567, -3730879, -4001612, -2232150, -805972, -1663735, -3705963, -4261113, -2589252, -583349, -97110, -936269, -1811581, -2054584, -1694017, -734047, 739268, 2176180, 3019683, 3284975, 3176488, 2484116, 923441, -1210044, -3228361]
50612c228361j345508j64896J440124K444297J468030j040736k530727j365083
50604d322860R12833J629911M76693n66354k48689P37703J459322J863960J785559
50595C728078M57191k013734l779199l049837l31243K067085K602271J815444
50587A496056J022115M22718q23256k747471l714237k286002M27932J647250M55578
50578d099317r86055n97118P58016J044916L53992K58654P19521K52179r66356
50569c261568r41022O76470J677035Q91416P5413O26287R46820n95280k183205
50560b087634j068302J677978K326762J75447j292111K84079K625595K324491
50552D966305k64835j938540j371152m64076r11467j628217p88749R39448J108116
$$ y = [-3228361, -4573869, -4738765, -3298641, -854344, 613686, -427050, -2957777, -4322860, -3410027, -1780116, -1303423, -1869777, -2118466, -1380763, 78559, 1942519, 3728078, 4185269, 2171535, -1607664, -4657501, -4988744, -2921659, -319388, 1496056, 2518171, 2940889, 2117633, -629838, -4344075, -6630077, -6202145, -4554895, -4099317, -5085372, -5682490, -4924474, -3879558, -3525566, -3266912, -2547391, -2295212, -3261568, -4202590, -3526120, -1849085, -957669, -882256, -255969, 690851, 95571, -2087634, -3155936, -1477958, 848804, 1024251, -267860, 16219, 2641814, 4966305, 4701470, 2762930, 1391778, 927702, 16235, -1611982, -2400731, -1461283, -353167]
50543c53167p25587j896579k99414K354138K744021O02832j125314p87669j18061
50534C95200q27878j521072q0490K459575L018574R13640j242843j316428k75642
50525A522636k76049j582832k493984j699819J62154J347784J126999P10946J507315
50516C25150K638852J618121j828051m287905k760897R68667K445956N40697j411347
50507a750757p75890R46166J216609N08176Q94865K061194J550732j139501l222629
50498B88965k263334N28989J943662P81234j155524j735285p60258O67382J718848
50489A4679J942370P99493j521761l206427k269648Q13499L216916L004356J140179
50480C933656k99647o81986o56524n83072m40037n83687j236248j620340q62544
$$ y = [-353167, -1078754, -2975333, -3274747, -920609, 1823412, 2426244, 1300930, 513261, 395200, -432678, -1953750, -2034240, 425335, 3443909, 4357549, 3114706, 1798278, 1522636, 1246587, -336245, -2830229, -4530048, -4367894, -3020110, -1893111, -1182165, 325150, 2964002, 4582123, 2754072, -1533833, -4294730, -3326063, -880107, -339410, -1750757, -2526647, -1580481, -363872, 144304, 1039169, 3100363, 4651095, 3511594, 288965, -1974369, -1445380, 498282, 1279516, 123992, -1611293, -2371551, -1704169, 14679, 1957049, 2756542, 1234781, -1971646, -4241294, -3427795, -210879, 2793477, 3933656, 3634009, 2952023, 2295499, 1712427, 1272390, 688703, -547545, -2167885, -3030429]
50471c030429M82803R81365K64113o33064q10635m18460k0908J26705J10625K09329
50461b738556N87188Q30464L55039l45464J07527J738306K408402O04637k044823
50452A502720k771604j368108M5165L53041L80495P12594P76225K87192k76768
50443c59048q17037j466631j378059K56577J979900J353525j118758k030136O090
50434c573577K115250J408027q50208j404813L14743J937185J664164J09311r77505
50425G42577m97114J116755K005870O08292k100134l222911j566442P61393J403237
50416g48477Q01491O86350J008658M34032r77600j668413q85774N18596J402289
50407E71152J216566m16j314501j141391Q85083K815667K501180L19948j537114
$$ y = [-3030429, -2547626, -1566261, -1302148, -1935212, -2745847, -3164307, -3185215, -3058510, -2947885, -2738556, -2151368, -1320904, -965865, -1311329, -1203802, 534504, 2942906, 3547543, 1502720, -1268884, -2636992, -2591827, -2238786, -1858291, -1145697, -369472, -82280, -359048, -1176085, -2642716, -4020775, -3764198, -1784298, -430773, -1549531, -3579667, -3573577, -1458327, -50300, -900508, -2305321, -1990578, -53393, 1610771, 1720082, 742577, 245463, 1362218, 3368088, 3976380, 1876246, -1346665, -2913107, -2151714, -748477, 53014, 739364, 1748022, 2182054, 1204454, -463959, -1349733, -831137, 571152, 1787718, 1787302, 472801, -668590, 216493, 3032160, 5533340, 5853288, 4316174]
50398D316174j956341j593270j140155n67833k676J12692j51154k78737j27436
50389a388736J49963N42610O84811k08893j750681j907101J45309J920018Q06261
50380a006439j581681j363148J550434K956627P15731j993026j663824L91653
50372a993673P04667p97548j341207k83150J28554q98834j014145J275916L566046
50363f53374K750178k53443j575748J65853K079992J358016q57493j685041r52919
50354C76021q51665j747842j414221Q75865K414753J024154j374351j639721j67457
50345b504464K19151q72538j030422N66410J731982J009981j32430p9483N25857
50336e65956O34796P62730J377633J332650j55649j649486j585449p14176m22207
$$ y = [4316174, 2359833, 766563, -373592, -941425, -944101, -831409, -982563, -1261300, -1388736, -1238773, -696163, -11352, -220245, -1970926, -3878027, -3732718, -1812700, -1006439, -2588120, -3951268, -2400834, 555793, 1271524, -721502, -2385326, -1993673, -1289006, -2086554, -3427761, -3710911, -3582357, -4481191, -5495336, -4219420, -653374, 2096804, 1843361, 267613, 433466, 2513458, 3871474, 3013981, 1328940, 376021, -475644, -2223486, -3637707, -2761842, -347089, 677065, -697286, -2337007, -2504464, -2285313, -3157851, -4188273, -3621863, -1889881, -879900, -1012330, -1091813, -565956, 68840, 831570, 2209203, 3541853, 3386204, 1736718, 151269, -562907, -985114]
50327i85114j30049J265734K609038J835987n92778k182985j896020p66516M39745
50318d02958J596271J713284J1020j679254q19998J373108J022237k102165l401059
50309b689514l97255L074482K565075m49254j530761k74952J33131j007063j017957
50300a594068J011558K492840J641403k5140o92911p25752q06753l65640O01083
50291A536620O08756p30576j420092j63186J317567R83077m12312j039374j026286
50282c45806j336356j211309L84481J874281Q15217j886215k708554o60980J405785
50273c669456J394652Q67996J837328L226853K817928J003570k2030j5523r04726
50264F536592l082230m016353j825349J546842K653868J172271j0108P25279J606587
$$ y = [-985114, -1115163, 150571, 2759609, 4595596, 4002818, 1819833, -76187, -842703, -402958, 1193313, 2906597, 2917617, 1238363, 418365, 1791473, 2813710, 711545, -2689514, -3086769, -12287, 2552788, 2103534, 572773, 297821, 430952, -576111, -1594068, -582510, 1910330, 3551733, 3526593, 2833682, 2107930, 1301177, 935537, 1536620, 2145376, 1414800, -5292, -168478, 1149089, 2132166, 1719854, 680480, -345806, -1682162, -2893471, -2508990, -634709, 180508, -1705707, -4414261, -5075241, -3669456, -2274804, -1406808, 430520, 3657373, 6475301, 7478871, 7456841, 7441318, 6536592, 3454362, -561991, -2387340, -840498, 1813370, 2985641, 2975533, 3700812, 5307399]
50255E307399P86249n95812o86665l61541j484624k911931j835379J119690K126565
50246A463951K24410r77560O44283K143627P72931j079905j68592J637559N53702
50237E214406k192601k167728N91280J494466q27011k328259m94254J671733R38469
50228A900501j161346j516579k66864O08546J003390J925446K690154J632115
50220F815363j169623l704577m008560j587204J962015L458259J184557k237846
50212G12384k473667N52776K356271N05943j972413j620688M38661J116185J73588
50203b10960m85103k46567J86335N57837O98442J08060m69479O56955K703719
50194C499239K327373j022404l206772j580045P07377J18653j383346l88329J468619
$$ y = [5307399, 6093648, 5497836, 4811171, 4449630, 2965006, 53075, -1782304, -662614, 1463951, 1688361, 710801, 1355084, 3498711, 4271642, 3191737, 3023145, 4660704, 5214406, 3021805, 854077, 1445357, 2939823, 2112812, -215447, -709701, 962032, 1900501, 739155, -777424, -1044288, -435742, 567648, 2493094, 5183248, 6815363, 5645740, 1941163, -2067397, -3654601, -1692586, 1765673, 2950230, 712384, -1761283, -1208507, 1147764, 1653707, -318706, -1939394, -1500733, -384548, -210960, -696063, -942630, -756295, -198458, 499984, 608044, 138565, 795520, 3499239, 5826612, 4804208, 1597436, 17391, 724768, 843421, -539925, -928254, 540365]
50185E40365N27995j964932j858151O66475J778259Q31877N80179J185077P4121
50176B361265k243896k234462K50385J405434J70535k43759J268016J590230n62033
50167A761715k022095q58313M75415R3574j91177P42418P61970q45959j107504
50158a189956R92436J589262j457330l845928j379346K964599L683074J040727
50150B397538o80884m70717n55071j044068j42233J401641J109359o02719j096197
50141C16649k01076j9938o70761m01854N43920L02576p34206m47473Q80608R49928
50131E18373k74294o58755o9140l02390j004839p9731J738106J437555o51495
50122F53390p86534J580392K296158n35070l138874k266826j45375L1671o69894
$$ y = [540365, 1068360, -896572, -2754723, -2088248, -309989, 521888, 1102067, 2287144, 2361265, 117369, -2117093, -1866708, -461274, -290739, -534498, 733518, 2323748, 1761715, -260380, -1118693, -643278, -549704, -740881, 1537, 763507, -82452, -1189956, -197520, 1391742, -65588, -3911516, -5290862, -2326263, 1356811, 2397538, 1716654, 1245937, 690866, -353202, -495435, 906206, 2015565, 1412846, 316649, 115573, 95635, -575126, -976980, -433060, -130484, -864690, -1312163, -431555, 518373, 244079, -414676, -483816, -786206, -1791045, -1870776, -132670, 1304885, 653390, -133144, 1447248, 3743406, 3208336, 69462, -2197364, -2342739, -2311068, -2980962]
50113b980962m5978N91842p04422j909347o4522L102934L428200R36972m92966
50104A861751M81262J219737J45240j098979j275784j446492k077305j704265
50096c894835N6917J191296N84595n2046P27439J578040Q52472n80704j052817
50087e89643o95578k78214O21524J978861J770362j090164l795299k899512M35317
50078d542346J942630N43520o08471M06943J651287J266167M13937M75594M70914
50069B020175m81366q77045M17133J477171K50966j800845k060447j060138j042192
50060c156588j531757j92736K451543L109660Q37287j504301j650295n98474Q3590
50051b152071N99844J270137J188216N7436p60623l63980L89976O76087P88901
$$ y = [-2980962, -3026940, -2435098, -3139520, -5048867, -5113389, -2010455, 1417745, 2354717, 1861751, 2343013, 3562750, 3707990, 2609011, 1333227, -113265, -2190570, -3894835, -3837918, -2646622, -2062027, -2114073, -1386634, 191406, 1043878, 463174, -589643, -1285221, -1563435, -941911, 1036950, 2807312, 1717148, -2078151, -4977663, -4542346, -2599716, -2056196, -2664667, -2257724, -606437, 659730, 1073667, 1549261, 2020175, 1538809, 661764, 1078897, 2556068, 2807034, 1006189, -1054258, -2114396, -3156588, -4688345, -4881081, -2429538, 680122, 1517409, 13108, -1637187, -2235661, -2152071, -1552227, -282090, 906126, 963562, 202939, -161041, 228935, 905022, 1693923]
50042A693923O38948m99666j817857j180911J239450K294779M37350j773552j659339
50033f26875j81267N20048N96245Q39760K19449j765737k643411m59950K278626
50024a223112K016310k04630p22364N00062L95860j122724q47890J539055K180138
50015B510705n14653k829723j529294J288755K010474R00696L85774M53079o12245
50006B063568k377786k644921j124698J97091K55649J9588L24816P60919J028636
49997a497138J505745J936342J220857o98423k065668j420862L85364J273357
49989F39574N00375p76030j176542m10740R72572K155162K217275P60385j159661
49980C722370j677186m07651Q46741O11250j58521M1293M16137p79688k656130
$$ y = [1693923, 2332871, 1833205, 15348, -1165563, 73887, 2368666, 2806016, 1032464, -626875, -808142, -288094, 308151, 1147911, 1367360, -398377, -3041788, -3501738, -1223112, 793198, 588568, -133796, 366266, 762126, -360598, -1208488, 330567, 2510705, 1996052, -833671, -2362965, -1074210, 936264, 1836960, 2222734, 2675813, 2063568, -314218, -2959139, -4083837, -3886746, -3631097, -3611509, -3286693, -2525774, -1497138, 8607, 1944949, 3165806, 2467383, 401715, -1019147, -633783, 639574, 1139949, 363919, -812623, -1223363, -250791, 1904371, 4121646, 4882031, 3722370, 2045184, 1637533, 2484274, 3095524, 2937003, 2978296, 3394433, 2614745, -41385]
49971d1385k361889M01118K531333K084985P19621K38167k16702j479942j892836
49962a7530k96613J123401K42038j049571K554J909281J317122r44181j092266
49953A194235R10107J111939j496848k973966q85042J867238J979008N79573L74820
49944B661064J128961R69193j27614r09700j183683j319002j016953m48574q56067
49935a102375k214138k247713K08501K800352K812159R65277k34159k65334k38171
49926D84399k46223K92613P59683L28189r8910O29434J385723K49016k129449
49917A654475l139569j826633L19457J770551K018097P58345j622625l050317
49909c118219j632396J460737L085006K069564J11523j059792j222716m66354
$$ y = [-41385, -2403274, -2002156, 529177, 2614162, 3333783, 3571950, 3355248, 1875306, -17530, -314143, 809258, 1051296, 1725, 4279, 1913560, 3230682, 2286501, 1194235, 2104342, 3216281, 1719433, -1254533, -2139575, -272337, 1706671, 2286244, 2661064, 3790025, 4759218, 4631604, 3721904, 2538221, 1219219, 202266, -246308, -1102375, -3316513, -5564226, -5355725, -2555373, 256786, 1222063, 987904, 722570, 484399, 238176, 530789, 1290472, 1618661, 1519751, 2149185, 3534908, 3783924, 1654475, -1485094, -3311727, -2992270, -1221719, 796378, 1554723, -67902, -3118219, -4750615, -3289878, -204872, 1864692, 1976215, 916423, -306293, -772647]
49901g72647J159201K501919K015506P8613j289209j301998j031803j003089m82348
49892a25855L72847J40370j180744j499122P0035J440716P25826p61745o62469
49883a480141P52832J258702J59276j021466j000614p9939R36879J659305J761630
49874B946464R15176n75246j781803k005128j235269M5937J043072R82185m4324
49865B91064q25345l60397P35642R43581q8003j009657n48685Q21663J437642
49856A397505M00225j418030k344657j658114j34009J119986J857852K267830
49848A488588J893541J41298k072325k579253o89623J423282J301455n37121j385565
49839a015723j02672J529431J443396j58795j507120j425275j23924J258482J307271
$$ y = [-772647, 386554, 2888473, 4903979, 4982592, 3693383, 2391385, 1359582, 356493, -125855, 246992, 387362, -793382, -2292504, -2222469, -781753, -55927, -817672, -1480141, -727309, 531393, 690669, -330797, -1331411, -1411350, -474471, 1184834, 2946464, 3861640, 3286394, 1504591, -500537, -1735806, -1689869, -646797, 335388, 291064, -534281, -894678, -159036, 784545, 696542, -313115, -861800, -40137, 1397505, 1797730, 379700, -1964957, -3623071, -3757080, -2637094, -779242, 1488588, 3382129, 3523427, 1451102, -1128151, -1817774, -394492, 906963, 369842, -1015723, -1118395, 411036, 1854432, 1695637, 188517, -1236758, -1360682, -102200, 1205071]
49830A205071n03330k616266k480451J94761K433954J625276q94531j732685j72556
49821b940757J302662J057377K76656K33826O1167j277249k641552k183939p3083
49812f184892J846921K358617J566172J37171r25416o62336M68395O43113o17166
49803a369421j173809N04828K310876J241405j795450k945890r64814J275924
49795b916351J301435J65813k515Q40298J393138J150866M61535k79764n39910
49786A574545O0888P52867K74287j017206j340773l15059L48756k35190n94782
49777d91667M93556J772185J417407k95936j724668k054185j541032p12295k96331
49768c432966p07182r34233L77541K155122J575372j394478k890911m78500L025926
$$ y = [1205071, 701741, -1914525, -4394976, -4200215, -1766261, -140985, -1035516, -2768201, -2940757, -1638095, -580718, -304062, -70236, -9069, -1286318, -3927870, -6111809, -6184892, -4337971, -1979354, -413182, -276011, -1201427, -1863763, -1395368, -752255, -1369421, -2543230, -2038402, 272474, 1513879, -281571, -3227461, -4192275, -2916351, -1614916, -1449103, -1451618, -611320, 781818, 1932684, 2394219, 2114455, 1574545, 1635433, 2388300, 2662587, 1645381, 304608, -10451, 338305, 103115, -491667, 1889, 1774074, 3191481, 2895545, 1170877, -883308, -2424340, -3136635, -3432966, -4140148, -5074381, -4696840, -2541718, -966346, -2360824, -5251735, -5730235, -2704309]
49759b704309L522737J159485r18789j393781j221977p86785J14674M87546n05163
49750b246362j252345J65853K352832K301233O7865j560477j565393j370405j304014
49741d411213j52895J533911J473233l07260j028748K38296J010515k27092j415205
49732c286458n15464J170359J332872J3733j247994j649796r41897R46819K626285
49723a551541J813061j167498k727823p96309J969218K005497j43312j278397
49715a877104m50405M49472J31250p03018j070631p08710L66267J601085J662601
49706e99193N7118j564109j339756J36270P61759J8371o56065k92614N26241R76925
49696a975053R49302O31453K30631N2978P6722j65872n99414l22038Q13112J456038
$$ y = [-2704309, 818428, 1977913, 1059124, -334657, -1556634, -2343419, -2228745, -1741199, -2246362, -3498707, -3332854, -980022, 1321211, 1389076, -171401, -1736794, -3107199, -4411213, -4564108, -3030197, -1556964, -1864224, -2892972, -2654676, -1644161, -1871253, -3286458, -3801922, -2631563, -1298691, -1284958, -2532952, -4182748, -5124645, -4177826, -1551541, 261520, -905978, -3633801, -4430110, -2460892, -455395, -598707, -1877104, -2327509, -1878037, -1746787, -2449805, -3520436, -4229146, -3862879, -2261794, -599193, -542075, -2106184, -3445940, -3309670, -2547911, -2529540, -3185605, -3478219, -2951978, -1975053, -1025751, -394298, -163667, -110689, -33967, -199839, -799253, -1121291, -308179, 1147859]
49686A147859Q10565J44490O24467R71668n28898k732950k989077j211123K40421
49677c522578N77049J363123K818856K642741l314k194150j179818J422078J956670
49668C880657k0732j569954r79414J65148n845q73436q49223j31892j96934j111177
49658a692802j164736M42081J982359J353669r36219k307395j452052K89653J183992
49649b301450J251741J294853J072172q5757j499626j557827R9819J969308K374515
49640B617748J014507j027306k075802j051905J200359K256893R13655r73696
49632B874453r65588L33283L55880r95549r49289J360368K815764R23618k122176
49623C630764k735462j352503j155681k478124k405877r1343J488380M62491p17072
$$ y = [1147859, 1958424, 2102914, 2727381, 3699049, 3170151, 437201, -2551876, -3762999, -3522578, -2945529, -1582406, 1236450, 3879191, 3875877, 1681727, 501909, 1923987, 3880657, 3859925, 2289971, 1310557, 1475705, 1469860, 596424, -252799, -384691, -581625, -1692802, -2857538, -2415457, -433098, 920571, -15648, -2323043, -3775095, -3485442, -2301450, -1049709, 245144, 1317316, 1231559, -268067, -1825894, -1726075, 243233, 2617748, 3632255, 2604949, 529147, -522758, 677601, 2934494, 3848149, 2874453, 1908865, 2242148, 2598028, 1602479, 653190, 2013558, 4829322, 5752940, 3630764, 895302, -457201, -1612882, -4091006, -6496883, -6588226, -5099846, -4637355, -5354427]
49614e354427O11968K693229K037067q60518k047841L30K392509K295207M86070
49605B253594q08900j204169j484299j432867m72923N48200L19457o57296o72877
49596c612080M65505J167078O68861R7876L49452N68928j91518j060684n02183
49587b048765J241923K257398J453704j68606j037866r74603j038734j754879
49579b070428k176967j016740J555808L736553L901985K258730L57544p14398
49571E832087j103422j324478j383770j016527l02688K99032L37977k90976j137421
49562i0186j363691n62703N65206Q77637K38330l07771m7976L97159J07974o79696
49552h65717r55979n03944j51653l11504j55681J104746K625299K572232M86032
$$ y = [-5354427, -4742459, -2049230, -12163, -872681, -2920522, -2920192, -527683, 1767524, 2253594, 1444694, 240525, -1243774, -2676641, -3149564, -2601364, -2281907, -2939203, -3612080, -3146575, -1979497, -1310636, -1212760, -863308, -294380, -485898, -1546582, -2048765, -806842, 1450556, 2904260, 2735654, 1697788, 723185, -315549, -2070428, -4247395, -5264135, -3708327, 28226, 3930211, 6188941, 6546485, 5832087, 4728665, 3404187, 2020417, 1003890, 701202, 1000234, 1338211, 1047235, -90186, -1453877, -2016580, -1451374, -573737, -335407, -643178, -691154, -293995, -186021, -865717, -1821696, -2325640, -2477293, -2788797, -2944478, -1839732, 785567, 3357799, 3843831]
49543C843831j812855k223533p55073P86622J152464P36704L43998J986m95604
49534A578540p67618l93945K06195K48350k76849n98796k61482K42073K4685j098933
49524a097780k073131j489928N53745K010778J281292m25690o78811N22264R05427
49515d91834l6612k2963J794203K628095M29144k217510j834426L30486L61622
49506I40205j845624k523522k63399K040960K171410J435936J220377M75223j397896
49497B253670k428960j241526K98684P3153q37584k41930J374897J750966L70972
49488A372342j198631j688373j028980L10524J408912J255752K37517K8992R30935
49479A628990J066482m02547j361573P724K097333K379473J213747M51841q3884
$$ y = [3843831, 2030976, -192557, -947630, -161008, 991456, 1728160, 2072158, 2074144, 1578540, 810922, 416977, 623172, 871522, 594673, -4123, -265605, -23532, 1153, -1097780, -3170911, -4660839, -4107094, -2096316, -815024, -1240714, -1919525, -1397261, -491834, -528446, -551409, 1242794, 3870889, 4300033, 2082523, 248097, 578583, 940205, -905419, -3428941, -3692340, -1651380, 520030, 1955966, 3176343, 3651566, 2253670, -175290, -1416816, -1118132, -1044979, -1882563, -2124493, -749596, 1001370, 1372342, 173711, -1514662, -2543642, -2233118, -824206, 431546, 669063, 698055, 1628990, 2695472, 2292925, 931352, 939076, 3036409, 5415882, 6629629, 7081470, 6997586]
49470F997586j568736k885647j898781N32793J297452j92133j227360k39039J036192
49461A852327O94380o40160j387620j216657n88425K35273Q01581N13541j83790
49452H0450R568J219111J815052N69475j594399k625000j496763Q45466K182112
49443A005072R74928j673628k710493q00678J672395J774022Q6705n52741M24850
49434B00432P86347n93424j997285j609422J93740J896403K361646J035903j389585
49425H84755k408458j50385L277842L558581O780l125899k428926L21798J441054
49416A377142N17597j73898K23928M06530l65034j162324j096121m94543q4504
49407h51227K4935K63274Q74070J323524O37750j138674k239947j140080J002053
$$ y = [6997586, 5428850, 2543203, 644422, 1177215, 2474667, 2282534, 1055174, 816135, 1852327, 2546707, 1906547, 518927, -697730, -1286155, -1050882, -249301, 264240, 80450, 90018, 1309129, 3124181, 3693656, 2099257, -525743, -2022506, -1177040, 1005072, 1980000, 306372, -2404121, -3204799, -1532404, 241618, 328323, -224418, 200432, 986779, 393355, -1603930, -3213352, -3019612, -1123209, 1238437, 2274340, 884755, -1523703, -1674088, 1603754, 5162335, 5169115, 2043216, -385710, -63912, 1377142, 1894739, 1720841, 1944769, 2351299, 1986265, 823941, -272180, -766723, -851227, -826292, -563018, 311052, 1634576, 2272326, 1133652, -1106295, -2246375, -1244322]
49398a244322J515921m2169j265145n39485P96262J001929O03236Q81870J353664
49389C061761P50750n41700j040163n79846l30898o33144n13846M69533J290870
49380A933317Q69994m15338j211868q76942k22829m05153j240884j201779N66539
49371b204943K797353L362264J570856j384513l600703l406009l89597L166709
49363h8583L366035n92133m088399k471044K154599L373180l98327l710273k238562
49354d693507J357635K322694P33527n5066P56011J096600J63735p31040q91768
49345E8821q88424p85632j47562M73525J69040n26283l74964M07920N51206j06401
49335a168754n63312m21151j51074M5814K89332L81523K47939L32713N86041J44730
$$ y = [-1244322, 271599, 229430, -1035715, -1575200, -778938, 222991, 826227, 1708097, 3061761, 3812511, 3270811, 2230648, 1650802, 1319904, 686760, 172914, 642447, 1933317, 2803311, 2387973, 1176105, 299163, 76334, -328819, -1569703, -2771482, -2204943, 592410, 3954674, 5525530, 4141017, 540314, -2865695, -3255292, -88583, 3277452, 2685319, -1403080, -3874124, -1719525, 1653655, 1255328, -2454945, -4693507, -3335872, -1013178, -279651, -334717, 421294, 1517894, 1681629, 950589, 58821, -829603, -1615235, -1762797, -1289272, -1120232, -1646515, -2021479, -1613559, -1062353, -1168754, -1732066, -2153217, -2304291, -2258477, -1969145, -1587622, -1339683, -1006970, -420929, -276199]
49325b76199r42335j138613J51886J292245J068581O65525J133704J142879l11076
49316B786597j298890j24617J128420q9322j926270r46399J710042J979734j21051
49307C098244o04882J294557J745151p24093k468434j096530N11753n25287k320490
49298a090011k150591j175374j336127j027572J676938M241391L023514l98686
49290A763482j310739O71492J361013p47121k105721k78430K092093J846381K34189
49281C526639J93923J222144N31185j861159k804715r42992J124144P92108p90339
49272I90938q58607N69764R62624m40096j304753J4242J713507J310489n01837
49263B456271j076410N2335Q21692J91623n67781n34015n85566j241405j247185
$$ y = [-276199, -1218534, -2357147, -2205261, -913016, 155565, 821090, 1954794, 3097673, 2786597, 1487707, 1363090, 2491510, 2402188, 475918, -470481, 1239561, 3219295, 3098244, 2493362, 3787919, 5533070, 4808977, 2340543, 1244013, 1755766, 1230479, -1090011, -3240602, -4415976, -5752103, -6779675, -5102737, -861346, 2162168, 1763482, 452743, 1124235, 2485248, 1738127, -367594, -646024, 1446069, 3292450, 3526639, 3720562, 4942706, 5473891, 3612732, 808017, -134975, 989169, 1781277, 990938, 132331, 702095, 1664719, 1224623, -80130, -65888, 1647619, 2958108, 2456271, 1379861, 1432196, 2253888, 2445511, 1877730, 1343715, 758149, -483256, -1730441]
49254a730441K94174K115293K591365J941813J203305L83939p64065j400389q64554
49245C770440k75481q88895j666843p15061J301399J672858k24542j794416j136325
49236D3134J15779m63904k120392k007899K96830J876136P42317j092013n65352
49227c175364J700688K173789j40644j886795m00514J933894J122198k123875
49219g96623l145160l76072K190555J024524j799265k134951l3989J013256j2918
49210d070643l27167J678929L498740K271234p78240k011513n08983Q96312n6899
49201E91770j775277j249100J338683K561537N89835j965967j597156J090853
49193d14822K304808O25632j143611m57261J292774J375525l6762o94989j35473
$$ y = [-1730441, -1436267, 679026, 3270391, 5212204, 6415509, 6799448, 6035383, 4634994, 3770440, 3494959, 2606064, 939221, 224160, 1525559, 3198417, 2973875, 1179459, 43134, 158913, -304991, -2425383, -4433282, -4136452, -2260316, -1517999, -2610012, -3175364, -1474676, 699113, 558469, -1328326, -1728840, 205054, 1327252, -796623, -3941783, -4317855, -2127300, -1102776, -2902041, -5036992, -5070981, -4057725, -4070643, -4397810, -2718881, 779859, 3051093, 2272853, 261340, -247643, 648669, 591770, -1183507, -2432607, -1093924, 1467613, 2057448, 91481, -1505675, -414822, 1889986, 2515618, 1372007, 914746, 2207520, 3583045, 3546283, 2851294, 2715821]
49184B715821J9359p49375j026174j44674O42039M35260J13010M37740N40157
49175B983163l34385j092335n43039K44593n81325k367840k437004o8578K174195
49166b022555J998911L98605l25076l2167k03419q42984m31295J021612J415557
49157I77189p9289j326849l75155J491941J747209L14303q86504j131766j249160
49148e18081j307346n11829O17878N39401m53948k33330J500883K147704K28912
49139B010244j855513j157629J436960K530546R87996r16434r29581M78942J168467
49130C753998j4312j940034k230946J19821L061007L372609N94951k263223k623036
49121A830835j322131n33743m51204L5166O88975L40874o73407p98882J51565
$$ y = [2715821, 2735180, 1985805, 959631, 814957, 1456996, 1892256, 2005266, 2443006, 2983163, 2648778, 1556443, 1013404, 1257997, 676672, -1691168, -4128172, -4196750, -2022555, -23644, 374961, 49885, 17718, -185701, -1028685, -1459980, -438368, 977189, 897900, -428949, -804104, 687837, 2435046, 2749349, 1862845, 731079, -518081, -1825427, -2337256, -1719378, -1179977, -1633925, -1867255, -366372, 1781332, 2010244, 154731, -1002898, 434062, 2964608, 3952604, 3036170, 2106589, 2585531, 3753998, 3739686, 1799652, -431294, -311473, 2749534, 6122143, 6717094, 4453871, 1830835, 508704, -25039, -476243, -441077, 247898, 588772, -84635, -883517, -731952]
49112g31952P25836K02101n87664r16550r21107n30522O36782J951320J980493
49103A808737N62114p52598r00656o03872p82586r71968l27974P08458R21743
49094c38602J34500m98844j25336N65217K62884r57030j361953Q8673J824468
49085d06023J461358p06572j864281p04804Q21671Q31547L53974J018361J855365
49076B660596R15749j231885k287916j671759o38619K94762J355151J599757j7485
49067I78351j972495j650781N08107J463708L26955o49791k64126J8292m35263
49058a677043J9020J689265K048370J6900j490794r127K239164J683116j067886
49049C450985k345293q41802J151117J344974k09974k079246k806899j651951
$$ y = [-731952, -6116, 195985, -391679, -1308229, -2229336, -2759858, -2123076, -171756, 1808737, 2370851, 1618253, 717597, 113725, -668861, -1640829, -1968803, -1260345, -338602, -204102, -702946, -828282, -263065, -181, -957211, -2319164, -2230491, -406023, 1055335, 348763, -1515518, -2220322, -1398651, -567104, -213130, 805231, 2660596, 3576345, 2344460, 56544, -1615215, -2253834, -1959072, -603921, 995836, 978351, -994144, -2644925, -2136818, -673110, -346155, -995946, -1260072, -1241780, -1677043, -1658023, 31242, 2079612, 2096512, 605718, 596591, 2835755, 4518871, 3450985, 1105692, 263890, 1415007, 2759981, 2550007, 470761, -2336138, -3988089]
49041c988089N90845K002156J729161P78589m8354j173216k187318j295139J384095
49032b207270K615663O99713j236826J61463K909795K722713j00008j438214j79098
49023C947931N70074p39893j815611j061232j57657m57961n27709O45390J177550
49014A580882n49360k759863k829309j076504L68318R84253J722621K410488J709376
49005A560902m27364k068448j534169N63804J944496J166977p02131j366173k95378
48996a157484O54825K56106j41886O83072R82416j227662l821928k748883J603332
48987d918092M249612K611166k15218o97470L23310L21259o06797r13866o70731
48978e16827o48315j97352J297480K396160J557055j94366q56888m60671k94651
$$ y = [-3988089, -3397244, -1395088, 334073, 1112662, 1064308, -108908, -2296226, -3591365, -2207270, 408393, 1108106, -128720, 32743, 2942538, 5665251, 5565243, 4127029, 3947931, 4518005, 3778112, 1962501, 901269, 743612, 285651, -242058, 403332, 1580882, 1031522, -1728341, -4557650, -5634154, -5265836, -4281583, -2558962, -148474, 1560902, 1133538, -934910, -2469079, -1905275, 39221, 1206198, 504067, -862106, -1157484, -502659, -246553, -388439, 294633, 1277049, 49387, -3772541, -6521424, -4918092, -668480, 1942686, 1727468, 1029998, 1353308, 1674567, 1067770, 153904, -516827, -1165142, -1362494, -65014, 2331146, 3888201, 3693835, 2836947, 2376276, 2081625]
48969B081625m10644j29797J44248j92676l86039K56309O19788l74791j483982
48960A24041j016469K59821N07778j02938k23014J1359j93474p1493J154182J764531
48950B214324n8185k365513j765800R64778J692165n87049k252251q77543J389263
48941a645811J738257N78520l39890q51661j378740j202153K41204J833844K149548
48932A123118J233221L737r37021j206869o39450J08093J98199K751L92977Q55773
48922A134529K68740o94275l48331Q86930Q99712m25412r23899J714M18746m88935
48912G29519j037180l38302K23273l6773M8608M60105n67912k558677k263795
48903e341134P60682K284629K4429k077692n4260L394121L142029l42072k396930
$$ y = [2081625, 1670981, 1541184, 1685432, 1492756, 1106717, 1363026, 1982814, 1608023, 124041, -892428, -632607, -124829, -227767, -450781, -439422, -632896, -704389, 449793, 2214324, 2156139, -209374, -1975174, -1010396, 681769, 94720, -2157531, -3035074, -1645811, 92446, 670966, 331076, -520585, -1899325, -3101478, -2860274, -1026430, 1123118, 2356339, 2360076, 1423055, 216186, -423264, -315171, -116972, -114221, 278756, 1134529, 1403269, 708994, 360663, 1247593, 2147305, 1721893, 797994, 799708, 1218454, 729519, -307661, -645963, -422690, -459463, -410855, 49250, -518662, -3077339, -5341134, -4580452, -2295823, -2271394, -4349086, -4403346, -1009225, 2132804, 1790732, -606198]
48894f06198j596053m92167j07648J048367K705340K434588J6856j822881j612479
48885c2275o28056P9915P94002J078799K3728j214985n06388J357973J371292
48876B324005p06035j793378o26011M04701k62229q32925J34287J016517L39363
48867a705l63539N69592J754406J176798k69957m72646K09815j97854j657057
48858G47853k105318q36167N24320P28649O30533J374087K210135J435239q28771
48849C880560k162533r14448J179685J067852j125234j956511J77651K302428
48841B449450J258418j448705k113366m81871N72668Q2365j34175N54412N50948
48832A290144n63487j097784m89643j85773m60040K74185J893479J801794o50340
$$ y = [-606198, -2202251, -2694418, -2802066, -1753699, 951641, 3386229, 3403085, 1580204, -32275, -660331, -580416, 213586, 1292385, 1316113, 101128, -405260, 952713, 2324005, 1617970, -175408, -801419, -396718, -658947, -1491872, -1357585, -341068, -1705, -365244, 204348, 1958754, 3135552, 2865595, 2392949, 2602764, 2404910, 747853, -1357465, -2193632, -1669312, -940663, -310130, 1063957, 3274092, 4709331, 3880560, 1718027, 803579, 1983264, 3051116, 1925882, -30629, 147022, 2449450, 3707868, 2259163, 145797, -336074, 236594, 318959, 184784, 739196, 1290144, 726657, -371127, -860770, -1046543, -1506583, -1232398, 661081, 2462875, 1812535]
48823A812535k266336n98685K336609L128633J418750p99075k238314k682829
48815A11288k083834j030223n46057k83692J110391K971837K648859k01290k319128
48806C78151j523513L00779Q02702O20690R47557Q10571m45429r18385N51611
48797A524734J611359J77227j670627j090974P39030J037878K72855N10984J015001
48788D127467j20707j663515j127930M38574K09538j090755n31520J260222R67750
48779B469124j126291j240242J120345J991320k46367k116204r84091R39199Q59789
48770A666582m02360r60052j030123j060975L1624K147011K514228k53030l134469
48761d81564k598743N00848K618092K365428J064485j08470r30778j012911j26660
$$ y = [1812535, -453801, -1052486, 1284123, 4412756, 5831506, 5032431, 2794117, 111288, -1972546, -3002769, -3548826, -3832518, -2722127, 249710, 2898569, 2697279, 378151, -1145362, -844583, -41881, 578809, 1526366, 2336937, 1891508, 973123, 1524734, 3136093, 3313320, 1642693, 551719, 1290749, 2328627, 2601482, 3112466, 4127467, 4006760, 2343245, 1215315, 1653889, 1863427, 772672, 241152, 1501374, 2469124, 1342833, 102591, 1222936, 3214256, 2967889, 851685, -132406, 806793, 1666582, 1264222, 304170, -725953, -1786928, -1755304, 391707, 2905935, 2652905, -481564, -3080307, -2579459, 38633, 2404061, 3468546, 3360076, 2429298, 1416387, 1289727]
48752A289727Q56406R45107L55310k46908q75336j566644j702985r82493L1495
48743a896321R97995K012467K292630P39086j467042j434962R64778K079575m5585
48734D242621k127879o07978K393953K121265j276157k807392k68733K535895
48726D205595J629842j505086k535537m77740J419896M94886j860635k295237
48718i24016K3974K276502J548139j406548l056427j528771J238074K214400Q39646
48709A224973j016116j575842n30503J303801K542011K041737K47334q36320p2567
48700C328508J074642N34004j267972j981350q07298M77638L61713l15017j05095
48691A299773O46292O80418K76820R00934K358072K283411m57669l363303l123746
$$ y = [1289727, 2146133, 3091240, 3446550, 3199642, 2324306, 757662, -945323, -1927816, -1896321, -898326, 1114141, 3406771, 4145857, 2678815, 1243853, 2208631, 4288206, 4242621, 2114742, 1506764, 3900717, 6021982, 4745825, 1938433, 1669700, 4205595, 5835437, 4330351, 1794814, 1317074, 2736970, 3231856, 1371221, -924016, -900042, 1376460, 2924599, 1518051, -1538376, -3067147, -1829073, 385327, 1224973, 208857, -1366985, -1897488, -593687, 1948324, 3990061, 4237395, 3401075, 3328508, 4403150, 4937154, 3669182, 1687832, 880534, 1358172, 1719885, 1404868, 1299773, 1946065, 2626483, 2903303, 3804237, 6162309, 8445720, 7988051, 4624748, 1501002]
48682A501002j63995J797089P89453j103213j310603l73456k47366q08734m53285
48673c73108P82658J219088L97625l16961j10720L13516M23518O59283J087769
48664D082668Q97337j57183j107843j123122n10380l7860m3916k72670j8403J096911
48654B805539J940377P17181j948932k670627k2691K431914Q69503k776781l428508
48645b083025l84722K226779K106686J088825N30071n48270j710929o19581K019342
48636B625176K071989j208598l040533o65192K014328J046888j156744o34277
48628A053037J206494Q73174m83111M38695K361371J346468k028241l376610j693933
48619c02656k07345k58929K00906J661361J766559q3583j401435r70173m49304
$$ y = [1501002, 1337007, 3134096, 3923549, 2820336, 1509733, 1136277, 888911, 80177, -373108, 409550, 1628638, 2026263, 1709302, 1598582, 1912098, 2335616, 2994899, 4082668, 4980005, 4822822, 3714979, 2591857, 2081477, 2043617, 1999701, 1727031, 1708628, 2805539, 4745916, 5463097, 3514165, 843538, 820847, 3252761, 4122264, 1345483, -2083025, -2467747, -240968, 1865718, 2954543, 3484614, 2936344, 1225415, 605834, 2625176, 4697165, 3488567, 448034, -217158, 1797170, 2844058, 1687314, 1053037, 2259531, 3132705, 2649594, 3088289, 5449660, 6796128, 4767887, 1391277, -302656, -510001, -768930, -568024, 1093337, 2859896, 2776313, 1374878, 404705, -44599]
48610d4599o12527J8151J569454J692451m08228k185601j586339K35601J416403
48601I4766J837639J822973J029761j35826m29897m9255n37978j726395j557379
48592C48409K30352J243297L00731q42382q20813o38037r39588m53860J113726
48583d58165J684075L58771m87692R83041K743873J977694o54115k447060k589635
48574A110787k089646j242610K61317J724971K184124J982188J841411J339894
48566G112436m914j217665j181312n01178l99953p13687o15416l84153p51000
48557A343158j237699p87717M39029J248948J013714J58850m41598Q56J439217
48548C176758K439552J607126j92315p39299J21338K42919j029897j627847n63588
$$ y = [-44599, -657126, -638975, 930479, 2622930, 2214702, 29101, -1557238, -1321637, 94766, 1932405, 3755378, 4785139, 4649313, 4219416, 4170161, 3632183, 1905788, 348409, 578761, 1822058, 2122789, 1280407, 459594, -178443, -1118031, -1571891, -458165, 1225910, 1584681, 1096989, 2080030, 4823903, 6801597, 6147482, 3700422, 1110787, -978859, -2221469, -1960152, -235181, 1948943, 3931131, 5772542, 7112436, 7107522, 5889857, 4708545, 4207367, 3807414, 3093727, 2478311, 2094158, 1343158, 105459, -682258, -243229, 1005719, 2019433, 2178283, 1736685, 1737541, 3176758, 5616310, 7223436, 7031121, 6291822, 6413160, 6656079, 5626182, 3998335, 3434747]
48539C434747P7641j048792j774845k24761J396158L67461j433791k52877L009885
48530C550826L647058M62124k246471j148793J450045J432204j321048l364051
48522B461894k523308q1571J522933J545278J044412R20377P39828j21373q94384
48513D614086k84495J150402J237906n45121j831952o16643J808572K721954J551234
48504I805943l0131o15092j87424M21265L7148j821547l505905k518407O44418
48495B230268K211365M35224j439247q5507K612278K669543K86165j146324q79119
48486F894646j051815j779235q17727J630773K440747Q31789j75620J040075K051715
48477A1065348P89049r97115r30483K95495P23084J88949n42586j498765k350031
$$ y = [3434747, 3512388, 2463596, 688751, 463990, 1860148, 2227609, 793818, 540941, 3550826, 7197884, 7660008, 5413537, 4264744, 5714789, 7146993, 5825945, 2461894, -61414, -142985, 1379948, 2925226, 3969638, 4890015, 5629843, 5508470, 4614086, 4329591, 5479993, 6717899, 6172778, 4340826, 3724183, 5532755, 8254709, 9805943, 9775812, 9160720, 8973296, 9394561, 9431709, 7610162, 4104257, 1585850, 2230268, 4441633, 4876857, 3437610, 3352103, 5964381, 8633924, 8920089, 7773765, 6894646, 5842831, 4063596, 3245869, 4876642, 7317389, 8149178, 7973558, 9013633, 11065348, 11854397, 10857282, 9926799, 10222294, 10945378, 11134327, 10591741, 9092976, 6742945]
48468F742945j629439Q90275K912929K617816J182494N33796M33541k34626r81741
48459A2467990o66633L14088O91572K17294n19294j085084r91089P8724J021561
48450A1529129K73924j172060m12283K440669L338240N41464j822983N8535L204854
48441A7979489K278646j714339k766930P52430L752988K380339o81841r77960
48433B1002822J475528L353496K902159J156503k21043m11721L14965P16208j07426
48424C0181491j022818K5597K733454M182314K792230O14968L24427J552722J913698
48415D3298083N84174q50670o53590J256655L553093M766271M542848M054795
48407F0551659M713647O289891P066105O093647M397679L636911M491751O617355
$$ y = [6742945, 5113506, 6003781, 8916710, 11534526, 12717020, 13250816, 13684357, 13449731, 12467990, 11801357, 12115445, 12807017, 13024311, 12505017, 11419933, 10428844, 10507568, 11529129, 11803053, 10630993, 10218710, 12659379, 15997619, 16539083, 14716100, 14774635, 17979489, 20258135, 18543796, 15776866, 16529296, 20282284, 22662623, 21980782, 21002822, 22478350, 25831846, 28734005, 29890508, 29669465, 29257744, 29572709, 30288917, 30181491, 29158673, 29184270, 31917724, 36100038, 38892268, 39507236, 39831663, 41384385, 43298083, 43882257, 43031587, 42377997, 43634652, 47187745, 51954016, 56496864, 60551659, 65265306, 71555197, 78621302, 84714949, 89112628, 92749539, 97241290, 103858645]
48399A03858645R087537J0581964J0407325R822728J1050937J4356021J7441367
48392A86606524J8534757J8722779K0184056K3282980K6595816K8862697K9686968
48385C52476577K8990936K6895601K3685324J9144884J2546903L909806n513877
48378D62136154j4505220k2542735k8647531l1141444k9791631k6913803k4921926
48371B83671864k3816391k2405920k0737198j9564201j8474227j6559370j4261169
48364A47853388j2594230j1150655q968273o922450o912406q655968r546185q096867
48356G5006354n603424l930565l458675l749107m475871m937738m145527k224093
48348D2481354o07999l15752j085566k380978l829472m470449l319735j203399
$$ y = [103858645, 112946182, 123528146, 133935471, 143758199, 154809136, 169165157, 186606524, 205141281, 223864060, 244048116, 267331096, 293926912, 322789609, 352476577, 381467513, 408363114, 432048438, 451193322, 463740225, 467650031, 462136154, 447630934, 425088199, 396440668, 365299224, 335507593, 308593790, 283671864, 259855473, 237449553, 216712355, 197148154, 178673927, 162114557, 147853388, 135259158, 124108503, 115140230, 108217780, 101305374, 92649406, 83103221, 75006354, 69402930, 65472365, 62013690, 58264583, 53788712, 48850974, 44705447, 42481354, 41873355, 41557603, 40472037, 38091059, 34261587, 29791138, 26471403, 25268004]
48340B5268004k85440j082347j695201q14170L83325M23273k44936o33717j079580
48331B0239211k002893k335112j173340J95326L7682r74490q73352K93734O50287
48322A4057053k20480o22553K47862R00689P6196j144186j065927k1390J92242
48313A2399506r82909k068682j623059j90099M44171l67553j288850q41018O19859
48304F101366J575465J476503R68995K58202j071238k390493k137626m09303M97006
48295D868877n80215j665272p29316R93384J069071j86266n56924K18878M51818
48286C884035o7606J92908J196244R57200p79650j533007p5423J303781L44220
48277E422702j623093j831696k15376Q41886m961j734562k643048j930570k9852
$$ y = [25268004, 24982564, 23900217, 22205016, 21390846, 21774171, 22197444, 21952508, 21318791, 20239211, 18236318, 15901206, 14727866, 14923192, 14960874, 13986384, 13113032, 13406766, 14057053, 13836573, 13214020, 13461882, 14362571, 14438767, 13294581, 12228654, 12207264, 12399506, 11416597, 9347915, 7724856, 7534757, 7978928, 7611375, 6322525, 5481507, 6101366, 7676831, 9153334, 10122329, 10380531, 9309293, 6918800, 4781174, 4371871, 4868877, 4288662, 2623390, 1894074, 2887458, 3956529, 3770263, 3213339, 3432217, 3884035, 3816429, 4009337, 5205581, 6162781, 5383131, 3850124, 3774701, 5078482, 5422702, 3799609, 1967913, 1752537, 2594423, 2589462, 854900, -1788148, -3718718, -3748570]
48268c748570J595132J536949J54725o23059L9670O50593q9540r38609J3828K185461
48258G76580L233472K403100J125322M19853l06554j513071k287190j680170k50037
48249A921305N39040L1025r47959j001567K44952J430053Q62695j086589j927923
48240F5032j91752K295223K575648M08085j583161j400483K33847J427862J347022
48231E177323M37200m94074q90538q21029r48325j506426j514712o3994J794814
48222A170239J963701L63149n69618P40700K598190K272148l57781k795243l030719
48213B354766j394592L85481Q66388j72055j476180j220874Q45111K469714J395955
48204D053714j366425k411201m41920J842809J427378r36106k007500n99939J128270
$$ y = [-3748570, -2153438, -616489, -461764, -1084823, -1045153, -394560, -484100, -1422709, -1408881, 776580, 4010052, 6413152, 7538474, 7958327, 7651773, 6138702, 3851512, 2171342, 1921305, 2460345, 2491370, 1543411, 541844, 786796, 2216849, 3079544, 1992955, 65032, -126720, 2168503, 4744151, 5152236, 3569075, 2168592, 2402439, 3830301, 5177323, 5614523, 5120449, 4229911, 3408882, 2460557, 954131, -560581, -624575, 1170239, 3133940, 3497089, 2927471, 3668171, 6266361, 8538509, 8180728, 5385485, 2354766, 960174, 1345655, 2212043, 2039988, 563808, -657066, 188045, 2657759, 4053714, 2687289, 276088, -165832, 1676977, 3104355, 2168249, 160749, -439190, 689080]
48195F89080R24064p67746j864044j276248K85223J404497J244896K18169l24188
48186E33703M04129J380772R10250q94027j980730j132363M90455J314570J407231
48177B433990J403535Q37379p10493j889286j152872M87033N61953j039933j693334
48168g62028m1392J776039J158934j216855k331494q53966J249842J343000n40636
48159b18556j728731l29189K174143K753994R22543p45751n37031J46228k80161
48150B157489p17158K71228J255622J69545j679316j379643O51288J350279K45599
48141B324933j39480P32350M75058j350185j979601n60656P195j535421k057074
48132d082881M82285L008646K269140L2630m94731q457n86568r54031R04924K881208
$$ y = [689080, 1613144, 845398, -1018646, -2294894, -2009671, -605174, 639722, 857891, 533703, 937832, 2318604, 3228854, 2334827, 354097, -778266, -287811, 1026759, 2433990, 3837525, 4674904, 3964411, 2075125, 922253, 1409286, 1971239, 931306, -762028, -803420, 972619, 2131553, 914698, -1416796, -2270762, -1020920, 322080, -218556, -1947287, -2276476, -102333, 2651661, 3574204, 2828453, 2291422, 2437650, 2157489, 1440331, 1711559, 2967181, 3136726, 1457410, 77767, 729055, 2079334, 2324933, 2185453, 2917803, 3392861, 2042676, 63075, -497581, -490386, -2025807, -4082881, -3600596, -591950, 1677190, 1709820, 1215089, 1206632, 620064, -333967, 570957, 3452165]
48122C452165J618340j487002k224408k49026J093122N79413j64734q59215k391063
48113f32408l109193o63055K734532K460339r61379k254521K5808J439742l31861
48104a291996j652364K99199K624079K013658J23325j37542L91435l20405j378991
48095F70398j147026n70763q71704p49247Q14963J830788O98413n86720l6456
48086E2646O17662m46048j070031Q88091K610479O10659k613767k162801Q32316
48077f80794R12354k259212l087032M79951L343052J478735j963407k188816J06715
48068c858454J099858J83240j57349R83583K044470J994453J317041L46396j049211
48059B904027k194570j918221l81503P27860J86433j338309k088436j077968Q95455
$$ y = [3452165, 5070505, 3583503, 1359095, 1110069, 2203191, 2782604, 2617870, 1758655, -632408, -3741601, -4404656, -1670124, 790215, -171164, -2425685, -2399877, -960135, -1291996, -2944360, -2645161, -21082, 1992576, 2115901, 1978359, 2369794, 2049389, 670398, -476628, -1047391, -1919095, -2668342, -1853379, -22591, 675822, 89102, 52646, 670308, 224260, -845771, 42320, 2652799, 3263458, 649691, -1513110, -680794, 231560, -2027652, -5114684, -4634733, -1291681, 187054, -1776353, -3965169, -3858454, -2758596, -2575356, -2732705, -1749122, 295348, 2289801, 3606842, 3953238, 2904027, 709457, -1208764, -1590267, -862407, -675974, -2014283, -4102719, -5180687, -4285232]
48050d285232J985925J188244n12738j142996J74149K385116L532570K364227
48042E689265n66691k968324k680825j54244J737139J179936l28729m59708M14461
48033A862280J78100j244464j565700K04877K047484J722340l62801k001794j758081
48024i17759N2870J999753K551213J272221n13846r72600K4752P19048j61933
48015D053719j641980j710186N6696J643906O96225k405004m176368j882481K502217
48006b863256M134320J602611j082670l33166J792817J046168k286991l902983
47998a893150j987116P00789J520771J131131R95981Q55081J78509k82120M4143
47989A264019L39439j10800p61107j021663j083222q98735o190J156723J543372
$$ y = [-4285232, -2299307, -1111063, -1623801, -2766797, -2592648, -207532, 3325038, 5689265, 5122574, 2154250, -526575, -680819, 1056320, 2236256, 1907527, 1447819, 1862280, 2040380, 795916, -769784, -564907, 1482577, 3204917, 2842116, 840322, -917759, -864889, 1134864, 3686077, 4958298, 4444452, 3471852, 3496604, 4215652, 4053719, 2411739, 701553, 758249, 2402155, 3098380, 693376, -3482992, -5365473, -2863256, 1271064, 2873675, 1791005, 1457839, 3250656, 4296824, 2009833, -1893150, -3880266, -3179477, -1658706, -527575, 468406, 1323487, 1501996, 1219876, 1264019, 1603458, 1492658, 731551, -290112, -1373334, -2272069, -2278259, -1121536, 421836]
47980D21836J348103J499928J333807m69191k506946j784066J062013J795679
47972B701163n89148j661707J020579K960159l24962n235635m862049M31768L667999
47963a891833J915185k48529R63615K856481J635761j315761k290137j137741
47955D87041l88719n44631r9806P71115K28909j556023j960883M8898J953205
47946a060894J129971j418491k434138o47410J920930K727483J459961k70886
47938A406526r95617n18167M23024R04999M61499m71549r18426n70914k25867
47929e04492m42170l95417Q24006K242079J930925o0361j476266j078082k92777
47920G47445o23834j167763l92561R07176O12044j232843k080734l76473K238123
$$ y = [421836, 1769939, 3269867, 4603674, 4134483, 1627537, -156529, 905484, 2701163, 2112015, 450308, 1470887, 4431046, 4106084, -1129551, -5991600, -5559832, -1891833, 23352, -225177, 738438, 3594919, 5230680, 3914919, 1624782, 487041, 98322, -446309, -546115, 225000, 453909, -1102114, -3062997, -3014099, -1060894, 69077, -1349414, -3783552, -4430962, -2510032, 217451, 1677412, 1406526, 410909, -107258, 315766, 1220765, 1682264, 1210715, 292289, -278625, -504492, -946662, -1342079, -518073, 1724006, 3654931, 3594570, 2118304, 1040222, 747445, 123611, -1044152, -1436713, -529537, 82507, -1150336, -3231070, -3607543, -1369420]
47911a369420K981720J277621p48701q54373P47130J697653M91432j418496j522408
47902A282158L0070M34367j494209l166838j948586P44847J504018J2754q11530
47893c412949L91356J476677N27904r74995m49028J855543L159431J901650m01240
47884D074349j263410k55515O69863k63373k302848k974715j215992J237243K130438
47875a63960J378387M52707k3384n22282r30053m26118Q49415J613283J266652
47866C494647N26731n9619p62285j409341j080516J80294Q35048M0030r70737
47857G94252q62325k85997m94414r47558k23846J224970J358219k70801j597190
47848a304690j007348M66448J003289O18908M12670K69970o63063j675370j023756
$$ y = [-1369420, 1612300, 2889921, 2141220, 1286847, 2033977, 3731630, 4223062, 2804566, 1282158, 1312228, 1746595, 252386, -2914452, -4863038, -4118191, -2614173, -2601419, -3412949, -3021593, -1544916, -1017012, -1992007, -2441035, -585492, 2573939, 4475589, 4074349, 2810939, 2555424, 3225287, 2961914, 659066, -2315649, -3531641, -2294398, -163960, 1214427, 1667134, 1643750, 1121468, 191415, -234703, 614712, 2227995, 3494647, 4021378, 3961759, 3199474, 1790133, 709617, 889911, 1724959, 1764989, 794252, -68073, -354070, -848484, -1796042, -2019888, -794918, 563301, 292500, -1304690, -2312038, -1845590, -842301, -223393, 189277, 459247, -203816, -1879186, -2902942]
47839b902942R09656J453763k16003j183417Q82264L541514K766490r07477l059064
47830A284784j950686m41811n91535n24043J282669K407237M47305k266455j800651
47821b153186J263993K764628J108947j220859j970372j432840m05683R42324
47813a103048J767616R48700p58226j405380q29836m81336m78885K59863J127841
47804i52691M30671j022370o12855J397599J886278L62964J6226J819112K313023
47795E637957l06503k503627j159447J139486O71229j111146n63143J580928J700186
47786E085920m09824j694378j237502q23534p96308J29253J315462Q40837n14557
47777A895369k48291J024774K85791k133222k411046K29437J771504q3904k249829
$$ y = [-2902942, -1993286, -539523, -755526, -1938943, -1056679, 2484835, 5251325, 4343848, 1284784, -665902, -1107713, -1699248, -2223291, -940622, 1466615, 1913920, -352535, -2153186, -889193, 1875435, 2984382, 1763523, -206849, -1639689, -2045372, -1103048, 664568, 1613268, 855042, -550338, -1380174, -1861510, -2340395, -2080532, -952691, -522020, -1544390, -2157245, -759646, 1126632, 1489596, 1505822, 3324934, 5637957, 5331454, 2827827, 1668380, 2807866, 3479095, 2367949, 1804806, 3385734, 5085920, 4676096, 2981718, 1744216, 920682, 124374, 253627, 1569089, 2409926, 1895369, 1647078, 2671852, 2957643, 824421, -1586625, -1357188, 414316, 330412, -1919417]
47768a919417j494635P05120J403880Q19371N98910L19907r73266j931068q45266
47759c316464J150179J748755J039177P03577Q04976P1742j369420k006096j295978
47750b469552j11382P01362P17103k92867j549191j328718O30180K087733J367540
47741b47792m3152j4729O84045j3429j592065j707198j45562J004589R04544P47518
47731d23231R45291M48955o89259q29068M07355J236023N82615l37123l10557
47722A031001K0595k43810n66083j12067P68350J259434J169887N97292l47986
47713C576613j043558r16655p30191j579178k431892j045466K045575L285934
47705A161182J239657r29428l32099J037262k38588k997311k982767M29039L064367
$$ y = [-1919417, -3414052, -2708932, -1305052, -485681, 113229, 433136, -540130, -2471198, -3316464, -2166285, -417530, 621647, 1325224, 2130200, 2201942, 832522, -1173574, -2469552, -2580934, -1879572, -1162469, -1455336, -3004527, -4333245, -3703065, -1615332, -247792, -290944, -305673, 378372, 364943, -1227122, -2934320, -3079882, -2075293, -1170749, -423231, 522060, 971015, 281756, -547312, -139957, 1096066, 1678681, 1341558, 1031001, 1051596, 807786, 241703, 129636, 897986, 2157420, 3327307, 3924599, 3576613, 2533055, 1616400, 886209, -692969, -3124861, -4170327, -2124752, 1161182, 2400839, 1471411, 1139312, 2176574, 1937986, -1059325, -4042092, -3613053, -548686]
47696e48686K003379o54819j306807N20065K554639K931063J535597n20440j738879
47687D775112j516915j030141j625130k332545j001649J760606K459944k25698
47679A263584k919245k177665O34820J857140J110667R29608J730423J019552
47671C448884j958767m244650l234534j97350J894856K139015J656780J269022
47663G73256R34982N93374J59247o30813j373436r24139Q05169K043564J397186
47654C778390j34185p68913n47014o20945q20670m4796J264929J257797m70410
47645B894183k096207k175018j325887o17656J08488J245810K047407J589669
47637A670789L81078k46965j7089R6094n51643j418274j667679j217805n25100
$$ y = [-548686, 1454693, 799874, -506933, 13132, 2567771, 5498834, 7034431, 6513991, 4775112, 3258197, 2228056, 602926, -1729619, -2731268, -970662, 1489282, 1263584, -1655661, -3833326, -3198506, -1341366, -230699, 698909, 2429332, 3448884, 1490117, -2754533, -5989067, -6186417, -4291561, -2152546, -495766, 773256, 1708238, 2301612, 2460859, 1830046, 456610, -467529, 337640, 2381204, 3778390, 3644205, 2875292, 2328278, 1707333, 886663, 841867, 2106796, 3364593, 2894183, 797976, -1377042, -2702929, -3320585, -3212097, -1966287, 81120, 1670789, 2051867, 1804902, 1787813, 1883907, 1332264, -86010, -1753689, -2971494, -3496594]
47628c496594K29290J144094J847803J476730p4337j411016j110218K51873P68050
47619c74325K7470k70293P97159J569144L17599j793022k207382o53317P38651
47610a848316O63234J8052L5514P52013J484061J465992J62873j703460j994365
47601i64402K15334K507278J890340q17693k099976r64527J40806j55326l01926
47592e50092N61664P66784m73138j175984j71761N81680l65706j053583L69893
47583a510243K079392J693461L44671J24609n3897j978651l665806k072253J117415
47574c921302J446262j160763k293631k38542J825009J664669J035765J239621
47566d02912M11668k198796l405069q60426K532786K609922O4839j089468K67206
$$ y = [-3496594, -3267304, -2123210, -275407, 1201323, 1126986, -284030, -1394248, -1142375, -374325, -346855, -617148, 180011, 1749155, 2066754, 273732, -1933650, -2586967, -1848316, -1185082, -1167030, -1131516, -379503, 1104558, 2570550, 2733423, 1029963, -964402, -749068, 1758210, 3648550, 2830857, 730881, -233646, -92840, -248166, -550092, 11572, 778356, 305218, -870766, -1042527, -460847, -826553, -1880136, -1510243, 569149, 2262610, 2607281, 2731890, 2677993, 699342, -2966464, -5038717, -3921302, -2475040, -3635803, -5929434, -6167976, -4342967, -2678298, -1642533, -402912, 8756, -2190040, -5595109, -6455535, -3922749, -1312827, -1247988, -2337456, -2070250]
47557b070250J355048K66626j469689j566489L8233J629269J825149O84635n75375
47548A17157p53487N9031N50139j25837j162086j099951L07905J730398J723051
47539A346320M11226m46984M55457J900029J398815j007191k140980l71996J300137
47530B844833l51777l135404k255111K011293M221027J879944j205692j366941
47522B642172k07976n56395j431436p61567J40755r36146k460514j419822J244876
47513c746053J886166J18077p76800N64538J664470O74793p59930n11481Q56049
47504c0171J480747Q57923k56478j174204j432195p69048K27445M29097k74310
47495i41194o62328Q2471J242406J651619J115436K72069l15357m65736k02258
$$ y = [-2070250, -715202, -448576, -1918265, -3484754, -3446521, -1817252, 7897, 692532, 117157, -636330, -577299, -27160, -152997, -1315083, -2415034, -2107129, -376731, 1346320, 1757546, 1310562, 1766019, 3666048, 5064863, 4057672, 1916692, 1544696, 2844833, 2493056, -642348, -2897459, -886166, 3334861, 5214805, 4009113, 2642172, 2434196, 1877801, 446365, -315202, -174447, -1110593, -3571107, -4990929, -3746053, -1859887, -1741810, -2518610, -1954072, -289602, 385191, -374739, -886220, -30171, 1450576, 2308499, 2052021, 877817, -554378, -1323426, -1095981, -666884, -941194, -1603522, -1521051, -278645, 1372974, 2488410, 2760479, 2445122, 1979386, 1777128]
47486A777128L05813O77778L82023q18323k161855k128841l32423J258429N56529
47477d83742j361671j415628P19089J798419J35812j508404m05998J595789J221625
47468B95291p45647j025136M87545Q70270m78494r92503J57543N02031j141868
47459b070968k282843q81082J241318J438200K62279q5133M38112J50870j022880
47450b812127j201798M69276K331916K232936R5254k015493k141650n16129Q30506
47441b727309O31044r0239K98860J540422J897481O94686r35856j767417j621553
47432b079881p99445L35644J121295J104451P93131Q38226P67257j35058j084226
47423H61394o79990N87588O27836j163655k823582k339164N7489K440394K969021
$$ y = [1777128, 2082941, 2760719, 3142742, 2324419, 162564, -1966277, -2298700, -1040271, -483742, -1845413, -3261041, -2541952, -743533, -607721, -2116125, -2522123, -926334, 295291, -450356, -1475492, -987947, -117677, -596171, -1588674, -1431131, -929100, -2070968, -4353811, -5234893, -3993575, -2555375, -2293096, -2378229, -1940117, -1789247, -2812127, -4013925, -3544649, -1212733, 1020203, 1115457, -900036, -3041686, -3557815, -2727309, -2096265, -2186504, -1887644, -347222, 1550259, 2244945, 1309089, -458328, -2079881, -2879326, -2543682, -1422387, -317936, 475195, 1313421, 2080678, 1945620, 861394, 181404, 768992, 1396828, 233173, -2590409, -4929573, -4872084, -2431690, 537331]
47414E37331J195273j263783j782433J77003J794916N61828j784572j641829Q43709
47405a362557J925031J04881j759719j155768N98760J112680M02496j18312O5514
47396a86994P64165J611351J396817q22240l087263j984301J932803L539395J96891
47387C360624l813925l035208J555358M331219K769129l56918j835899j556368
47379A418012r42619n96792l44365j25559k04429r29100k038047k173445l34976
47370f271320J951237J899535l92386j501688L17847K357868J681318m56416j065922
47361a479927j08674L47793K843J57047P98313Q56475N38995P17724Q31991n9324
47351B603256j099900r98394m16594m66685k96366R46210J436201n20386k581926
$$ y = [537331, 1732604, 468821, -1313612, -1136609, 658307, 1220135, -564437, -2206266, -1362557, 562474, 667355, -1092364, -2248132, -1649372, -536692, -134196, -252508, -186994, 577171, 2188522, 3585339, 2763099, -324164, -2308465, -375662, 3163733, 3360624, -453301, -3488509, -1933151, 2398068, 5167197, 4810279, 2974380, 1418012, 475393, -121399, -465764, -591323, -795752, -1724852, -3762899, -5936344, -6271320, -4320083, -2420548, -2812934, -4314622, -3996775, -1638907, 42411, -414005, -1479927, -1588601, -1240808, -1237965, -1080918, -282605, 573870, 1112865, 1830589, 2662580, 2603256, 1503356, 504962, 88368, -378317, -674683, 271527, 1707728, 1187342, -1394584]
47342a394584j447116J326325J312256j467190k345155M05991K896485J975573
47334A262585l19903p90887K79261Q62108M76243m44782j822528k707186j388046
47325d593135J520857K744295Q71799j410884j414805m9745O24221O34882O11448
47316d61067j73288j644090j429506J458190L800344K402542q28597j731134k67437
47307A125957N1316j637812k261597j48518K178304J902375k22144j545676j145474
47298a703269k01920R5253k58954m72855J31529J322925K013905J506384L85415
47289B818413m10969q48572j247877j160554p8595J180942J230196Q5214r20014
47280F48184j041699o23350J38707J355047K250179J467560q44005k613143k317810
$$ y = [-1394584, -2841700, -1515375, -203119, -1670309, -4015464, -3609473, -712988, 1262585, 942682, 151795, 431056, 1293164, 1769407, 1324625, -497903, -3205089, -4593135, -3072278, -327983, 543816, -867068, -2281873, -2331618, -1707397, -1072515, -461067, -634355, -2278445, -3707951, -2249761, 1550583, 3953125, 3124528, 1393394, 1125957, 1177273, -460539, -2722136, -2870654, -692350, 1210025, 987881, -557795, -1703269, -1905189, -1809936, -2068890, -2541745, -2410216, -1087291, 926614, 2432998, 2818413, 2407444, 1558872, 310995, -849559, -928154, 252788, 1482984, 1568198, 648184, -393515, -1016865, -878158, 476889, 2727068, 4194628, 3350623, 737480, -1580330]
47271a580330q26223Q6142J65625N13720J441715J742633M37349j508509j983095
47262a510973k86695J714085J579350p26951k635180k013951L02262J646577P35748
47253a195728j016998j361981K05869J960199J882300o1702j788700j431525N13154
47244b295112J905826J571953L46700m33576m68069k78490l78958r61637j589719
47235b581082j123538R10514K788451K051803r52572k804120j355218J391840
47227a673922K251439J055784j15003n38259j114694j704825r77179R14225J948020
47218D5586J166612m0160l62122m10693j055806j535822p00583Q55537J403072
47209f34379M42832p18012p39534J90354P54033J31433r70465j086500J25370
$$ y = [-1580330, -2406553, -2320411, -2154786, -1641066, -199351, 1543282, 1980631, 472122, -1510973, -1797668, -83583, 1495767, 768816, -1866364, -3880315, -3578053, -1931476, -1195728, -2212726, -3574707, -3368838, -1408639, 473661, 411959, -1376741, -2808266, -2295112, -389286, 1182667, 1529367, 1095791, 627722, 349232, -29726, -991363, -2581082, -3704620, -2794106, -5655, 2046148, 1093576, -1710544, -3065762, -1673922, 577517, 1633301, 1518298, 980039, -134655, -1839480, -2816659, -1902434, 45586, 1212198, 1172038, 809916, 399223, -656583, -2192405, -2892988, -2037451, -634379, -191547, -909559, -1649093, -1458739, -704706, -573273, -1543738, -2630238, -2504868]
47200b504868J273354J039741Q228l46126j1085k14330r09907m80968J331827
47191h14134K211138N53923j549315q71692K111396L466611J182788k032504k550040
47182A708171o63518K64032j298569l129750k539893J14633K227614K295955J228505
47173B07180N96861P55749R75558O42369j77929j002261j382950j269849j042064
47164a697336r29985m75869Q20608K214905J990286l35446k820881l135104j386233
47155e755055K25937M25114J47021N24535J105824J100006J167476K282382L354708
47146D577948K044709j621691m311939l299404o1048J639478N47539j044721r19741
47137b448870L60748R83039M97911j87572m19047l10899k33817n08832j027666
$$ y = [-2504868, -1231514, -191773, -183545, -529671, -540756, -755086, -1664993, -2145961, -814134, 1397004, 1950927, 401612, -470080, 1641316, 5107927, 6290715, 4258211, 1708171, 1044653, 1308685, 10116, -3119634, -5659527, -5544894, -3317280, -1021325, 207180, 804041, 1559790, 2535348, 3177717, 2999788, 1997527, 614577, -655272, -1697336, -2627321, -3103190, -2282582, -67677, 1922609, 1587163, -1233718, -4368822, -5755055, -5529118, -5104004, -4956983, -4432448, -3326624, -2226618, -1059142, 1223240, 4577948, 6622657, 5000966, 689027, -2610377, -2671425, -1031947, -484408, -1529129, -2448870, -2088122, -1105083, -607172, -794744, -1213791, -1524690, -1758507, -2267339, -3295005]
47128c295005q30632Q39115K627757J942403j182437l067151j172837J926304
47120b212483K104579k10811j058068N84284J538349K02383p11453R24737K782280
47111C943797J905424n08278j420837q71056j026977j799732j213965M25348M99499
47102f6777j462120k603579j014970J484246K166270R96112m0483J26467P47809
47093C32975O52946l16482j079555m77603J007459J343278l22111j931499j135928
47084a926520J151421K003031P90586m13924o99842j424479k720394k279608N50669
47075d969060K476153P78926k126875j907646J316679L315851K018128l8734q7798
47066G75624J052355R58777o97582k153880k143936j062121n8676J10285l32873
$$ y = [-3295005, -4125637, -3286522, -658765, 1283638, 101201, -2965950, -4138787, -2212483, -107904, -318715, -1376783, -792499, 745850, 948233, 236780, 1161517, 3943797, 5849221, 5340943, 3920106, 3049050, 2022073, 222341, -991624, -566276, -66777, -1528897, -4132476, -5147446, -3663200, -1496930, -500818, -541301, -414834, 332975, 985921, 669439, -410116, -887719, 119740, 1463018, 1140907, -790592, -1926520, -775099, 1227932, 2018518, 1604594, 904752, -519727, -3240121, -5519729, -4969060, -2492907, -1713981, -3840856, -5748502, -4431823, -1115972, 902156, 863422, 775624, 1827979, 2786756, 2089174, -64706, -2208642, -3270763, -3329439, -3219154, -3552027]
47057c552027l04620R25309K403767K235288P4014k095810k349619j059658J62295
47048c561061Q40040J573807K127126J335873p25443j984349q09170J577707K329416
47039B703946N21665j582628j307282J028622K380760P36033k297090l445119
47031a261093j836920J61583L61545m76447l07958R61859J626294R82680k693
47022B08850q03462j928455k868408j773543J455180L777994K689990k23509j599483
47013a064846r08426j83889q6755O26014J846476J615196l81362j721515q69162
47004a128269O08943Q03099J27976k75072n80856j012818o52837N84919Q60477
46995f64438o14165j616052l66811J218024P22556m09100N49910K333414J508308
$$ y = [-3552027, -3856647, -2931338, -527571, 1707717, 1781731, -314079, -2663698, -3723356, -3561061, -2721021, -1147214, 979912, 2315785, 1590342, -394007, -1203177, 374530, 2703946, 3225611, 1642983, 335701, 1364323, 3745083, 4481116, 2184026, -1261093, -3098013, -2936430, -2574885, -3051332, -3359290, -2397431, -771137, 211543, 208850, -594612, -2523067, -5391475, -7165018, -5709838, -1931844, 758146, 534637, -1064846, -1973272, -2157161, -2243916, -1617902, 228574, 1843770, 1462408, -259107, -1128269, -519326, 283773, 411749, 136677, -444179, -1456997, -2109834, -1524915, -664438, -1278603, -2894655, -3261466, -2043442, -1320886, -1729986, -1180076, 1153338, 2661646]
46986B661646j240860j691476P78230J830505n93587k696196j149094J441474
46978f59358J150217o67481p273K665527K930145m21425l317901k420672L86291
46969c61930J214140n53252k186155j566964N41900J927646J519318K62041k99545
46960D97199R6064M24868J21671j61972Q3290K43534k35652p62050p35200o80161
46950a108409r34770l76792J688454L301531J911953j583932l363935j618970
46942b084870J321792K534792J945217J019591Q5977j146129j788752p30455J116805
46933B273968J518617o6138j753997j819667o76388K28733L53078Q9312l32994
46924a85476r31028j263706p09189L79515P16763j54419q72425p173J583333J529681
$$ y = [2661646, 1420786, -270690, 507540, 2338045, 1744458, -951738, -2100832, -659358, 490859, -176622, -183895, 2481632, 5411777, 4990352, 1672451, -748221, -361930, 852210, 298958, -1887197, -3454161, -2912261, -984615, 534703, 796744, 497199, 593263, 1018131, 1139802, 977830, 1061120, 1304654, 1069002, 306952, -428248, -1108409, -2043179, -2419971, -731517, 2570014, 4481967, 2898035, -465900, -2084870, -763078, 1771714, 3716931, 4736522, 4822499, 3676370, 1887618, 1157163, 2273968, 3792585, 3726447, 1972450, 152783, -523605, -294872, 58206, 147518, -185476, -1116504, -2380210, -3089399, -2709884, -1993121, -2147540, -3019965, -3027138, -1443805, 85876]
46914H5876o51665k412906j419171J239679K566487J603789L9839p48569j070510
46905g67151j087582L7447K074349K853496J127431j204332j553500j14448J039727
46896B405437J179256R63008K56051j301828k113320l04114K303967J560961k643054
46887B306364n117774k522761J707685K566481N63431l02745O12486N48278r17551
46878e56106j166092J68322J18326k089092k961185m08806K490384K318208N65588
46869a520453N52001J706812R74634j598048k802822j370218M87623Q39905K98370
46860b432196J8191K0308J86490Q03635J437823J031548l14112j194735r41896
46851a384944l65007j73986q6605K14831N29326P10162O75590L6448j068615j315676
$$ y = [85876, -565789, -2978695, -4397866, -3158187, -591700, 1012089, 1051928, 303359, -767151, -1854733, -1817286, 257063, 3110559, 4237990, 3033658, 1480158, 1365710, 2405437, 3584693, 4547701, 4803752, 3501924, 1388604, 1084490, 3388457, 4949418, 2306364, -2811410, -5334171, -3626486, -1060005, -496574, -799319, -186833, 361445, -556106, -1722198, -1553876, -1435550, -3524642, -6485827, -6894633, -4404249, -2086041, -1520453, -968452, 738360, 1712994, 114946, -2687876, -4058094, -3570471, -2730566, -2432196, -2414005, -2393697, -2207207, -1403572, 34251, 1065799, 751687, -443048, -1384944, -1749951, -1923937, -2010542, -1795711, -1266385, -556223, 119367, 155815, -912800, -2228476]
46841b228476J0094J220691L01606j750370k110313l49474J230222J414646J230919
46832a030455J039621k03484j978431j902724K15459J296113k33529j733812o94364
46823e225606J188926J081258l78027o95801K15396O78312O54862J230352J795732
46814E45404R61508m84107o04285L19968M77330j126M85143J364059K74312k561274
46804G76932l840682k074838J60783L36308m39992R1882J445416J385104l50973
46795b510060j602529q13560J130256K271698J779712M39190n53582q23680p47363
46786a429918n22912m668N33599M82737R7346L87456J174071P81355j184035k415274
46776b100243j046060J285246J761191N21479j78443L5583l75619j336379r90959
$$ y = [-2228476, -2218382, -997691, -696085, -2446455, -4556768, -4906242, -3676020, -2261374, -1030455, 9166, -194318, -2172749, -4075473, -3860014, -2563901, -2797430, -4531242, -5225606, -4036680, -2955422, -3333449, -4029250, -3813854, -3135542, -2480680, -1250328, 545404, 1506912, 1022805, 418520, 738488, 1215818, 1214692, 1699835, 3063894, 3338206, 776932, -3063750, -5138588, -4977805, -4641497, -5081489, -4989607, -3544191, -2159087, -2510060, -4112589, -4926149, -3795893, -1524195, 255517, 694707, 141125, -682555, -1429918, -1952830, -1957498, -1423899, -941162, -843816, -456360, 717711, 1499066, 315031, -2100243, -3146303, -1861057, -99866, 421613, 243170, 278753, -96866, -1433245, -2424204]
46767b424204O64654J273853K6933r76117l66174L90432n5880o06417j14719K98219
46757a889420n86529j565425q71798R06604J861497J609810J209890J095892P90391
46748B560912P6522q24399j650889j856997r13891N05588R85963O18658R55826
46739D57293J922807J226962j629654l386012j487258J752307K428314O72591
46731A957350l92929N977j56358j342668j555201j39624J036907R78127R38813
46722A330394J434107R72482q57629j967630j200730m77923j346545j888305J23611
46713c878168K930865L007356N13937r85857q0901P39060l61322j560057o97508
46704c72595J012213J054451l34268r63308n47282p39989j512935p19738J920392
$$ y = [-2424204, -1759550, -485697, -458764, -1434881, -1801055, -1410623, -1466503, -2072920, -2187639, -1889420, -2475949, -4041374, -4913172, -4006568, -2145071, -535261, 674629, 1770521, 2560912, 2637434, 1813035, 162146, -1694851, -2608742, -2103154, -1117191, -498533, 457293, 2380100, 3607062, 1977408, -1408604, -2895862, -1143555, 1284759, 1957350, 1564421, 1570398, 1414040, 71372, -1483829, -1623453, -586546, 391581, 1330394, 2764501, 3736983, 2879354, 911724, -289006, -766929, -2113474, -4001779, -3878168, -947303, 2060053, 2573990, 1588133, 1507232, 2246292, 1884970, 324913, -372595, 639618, 1694069, 1359801, 396493, -150789, -890778, -2403713, -3123451, -1203059]
46695a203059L430278J863905n46094q06730L83888M38846n18900l32983P91038
46686C500189M21238j540747k308989r84186o5442p93488p83860J451418L126256
46677B022389J401714j791619k605040q62388O92059J024733J052954N99121j074021
46668D59902k528493j707401L20370Q05017p5064O7056J035710M40145j205926
46659b388684p26984J721177K148901k97211j299888J196698K951460N68851k298937
46650A575383q93063K497643K261600j295681k807425p30586R43837n7576j252097
46641B42035p56491l82104j418546j845299k19344J385297R84476Q6633P13753
46632a209590J748029J261073K20361N75302J320007K2745k567194l023881m74916
$$ y = [-1203059, 2227219, 4091124, 3545030, 2738300, 3122188, 3561034, 3042134, 2709151, 3500189, 3921427, 2380680, 71691, -912495, -977937, -1771425, -2555285, -1103867, 2022389, 3424103, 1632484, -972556, -1834944, -1142885, -118152, 934802, 1533923, 459902, -2068591, -3775992, -3455622, -2650605, -2725669, -2658613, -1622903, -1182758, -2388684, -3115668, -1394491, 754410, 457199, -842689, 354009, 3305469, 3874320, 1575383, 682320, 3179963, 5441563, 4145882, 1338457, 607871, 1551708, 1494132, 242035, -514456, -896560, -2315106, -4160405, -4379749, -2994452, -2009976, -1923343, -1209590, 538439, 1799512, 2019873, 2595175, 3915182, 3937927, 1370733, -1653148, -2128064]
46623b128064J842035J173710j064925j647706L0760J583812J121393l79184o07292
46614g5461Q93011K027692R86038j098242j573023l0724J171112N52472m10727
46605B442148r4929M14574n74823j926838j179745J183946K042843L69395j352784
46596A323787j277404q55958j748272k617408j379692J097727K244109J761279
46588a451832J613926K349732K152445M7928k275697k866466j976721r83389k37994
46579c628068O83723J553378J663245R45318o6636r20757j135204j85593J387628
46570B97034J747871P8831j606597q60959J389171J794704l63705j737135J23577
46561H62792K752976K127820j441147l694209k325785L51858J183256J28100p82073
$$ y = [-2128064, -286029, 887681, -177244, -1824950, -1794190, -210378, 911015, 531831, -75461, 817550, 2845242, 3831280, 2733038, 1160015, 1129291, 2300403, 2852875, 2442148, 2347219, 2761793, 2186970, 260132, -919613, 264333, 2307176, 2676571, 1323787, 46383, -809575, -2557847, -5175255, -6554947, -5457220, -3213111, -1451832, 162094, 2511826, 4664271, 4712199, 2436502, -429964, -2406685, -3390074, -3628068, -2944345, -1390967, 272278, 1217596, 1150960, 230203, -905001, -1090594, 297034, 2044905, 2123736, 517139, -343820, 1045351, 2840055, 2476350, 739215, 862792, 3615768, 5743588, 4302441, 608232, -1717553, -1365695, -182439, -54339, -836412]
46552h36412n83406J22141O83683Q95748N78213j39154n34751j98589K70470K21086
46542D79029p1790j62183k78432m27788K73595J938405K571695L73684l111351
46533A584864m287913j982100J318820K853461K255975N72246j213165j955613
46525h53425p73334J214755J450987n51189k112814j235173L74776Q6984j469466
46516c867899j475124P42247K905479L030861J393928o40145j946823j855594
46508a713070o34145K86506r5043q60694o19795K18261L29116p6768J92889Q22031
46498b150712M57895n43152m19852Q30829J224878J29871p73585m72896M5000
46489a671724K01438Q43379J821949J354938p77344k115938j305676l51550j095574
$$ y = [-836412, -1419818, -1297677, -613994, 281754, 859967, 720813, 186062, -12527, 257943, 479029, 407239, 245056, -33376, -461164, -187569, 1750836, 4322531, 4696215, 1584864, -2703049, -4685149, -3366329, -512868, 1743107, 2315353, 1102188, -853425, -1626759, -412004, 1038983, 487794, -1625020, -2860193, -2485417, -2398433, -3867899, -5343023, -4600776, -1695297, 1335564, 2729492, 2089347, 142524, -1713070, -2347215, -2060709, -2155752, -3016446, -3636241, -3417980, -3088864, -3165632, -2972743, -2150712, -1692817, -2235969, -2655821, -1824992, -600114, -470243, -1243828, -1716724, -1671724, -1470286, -626907, 1195042, 2549980, 1772636, -343302, -1648978, -2000528, -3096102]
46480c096102k020381j009832R64093J629820J047672P36444P60143L56291K7502
46471f04350M31870O62823J28827L18597J874917K084673j074903m406033l481167
46462d064746K65316J492199o82975j753849M64424K792797K665145J829550J933432
46453D941293J285147j124834k594379j001052J313436J230763n23796j563149
46445A963429j772177j848065p51940J794177K844184K09440l212222l162355
46437c935529l13926J333945Q01216L46823M35448o41124k365953j987993O06809
46428e720284K299880J734026Q85795Q66050K85645j020465q47974J020508J344920
46419H48101j288747l355270j504586K250226L703492K368920Q27821J02854p28935
$$ y = [-3096102, -5116483, -6126315, -5162222, -3532402, -2484730, -1748286, -988143, -631852, -604350, -172480, 490343, 619170, 937767, 2812684, 4897357, 3822454, -583579, -4064746, -3799430, -2307231, -2990206, -4744055, -4279631, -1486834, 1178311, 3007861, 4941293, 6226440, 5101606, 2507227, 1506175, 2819611, 4050374, 3526578, 1963429, 191252, -1656813, -2408753, -614576, 2229608, 2439048, -773174, -3935529, -4249455, -2915510, -2114294, -1767471, -1332023, -1973147, -4339100, -6327093, -5720284, -3420404, -1686378, -800583, 65467, 351112, -669353, -1517327, -496819, 848101, -440646, -3795916, -5300502, -3050276, 653216, 3022136, 3849957, 3952811, 3223876]
46410C223876j528326j197223k24431p3999m07342K51411J421763J198300j77597
46401B486432l66835R87659J305376o80862k491451j506680J088393K073225N67896
46392C463153j432736k133954j599305o08160L86984R49164O48496j56963l91618
46383h74939M24815J453098J466168K21164j246587j534229k00514J548340J800722
46374C058038N1163j963172k229247r07876J98336L60173N89298J365044J516460
46365B038217L73170o56040k87597K52190p50654k084948j067100J785272K737356
46356B339866L66190j963887j009873J525455J731413o53373k206684j012187
46348h83080J052228J467708J70938j169612j294271j28119J362291J701745L57800
$$ y = [3223876, 1695550, 498327, 273896, 199897, -207445, 43966, 1465729, 2664029, 2486432, 2119597, 3107256, 4412632, 3731770, 1240319, -266361, 822032, 2895257, 3463153, 2030417, -103537, -1702842, -2311002, -1924018, -974854, -326358, -483321, -874939, -450124, 1002974, 2469142, 2690306, 1443719, -90510, -291024, 1257316, 3058038, 3109201, 1146029, -1083218, -1991094, -1792758, -1432585, -843287, 521757, 2038217, 2411387, 1755347, 1467750, 1719940, 969286, -1115662, -2182762, -397490, 2339866, 2706056, 742169, -267704, 1257751, 2989164, 2335791, 129107, -883080, 169148, 1636856, 1807794, 638182, -656089, -784208, 578083, 2279828, 2637628]
46339B637628j210390j093885M59345J311081M24592q81862j090771n20591m56056
46330d20909j170816j609257p49100J001035J821902M90238j479326j142960J529449
46321a729744K654658j37736l357590k207857J912600L113502Q8468j901255K94594
46312a270360K493267J93613l661071l070004J525057L843197J196624k023671
46304g73348j259240K108509L558098J493771j675604k991207j767734K92001
46296a014754Q07774r54222l068320k874356o3318K867080L318406J143057j397720
46287a236373j707042O94186L249210K722008p75338l345982k162847O95042J280208
46278e86928o16403j689689l95866J153377R54727j59862o28868n82336p51090
$$ y = [2637628, 1427238, 333353, 792698, 2103779, 2528371, 1646509, 555738, 35147, -420909, -1591725, -3200982, -3950082, -2949047, -1127145, -636907, -2116233, -3259193, -1729744, 924914, 787178, -2570412, -4778269, -2865669, 247833, 336301, -1564954, -1270360, 1222907, 1416520, -2244551, -5314555, -3789498, 53699, 1250323, -773348, -2032588, 75921, 3634019, 5127790, 3452186, 460979, -1306755, -1014754, -206980, -1161202, -4229522, -7103878, -7167196, -4300116, -981710, 161347, -1236373, -2943415, -2249229, 999981, 3721989, 2946651, -399331, -2562178, -1867136, -586928, -1203331, -2893020, -3288886, -2135509, -1180782, -1340644, -1969512, -2551848, -3302938]
46269c302938p90053j43439P15633J101365J135009J103888Q53327M47160K88217
46260A408169J35728o09462j279308m18549J495227J967901K48838j082415k2065
46251A844064J502715O29886j717758k149883j33153J193422j37372k082307j804897
46242b855283K99626J499019O11921p19111n91410O08279R45681k17352j172255
46233a590885k15810J736675K226155P66568m70230n3611N30221m54580j797141
46224F77362j093935J177014K021191M16459j199723p82489L49635m978j311456
46215B49080j380042r5103M09596p04677j566497n46015J215541J626590P35063
46206e6464K22030M44746L4161j383703k059192p21572J160095J204299n74307
$$ y = [-3302938, -4092991, -4236430, -3520797, -2419432, -1284423, -180535, 672792, 1119952, 1408169, 1543897, 934435, -344873, -763422, 731805, 2699706, 2948544, 1866129, 1844064, 3346779, 3976665, 2258907, 109024, -24129, 1169293, 1031921, -1050386, -2855283, -2555657, -1056638, -444717, -1163828, -1755238, -1146959, -201278, -418630, -1590885, -1806695, -70020, 2156135, 2922703, 2452473, 2398862, 2929083, 2474503, 677362, -416573, 760441, 2781632, 3198091, 1998368, 1215879, 1565514, 1560536, 249080, -1130962, -1226065, -816469, -1521146, -3087643, -3633658, -2418117, -791527, -56464, 165566, 610312, 644473, -739230, -2798422, -3519994, -2359899, -1155600, -1729907]
46197a729907j816250r57561J003626K011451J245685l23328j058874k47151J099381
46188g72928J318212K64852m26188J22130N26173m43434j319013j33435J751968
46179H88337J127061j758963k830914k17955K667855K155298l96642j179444K34192
46170F88825R86723j72255j461803j439117q22436m53423J00125J084516J625874
46161A37029J142063K51290l70446p24415o63479J53381R62119K59037j647069
46152e00490k161043J21982K875262K803733Q5148j974502j446730J52430O97469
46143F53259L62103M62125Q17751J40228j394259j878597m40503J231078J095304
46134A048489n15577j563050j077468K4026O35344O65347M48360J18749j01687
$$ y = [-1729907, -3546157, -4503718, -3500092, -1488641, -242956, -566284, -1625158, -1872309, -772928, 545284, 810136, 383948, 506078, 1032251, 588817, -730196, -863631, 888337, 2015398, 256435, -2574479, -2792434, -124579, 2030719, 1634077, 454633, 688825, 1675548, 1503293, 41490, -1397627, -2220063, -2673486, -2573361, -1488845, 137029, 1279092, 1530382, 1159936, 435521, -227958, -74577, 887542, 1146579, -500490, -2661533, -2539551, 335711, 3139444, 3224592, 1250090, -196640, -44210, 653259, 1015362, 1477487, 2295238, 2435466, 1041207, -837390, -1277893, -46815, 1048489, 532912, -1030138, -2107606, -2083580, -1448236, -782889, -334529, -215780, -317467]
46125c17467Q4526M18570K30644n42729j195779j224383p48060l9455N15466K67730
46115b550937p14173r09778P54348K579234J888414p72182j905771k19851J426262
46106d24434O52672q18324m26481R31148P89287o15573j111294l30360L41668
46097a011691N41043P47031L48081j092516j695601K18460K409596J413613j599887
46088B78129k086266O21461K080511j31278k720321k170300K11750J389933J213979
46079a312402J013825N88156l76845n23530N36498M27422j871541k829237O19761
46070c727893N079516M597245n90646m332490l443272j152191p16028o34749J313396
46061c607112L320477K353505o97759k219046j108191K92049K09567l35755J30426
$$ y = [-317467, -232941, 185629, 416273, -126456, -1322235, -2546618, -3294678, -3334133, -2818667, -2550937, -3265110, -4174888, -3420540, -841306, 1047108, 274926, -1630845, -1850696, -424434, 228238, -590086, -1016567, -85419, 703868, 88295, -1022999, -1353359, -1011691, -470648, 276383, 624464, -468052, -2163653, -1945193, 464403, 1878016, 278129, -1808137, -1186676, 893835, 762557, -1957764, -4128064, -3916314, -2526381, -1312402, -298577, 289579, -87266, -610796, -74298, 353124, -1518417, -4347654, -3727893, 1351623, 5948868, 5358222, 1025732, -2417540, -3569731, -4285759, -4920508, -3607112, -286635, 2066870, 1369111, -849935, -1958126, -1666077, -1456510, -1792265, -1661839]
46052a661839J054647R19702k98261j094483o70321l0021l24190r39199l74995
46043c418960J245647K043710J149592K5884M2789K84385n75712j486505m16015
46034a105185K033269K910771R73276j801053l184311l008930j863742J87959
46026d857946K336473K587904M25937j616371j013792J229578K143143J051404
46018B286330K6533L97283J141994J110942P13429M49287m83314k613041m294477
46009a265034l191572M16392L294376K822458N3031j633845n65635J524956K043558
46000C498685P80001l29789j78000J85417m89149j634448j751631n76232O76898
45991A81752Q67585j29372j625256k330088r05717K320250M477138K765596j703209
$$ y = [-1661839, -607192, 312510, 14249, -1080234, -1750555, -1780576, -2104766, -3043965, -3418960, -2173313, -129603, 1019989, 1045873, 1088662, 1373047, 797335, -689170, -1105185, 928084, 3838855, 4812131, 3011078, -173233, -3182163, -5045905, -4857946, -2521473, 66431, 492368, -1124003, -2137795, -908217, 1234926, 2286330, 2312863, 2710146, 3852140, 4963082, 5676511, 6125798, 5642484, 3029443, -1265034, -4456606, -4040214, -745838, 2076620, 2129651, 495806, -69829, 1455127, 3498685, 4278686, 3948897, 3770897, 3956314, 3467165, 1832717, 81086, -495146, 181752, 1049337, 919965, -705291, -3035379, -3941096, -1620846, 2856292, 5621888, 3918679]
45982C918679m432255k770992R14638K520260J251400l41540m13346K71320L72617
45973A290781j11195n26892o93814o25951j55874N16175O66419m2013j066634
45964g48998j648570j383413j83891J451700K244038J379576o0064k71287O69249
45955A448340J044646M08154P1333K37376o70965k637822k921382m02897J686413
45946a736804L70107k080078j537087J273394J952045l42684j685272M8071K080763
45937a657545J787315O45679P85603J159080P1822j277622r36423K57310L75708
45928A210927r5218L85639R93116j21399j971536j754069M99087J679707L82843
45919A209097j185900r41840K13301N73723L62315N66902P23346k00253j593354
$$ y = [3918679, -513576, -3284568, -2369930, 150330, 1401730, 1060190, 646844, 918164, 1290781, 1179586, 652694, -41120, -667071, -822945, -306770, 359649, 317636, -748998, -2397568, -3780981, -3964872, -2513172, -269134, 1110442, 1050378, 779091, 1448340, 2492986, 2901140, 2972473, 3209849, 2538884, -98938, -3020320, -3423217, -1736804, -1366697, -3446775, -4983862, -3710468, -1758423, -2101107, -3786379, -3738308, -1657545, 129770, 775449, 1561052, 2720132, 2791954, 1514332, 577909, 835219, 1210927, 1115709, 1501348, 2494464, 2373065, 401529, -1352540, -853453, 826254, 1209097, 23197, -918643, -705342, -131619, 230696, 797598, 1520944, 1320691, -272663]
45910b72663j701977j77787J277635J128441o0053n25693K74770J044191O84998
45901A671862Q738L55475J142028N51039j300118k027300o41191O65056k4049
45892D01540j149707l02825J528245J331568j033493k470782j284373P10106J345618
45883i24103Q36246L81495J87042K7246R0537K43651j07816p08062n67777L3320
45873e08221m06593j766230j752804M43229K180493J043716j362392j703481L07759
45864c524524J980026J688172L36507p84472j179201m05848J410583K335988M35138
45855B292369k884610l950017j842595M29232P74163Q96953K401143L166181Q71012
45846B153831k194537j994726P36081J380735j189202k841808r68860J531889
$$ y = [-272663, -1974640, -2152427, -874792, 253649, 193596, -332097, -57327, 986864, 1671862, 1680600, 2036075, 3178103, 3729142, 2429024, 401724, -239467, 425589, 401540, -748167, -1050992, 477253, 1808821, 775328, -1695454, -2979827, -2269721, -924103, -87857, 293638, 480680, 507926, 598463, 842114, 734298, 26236, -541541, -508221, -914814, -2681044, -4433848, -3990619, -1810126, -766410, -2128802, -3832283, -3524524, -1544498, 143674, 480181, -304291, -1483492, -1889340, -478757, 1857231, 2292369, -592241, -4542258, -6384853, -5955621, -5181458, -4284505, -1883362, 1282819, 2153831, -40706, -2035432, -1299351, 81384, -1107818, -3949626, -4918486, -3386597]
45838c386597J460716M17519J212304K477001J249191j258660j327846Q67793
45830A711421J431998p49030k414947j573259k35510j22313J43578J523416K050293
45821A765647L78357j380976j099802q6199k83484o68429M32924J735008J076492
45812A869538o74638j141559m20058k96681p42244m23854K88428m1175j076673
45803b658916j349292q07754q6771J381089L568361L882444O25118l120822l188989
45794a755532o43206J27333j404054j732269O2390J008730K1793l66391Q86445
45785c794761J570989Q99009R55453J952648J148917j560821k209907N66773K578329
45776B106629Q75962j484879j115541N2981r13666k290391j188535Q94100J047247
$$ y = [-3386597, -1925881, -1508362, -296058, 2180943, 3430134, 2171474, 843628, 1711421, 3143419, 2394389, -20558, -1593817, -1829327, -1951640, -1808062, -284646, 1765647, 2144004, 763028, -336774, -422973, -706457, -1374886, -941962, 793046, 1869538, 1194900, 53341, -366717, -663398, -1405642, -1829496, -1541068, -1582243, -2658916, -4008208, -4815962, -4902733, -3521644, 46717, 3929161, 4554279, 1433457, -1755532, -2398738, -2271405, -3675459, -5407728, -5345338, -4336608, -4314815, -4681206, -3794761, -2223772, -1324763, -369310, 1583338, 2732255, 1171434, -1038473, -471700, 2106629, 2982591, 1497712, 382171, 435152, -478514, -2768905, -3957440, -3063340, -2016093]
45767b016093L97851J448501K644153R78655k055463k534520n74513N13233K28584
45758i69612P28076J674673P59322j095406n91988J795981J993549p32369k329939
45749A232287o99365J164620N97475p20896m89300L69715J61581m30311j75428
45740A010378K30710k20739q63284q71847p99912r53015k49299J588522K615657
45731A487171J290681j014488j871932r43926K61438P48853P14403N10847N4543
45722A237590r04702k199026k709988j090014K020141L551191J607829j424655
45714H8366j785176M05344J735211Q67246k21645m40806j053662k068215j257886
$$ y = [-2016093, -1618242, -169741, 2474412, 3453067, 1397604, -1136916, -1711429, -1198196, -969612, -241536, 1433137, 2192459, 1097053, 505065, 2301046, 4294595, 3562226, 1232287, 532922, 1697542, 2295017, 1574121, 1084821, 1454536, 1616117, 1185806, 1010378, 1241088, 1020349, 157065, -714782, -1514694, -2467709, -2717008, -1128486, 1487171, 2777852, 1763364, -108568, -1052494, -791056, -42203, 672200, 1183047, 1237590, 332888, -1866138, -4576126, -5666140, -3645999, -94808, 1513021, 88366, -1696810, -1291466, 443745, 1310991, 1089346, 648540, -405122, -2473337, -3731223]
$$ [...]
##END NTUPLES=NMR SPECTRUM
##END=
