##TITLE=31Pdec_LR-755-i2t
  24 sc
 17.10.2022
##JCAMPDX= 6.0         $$ Bruker NMR JCAMP-DX V2.0
##DATA TYPE= NMR SPECTRUM
##DATA CLASS= NTUPLES
##ORIGIN= UXNMR, Bruker Analytische Messtechnik GmbH
##OWNER= root
$$ XWIN-NMR		Version 3.5
$$ Mon Oct 17 13:51:38 2022 Russian Standard Time (UT+4h)  she@DPX200
##.OBSERVE FREQUENCY= 81.013821
##.OBSERVE NUCLEUS= ^31P
##.ACQUISITION MODE= SIMULTANEOUS
##.ACQUISITION SCHEME= undefined
##.AVERAGES= 24
##.DIGITISER RES= 16
##SPECTROMETER/DATA SYSTEM= spect
##.PULSE SEQUENCE= zgpg30
##.SOLVENT NAME= D2O
##.SHIFT REFERENCE= (INTERNAL, D2O, 0, 248.564)
##AUDIT TRAIL= $$ (NUMBER, WHEN, WHO, WHERE, WHAT)
$$ ##TITLE= Audit trail, XWIN-NMR		Version 3.5
$$ ##JCAMPDX= 5.01
$$ ##ORIGIN= Bruker BioSpin GmbH
$$ ##OWNER= she
$$ F:/spectra/data/she/nmr/P31/1/pdata/1/auditp.txt
$$ ##AUDIT TRAIL=  $$ (NUMBER, WHEN, WHO, WHERE, WHAT)
(   1,<2022-10-17 13:50:20.57 +0400>,<she>,<DPX200>,
      <created by zg, POWCHK disabled, PULCHK disabled
       configuration hash MD5:
       00 E9 B6 7A A2 85 ED C7 34 08 36 98 17 FE 4E 26
       data hash MD5: 32K
       1A 69 E7 38 A9 D8 D5 E1 B2 75 AC 56 BC CC 4F 55>)
(   2,<2022-10-17 13:50:29.46 +0400>,<she>,<DPX200>,
      <Start of raw data processing
       efp BC_mod = 2 LB = 1 FT_mod = 6 PKNL = 1 PHC0 = -10287.02 PHC1 = 80.25658 SI = 64K 
       data hash MD5: 64K
       9E 7B B8 2D B1 37 B8 82 C8 A3 F1 7E 55 F3 17 74>)
(   3,<2022-10-17 13:50:51.57 +0400>,<she>,<DPX200>,
      <pk PHC0 = 28.35455 PHC1 = 13.4 
       data hash MD5: 64K
       BD 6F 65 CA E5 E5 7E 88 63 71 D1 EE CB 9C 76 15>)
(   4,<2022-10-17 13:50:55.06 +0400>,<she>,<DPX200>,
      <abs ABSG = 5 
       data hash MD5: 64K
       80 5C 18 8D C2 B3 7F DF 89 C2 63 FB BD EE 4A 0E>)
$$ ##END=
$$ 
$$ hash MD5
$$ 01 EA A2 F5 D3 E6 22 62 56 3B 63 E2 D8 C9 F3 49
##$RELAX= 
##$RELAX= 
##$RELAX= 
##$RELAX= 
##$RELAX= 
##$RELAX= 
##$RELAX= 
##$RELAX= 
##$RELAX= 
$$ Bruker specific parameters
$$ --------------------------
##$DU= <F:/spectra>
##$EXPNO= 1
##$NAME= <P31>
##$PROCNO= 1
##$TYPE= <nmr>
##$USER= <she>
##$AMP= (0..31)
100 100 100 100 100 100 100 100 100 100 100 100 100 100 100 100 100 100 
100 100 100 100 100 100 100 100 100 100 100 100 100 100 
##$AQSEQ= 0
##$AQ_mod= 1
##$AUNM= <au_zg>
##$AUTOPOS= <>
##$BF1= 81.014009
##$BF2= 200.13
##$BF3= 200.13
##$BF4= 200.13
##$BF5= 200.13
##$BF6= 200.13
##$BF7= 200.13
##$BF8= 200.13
##$BYTORDA= 1
##$CFDGTYP= 0
##$CFRGTYP= 5
##$CHEMSTR= <none>
##$CNST= (0..31)
1 1 145 1 1 1 1 1 1 1 1 1 1 1 1 1 1 1 1 1 1 1 1 1 1 1 1 1 1 1 1 1 
##$CPDPRG= <waltz16>
##$CPDPRG1= <>
##$CPDPRG2= <waltz16>
##$CPDPRG3= <>
##$CPDPRG4= <mlev>
##$CPDPRG5= <mlev>
##$CPDPRG6= <mlev>
##$CPDPRG7= <mlev>
##$CPDPRG8= <mlev>
##$CPDPRGB= <>
##$CPDPRGT= <>
##$D= (0..31)
0 1 0 0 0 0 0 0 0 0 0 0.03 2e-05 3e-06 0 0 0 0 0 0 0 0 0 0 0 0 0 0 0 0 
0 0 
##$DATE= 1666000220
##$DBL= (0..7)
120 120 120 11 120 120 24 19 
##$DBP= (0..7)
150 150 150 150 150 150 150 150 
##$DBP07= 0
##$DBPNAM0= <>
##$DBPNAM1= <>
##$DBPNAM2= <>
$$ [...]
##$SUBNAM3= <"">
##$SUBNAM4= <"">
##$SUBNAM5= <"">
##$SUBNAM6= <"">
##$SUBNAM7= <"">
##$SUBNAM8= <"">
##$SUBNAM9= <"">
##$SW= 501.771253377433
##$SWIBOX= (0..15)
0 1 3 0 0 0 0 0 0 0 0 0 0 0 0 0 
##$SW_h= 40650.406504065
##$TD= 32768
##$TD0= 1
##$TE= 0
##$TE2= 300
##$TE3= 300
##$TEG= 300
##$TL= (0..7)
0 120 53 12 22 120 120 120 
##$TP= (0..7)
150 150 150 150 150 150 150 150 
##$TP07= 0
##$TPNAME0= <>
##$TPNAME1= <>
##$TPNAME2= <>
##$TPNAME3= <>
##$TPNAME4= <>
##$TPNAME5= <>
##$TPNAME6= <>
##$TPNAME7= <>
##$TPOAL= (0..7)
0.5 0.5 0.5 0.5 0.5 0.5 0.5 0.5 
##$TPOFFS= (0..7)
0 0 0 0 0 0 0 0 
##$TUNHIN= 0
##$TUNHOUT= 0
##$TUNXOUT= 0
##$USERA1= <user>
##$USERA2= <user>
##$USERA3= <user>
##$USERA4= <user>
##$USERA5= <user>
##$V9= 5
##$VALIST= <valist>
##$VCLIST= <CCCCCCCCCCCCCCC>
##$VD= 0
##$VDLIST= <DDDDDDDDDDDDDDD>
##$VPLIST= <PPPPPPPPPPPPPPP>
##$VTLIST= <TTTTTTTTTTTTTTT>
##$WBST= 1024
##$WBSW= 4
##$XGAIN= (0..3)
0 0 0 0 
##$XL= 0
##$YL= 0
##$YMAX_a= 5247
##$YMIN_a= -5713
##$ZGOPTNS= <>
##$ZL1= 120
##$ZL2= 120
##$ZL3= 120
##$ZL4= 120
##$ABSF1= 248.5645
##$ABSF2= -253.2056
##$ABSG= 5
##$ABSL= 3
##$ALPHA= 0
##$AQORDER= 0
##$ASSFAC= 0
##$ASSFACI= 0
##$ASSFACX= 0
##$ASSWID= 0
##$AUNMP= <proc_1d>
##$AZFE= 0.1
##$AZFW= 0.5
##$BCFW= 0
##$BC_mod= 2
##$BYTORDP= 0
##$COROFFS= 0
##$CY= -3
##$DATMOD= 1
##$DC= 0
##$DFILT= <>
##$DTYPP= 0
##$F1P= 0
##$F2P= 0
##$FCOR= 1
##$FTSIZE= 65536
##$FT_mod= 6
##$GAMMA= 0
##$GB= 0
##$INTBC= 1
##$INTSCL= 6.834604e-11
##$ISEN= 30
##$LB= 1
##$LEV0= 0
##$LPBIN= 0
##$MAXI= 10000
##$MC2= 0
##$MEAN= 0
##$ME_mod= 0
##$MI= 50
##$NCOEF= 0
##$NC_proc= -5
##$NLEV= 6
##$NOISF1= 182.463
##$NOISF2= 159.3651
##$NSP= 0
##$NTH_PI= 0
##$NZP= 0
##$OFFSET= 248.5645
##$PC= 4
##$PHC0= -10258.67
##$PHC1= 93.65658
##$PH_mod= 1
##$PKNL= yes
##$PPARMOD= 0
##$PSCAL= 0
##$PSIGN= 0
##$REVERSE= no
##$SF= 81.0140089999694
##$SI= 65536
##$SIGF1= 159.3651
##$SIGF2= -187.1042
##$SINO= 113.3802
##$SIOLD= 16384
##$SREGLST= <1H.CDCl3>
##$SSB= 0
##$STSI= 65536
##$STSR= 0
##$SW_p= 40650.406504065
##$SYMM= 0
##$S_DEV= 0
##$TDeff= 32768
##$TDoff= 0
##$TI= <>
##$TILT= no
##$TM1= 0
##$TM2= 0
##$TOPLEV= 0
##$USERP1= <user>
##$USERP2= <user>
##$USERP3= <user>
##$USERP4= <user>
##$USERP5= <user>
##$WDW= 1
##$XDIM= 65536
##$YMAX_p= 464215750
##$YMIN_p= -3074934
$$ End of Bruker specific parameters
$$ ---------------------------------
##NTUPLES= NMR SPECTRUM
##VAR_NAME=  FREQUENCY,     SPECTRUM/REAL,   SPECTRUM/IMAG
##SYMBOL=    X,             R,               I
##VAR_TYPE=  INDEPENDENT,   DEPENDENT,       DEPENDENT
##VAR_FORM=  AFFN,          ASDF,            ASDF
##VAR_DIM=   65536,         65536,           65536
##UNITS=     HZ,            ARBITRARY UNITS, ARBITRARY UNITS
##FACTOR=    0.620285442955139, 1,           1
##FIRST=     20137.2065510682, 0,            0
##LAST=      -20513.1999529968, 0,           0
##MIN=       -20513.1999529968, -3074934,    0
##MAX=       20137.2065510682, 464215750,    0
$$ Real data points
##PAGE= N=1
##DATA TABLE= (X++(R..R)), XYDATA
$$ [...]
38803F20893m7222k95750m35316k94138k4723Q2926j6123r5410K243J85449L14789
38792b382L85386M00191K50425p9000l20278k08810R3897J70760l3179j19211
38782E37799R6819K07907j66808o85976o78817j04948L86853L70781J06229m0071
38772B9768j19513k58681k36526J50083N75933N36811R6710j78063l1770J62714
38762G27466J4668l09808l52706r369L35334K87522r7657m03772l51401j02139
38752b61862J0045m9205j8210J95447L30203J64485j58139l70664m17940l49139
38742i24979j21516K16241L66815J47920j46812j03065K22718M35192M19967M16717
38732I29198N03827M36569P3395l75594o15063n35235k15863Q6607K9639m03026
$$ plain form
38803 620893 573671 277921 -157395 -451533 -476256 -393330 -409453 -504863 -502620 -317171 -2382
38792 -2382 383004 783195 1033620 954620 634342 425532 519429 690189 657010 537799
38782 537799 634618 842525 675717 -10259 -689076 -794024 -407171 -36390 69839 29768
38772 29768 -89745 -348426 -584952 -434869 141064 677875 774585 596522 564752 727466
38762 727466 742134 432326 79620 70251 405585 693107 595450 191678 -159723 -261862
38752 -261862 -251817 -301022 -319232 -123785 206418 370903 212764 -157900 -575840 -924979
38742 -924979 -1046495 -830254 -463439 -315519 -462331 -565396 -342678 92514 512481 929198
38732 929198 1433025 1869594 1942989 1567395 952332 417097 201234 287841 317480 -85546
38722h5546o63655k43988N17543P32326J29324n83072o74430k29186J89069K70961
38712f40654R5232j07724q2484K43085N06011K39566l92253o62665k93812J45886
38702i49812J62917M6145J83373K88042p847k92667L9063O50112O43111k8184
38692G34253m79803l04977j07509l36746m91719l8430N82340N74803j4041m23309
38682c05138k76440R5067L18185L64717K69122J4053k02826p6356K65895K71315
38672G37594k51411p40426n96156J0477M20851L74586J94533J73704K03655P3949
38662F01356j89507m06849m51510k96752k4678J85924K41871K58975K99958J23811
38652C42599m39823r68054q15013m4919N64505N86582M06061L85929K75455j09156
$$ plain form
38722 -85546 -749201 -993189 -475646 256680 386004 -197068 -871498 -1100684 -911615 -640654
38712 -640654 -545422 -653146 -735630 -492545 13466 253032 -139221 -801886 -1095698 -949812
38702 -949812 -786895 -740750 -557377 -269335 -277182 -569849 -530786 119326 762437 734253
38692 734253 254450 -50527 -158036 -494782 -986501 -1024931 -442591 132212 118171 -305138
38682 -305138 -581578 -486511 -168326 196391 465513 479566 276740 200384 466279 737594
38672 737594 486183 -254243 -850399 -839922 -419071 -44485 150048 323752 527407 601356
38662 601356 411849 5000 -446510 -743262 -767940 -582016 -340145 -81170 218788 342599
38652 342599 -97224 -1065278 -1880291 -1925210 -1360705 -774123 -368062 17867 293322 184166
38642A84166k97038Q7458N35385L75992j38857k90282p3876k2795j29827L5212
38632B65538K78412k3880o38600n62232L24915Q36434K25029o76781p50402j59388
38622h80955J91935R4324L4188J88335K74032J91892J18501P4812n7444k03093
38612B6527j98427p7885O1517K29941K98626k1441n90121o96703j6140P25999
38602b58107O56481k6455l99052j14224L37218N11980M68253L56367J58585r8840
38592A592206l15028n03972o63399n70055j11729L20373K45259j90718l83238
38583e80301j12898K28706K52862K0039j53012m0569L18545N93838M44799M563
38573I76572j98690l0428l2054n24859r17705n27122K90456N82913J74004j92724
$$ plain form
38642 184166 -112872 -25414 509971 885963 747106 456824 382948 360153 230326 265538
38632 265538 543950 520070 -118530 -680762 -355847 480587 705616 28835 -721567 -880955
38622 -880955 -689020 -594696 -560508 -372173 -98141 93751 212252 287064 229620 26527
38612 26527 -171900 -249785 -188268 41673 340299 318858 -271263 -967966 -984106 -258107
38602 -258107 398374 371919 -27133 -141357 195861 707841 1176094 1532461 1691046 1592206
38592 1592206 1277178 773206 109807 -460248 -571977 -251604 -6345 -197063 -580301
38583 -580301 -693199 -464493 -211631 -191592 -344604 -385173 -66628 527210 972009 976572
38573 976572 777882 747454 715400 190541 -727164 -1254286 -963830 -380917 -206913 -399637
38563c99637l5468K87447K81521k8211l18674l79901j69683J82387L67583K00277
38553a2359r7293j89109q0841J1096L7869L4322o6371j66019P4970N86006O27322
38542G59593j77985j017188r01525j10134L18900K18812L05170O90299O02215
38533F88157k39086j050626j129365o80423j81824K65917O16559O35460L31916
38524g43315N4086n3162j20840n5067L22313O39427L53463j93982r9620N89503
38514F92806P88479P2513o81144p52781n17742l99827q9525M80354N48882j75914
38504c3899o84551j58531O40564N97302J8986o5963K97087K61414k00791l30519
38494C41099k5038M4477k84784m42794k39309j29430k48047j65256K16691M17473
$$ plain form
38563 -399637 -435105 -147658 133863 105652 -213022 -592923 -762606 -580219 -212636 -12359
38553 -12359 -109652 -298761 -379602 -368506 -330637 -296315 -362686 -528705 -453735 132271 759593
38542 759593 581608 -435580 -1337105 -1447239 -1128339 -909527 -604357 85942 688157
38533 688157 449071 -601555 -1730920 -2411343 -2593167 -2327250 -1710691 -1075231 -743315
38524 -743315 -689229 -742391 -863231 -918298 -595985 43442 396905 202923 103303 692806
38514 692806 1481285 1553798 872654 119873 -397869 -797696 -887221 -406867 142015 -33899
38504 -33899 -718450 -876981 -236417 360885 379871 313908 610995 872409 671618 341099
38494 341099 316061 360538 75754 -367040 -606349 -735779 -983826 -1149082 -932391 -514918
38484e14918K35708L9765N176j46737m21818l54044J46353M67130K18091j35177
38474d60471j4099L97147N12348K30122l3119k5186M8674q5431l49229l88014
38464a67258l5549L80966L66095p8918l91814k23755M9391p5898m23477m10319
38454a010536M4215M06211K93637r4766l34157j99996K37680O31008N56576K6365
38444E56237l63171j69984K25428J75929k35719l80689j18213P3673j7120o9000
38434c22629N4563N4369j33219j15791K19760M05729J68384j08411p2597M3478
38424A93636l800N5110M08020N93189J86977l86018m52513j42810n8547j72903
38414B20341K4490M00315K16773n40125q65629k04857O34413O57916Q4881j91174
$$ plain form
38484 -514918 -279210 -239445 -234269 -381006 -802824 -1156868 -1010515 -543385 -325294 -460471
38474 -460471 -474570 -77423 434925 665047 631928 606742 655416 569985 220756 -167258
38464 -167258 -202807 178159 544254 465336 73522 -150233 -100842 -176740 -600217 -1010536
38454 -1010536 -966321 -560110 -266473 -361239 -695396 -895392 -657712 -26704 529872 556237
38444 556237 193066 23082 248510 424439 188720 -191969 -310182 -236509 -253629 -322629
38434 -322629 -268066 -213697 -346916 -462707 -242947 162782 331166 222755 150158 193636
38424 193636 189836 244946 652966 1246155 1433132 1047114 594601 451791 393244 220341
38414 220341 244831 645146 861919 321794 -543835 -748692 -114279 543637 628518 437344
38404D37344k1336K0346k07240k43792Q135P4528j58852j62457K59886N01057
38394E07619J37024l23536k83990l4884j46798m00051j92476L31463N03657K93777
38384C91805K64495M27310J92743m19286n99097r8746K79513L5323k04211J05964
38374C75813L59227j19909p10730l78449N66318Q40509J49041m46611k26991K37542
38364F45760J99903j36187j68810O9352P2498k70668n19916l14357J76778M54057
38354B08410K25481k44776l71624O2375N82764N92452J03200l91515n83105m87660
38344c03998j16743M30909O50521R3061p76857r02107o0963P15041N47293j15846
38334A60311l00662P2262L28696K42592K06544K81317r096p00723j008402m13390
$$ plain form
38404 437344 416008 436354 229114 -14678 -6543 67985 -90867 -253324 6562 507619
38394 507619 644643 321107 37117 2233 -144565 -544616 -737092 -405629 98028 391805
38384 391805 656300 1083610 1276353 857067 257970 159224 438737 474060 269849 375813
38374 375813 735040 615131 -95599 -474048 92270 932779 1081820 635209 408218 645760
38364 645760 845663 709476 540666 610018 682516 411848 -108068 -422425 -245647 208410
38354 208410 433891 189115 -182509 -120134 462630 1055082 1158282 766767 183662 -303998
38344 -303998 -420741 10168 660689 753750 -23107 -925214 -986177 -271136 276157 160311
38334 160311 -140351 -68089 260607 503199 709743 991060 981964 281241 -727161 -1140551
38324a140551M37677N45915o3557m58735j80056J98099M0335m04918m11083K09840
38314a227034Q91408R85951L85345m39872q38692n34993P4806L39639J54992M1663
38304a66787K83564M61666K06046r9570K9174K49602o7205o38813n89724Q2845
38294b49202M12508J2599l41262q0843K31447j4629l84276k17547J87662J50813
38284b92730j76889j60692J33055J12773j91260j66137K39484L74304P078k77071
38274c98085n3178K99596K61185q4384l04646k09094R4153M14182N36631L27269
38264H83629o4283l03896k53755q2557k236p1786k00897j88537R3245M00514K90561
38253E00002j80830l53828O7158M29660R5172m83066m18750K21120N82565L67384
$$ plain form
38324 -1140551 -702874 -156959 -220516 -679251 -859307 -661208 -620873 -1025791 -1436874 -1227034
38314 -1227034 -335626 650325 1035670 595798 -242894 -777887 -703081 -363442 -208450 -166787
38304 -166787 116777 578443 784489 684919 714093 963695 896490 257677 -332047 -249202
38294 -249202 163306 175905 -165357 -246200 -14753 -29382 -413658 -631205 -443543 -292730
38284 -292730 -469619 -630311 -497256 -384483 -575743 -741880 -502396 -128092 -121014 -398085
38274 -398085 -451263 -151667 109518 25134 -279512 -488606 -394453 19729 556360 883629
38264 883629 819346 515450 261695 179138 176902 105116 -95781 -284318 -191073 209441 500002
38253 500002 319172 -34656 32502 462162 557334 74268 -344482 -123362 459203 826587
38243H26587O4028o4828k38269l89229j48686K90353L02509j3645J10000O42185
38233A381005N44282m66837j169080o39936K85435L78496q9773n5037M14301L09657
38223H92513m70883q57307l09435L84800L71969r9914k49697J13282N12379N09684
38213G97391J31073k53538l04257o1732R4149l7992j87614q8536K1934j82546
38203g1668m40015k35056K98976M89082J65133j09781j4199M8318k26315m22352
38193e17877j32010K61257J92168j04563J682L79008K55747m52402q07831j93125
38183a117946P15581Q64142K28886l22641k99460m4310P826j03049j50652q1109
38173c02732Q9479L44412M82357K40706k42305m74308k86620m6950J073J03106
$$ plain form
38243 826587 890615 825787 587518 198289 49603 339956 642465 628820 738820 1381005
38233 1381005 1925287 1458450 289370 -350566 -65131 313365 223592 168555 582856 892513
38223 892513 421630 -435677 -745112 -360312 11657 -88257 -337954 -224672 287707 797391
38213 797391 928464 674926 370669 308937 403086 365094 177480 88944 110878 -71668
38203 -71668 -511683 -746739 -447763 41319 206452 96671 82472 130790 -95525 -517877
38193 -517877 -649887 -388630 -196462 -301025 -299343 79665 335412 -116990 -924821 -1117946
38183 -1117946 -402365 461777 690663 368022 68562 24252 32078 -70971 -221623 -302732
38173 -302732 -213253 131159 613516 854222 611917 137609 -149011 -195961 -194888 -91782
38163i1782L74986L72160j86759p25331n26347J58051M63395K05989J0380J72745
38153B27487K54618j1821k28716j02515J569k34112m13238q0261L90417K67678
38143G1106l78059o89631k12893N27209Q08857N88595L01295J35148o5788k95268
38133G90571k54100J13227L15490p8846p04484p53612j05394M21381J99914l04854
38123c60707k36382L95308P66137M27605j69953m12226k54043k6371R6100J71466
38113C96934K33929J77714j04775m85934n73363j54536L27962K06444l45627l37768
38103f59020N09846J045949L33300p08121n61011M45471N50135o00537j288879
38094i32867m29445P27517O05988l40873o06188J2285M86422M00593K65212K51155
$$ plain form
38163 -91782 283204 655364 468605 -256726 -783073 -625022 -161627 44362 54742 227487
38153 227487 482105 470284 241568 139053 140622 -93490 -506728 -586989 -196572 71106
38143 71106 -306953 -996584 -1209477 -682268 126589 715184 1016479 1151627 1085839 790571
38133 790571 536471 649698 965188 886342 181858 -571754 -677148 -255767 -55853 -360707
38123 -360707 -597089 -201781 564356 991961 822008 409782 155739 129368 225468 396934
38113 396934 630863 808577 703802 217868 -355495 -510031 -182069 24375 -321252 -659020
38103 -659020 -149174 896775 1230075 521954 -39057 406414 956549 356012 -932867
38094 -932867 -1362312 -634795 -28807 -369680 -975868 -963583 -477161 -76568 188644 439799
38084D39799k4557m51246l78660K02761M79429R5285k84703o3238L86580L59683
38074G61133j79703o73169p00181l05641J67339L59003J84992o7298j00409m78
38064e54412n278k0182K06301M99932L84695j43824m89620k90635O3004J7399
38054c32620l69843n57614k50438K68922M99137K66234j18277k31843k7050J79487
38044f73905J79278P1366n3488k39127l20834L9404O49429O98515o5649o36770
38034c51781n4199J019806J081142l5530r27290o82012J3220K06584J4794k6041
38024B58693p421k07838k96319J17897O06824M80223r4161l78124k48848k23699
38014G227l88995k11437M33967Q49487M73877l12931p22374n10719o4442J94866
$$ plain form
38084 439799 415242 -36004 -414664 -211903 267526 362811 78108 14870 401450 761133
38074 761133 581430 -91739 -791920 -1097561 -930222 -571219 -386227 -453525 -553934 -554412
38064 -554412 -559690 -579872 -373571 126361 511056 367232 -122388 -413023 -350019 -332620
38054 -332620 -702463 -1260077 -1510515 -1241593 -742456 -476222 -594499 -826342 -853392 -673905
38044 -673905 -494627 -423261 -476749 -715876 -1036710 -997306 -347877 350638 284989 -351781
38034 -351781 -405980 613826 1694968 1659438 732148 50136 63356 269940 284734 258693
38024 258693 251272 43434 -252885 -134988 471836 952059 857898 479774 230926 7227
38014 7227 -381768 -593205 -159238 690249 1164126 851195 128821 -381898 -446340 -251474
38004b51474J85968R6191J38808L05473L17877j6786m26052m38440o9043J25070
37994c2408j66761n32129m39916k0587J77999N6102P5229M40032O56199K32307
37984D46067m78304o23129j7152N22125K45951m88756o89838o5059O46937P28992
37974B27834L26086k1185j91533l66577m39699j52127K86514L29227p2182l08359
37964c82001N933M68338N09916J82973o0978q8989j28731k45746k38480m5879
37954b3644J25780J38425P0190k8350k09997l66001k14871K49604N80535M20750
37944G42421J5638j42500l9420r5757m10601n21564j26078L62409L63762j5371
37934A32939j55301J40717M02504K56538p1217k24199k25426k11024q2601J65696
$$ plain form
38004 -251474 -65506 30685 169493 474966 792843 776057 350005 -88435 -157478 -32408
37994 -32408 -199169 -731298 -1171214 -1191801 -1013802 -957700 -882471 -442439 213760 446067
37984 446067 -32237 -655366 -672518 -150393 95558 -393198 -1083036 -1148095 -501158 227834
37974 227834 553920 532735 341202 -25375 -465074 -617201 -330687 -1460 -73642 -382001
37964 -382001 -376068 92270 602186 785159 724181 635192 506461 260715 22235 -23644
37954 -23644 102136 240561 310751 282401 72404 -293597 -508468 -258864 321671 742421
37944 742421 758059 615559 576139 480382 69781 -451783 -577861 -215452 148310 132939
37934 132939 -22362 118355 520859 777397 706180 481981 256555 45531 -37070 128626
37924A28626J67597k45961n39359j74562M46623N10657R7513L7592M43952M34441
37914A307119l61377j040018p66154j1209L00987J65071J47512K49441P8649k24078
37904a54057j82858J25144K48019K07818L18205L86633J1108n25660o15605l88536
37894e69789l89152m07856J44859Q27694N75624l89012o24059K02216O94220P7988
37884A42733n17453j11720M21514O2897l84126K43655J157809P61034n79285r87943
37874B09115p1250O02380J63281l64749p8970L06511j19440q50784q21446l7481
37864a062833N94438N42653J5637n44689p40647l20735N03210J079574R85917
37855A052525M41184j11802m75217n98402m48757j88921q8642r7830P8864L74490
$$ plain form
37924 128626 296223 50262 -489097 -663659 -217036 293621 391134 428726 872678 1307119
37914 1307119 945742 -94276 -860430 -871639 -570652 -405581 -258069 -8628 70021 -154057
37904 -154057 -336915 -211771 36248 244066 562271 948904 960012 434352 -181253 -569789
37894 -569789 -958941 -1366797 -1221938 -394244 181380 -207632 -831691 -629475 64745 142733
37884 142733 -374720 -486440 -64926 -2029 -386155 -142500 1015309 1776343 1197058 209115
37874 209115 137865 740245 903526 538777 459807 766318 646878 -203906 -1025352 -1062833
37864 -1062833 -468395 74258 89895 -454794 -1195441 -1516176 -1012966 66608 1052525
37855 1052525 1493709 1381907 906690 308288 -140469 -329390 -418032 -515862 -436998 -62508
37845f2508L52097k4031j99213Q9523L12122l5859n75672n50461P0798N27627
37835i5577K63479m10253p42689m26386J15384L28339K30389K44247M04850K67925
37825A79708j96289k75678L86275R64975N34210m58800p75692k11460K36987L764
37815C88000l48789k67472q503P2273J31220K87373K29454j53453m02852k01770
37805b74519J18488J74473Q7881R8995J57888K05814L25812L69943L9729m39816
37795H64688m24977R9083L40338p9668n20439l82427R024J09600R365l756m6525
37784b5694j93464q3970L73594N32094n0432p51302p10573o0647L94887L43415
37774b32092J04718o7790j56116p1228K47903N71526O02965K96164k25919p20765
$$ plain form
37845 -62508 289589 265558 66345 155868 467990 432131 -143541 -694002 -623204 -95577
37835 -95577 167902 -242351 -985040 -1411426 -1296042 -967703 -737314 -493067 -88217 179708
37825 179708 -16581 -292259 94016 1058991 1593201 1134401 358709 147249 384236 388000
37815 388000 39211 -228261 -236764 -164491 -33271 254102 483556 330103 -72749 -274519
37805 -274519 -156031 18442 106323 205318 363206 569020 894832 1264775 1304504 864688
37795 864688 439711 538794 879132 799464 279025 -103402 -94378 15222 24587 20831 -25694
37784 -25694 -219158 -303128 70466 602560 552128 -199174 -909747 -970394 -575507 -232092
37774 -232092 -127374 -195164 -351280 -422508 -174605 396921 999886 1296050 1070131 349366
37764C49366p26166q365P83705O98611j01673m59675k7491K18025k42497n05436
37754b1596J01866P10799L97487j95218p1945L17053L3146m66451j31115O15624
37744A289650M48969n39160r22264k72422L34755K67229J24329K85546K27147
37735A243779k51265m86250j62375J22866m231j01320P3459L8945l92074n91956
37725e10422j82666K92004L13423J61209K01552K08439m9420k64589j58272M4656
37715E5914J24222J99303K28126p5030m99082l67900K89208N30406j7444m47895
37705A9828m2759M98696K12342n39573o92313j42275L01504K92883K24830K77917
37695D11080J62924j62653l37988k58516k17340k85800j68581J83007L80981K36691
$$ plain form
37764 349366 -376800 -385165 398540 1097151 995478 535803 508312 726337 483840 -21596
37754 -21596 80270 791069 1188556 993338 921393 1238446 1271592 805141 674026 1289650
37744 1289650 1738619 1199459 277195 4773 339528 606757 731086 1016632 1243779
37735 1243779 992514 506264 343889 466755 462524 361204 434663 473608 81534 -510422
37725 -510422 -693088 -401084 -87661 73548 275100 483539 434119 169530 11258 55914
37715 55914 180136 379439 607565 532535 33453 -334447 -45239 485167 467723 19828
37705 19828 -22931 475765 688107 148534 -543779 -686054 -384550 -91667 133163 411080
37695 411080 574004 411351 73363 -185153 -402493 -688293 -856874 -673867 -292886 -56195
37685e6195J01758K89855N35332L81998j06293l95367k04130J36428J57808j35451
37675G05743l53209l05483j88974j60118p2018J85998M05308L82435K45614J49663
37665I94959n0512m18934n42746p2045N51099N36984j45261p14990o32938j27276
37655f21660L45490N64076M11026j04051n62086m52452Q2825L67813J61923q8205
37645A04699q4930q4191k45515k86662j23525j72112n70940p31478k08871N06182
37635a897343O72357L64936K23107M14445M97604K07614j78052k79660m7961K59092
37625B36139L01213o7514n58048o38582j73601L28636L52067L7016j01630P4772
37615b09532K54379K71079L55899O93706J024909Q90521J86077o59796j075146
$$ plain form
37685 -56195 45563 335418 870750 1252748 1146455 751088 546958 683386 841194 705743
37675 705743 352534 47051 -141923 -302041 -374059 -188061 217247 599682 845296 994959
37665 994959 944447 525513 -17233 -89278 461821 998805 853544 138554 -494384 -621660
37655 -621660 -276170 287906 698932 594881 32795 -419657 -336832 30981 192904 104699
37645 104699 19769 -64422 -309937 -596599 -720124 -892236 -1463176 -2194654 -2403525 -1897343
37635 -1897343 -1224986 -860050 -636943 -222498 275106 482720 304668 25008 -22953 236139
37625 236139 537352 469838 -88210 -726792 -900393 -571757 -219690 -182674 -284304 -209532
37615 -209532 44847 315926 671825 1365531 2390440 3280961 3467038 2807242 1732096
37606A732096q86410m53602k55173l70147m30970r0713N26376R01814O82605J22226
37596A478102j85199o0085L2005k70441n72597l24650J70188J22946l94636m31317
37586d35684K44223N65912j74719j047133q01895K45920P68793M00559j8233M7688
37576b04569K23888J52251J5541j4284o0786j52636j72610j79577k21154l8543
37566f52479M08061N05665q9958n57833j7881Q76958P72380k29907p44250l54580
37556h3824n7251k83424k08377M73334P57544R5230n44984l13985J43573j7014
37546c9178l65583j53455K75546K28008j8826J63133M85821K69176k82343m20536
37536A41763p9197K06168K50551K29432J00557j82743k61315O9308L10493K5656
$$ plain form
37606 1732096 845686 392084 136911 -233236 -664206 -754919 -228543 673271 1355876 1478102
37596 1478102 1292903 1232818 1264823 994382 421785 97135 267323 390269 -4367 -435684
37586 -435684 -191461 374451 199732 -847401 -1649296 -1403376 -634583 -234024 -252257 -204569
37576 -204569 19319 171570 187111 172827 112041 -40595 -213205 -392782 -613936 -652479
37566 -652479 -244418 261247 171289 -386544 -404425 472533 1244913 1015006 270756 -83824
37556 -83824 -141075 -424499 -632876 -159542 598002 693232 148248 -165737 -22164 -39178
37546 -39178 -404761 -558216 -282670 -54662 -73488 89645 575466 844642 562299 141763
37536 141763 62566 268734 519285 748717 849274 666531 405216 474524 785017 810673
37526H10673l18832r6370L59760K86075k26299m15366r1049J93102J10342o2820
37516E49216k3807J74780K90710R0706m19157p49941l75423L53932M55772j69968
37506A76820m01561L23789R36405L90458n84762o42893M1760K42467k21199l97924
37496a36640r881J80195j19583k38921J61648M98451L34994M0180j5228n4449
37486F40766k77246l75509q4301L37175N13608M08739J54832j71500m42391m89926
37476B14247l22115q3219J43572K66075J43196r4262l5588L24629L71153j51518
37466G76170n19857j19061M25700J67408n66352o32977J11588O56539M62661P9599
37456H41418k103k5996k10485k63169k0333J87911J29094q986q0244j40507n7522
$$ plain form
37526 810673 491841 395471 755231 1041306 815007 399641 308592 501694 612036 549216
37516 549216 525409 700189 990899 1081605 662448 -87493 -462916 -108984 346788 176820
37506 176820 -224741 99048 1035453 1425911 841149 198256 240016 482483 261284 -136640
37496 -136640 -146521 33674 -85909 -324830 -163182 335269 670263 710443 695215 640766
37486 640766 363520 -11989 -96290 240885 754493 1163232 1318064 1146564 704173 214247
37476 214247 -107868 -191087 -47515 218560 361756 267494 231906 556535 927688 776170
37466 776170 256313 137252 562952 730360 164008 -468969 -357381 299158 761819 841418
37456 841418 839315 813319 602834 339665 319332 507243 636337 627351 547107 406600 349078
37445C49078L31812O05844J18778q57570j199838m35966N85031Q66373M07550
37436G71092j82887n51328o35496l72819J57605O13412P08766M43431l1844m55883
37426D64049m47780O1650M82280K30867l46607m00928J37868M93279K72093r8036
37416H48735k81788m96728q07575q02916l28222J81513M16986N51076O26569L61372
37406B69022j23732j93670K80033N67960K08749k74646k94023q7136j04377j94260
37396E3920n1292J22130N8766m476J59665K10313j41278m57712k35011K19542
37386f5433L14386J57964K11840L28022L5068m45566m20128R8661L58176R4237
37376F67227j00600J28886K87693n5110m53640k96224J63433J89854k60553m66687
$$ plain form
37445 349078 680890 1286734 1405512 547942 -651896 -1087862 -502831 363542 771092
37436 771092 588205 36877 -598619 -971438 -813833 -200421 508345 951776 919932 464049
37426 464049 16269 77919 560199 791066 444459 43531 181399 674678 946771 848735
37416 848735 566947 70219 -737356 -1540272 -1868494 -1686981 -1269995 -718919 -92350 269022
37406 269022 145290 -48380 231653 799613 1008362 733716 439693 352557 248180 53920
37396 53920 2628 124758 183524 179048 338713 549026 407748 -49964 -284975 -65433
37386 -65433 248953 406917 618757 946779 981847 536281 116153 214814 572990 667227
37376 667227 566627 695513 983206 928096 474456 178232 341665 531519 270966 -195721
37366a95721n7771M44769M35029O3340j23475l6622m1251k59480m09449l40531
37356e21162k19119q7599K41684O61852O79682J67617k99344k71498r8883k58037
37346d807m76510k12646L40959N17875K53221J00093K28280J95739k00029n58913
37336A83262n41556l04842j00444N5739J72179J89363J85351K61904K39561p4089
37326B66428l92249k82462Q2600J40510j39389k43702k8108R6601l5134j00574
37316f35479K7849P5668k1781r169Q0804m0208j91283J17963O71205O40211o0777
37305F55003n08176k14592J63655L7307j94818l9380K07243J62338J04757K93539
37295F66876L19171j17436n13847m02566j47258j46715l4228M63142O72631K0391
$$ plain form
37366 -195721 -253492 191277 626306 689646 566171 529549 488298 228818 -180631 -521162
37356 -521162 -740281 -827880 -586196 75656 755338 922955 623611 352113 253230 -4807
37346 -4807 -481317 -693963 -353004 164871 418092 518185 746465 942204 742175 183262
37336 183262 -358294 -663136 -763580 -707841 -535662 -346299 -160948 100956 340517 266428
37326 266428 -125821 -408283 -325683 -185173 -324562 -568264 -596372 -499771 -534905 -635479
37316 -635479 -607630 -531962 -553743 -562912 -482108 -522316 -713599 -595636 75569 715780 655003
37305 655003 146827 -67765 95890 133197 -61621 -101001 106242 268580 373337 666876
37295 666876 986047 868611 354764 -47802 -195060 -341775 -376003 87139 759770 780161
37285G80161p75567o97444k7421K42121R4037K73210P26615O37073p4204n66712
37275F11869m53591j99013p9611J18909K71116o5109o06585m81794K97035O41157
37265E4383P6993m83294k17732L98788N50980L15408J44061o9672n14233p14702
37255d59020k33573L73539K88206k36963k81901K28139M77776J91368P512K19292
37245E74375K17191l19810o35448p4301O72677M93811l77696o42522O3561N94130
37235E65968P8150p42990o96366N5420M09451Q1410j29201J94513M27298L7208
37225B80861n01051m73773K1306L84126M08109K74500K1259l57129n37916k31014
37215g10722K38054L00424p535j64135n0596m6761k06174p2956M32367O33967
$$ plain form
37285 780161 4594 -692850 -720271 -478150 -384113 -110903 615712 1252785 1178581 611869
37275 611869 158278 -40735 -120346 -1437 269679 204570 -402015 -883809 -586774 54383
37265 54383 131376 -351918 -569650 -170862 380118 695526 839587 769915 255682 -459020
37255 -459020 -692593 -319054 -30848 -267811 -549712 -321573 156203 347571 355083 574375
37245 574375 791566 471756 -163692 -237993 434684 928495 550799 -91723 -28162 565968
37235 565968 644118 -98872 -795238 -739818 -330367 -248957 -378158 -183645 243653 280861
37225 280861 -220190 -693963 -672657 -288531 119578 394078 415337 58208 -479708 -710722
37215 -710722 -472668 -172244 -179779 -343914 -394510 -441271 -647445 -720401 -288034 345933
37205C45933P5292o36786n62369K66118Q80238O57814Q514l38912k53789j08998
37195C33055q2180K4472L18557N47976M33797M6806l12087m52072l52274m8630
37185D57420L02479L81168M5522l37468k75583J03047J23077m42574q98591n32474
37175a073977L29476P00149K53699k90410k13274K67437M13944J113m72816n02752
37165e87411j27492K79109M63232M05932K08615L6118J8860O1987p5120l54077
37155C29753l81197m3177J02308m04887j002541p06380L70360R79907M93307k09517
37145d72064j38538L74534M51900J57352J56506L67645J41110m11005m68035P4771
37135B34176L72393K6469l41630k34224j0259o2999j64692r3246p8105j50714
$$ plain form
37205 345933 421225 -215561 -777930 -511812 368426 1026240 1034754 695842 442053 333055
37195 333055 250875 275347 593904 1141880 1575677 1622483 1310396 858324 506050 457420
37185 457420 759899 1141067 1186589 849121 573538 676585 799662 357088 -541503 -1073977
37175 -1073977 -744501 -44352 209347 -81063 -294337 -26900 387044 388157 -84659 -587411
37165 -587411 -714903 -435794 27438 433370 641985 678103 696963 758950 683830 329753
37155 329753 -51444 -94621 7687 -397200 -1399741 -2106121 -1735761 -755854 -262547 -472064
37145 -472064 -610602 -236068 215832 373184 529690 897335 1038445 627440 159405 234176
37135 234176 606569 633038 291408 57184 46925 -16074 -180766 -274012 -352117 -502831
37125e02831J07129O43509O40086k10119r65052p56925j00105J3181l24490k74805
37115a730422L11796Q05245Q43192N67497Q0869m72770n70235L8634N90719J89603
37105F54128p59277j019977l32891L42951M20999L62557N32300N24752J00072
37096H25614k10247l6363J36517j28824l71086m1627M50235L58721j61187l31603
37086D90150k9635J04562j98509m34080k15050J42001K16014J00146M9949m0568
37076A84980l57308o52952n11160m850L66020L76523K81539K59272J13731k51065
37066a95270m77673k43966J87675L38356K22588K05517K89377J26886k48937l46158
37056a41605m8662Q6284k84015o44911l72165K83002N55954K84578M1531K09364
$$ plain form
37125 -502831 -395702 247807 887893 677774 -287278 -1044203 -1144308 -1131127 -1455617 -1730422
37115 -1730422 -1418626 -613381 229811 797308 878177 405407 -164828 -126194 464525 654128
37105 654128 -105149 -1125126 -1458017 -1115066 -694067 -331510 200790 725542 825614
37096 825614 615367 579004 715521 586697 215611 173984 624219 982940 821753 490150
37086 490150 460515 565077 366568 -67512 -282562 -140561 75453 175599 225548 184980
37076 184980 -172328 -825280 -1336440 -1341290 -975270 -598747 -317208 -57936 55795 -195270
37066 -195270 -672943 -916909 -729234 -390878 -168290 37227 326604 453490 204553 -141605
37056 -141605 -190267 -103983 -387998 -1032909 -1405074 -1122072 -566118 -281540 -240009 -30645
37046c0645N04172N19558K73902K4298j27117k20130k41961j53078j3360N7678
37036E93317K2734l0791N871J09939J04652j16408l57896l04749P705J50900j04448
37025H0826l94124k42410K20200L85210M204m50654m10601M3576L06037N2774
37015d04962l38107l08117J10711L43357R9299k10627r9429K79378M17862K29350
37005A18715O4600P2588O3482j8099j3330L0541r2544k24308K5204N02467N47295
36994A076611L9107l07351o1127K24415m6293n21087n14435q8456J96059J96102
36984A93545J31228k7826l55624m60317J2201N83898N02742n4500k44823L3109
36974C13633N421n50062p86287j48501O34483N87914j15397n40947l58439n2189
$$ plain form
37046 -30645 473527 993085 1266987 1291285 1164168 944038 702077 548999 535639 593317
37036 593317 616051 585260 591131 701070 805722 689314 331418 26669 34374 185274 80826
37025 80826 -313298 -555708 -335508 49702 53906 -396748 -807349 -763773 -457736 -404962
37015 -404962 -743069 -1051186 -940475 -597118 -497819 -708446 -807875 -528497 -110635 118715
37005 118715 183315 255903 319385 301286 287956 318497 225953 1645 26849 529316 1076611
36994 1076611 1115718 808367 747240 971655 925362 404275 -110160 -198616 -2557 193545
36984 193545 324773 296947 -58677 -518994 -506793 77105 579847 525347 280524 313633
36974 313633 319054 -231008 -1017295 -1165796 -531313 56601 -58796 -599743 -958182 -1010371
36964a010371L8601J26378L62518M62032K02640j38338j82859k2119k7214k27482
36954d16214k70529j3455K33989K09301R3578J42911K23812R1926r9359m3042
36944A52918J15863k3719l55862l22028J65822M79928J97718k91073m13241j55318
36934d48992J58294L66870L95156J19209l06328m05897m8824K65420J60566n6640
36924A98834j2017R2259k4273j11628Q5672J94020j58722n15547k36090L63977
36914a23515M40164j3694j93818J45442L11186j59229p72800q45954l92934P2743
36904a532409K16358J21121J00758L53390O45337N04346n2552l54128k9524L48433
36894C21130J65395k10380j25108J32445j29846n95683l48573M34969N98650o4613
$$ plain form
36964 -1010371 -971770 -845392 -482874 -20842 181798 43460 -139399 -161518 -188732 -416214
36954 -416214 -686743 -700198 -466209 -256908 -163330 -20419 203393 295319 195960 152918
36944 152918 268781 245062 -110800 -432828 -267006 212922 410640 119567 -293674 -448992
36934 -448992 -290698 76172 471328 590537 284209 -121688 -170512 94908 255474 198834
36924 198834 186817 279076 254803 143175 228847 422867 264145 -251402 -487492 -123515
36914 -123515 316649 302955 109137 254579 565765 406536 -366264 -1212218 -1605152 -1532409
36904 -1532409 -1316051 -1194930 -1094172 -740782 -95445 408901 356349 2221 -27303 321130
36894 321130 486525 276145 151037 283482 153636 -442047 -790620 -355651 242999 178386
36884A78386m43909l4359K47834j72820m06192K57462Q55149K50184q22517p71931
36874h62713L11856P61928r8993j026683q28294K3582M09937K47868K75515O66598
36864a19399P83911K81264k77146j98039L49490N68195J53871l04693k35480N1821
36854A053795r8725n44737m52570L72400R91486N65011m70100j002998o77000
36845b63438j15891R6075M0639M7137J77267L08434L77603L40796J25946j86503
36835I48065l10129q6655K18536J78536k22456m94984k65979J72826K22469j65118
36825A95111l83015o6612L30085K12731k48036m14027j67901K2558l3974q362
36815e61442K25839K99836L5588j92539j32278j09323l55460m24740J13068Q06459
$$ plain form
36884 178386 -265523 -299882 -52048 -224868 -631060 -373598 481551 731735 -90782 -862713
36874 -862713 -550857 211071 112078 -914605 -1742899 -1719317 -1309380 -1061512 -785997 -119399
36864 -119399 664512 945776 668630 470591 820081 1388276 1542147 1237454 1001974 1053795
36854 1053795 955070 410333 -42237 330163 1321649 1886660 1416560 413562 -263438
36845 -263438 -379329 -283254 -242615 -195478 -18211 290223 667826 1008622 1134568 948065
36835 948065 637936 551281 769817 948353 725897 230913 -35066 137760 360229 195111
36825 195111 -187904 -254516 75569 288300 40264 -373763 -541664 -519106 -553080 -561442
36815 -561442 -335603 -35767 -179 -192718 -324996 -434319 -789779 -1214519 -1101451 -294992
36805b94992Q48364K31952l11147l94738k92998k02937N1309M14690M10753r5768
36795C64488n07337k99750K10597L81067J81009O4118J19138k2677m31418o22769
36785e63534k65780K87405M68917K11224r4347j70554r7902p1597j60432k98712
36775g55312l60950k48502R148K69640M27178M59439L33447O1671j26326K8399
36765I7832L38722K51023l52323q01181m70899L36239P96352O08959J47057k19926
36755G31855l95906l12021r487J37938j13908l25233L2853N68125M14754l30351
36745C98619o20974r0404L88907J71668j71014N2714M97594N02513K08233R8752
36735A436608M6161k91889o10121l97105J16750L05479J49126P3303N8393k41809
$$ plain form
36805 -294992 553372 785324 474177 79439 -213559 -416496 -365187 49503 460256 364488
36795 364488 -142849 -442599 -232002 149065 330074 394192 513330 490653 59235 -563534
36785 -563534 -829314 -541909 -72992 138232 43885 -126669 -224571 -296168 -456600 -755312
36775 -755312 -1116262 -1364764 -1355616 -1085976 -658798 -199359 134088 195759 69433 97832
36765 97832 436554 687577 335254 -465927 -936826 -600587 195765 804724 951781 731855
36755 731855 335949 23928 14441 152379 38471 -286762 -253909 314216 728970 398619
36745 398619 -222355 -312759 76148 247816 76802 129516 627110 1129623 1337856 1436608
36735 1436608 1482769 1190880 580759 183654 300404 605883 755009 828312 886705 644896
36725F44896o62014o34025q6331M59076O44846N43319K74082p3089k64566j92597
36715F53597j27319k32387j78913K08357L92403n4644n40180k63199M45487O04293
36705I07495J21616k21048j44373r2628j45239J11543N35213M12299k71504o28604
36695E84770k59192J57109L7724k63905k35863r007O9671j4232j75171l86586
36685d94682l97295J6758M01996Q8147n64948m28162N94082J177524N33575l84287
36675E42708m07178J30712J86181k68910m25425o4854K37550J24285j75483l74790
36665d95204l77583j27181K72554M62933K93399J15923K08103K71576j1319l25540
36655B87661k17093J17009J84665N0478J18310K67566p218o18832q18586k83697
$$ plain form
36725 644896 -17118 -651143 -737474 -278398 366448 909767 1183849 1110760 846194 653597
36715 653597 526278 293891 114978 323335 715738 661094 120914 -142285 303202 907495
36705 907495 1029111 808063 663690 571062 425823 537366 1072579 1484878 1213374 584770
36695 584770 325578 482687 520411 256506 20643 11636 81307 67075 -108096 -494682
36685 -494682 -891977 -875219 -473223 -385076 -950024 -1378186 -784104 393420 926995 542708
36675 542708 135530 266242 452423 183513 -241912 -306766 -69216 55069 -120414 -495204
36665 -495204 -872787 -999968 -727414 -264481 28918 144841 352944 624520 613201 287661
36655 287661 70568 187577 372242 422720 541030 808596 801378 182546 -636040 -919737
36645i19737L59524M07702J3724j33678K05793N66441M60834k749l24189k58906
36635C74759l4429N0902k0098j32535k70815l90938l02812L9640L40557L57022
36625A1253K61454K68707J97648j31764l71748j31798K51876J59620k49828k40636
36615B4784K61498N03484J09584l87187m59774k56343o2398J58525L30216Q4189
36605C06578n40357q32584l31017M76860Q10357N33844O7150k43509l04332j45798
36595b02808Q8172K44903L53039M43437K86372k29829o23126l80112J41969J78918
36585C00935j81850j78036K19809K27461k79431m61707k9376K25827p3665j69965
36575c99998L40950N87774o9825p94613o41408j31464k17732n67700k43932N69641
$$ plain form
36645 -919737 -560213 -152511 -138787 -272465 -66672 499769 960603 957854 633665 374759
36635 374759 340330 391232 371134 238599 -32216 -423154 -725966 -686326 -345769 11253
36625 11253 272707 541414 739062 607298 235550 103752 355628 515248 265420 24784
36615 24784 286282 789766 899350 512163 52389 -203954 -266352 -107827 222389 306578
36605 306578 -233779 -1066363 -1397380 -920520 -110163 423681 490831 247322 -57010 -202808
36595 -202808 -114636 130267 483306 926743 1213115 983286 360160 -19952 122017 300935
36585 300935 119085 -58951 160858 388319 108888 -352819 -382195 -156368 -230033 -399998
36575 -399998 -59048 528726 458901 -335712 -977120 -1108584 -1326316 -1894016 -2137948 -1568307
36565a568307R07464O23757L43787J88461j67471m63917j83309K81865Q5187n39341
36555d91824n06955L03894P74756L29018k41733j74392J25934l5934m62174m70126
36545h49536K7904M78303M56780N8202l21849l45304j0870L13459K88501K1525
36535A17115j39529j49991k58518m68630m11753J07281P24028Q71943M29846j17710
36525G04082k16793P1154J04482m30081r05707n43348L48318O63367J03236l75103
36515d76393o0633M35899K32178m33897o75419l14816P2885J62480J37862J33420
36505g86434J00612J08893K19313K14805n0871k66018j25070R6648j3906k55082
36495g57110j05233M18925P76803O55408K25021k17338m48066l35812r437K08102
$$ plain form
36565 -1568307 -660843 -37086 306701 495162 327691 -136226 -319535 -37670 47517 -491824
36555 -491824 -998779 -694885 79871 408889 167156 -7236 118698 82764 -379410 -849536
36545 -849536 -821632 -343329 113451 171653 -150196 -495500 -506370 -192911 95590 117115
36535 117115 -22414 -172405 -430923 -899553 -1311306 -1204025 -479997 391946 821792 704082
36525 704082 487289 558443 662925 232844 -672863 -1216211 -867893 -204526 -101290 -476393
36515 -476393 -537026 -101127 131051 -302846 -978265 -1293081 -1220196 -1057716 -919854 -786434
36505 -786434 -685822 -576929 -357616 -142811 -193682 -459700 -584770 -488122 -502028 -757110
36495 -757110 -862343 -443418 333385 988793 1213814 996476 548410 212598 203161 411263
36485D11263K60018L62232L73679j63948j002432j056974M5143J105864R11707
36476A246552p5849n75659l71597j93686k44559j21582J03271j0958k61039q7878
36466e92984K69115J19498l00815j13927N47316N75859k25095p03450k21959L64633
36456b81809K05893k51466k21426J59843L49249L67034M26908K65882l17919p80260
36446g8071n11161J69718M60343K40889O2928J59675J93263k2257j80177r326
36436D85824L03640M10159K36149l9165k44143k95724j50485J34944L24811J86735
36426A352745j70452l34479j35421N0875j46130m24352j92951M29480O29501O0353
36416A119169o38236p65551m11411k7863K47922L89678J88124k83020m26663N8820
$$ plain form
36485 411263 671281 1033513 1407192 1243244 240812 -816162 -771019 334845 1246552
36476 1246552 1170703 595044 223447 29761 -214798 -336380 -233109 -244067 -505106 -592984
36466 -592984 -323869 -204371 -505186 -619113 -71797 504062 278967 -424483 -646442 -281809
36456 -281809 -75916 -327382 -548808 -388965 -39716 327318 754226 1020108 702189 -78071
36446 -78071 -589232 -419514 40829 281718 344646 504321 697584 675327 495150 485824
36436 485824 789464 1199623 1435772 1396607 1152464 856740 706255 841199 1166010 1352745
36426 1352745 1182293 847814 712393 763268 617138 192786 -165 429315 1058816 1119169
36416 1119169 480933 -284618 -696029 -723892 -475970 -86292 101832 -181188 -607851 -549031
36406e49031N96392N60331J88767K2034l6358l28355n90909l58301J47198L66190
36396A7958L16053L42361L29548L3622j78467J19734M79754K26435k91950k28602
36386A166446K70102L33753o5075j50601J15850l7228o03536n88685K78719R89535
36376A709280Q65764M64710L79340M04704M85913J181962K361484K642403J179574
36367A1675134r10022j942358j730307j277076j132294j119628j135961j141858
36359A285630p55810J46574P89791M45151l07852l25992L25651N12033q8317m72043
36349A554816J900N29843J17705q75966j256758o37270K00668M51740J49622j74712
36339F1588j94623M3909L28889M38872K88357P9883J20987L40715K61902k74637
$$ plain form
36406 -549031 47361 607692 796459 818493 782135 453780 -137129 -495430 -348232 17958
36396 17958 334011 676372 1005920 1039542 861075 980809 1460563 1686998 1395048 1166446
36386 1166446 1436548 1770301 1705226 1554625 1670475 1633247 1029711 441026 719745 1709280
36376 1709280 2575044 3039754 3419094 3823798 4309711 5491673 7853157 10495560 11675134
36367 11675134 10765112 8822754 7092447 5815371 4683077 3563449 2427488 1285630
36359 1285630 529820 676394 1466185 1911336 1603484 1277492 1603143 2115176 2026859 1554816
36349 1554816 1556716 2086559 2204264 1328298 71540 -565730 -365062 86678 236300 61588
36339 61588 -133035 -89126 239763 678635 966992 1046875 1167862 1508577 1770479 1495842
36329A495842o66705l13850L85836M71989j59079n52979j43153M11408L24558
36320A253867j21850k11875l8229j86741n25025l32882M01175P81153L04628m27075
36310H97146o19691k90338J0430L1394j5022J10843L52247M03460N1742m38108
36300D94103m63197J29999O43205L59341m17893p39209l28679J54673K28909K15143
36290B76395M50918N49673O353q47229j124706n43341K19072M26371J38692q2519
36280e30321l2683O21j13409r6946J47784K28587l7153j11397M23169R31439N30796
36269A340487m26897p55639k59591O1472k07804k59780L24836O82069J69862m44806
36259B24209k86507J93591J62553j61283j83977j72690n43209o92439N2691R46520
$$ plain form
36329 1495842 829137 515287 901123 1373112 1214033 661054 517901 929309 1253867
36320 1253867 1132017 920142 881913 695172 170147 -162735 238440 1019593 1324221 897146
36310 897146 277455 -12883 -2453 28941 13919 124762 477009 880469 932211 494103
36300 494103 30906 160905 804110 1163451 745558 6349 -322330 -167657 61252 276395
36290 276395 727313 1276986 1283339 436110 -688596 -1231937 -1012865 -586494 -447802 -530321
36280 -530321 -563004 -562383 -675792 -772738 -624954 -396367 -433520 -544917 -121748 809691 1340487
36269 1340487 913590 157951 -101640 -40168 -247972 -507752 -182916 499153 669015 224209
36259 224209 -62298 131293 293846 132563 -51414 -224104 -767313 -1459752 -1407061 -460541
36249d60541P71834j69292n12814R215L64554M9417l19055k71078n7154J22467
36239d72447L27909L24553j02532m03354K1340N62391J77496p33942p41583K80238
36229g59931Q18489O4444q94629p97998J17730Q09846P93912K46106m25647o65264
36219f92942j66019N22085N22454q8893l85794o7866J59669j29858m42880l11014
36209a081058M2074K75015L44173J59537l30957o19274j34609O60943O97881p7763
36199f4038o00645l52680K5342K2335k8313J26438J44198q8333j32956J22066
36189h26586K23303P3814R1380K26428o5178o24920n79915J42056N45551K32471
36179e61596L3029M26397O34976K8899p28128p59693k40887J73732L28984L21053
$$ plain form
36249 -460541 311293 142001 -370813 -361598 2956 52373 -266682 -537760 -594914 -472447
36239 -472447 -144538 180015 77483 -325871 -304531 257860 435356 -298586 -1040169 -759931
36229 -759931 58558 123002 -771627 -1569625 -1451895 -642049 151863 397969 -27678 -692942
36219 -692942 -858961 -336876 185578 96685 -289109 -356975 -197306 -327164 -770044 -1081058
36209 -1081058 -1038984 -763969 -419796 -260259 -591216 -1210490 -1345099 -684156 13725 -64038
36199 -64038 -664683 -1017363 -992021 -969686 -997999 -871561 -727363 -815696 -948652 -826586
36189 -826586 -603283 -529469 -438089 -211661 -276839 -901759 -1481674 -1339618 -794067 -561596
36179 -561596 -528567 -102170 532806 561705 -166423 -926116 -1167003 -993271 -664287 -343234
36169c43234J04306q3944K36478Q20205P16433k16662q44129m27118K65860K57768
36159D85963j95549l02585m3187J02535Q9196J58257K37172J40952k0507r1591
36149E60656j31113j65059j47473k45980n57908o12138J7978P37017O30068J7740
36139A03788j1413M31076J57018q17829r68318J72180R95441L46755o26700m24957
36129f42959M50708N70222r1342m26790r4141K59471K53597J05091l3877k03795
36119A46185l27705l45660l45026k28542K15857O78902N14831j72097n01467j69924
36109e34646J44838M6548r674K03878K17348n5167J1126M56769M01441l57251
36099E25210p30918r9807O07591M68559l7169j26705k7233j82294k43784J02859
$$ plain form
36169 -343234 -238928 -322872 -86394 733811 1450244 1233582 389453 -37665 228195 485963
36159 485963 290414 -12171 -55358 47177 136373 294630 531802 672754 652247 560656
36149 560656 429543 264484 117011 -128969 -686877 -1299015 -1281037 -544020 86048 103788
36139 103788 92375 523451 680469 -137360 -1105678 -933498 61943 408698 -218002 -642959
36129 -642959 -192251 377971 286629 -140161 -234302 25169 278766 383857 349980 146185
36119 146185 -181520 -527180 -872206 -1100748 -884891 -205989 308842 136745 -364722 -534646
36109 -534646 -389808 -343260 -352934 -149056 68292 13125 24251 481020 882461 525210
36099 525210 -205708 -305515 302076 770635 733466 606761 579528 397234 153450 256309
36089B56309L05994m6667l34771K487M03764J94309k19173j34708K57547L78483
36079A063574K23946N3147j56287l18995j23773J99877j9355n93095m86369L53189
36069A95859N93879l30404j137236o93701K94662O33614L82411J65668l7718l25670
36059b58636k28362L26939M97754q7540n64366l15015L7340k7502K2124M48251
36049a49013M53531k52473o04243m984N25884J77255k69792r0574L6354l38250
36039e16305k35642P76858J215381P7650j098712n90118O46453O45606l54340
36030E66831o73150j24051J17601j53344j32553K07228K02784m8665K3387K02121
36020A88189k2870k93137p1731K22205O3756o2224L07215M82661j00844n80788
$$ plain form
36089 256309 562303 515636 180865 183352 587116 781425 562252 427544 685091 1063574
36079 1063574 1287520 1340667 1184380 865385 741612 941489 922134 329039 -157330 195859
36069 195859 789738 459334 -677902 -1371603 -1076941 -443327 -60916 104752 67034 -258636
36059 -258636 -486998 -160059 337695 250155 -314211 -629226 -591886 -619388 -597264 -149013
36049 -149013 304518 52045 -552198 -557182 -31298 145957 -123835 -214409 -178055 -516305
36039 -516305 -751947 24911 1240292 1317942 219230 -370888 275565 921171 566831
36030 566831 -106319 -230370 -112769 -266113 -398666 -191438 11346 -37319 -13932 188189
36020 188189 165319 -127818 -199549 22656 86412 24188 331403 814064 713220 132432
36010A32432j18903M78676J64085m55480k72522L41480L79081j17j24430k23406
36000C00896o10293n77565K90364Q89548L14799m52680k53504K16142j12063n68783
35990e63139j06952N60713K67256l91432k26306L41676L05671R0823M70983P15047
35980A464340m5659q47569m73882K58364M055o26330l75528K19397Q0378j05991
35970d48425O39046J206758K05944j166131r13262K92393L82436m50468m24564
35961f76273M07681N08286p4108j2965M85137J19022p53544o57158J57800J90191
35951c05931m28392k55401O36950P96509M0041m59053l48679j57872J99046Q56694
35941E73912Q43362l40618j147024k69616Q76596M52001n96039l81628M84511
$$ plain form
36010 132432 13529 492205 656290 200810 -71712 269768 648849 648732 524302 300896
36000 300896 -309397 -886962 -596598 292950 607749 155069 -98435 117707 5644 -563139
35990 -563139 -670091 -109378 157878 -233554 -459860 -118184 187487 278310 749293 1464340
35980 1464340 1418681 571112 97230 355594 359649 -266681 -642209 -422812 -342434 -448425
35970 -448425 190621 1397379 1603323 437192 -476070 -183677 198759 -251709 -676273
35961 -676273 -268592 239694 165586 152621 637758 756780 3236 -653922 -496122 -305931
35951 -305931 -734323 -989724 -352774 443735 483776 24723 -323956 -481828 -282782 573912
35941 573912 1417274 1076656 -70368 -339984 536612 988613 392574 10946 495457
35932D95457L37462k59934R7398N52935l30422j313241m78195R73968O46380p21972
35922a64o91780M15668M54221l45406j24962P41401N20674k31750J52983Q29526
35912A720411O96j199043n38278R53178P35707n54415n48395K77472P75m88855
35902C59253N92015J618209K68556j462774m57414J429939M73156j799850j178863
35893a57773J347036J347937q47908j076790O37901N56316j086724n91780J533822
35884A662037J227603j150345j340683O32371P64519q43156m30661J373701N61680
35875B457066j736920q10030K144948J704644j217555q04676K230172J767031
35867E734680j535496j131138K446126K285803j111894m72881L529756L076049
$$ plain form
35932 495457 832919 572985 670383 1223318 892896 -420345 -898540 75428 721808 -164
35922 -164 -691944 -276276 177945 -167461 -292423 448978 969652 737902 890885 1720411
35912 1720411 1721107 522064 -16214 936964 1672671 1118256 569861 847333 848108 359253
35902 359253 951268 2569477 2838033 1375259 917845 2347784 2820940 1021090 -157773
35893 -157773 1189263 2537200 1689292 612502 1250403 1806719 719995 128215 1662037
35884 1662037 2889640 1739295 398612 1030983 1795502 952346 521685 1895386 2457066
35875 2457066 720146 -89884 2055064 3759708 2542153 1737477 3967649 5734680
35867 5734680 4199184 3068046 5514172 7799975 6688081 6215200 9744956 12821005
35859A2821005p92551O75490O050458N265571K00562K919321J1447674J1494433
35851E0081963N628879J1906243K7439122K9021727K2624397M8087832J05663429
35844C00453592J22341180M1420978q3062368j40338026r9859921l5852933j5709442
35837H9393060k5312251k2193871o217747j837441q272199p323729K28093K25523
35829A8689438n687310m861672J297464J360278l718781l571033J392001J925144
35821F825529j923623k039882J487485J272409k475373k618334R62573J549450
35813C040234j411071j907623P81653J352063q33396j009881J194435J190880
35805B397294j290784j634870P26948J447535l59827r49376M90689O97616q11003
$$ plain form
35859 12821005 12028454 12703944 18754402 24019973 24220535 27139856 38587530 50081963
35851 50081963 55710842 67617085 95056207 124077934 146702331 194790163 300453592
35844 300453592 422794772 464215750 381153382 240815356 140955435 105102502 89393060
35837 89393060 64080809 41886938 35669191 33831750 25559551 18235822 18463915 18689438
35829 18689438 13002128 8140456 9437920 10798198 7079417 3508384 4900385 6825529
35821 6825529 4901906 2862024 4349509 5621918 3146545 528211 1490784 3040234
35813 3040234 1629163 -278460 503193 1855256 1021860 11979 1206414 2397294
35805 2397294 1106510 -528360 198588 1646123 1286296 336920 827609 1525225 714222
35796G14222q88874P48665Q86572q55276j339020K6765N08929l48780j20656J209954
35786E42501R76194p90136j108159M05494R25623k16813n87311M27376N97911
35777A172680o06441j025914n9388L50508l55029m34085N41298R15552L15369
35768H14550K33131Q41006O21961m98514q87945k73450n475k59307J9551N61746
35758A167254J84670n72612k70819M54823r2415j244504r07314N64465Q89683
35749A73231j07737m69587J55826K22591m04385k70304N80881O32285l7786P4810
35739E49825P69360M08274p90091r75674j07021Q0700n23605l31479O37058O96446
35729D13793j82424l00848M06399K68480o94163o27225N64551Q60553j85534p05106
$$ plain form
35796 714222 -174652 574013 1460585 605309 -733711 -706946 -198017 -546797 -667453 542501
35786 542501 1518695 728559 -379600 25894 951517 734704 147393 574769 1172680
35777 1172680 566239 -459675 -519063 -168555 -523584 -957669 -416371 499181 814550
35768 814550 1047681 1888687 2510648 2012134 1124189 850739 845264 585957 605508 1167254
35758 1167254 1351924 779312 508493 963316 870901 -373603 -1280917 -716452 173231
35749 173231 65494 -404093 -248267 -25676 -430061 -700365 -119484 512801 475015 549825
35739 549825 1319185 1727459 937368 -38306 -145327 -64627 -588232 -919711 -282653 413793
35729 413793 231369 -69479 336920 605400 -88763 -715988 -151437 709116 523582 -181524
35719a81524r495M13350L590K9283P01671N59678m97911o94669K77269N23094
35709A124336n01969q61680K80834J042793K01546o93032k03884N93551L10650
35700A293145m26350n27447l28985l81340j60411N73193Q03821j8353q15740o04676
35690e93143P4931M16462N37036N59363O9449o92143o93345P2505K99682l65861
35680c15064n91003K55399Q69244K63020n33809k95928M50441O22061L46366K26680
35670A297407M3117n30007r18821n51754O8468K05850L0854N1103J67085R6415
35660d0283L6948J97865L02511J29861n2630k1147N2363N9321J11174R4520j92553
35649F77950m26115j34005L41319K43373k76379l45029J29969L47338O2714r6041
$$ plain form
35719 -181524 -191019 222331 225921 255204 956875 1516553 1018642 323973 601242 1124336
35709 1124336 622367 -239313 41521 1084314 1285860 592828 388944 982495 1293145
35700 1293145 866795 339348 10363 -370977 -531388 41805 845626 827273 11533 -593143
35690 -593143 -518212 -101750 435286 994649 1064098 371955 -321390 -248885 50797 -315064
35680 -315064 -906067 -650668 218576 481596 -52213 -348141 102300 724361 1070727 1297407
35670 1297407 1340524 810517 -108304 -660058 -591590 -385740 -354886 -303783 -136698 -40283
35660 -40283 -3335 194530 497041 626902 574272 553125 605488 664809 775983 870503 677950
35649 677950 251835 117830 459149 702522 426143 81114 211083 558421 621135 525094
35639E25094R8277J33771j16415j57641L4786r2253m74288l62784K88393N88893
35629D65833J69430k83127k54758o5720j2537R3376K49090J04207k87540m47323
35619b69069k97644j59195j1362L20630M70031O4316l63473j57505J95327p7365
35609b85309m25244J44881J029630P75524l79892p75078j05872K15926l14819
35600a20253n32776N6828L44339k23178n59632M0279O10358K85862k43489j42561
35590d84223J33434p7352l50726n7931M56043N36935K50091J477j23371j19054
35580A65323P8110J70563k06274o27555l41063L55761M15524k19028n37340k14440
35570i60419M9090O3470L84660Q08762M13386n56152p11189J04871M28936k18479
$$ plain form
35639 525094 623371 757142 640727 483086 517872 425619 -48669 -411453 -123060 465833
35629 465833 635263 352136 97378 31658 19121 112497 361587 465794 178254 -269069
35619 -269069 -566713 -725908 -737270 -416640 53391 117707 -245766 -403271 -207944 -285309
35609 -285309 -710553 -565672 463958 1239482 859590 84512 -21360 194566 -120253
35600 -120253 -653029 -596201 -251862 -475040 -1034672 -994393 -384035 -98173 -341662 -484223
35590 -484223 -350789 -428141 -778867 -836798 -380755 156180 406271 407748 284377 165323
35580 165323 243433 413996 207722 -419833 -760896 -405135 10389 -208639 -745979 -960419
35570 -960419 -911329 -847859 -463199 345563 758949 202797 -508392 -403521 25415 -193064
35560a93064m29173M98459J153926M26384n93365n50215K7174L9329k17252K0554
35550A82757L69379J75543j12618P8388J68586m21281q88069l44627M60574L15825
35540a5543l85459l89645K57075M61713P4939Q355N19486Q17182M23918k11549
35530A560472n37968m55406o1467M14775N21190P4364m14218l69592K5847J72523
35520I30520p4953l92652n47655m97713k14967J96400M82207N71701N61987L03581
35510A318456l83713j011082p80633J44168O60132L28445m9399J21385K97032
35501F44791o9198m99966l85674k1414N1681k2265R8686K42681K03812K40349
35491D83483M48539L71291j41517m72077k78263j46235m92126p10464k49019L32671
$$ plain form
35560 -193064 -622237 -123778 1030148 1456532 863167 312952 340126 379455 162203 182757
35550 182757 552136 727679 615061 693449 862035 440754 -447315 -791942 -331368 -15543
35540 -15543 -401002 -790647 -533572 -71859 3080 11435 530921 1348103 1772021 1560472
35530 1560472 1022504 567098 505631 920406 1441596 1515960 1101742 732150 757997 930520
35520 930520 855567 462915 -84740 -582453 -797420 -601020 -118813 452888 1014875 1318456
35510 1318456 934743 -76339 -856972 -712804 -52672 275773 226374 347759 644791
35501 644791 575593 75627 -310047 -331461 -279780 -302045 -203359 39322 243134 483483
35491 483483 932022 1303313 1161796 689719 411456 265221 -226905 -937369 -1186388 -853717
35481h53717L10199P145O7745K40146l5548m15506j59643N36805P77629L09653
35471G84908k64138m51703l03509l3262J72185J31203p2152o3882K17477L12507
35461D29634J8493j62140J63431N56266M03791j54159m98808l54105R2919N02075
35451I97397M96019n9483o48751n61246N1904L03286n3755k81356R766K23850
35441D77631m9074k96235j42614r4351m65633n76956Q4717Q12234P37945J52643
35431F40307j77214k49327m05469l97181P0457M67148J83101l38379k54189K91601
35421a69145M52583O3544k30769q2700J58712J16201j66628m13504l74461m0110
35411f86277K13575K9097l05438j97734K31852K89354k4609O1443O10976O34714
$$ plain form
35481 -853717 -543518 -536373 -468628 -228482 -264030 -679536 -839179 -302374 475255 784908
35471 784908 520770 69067 -234442 -267704 -95519 35684 -36468 -100350 117127 429634
35461 429634 448127 285987 449418 1005684 1409475 1255316 756508 402403 495322 997397
35451 997397 1493416 1433933 785182 223936 275840 579126 525371 244015 253781 477631
35441 477631 428557 132322 -10292 -104643 -570276 -1147232 -1062515 -250281 487664 640307
35431 640307 463093 213766 -191703 -588884 -518427 -51279 131822 -206557 -460746 -169145
35421 -169145 283438 346982 116213 33513 192225 308426 141798 -271706 -646167 -686277
35411 -686277 -472702 -443605 -749043 -946777 -714925 -425571 -450180 -388737 222239 856953
35401H56953k37177r51428o30519J54459N05195M81191M13725O9845n37636o11215
35391d86607J22598O40659K26410k79225J144L93124k0208o28042m02085K06599
35381b25633J67635j82462J14531O51678L18166n39993n64004K64413O14231R4148
35371G12710k79089k6850J06813k70582m85091q8700M25496O01799N97019M67307
35361A760832n9273p97552j047920n88184P7341N32305P04355M15070l49076q22613
35351a74715k20182R08299J209773M46597k78345k96785j40131k95078m17894
35342G41539k16679n2115j60289j75853R2740K15273o6143l07746r2737L04965
35332B82955M04967J82985r0401k63276k92070j52970O7550K43617L76103M50990
$$ plain form
35401 856953 619776 -331652 -962171 -807712 -302517 178674 592399 662244 124608 -486607
35391 -486607 -364009 276650 503060 223835 224979 618103 597895 -30147 -432232 -225633
35381 -225633 -57998 -240460 -125929 525749 843915 303922 -260082 4331 618562 712710
35371 712710 433621 406771 513584 243002 -242089 -330789 94707 696506 1293525 1760832
35361 1760832 1701559 904007 -143913 -732097 -654756 -122451 581904 996974 647898 -174715
35351 -174715 -394897 513402 1723175 2169772 1891427 1594642 1454511 1159433 741539
35342 741539 524860 472745 312456 136603 229343 444616 378473 70727 -22010 282955
35332 282955 687922 870907 780506 517230 225160 72190 139740 383357 759460 1210450
35322A210450L04564n3800k56711j01880Q0918o26j26497j34276l38610p44143
35312a60611n99078L58239R78498K29830r89750r90616J82750R11726M98073j00003
35302C19058r0461J38083J17358M4256L4110j85494m75677k75638L00353M22990
35292C48938j14019n67033m90839k36221l596M25039P72335L54712n61337p79601
35282h51622o358O10617K96653k81373l65895k18961j53715K29689R42369R99195
35272A200599j5025q98390n39083L24273L38494l26347m93310K530K98622J52212
35262D4575J65195M72856N17714J93500N1018J93395J6446o59770j110868p62070
35252h78009j7556L90655L54614K70421L32951L57658J51808k05994m30412l04027
$$ plain form
35322 1210450 1515014 1461214 1204503 1102623 1183541 1182915 1056418 922142 583532 -160611
35312 -160611 -759689 -401450 577048 806878 -182872 -1173488 -990738 -79012 419061 319058
35302 319058 228597 366680 484038 528294 562404 376910 -98767 -374405 -74052 348938
35292 348938 234919 -332114 -822953 -1059174 -1062770 -637731 134604 489316 -72021 -851622
35282 -851622 -857980 -247363 49290 -232083 -597978 -816939 -970654 -740965 201404 1200599
35272 1200599 1185574 287184 -251899 72374 410868 84521 -408789 -406259 -107637 44575
35262 44575 209770 682626 1200340 1393840 1444858 1638253 1654699 994929 -115939 -878009
35252 -878009 -895565 -504910 -150296 120125 453076 810734 962542 756548 326136 22109
35242B2109O6318L16673K46971O1056L3684R6042K34k25680l01338j47373j2091
35231A56605q2779k17481j89793l2262L2818o3839j43419n8452R5745J71019K22365
35220a09473L52935M22319K51628N4557J79060L84352K9677p75410r86025j40734
35210c37114O87369L28439o91405r17061j62211L70191J15742j01808L26698P57857
35200C76697M98907n0934k54461l08938n74544o32970n5694N08289J82417n80271
35190h91502n35085L64225P83965M7996q22030o69143J41810M49962O6841j41437
35180a204398K73137P07352N04476j14042m67067l11245P3575L98073N45410M14584
35170H19855J4845l30931k69859P6407K46627J02448l9741p789l8936k46911k95906
$$ plain form
35242 22109 88427 405100 652071 713127 746811 842853 843087 617407 316069 168696 156605
35231 156605 73826 -143655 -333448 -365710 -332892 -396731 -540150 -598602 -502857 -331838 -109473
35220 -109473 243462 665781 917409 971966 1151026 1535378 1565055 789645 -196380 -337114
35210 -337114 350255 678694 -12711 -929772 -1091983 -721792 -606050 -707858 -381160 376697
35200 376697 875604 824670 570209 261271 -313273 -946243 -1001937 -493648 -311231 -891502
35190 -891502 -1426587 -1062362 -278397 -230401 -1052431 -1721574 -1579764 -1129802 -1062961 -1204398
35180 -1204398 -931261 -223909 280567 166525 -300542 -611787 -538212 -140139 405271 819855
35170 819855 834700 503769 233910 310317 556944 659392 619651 611862 572926 326015 30109
35159C0109L5057L52318J90378k04596j87505K76519M86230J5544o23254o47156
35149b76356o8889L22843N4997l65058j81612M63167O75980J50704l25591j02503
35139C47682K68600m5800o84996n89372K37456O54073J77337l40448j95545J42636
35129b8377P3161r6122J00797L57278K30230m798O2160J74345k1440k12058j8416
35118F16760K24872Q5240j44567l1589J73386Q8896n1535j5189j98704p34000
35108A3570p98274P5337Q38360M05264m77955l74172M79648O69556J5982l75624
35098D71692k56568m69097r88618p22416L78449R13313L37302j15714L82122Q23191
35088G53656J85596p51413o87436J59709N81746K38993j75412j86268L0377K13809
$$ plain form
35159 30109 65166 417484 607862 403266 215761 492280 978510 994054 370800 -276356
35149 -276356 -345245 -22402 32595 -332463 -514075 -50908 625072 775776 450185 347682
35139 347682 616282 570482 -114514 -703886 -466430 187643 364980 24532 -171013 -28377
35129 -28377 44784 -51338 49459 406737 636967 632169 694329 868674 847234 635176 616760
35118 616760 841632 926872 782305 750716 924102 1012998 961463 946274 747570 13570
35108 13570 -784704 -709367 128993 534257 56302 -317870 161778 831334 847316 471692
35098 471692 215124 -253973 -1242591 -1965007 -1586558 -673245 -335943 -451657 -69535 753656
35088 753656 939252 187839 -499597 -339888 241858 480851 305439 119171 149548 363357
35078C63357K83637J98475J9210o7174k4560J5757Q0760K57564L06661j0803k98944
35067A123940k1645M35654J96143n85923p92457j32299L79550J28984j74924J04812
35057F61835M05978M6124n59005o27819j97219J97526L54483K66056j63375o66076
35047b81492n94780P4733M73754J16868l62281l03095M1186K60996N32498Q89853
35037H48240P33359r6582o85577l93632O7812j20479m84694k25172K67803J51452
35027F2530k96788k02484L07598L92293L2876o5182J09882r4217n90845m95912
35017h40249L48788R49238N95350j96257n51680l34220J526J22795M6179m9742
35007I1728m9067n9294k75235n62639m76625N9993M88406L78846N0821J1970K11959
$$ plain form
35078 363357 646994 845469 864679 797505 772945 788702 869462 1127026 1433687 1422884 1123940
35067 1123940 1102295 1537949 1734092 1148169 355712 223413 602963 731947 557023 661835
35057 661835 1067813 1113937 554932 -72887 -270106 -72580 281903 547959 384584 -281492
35047 -281492 -876272 -801539 -327785 -210917 -573198 -876293 -835107 -574111 -41613 848240
35037 848240 1581599 1485017 799440 405808 473620 353141 -131553 -356725 -88922 62530
35027 62530 -234258 -436742 -129144 263149 296025 230843 340725 246508 -344337 -840249
35017 -840249 -491461 457777 1053127 856870 305190 -29030 -27504 95291 141470 91728
35007 91728 42661 -16633 -291868 -854507 -1331132 -1271139 -782733 -403887 -353066 -341096 -129137
34996a29137L29642L59400L88353K32981j45092l06579O51L01360J23643k16567
34986I38655k19410p6575j93813l31792p1688K72826J09748l66775m48787l6429
34976d24040L26888L56076K24326P1029j8037J73869N51137M95154j87437o45568
34966I23397j99077M10163J01456p11016p09429J80166O80406K07977l73801k83136
34956B27106J51390L52514L07147J28346k55474o12236m57013J04427L90590K25646
34946E62443J46589L27474K56567k15423m92576l04781j94088m31002l97668K94660
34936d47805R19459O48371j93059o65464n28427k74812k16132k29057j91728r7059
34926a275713J17640M18790N27144K86547p126K3390L10572M60844K38787k55679
$$ plain form
34996 -129137 200505 559905 948258 1181239 1036147 729568 730219 1031579 1155222 938655
34986 938655 719245 642670 448857 117065 45377 318203 427951 61176 -387611 -424040
34976 -424040 -97152 258924 483250 554279 536242 710111 1261248 1756402 1568965 923397
34966 923397 724320 1134483 1235939 524923 -184506 -4340 676066 884043 510242 227106
34956 227106 378496 731010 1038157 1166503 911029 298793 -158220 -53793 336797 562443
34946 562443 709032 1036506 1293073 1077650 585074 280293 86205 -344797 -742465 -447805
34936 -447805 471654 1120025 926966 261502 -266925 -541737 -757869 -986926 -1178654 -1275713
34926 -1275713 -1158073 -739283 -212139 74408 67282 90672 401244 862088 1100875 845196
34916H45196o99826p22746k35322L24275M01222M2734k02997j49719j70082l81539
34906i48804l13842K45658P06082N03395k0636j67403P4076J73910r899j17448
34896A25089J1993J51135J94523K89319L77917J39096m21248p61653m79505J07235
34886b66099L75882K11130N5037K08441M41926M00464R8743k02279m02271n47648
34876C73326n35723k11321K34390L58382Q4147j45917l3459J32092p660k55757
34866g500j74597J94576L95018K56268Q9847J45193K37236N9318l43730n75615
34856B76014l39466J66095M06679J75930o7209J69452N99918N09231j21949n35168
34846A239527l78436j81129l10815l15244J13021L58111q9163n33691o0083Q80292
$$ plain form
34916 845196 145370 -577376 -812698 -488423 -87201 -44467 -247464 -397183 -567265 -948804
34906 -948804 -1262646 -1016988 -310906 192489 171853 4450 78526 252436 242537 125089
34896 125089 137082 288217 482740 772059 1149976 1289072 867824 106171 -373334 -266099
34886 -266099 109783 320913 375950 584391 1026317 1426781 1525524 1323245 920974 373326
34876 373326 -162397 -373718 -139328 219054 303201 157284 123825 255917 248257 -7500
34866 -7500 -182097 12479 407497 663765 753612 898805 1136041 1195359 851629 276014
34856 276014 -63452 102643 509322 685252 618043 787495 1387413 1896644 1774695 1239527
34846 1239527 861091 679962 369147 53903 166924 525035 435872 -97819 -157902 722390
34836G22390J026206J99769n14633m37036m2333O9867l3180r3750j15010q2362
34826F99928J16138L29635K67775N011j95845m14084p49892p50360o4459N98392
34816a57761L12724m18528k31974Q32695J178965J42714r31145q17189j58939
34807b48438j00974m46216l86644n4427k6203m6629M08808Q59571M65351m12576
34797A1623o26771n5262K79818q2431m29857j87204K32957K80422J15971J31112
34787c29622K34442J06209k06084l45310j24565K68748M62912K63628q9655j52494
34777H8209J07726J87746k06667o27541n05279N909L21175L09908K82680K71723
34767B35589J5139l69113l79872Q0244M98678M90024K29488Q86j85163l30444
$$ plain form
34836 722390 1748596 1948365 1433732 996696 954363 1024230 991050 897300 782290 699928
34826 699928 816066 1145701 1413476 1418487 1222642 808558 58666 -691694 -756153 -157761
34816 -157761 154963 -263565 -495539 337156 1516121 1658835 727690 -89499 -248438
34807 -248438 -349412 -795628 -1182272 -1236699 -1262902 -1309531 -900723 -41152 424199 11623
34797 11623 -615148 -670410 -390592 -473023 -902880 -1090084 -857127 -576705 -460734 -329622
34787 -329622 -95180 11029 -195055 -540365 -664930 -396182 66730 330358 240703 88209
34777 88209 195935 383681 177014 -450527 -955806 -949897 -628722 -318814 -36134 235589
34767 235589 250728 -118385 -498257 -418013 80665 570689 800177 801063 615900 285456
34757B85456k81563o2318L7022o2554n8080J75170K60541r4333n27482m66814
34747g94955N8576M78399M60272K24097O9957k4531j79743k57972k452N22899
34737E54547Q57805O10989q0279o66045p52721m61508j93934j49406j77395n8021
34727e15968K03273M03467L90247K08072Q520j05665j03926J9099J88232J97723
34717H93074p9040m15808m27541j18296Q4246Q530N1428M71028P81013M06871
34707A655505l50570o85033m37006j24257O2308L88655O70061K87861n82469q34797
34697E0258q6223N55629J65777n21489l66741K60415J72579n32524n90292K90929
34687f01682R13390N09875j55990j75194J33734j746m84735o31328k65048J97704
$$ plain form
34757 285456 3893 -58425 -21403 -83957 -142037 33133 293674 199341 -328141 -794955
34747 -794955 -736379 -257980 202292 426389 496346 471815 292072 34100 31648 554547
34737 554547 1412352 2023341 1943062 1277017 524296 62788 -131146 -280552 -457947 -515968
34727 -515968 -312695 90772 481019 689091 697611 591946 488020 507119 695351 893074
34717 893074 814034 398226 -29315 -147611 -63365 -54835 -3407 467621 1248634 1655505
34707 1655505 1304935 619902 182896 58639 120947 509602 1179663 1467524 885055 50258
34697 50258 -35965 519664 685441 163952 -202789 57626 230205 -302319 -892611 -601682
34687 -601682 311708 821583 665593 490399 624133 622387 137652 -493676 -758724 -561020
34677e61020M26955L78650J06781j61104p1552L13796L83257j71213p42641n81614
34667f79705J33280N69641L60014j17270m09272l87668q8206L19938M70918J87775
34657C59445j48433q2618J88351J22162k45024l43484n1459Q2149k26369n15185
34647h60465l47699K6716J86935K17079L94832N88556M83778J68055L804O0509
34637I22100R7082J7247l1886L2760J26835J59667P2892j85728n21589o70697
34627A8683n22363k75093p3821K11352N64208N66423K6574m79631l10092K44216
34617b9544L62655m2640k59927J9197K74165J30549m6020J08626L25723K63206
34607A105990R6907P3573J7416k04894k42992J30957M36034J59181l55440m03196
$$ plain form
34677 -561020 -134065 244585 351366 190262 118710 432506 815763 644550 -98091 -679705
34667 -679705 -546425 23216 383230 265960 -143312 -530980 -619186 -299248 171670 359445
34657 359445 211012 128394 316745 438907 193883 -149601 -201060 -118911 -345280 -860465
34647 -860465 -1208164 -1181448 -994513 -777434 -382602 205954 689732 857787 861591 922100
34637 922100 1019182 1036429 1004543 1037303 1164138 1323805 1396697 1210969 689380 18683
34627 18683 -503680 -778773 -852594 -641242 -77034 489389 515963 36332 -273760 -29544
34617 -29544 333111 290471 30544 49741 323906 454455 408435 517061 842784 1105990
34607 1105990 1202897 1276470 1293886 1088992 846000 976957 1412991 1572172 1216732 813536
34597H13536l3731P6848k75919n93417n26199k81377j00279P9437L00147M02707
34587a38247L14513J58566J1699j25281j48784K73R7550m7518j63462R6052M62730
34576E18091L57301j73360m90965l56589j72095j37248N2862M34741M94860N9063
34566E86661k57661M64L66839K28381j81493k33700P6369K57662J67332L9796
34556A050650j00729l72671n40933k84910J11074L6740m51275o09218j15204M57163
34546h19313N20417K37102N5792p913j75193l54001k79959m188K00701K85551
34536c41004L64128L30801J0773l48461k69310J71860L04802j27582m61624p4419
34526d40036O00949O78469J42838k36820k14058l38097p44404o89512J61414Q79035
$$ plain form
34597 813536 779805 856653 580734 -12683 -538882 -820259 -920538 -841101 -540954 -138247
34587 -138247 176266 334832 346531 221250 72466 72739 170289 122771 -40691 55361 518091
34576 518091 875392 702032 211067 -145522 -317617 -454865 -402003 32738 527598 586661
34566 586661 329000 329464 696303 924684 743191 509491 585860 843522 1010854 1050650
34556 1050650 949921 577250 36317 -248593 -137519 -100779 -552054 -1161272 -1276476 -819313
34546 -819313 -298896 -61794 -6002 -13915 -189108 -543109 -823068 -827256 -626555 -341004
34536 -341004 23124 353925 364698 16237 -253073 -81213 223589 96007 -365617 -440036
34526 -440036 160913 839382 982220 745400 531342 193245 -551159 -1240671 -1079257 -200222
34516b00222N37968l27298n23970Q114L17476R6093j695K89430L97994J02061
34506F95951L1427N02060Q50759N41454N3545k0833L8036k25035m83746k68990
34496A714628L3629j94471o39758n41818k2354J43402r5197l2145M40423N61176
34486A367515J5608m89280l69622k5243m9638k81795k27419P9977K08626j577
34476B27152l48337n97806n74589j88057L44592N80165M02614J79666J44760M1045
34466B11205k99585m85050j60864K85372K14447k73030m45658J0310O02685P41281
34456D01113L71336j79078n70196n62655j37536L49580M47287J67921l2879N9194
34446C14087J22629j18183m06333l80549j78288j73305l00270j44303L26811O22978
$$ plain form
34516 -200222 337746 10448 -513522 -505408 -187932 -91839 -93534 195896 593890 695951
34506 695951 727378 1229438 2080197 2621651 2675196 2654363 2692399 2467364 1983618 1714628
34496 1714628 1748257 1553786 914028 372210 349856 493258 398061 365916 806339 1367515
34486 1367515 1383123 893843 524221 498978 449340 167545 -59874 20103 228729 227152
34476 227152 -121185 -718991 -1293580 -1481637 -1137045 -556880 -154266 25400 170160 211205
34466 211205 -88380 -573430 -734294 -448922 -234475 -507505 -953163 -942853 -340168 401113
34456 401113 772449 593371 23175 -539480 -677016 -327436 119851 287772 254893 314087
34446 314087 436716 318533 -87800 -468349 -646637 -819942 -1120212 -1264515 -937704 -314726
34436c14726M46700J07969l038J9415j07967k82774j75441J52886K40628j07460
34426b3808n00411m55849K1027M93865N61525J65214m03480o96367m67207N2910
34416a252581L71782L01530J30712J45866K28260J28053p5538r3979Q2778J34682
34406A01565j14528m05964l31270J93393P93446R45457M68856k31610n12099j81993
34396G25253K71498K99283k7154k11225r4724m0681l03723o10367n89648l29333
34386i10821j80054j73303j5168L56767N89982M27451R7297l8543J0431K0404
34376A84443L9760K86005N94962M88631n3680m08099k14697J8147k73209p20070
34366e7807n73842J9716K06344j32319j31821N56648J016370M51396m94503o79691
$$ plain form
34436 -314726 131974 239943 236905 256320 148353 -134421 -309862 -156976 83652 -23808
34426 -23808 -524219 -980068 -959041 -465176 96349 261563 -141917 -838284 -1305491 -1252581
34416 -1252581 -880799 -579269 -448557 -302691 -74431 53622 -21916 -115895 -33117 101565
34406 101565 -12963 -418927 -750197 -556804 236642 1182099 1650955 1419345 907246 725253
34396 725253 996751 1296034 1268880 1057655 962931 922250 618527 8160 -581488 -910821
34386 -910821 -1090875 -1264178 -1279346 -922579 -332597 94854 192151 153608 164039 184443
34376 184443 224203 510208 1105170 1593801 1540121 1132022 917325 935472 662263 -57807
34366 -57807 -631649 -611933 -405589 -537908 -669729 -113081 903289 1354685 860182 180491
34356A80491j58689O9697k93316n16574j55365K86597K70059J0188k0602J95148
34346a32366L71092L50398R8462l43813o56826m13000K68523O42638K47118m51235
34336a9009o64870k52783K62887M05547J36336k65358m13492q8193M37872N50071
34326H9008M1450n09836m27436J97155O70755N73250J06657l17031m65134k99827
34316c40989N8849L50225L73939J75705r8568m07689o92632p37223m29118j0896
34306a758397K21404L13595M22589L83002m0951n72116o15157q3759M44274N18823
34296g66693L26921K38014K51225J56932n9518k52179l42425k91343l5235L48258
34286d26043N80852M79187J65749j50407m08355n56793m25590M942L83692L42691
$$ plain form
34356 180491 21802 91499 -201817 -718391 -873756 -587159 -317100 -306912 -327514 -132366
34346 -132366 238726 589124 687586 343773 -313053 -726053 -457530 185108 432226 -19009
34336 -19009 -683879 -936662 -673775 -268228 -131892 -397250 -810742 -898935 -461063 89008
34326 89008 130458 -379378 -806814 -609659 61096 634346 741003 423972 -41162 -340989
34316 -340989 -282140 68085 442024 617729 519161 111472 -581160 -1318383 -1747501 -1758397
34306 -1758397 -1536993 -1223398 -800809 -417807 -458758 -1030874 -1646031 -1729790 -1285516 -766693
34296 -766693 -439772 -201758 49467 206399 146881 -105298 -447723 -739066 -774301 -426043
34286 -426043 154809 633996 799745 649338 240983 -315810 -741400 -736458 -352766 -10075
34276a0075j1840k48468k15066j93719l89905n47019k79782L35699P61170O34102
34266a64903K05132k6724K5492K7052j64603k74841j44651n7383j93600j58952
34256i27981L97107R65601O99233k94993r34312n94103J29127L80366J27279j43151
34246a95827k45138k61190r4326L52072P64144O97724J61673m26899p19075o11576
34236e78418k11100J19557K3675k73739j19863N04319P15692P6444n04913q7513
34226c35859P15101O27562k12928m69500J73607N01027j81001q96207o08971J85401
34216e01768M02208J5090k40686j77358j50148j61721N0211K71474O3041l61820
34206g91477l40818J79866N48110M11550J18464p86r0672k90990l76612j89938
$$ plain form
34276 -10075 -21915 -270383 -485449 -679168 -1069073 -1616092 -1895874 -1560175 -799005 -164903
34266 -164903 40229 13505 38997 66049 -98554 -373395 -518046 -575429 -769029 -927981
34256 -927981 -530874 434727 1133960 838967 -95345 -689448 -560321 -179955 -52676 -195827
34246 -195827 -440965 -702155 -796481 -444409 319735 1017459 1179132 752233 33158 -578418
34236 -578418 -789518 -669961 -646286 -920025 -1039888 -535569 180123 256567 -248346 -335859
34226 -335859 379242 1006804 793876 324376 497983 999010 818009 -78198 -687169 -501768
34216 -501768 -99560 -84470 -325156 -502514 -652662 -814383 -764172 -492698 -429657 -791477
34206 -791477 -1132295 -952429 -404319 7231 125695 124909 34237 -256753 -633365 -823303
34196h23303P622l2006q2311J94237N96351N25679j57687p55358m98377M05938
34186f19215Q95751L95013l79213m13066J21561J63131n01333p85713Q634R95038
34176a19412R74622K03804j29707K19285L57169j48563o18098m59047l8318R0914
34166C32649M3639J38311K06499j3877k53740j21903J71886J38175j40886j26533
34156C74220K57738M48615J06254l75746m66358j99908J6784M304j14679k34756
34146a83532l04003j69749K21569N18456K93264k58121m09484R2025N66271L17296
34136F83992l64410o32736k78291J17049J39746K1979O4430J66273J53273R5007
34126A66312M0430j43536m06735l94714K308L52830K80860K2058m902J10998k3676
$$ plain form
34196 -823303 -815681 -847687 -929998 -735761 -139410 386269 228582 -526776 -1025153 -619215
34186 -619215 276536 671549 292336 -120730 831 163962 -337371 -1123084 -1114450 -119412
34176 -119412 855210 1059014 929307 1148592 1505761 1357198 739100 280053 241735 332649
34166 332649 376288 514599 721098 707221 453481 331578 503464 641639 500753 374220
34156 374220 631958 1080573 1186827 811081 344723 144815 161599 165903 51224 -183532
34146 -183532 -487535 -657284 -435715 82741 376005 117884 -291600 -199575 366696 683992
34136 683992 319582 -313154 -591445 -474396 -334650 -312671 -248241 -81968 71305 166312
34126 166312 206742 63206 -343529 -738243 -735935 -383105 -102245 -80187 -85089 25909 2233
34115B233l79831m68946n9646M30063M11421j43488n94405l34381M27033Q15389
34105A05442L82424k78139l81664o3890Q383j37152J16770O63990N77097l32055
34095F61206r19527l21128P22372R45226K77479l57673m45003k25905q013R5783
34085D24817j8272k72841l12903n9459M5146j92682k69425J27177M36795J50273
34075E8626k41215o1570L95149M33690J07087j39633l67530o75221n02976M14259
34065e79334J055230M37920o42594p15668L3177K35700k35145k41200L44615L99070
34055I1771k24517l15958L61661M26157o41887j327605m94709P53222R14672L18893
34045a38300J16916K86838J20760k58471k92598j55633k46325j99050L86203Q91831
$$ plain form
34115 2233 -377598 -846544 -906190 -476127 -64706 -208194 -802599 -1136980 -709947 105442
34105 105442 487866 209727 -171937 -235827 -227444 -364596 -247826 416164 993261 661206
34095 661206 -258321 -579449 142923 1088149 1365628 1007955 562952 337047 329034 424817
34085 424817 406545 133704 -179199 -238658 -193512 -386194 -655619 -528442 -91647 58626
34075 58626 -182589 -244159 150990 584680 691767 552134 184604 -490617 -993593 -579334
34065 -579334 475896 913816 271222 -444446 -411269 -175569 -410714 -651914 -307299 91771
34055 91771 -132746 -448704 -87043 339114 -302773 -1630378 -2125087 -1371865 -457193 -138300
34045 -138300 -21384 265454 386214 127743 -164855 -320488 -566813 -765863 -379660 512171
34035E12171N77620q7240k06266J5644j93019o14286l93414L64876P00292L56534
34025A032912J46m1077p5260j15522J58518M37488k9743j047038j388750n17218
34015a585544N80317P81933K43839j65867j70690j10644r2788J22570M95210N98818
34005F97154K59720j34498j80538j9627n7403k94970l27492o457L12631L19067
33995E67587J31562p7284l75976o73200n50940K5677L81769J31029q9090L29743
33985a99123Q08197N17757r6477j9239N59468O52488L26464M69822R32491Q42547
33975D794395P39900K057107M024359L656450K0734l762568m417586k521435q38951
33966C752405l82176k59430j29865m49023r35992q58740m67108m64172n30224
$$ plain form
34035 512171 1089791 1002551 796285 811929 618910 4624 -388790 -23914 676378 1032912
34025 1032912 1033058 991981 916721 801199 959717 1397205 1367462 320424 -1068326 -1585544
34015 -1585544 -1005227 -223294 20545 -145322 -316012 -426656 -519444 -396874 98336 697154
34005 697154 956874 822376 641838 622211 564808 269838 -57654 -64111 248520 567587
33995 567587 699149 621865 245889 -427311 -978251 -952574 -570805 -439776 -528866 -199123
33985 -199123 609074 1126831 1030354 1011115 1570583 2223071 2549535 3019357 3951848 4794395
33975 4794395 5534295 7591402 11615761 15272211 15292945 11530377 7112791 4591356 3752405
33966 3752405 3370229 3110799 2980934 2531911 1595919 737179 270071 -194101 -724325
33957g24325K6895O96829M94248k33462l79434N333M1928j78891J00870N54871
33947D04862J74116p46314q54679K2605O34514L90039L2981O2453N5858j65581
33937A0854j14530L31032O72438O97514N61502J01010p46698j155547m24814N91708
33927E24469O18462Q5303L60745J352109J963116K465241L792435M619949K302531
33918A8084360k580265n718960m535443j493641k35542q28772j018501k29391
33910A443845K50525o3923l89579l50866k57935q7838L28255N25083Q9152l89287
33900A097432k33776P1322k27107o73183l59793L91899N21837J8432j75010J68604
33890F00657L08849o9026l90714k51499J0135j4418k41438l43384j24700L18715
$$ plain form
33957 -724325 -697430 -601 493647 260185 -119249 -113916 -71988 -250879 -150009 404862
33947 404862 578978 -167336 -1022015 -999410 -364896 25143 58124 120577 176435 10854
33937 10854 -103676 227356 899794 1597308 2158810 2259820 1513122 357575 -67239 524469
33927 524469 1142931 1228234 1588979 2941088 4904204 7369445 11161880 15781829 18084360
33918 18084360 15504095 9785135 5249692 3756051 3520509 2691737 1673236 1443845
33910 1443845 1694370 1630447 1240868 890002 632067 544229 872484 1397567 1486719 1097432
33900 1097432 863656 934978 707871 34688 -325105 66794 588631 607063 432053 600657
33890 600657 909506 840480 449766 198267 208402 193984 -47454 -390838 -515538 -196823
33880a96823N40771J21642o32410q36830k08442M88638N64177K68958O8078j44810
33870C2949m72822m69287O7393N01941L63074J76163M43208O04351L4250o79823
33860F01397o10037j6603J88580k6727n0371O7790j59314m60556j58810M73282
33850a51369M99263j19503m75976k11322J33203K76557N03904O98714K84773n81831
33840H56413q82150k10596N69590N91051P7043k82264l19583k62755j88987q1874
33830a34112l9204p4514j8382J71700K98175K29166K2923k53569m87491l90861
33820f76169J38186O13459M60599j21387l81571j07394J33843n9828l75405m04103
33810g79770k48212j86321j60474L5862L17243L86819J60988j06954j36131L4193
$$ plain form
33880 -196823 343948 465590 -166820 -1003650 -1212092 -723454 -159277 109681 177759 32949
33870 32949 -439873 -909160 -841767 -339826 23248 199411 642619 1246970 1281220 601397
33860 601397 -8640 -25243 163337 136610 86239 154029 -5285 -465841 -624651 -151369
33850 -151369 347894 228391 -247585 -458907 -325704 -49147 454757 1153471 1438244 856413
33840 856413 -25737 -236333 333257 924308 1001351 719087 399504 136749 -52238 -134112
33830 -134112 -173316 -247830 -266212 -94512 203663 432829 455752 202183 -285308 -676169
33820 -676169 -537983 75476 536075 414688 33117 -74277 59566 -262 -375667 -779770
33810 -779770 -1027982 -1214303 -1374777 -1338915 -1021672 -634853 -473865 -580819 -716950 -682757
33800f82757Q1732j41315k95167K7444N99749P15503J67862m09406m20443l9579
33790c96377K46180L14394K32089p7016n06407n93147j88374J73382R4516m4511
33780g45271J40747K57639r0642l68485P4161P33783O10563j83703o24499m01134
33770e96841j63280j79876L9561O12789Q89412N15256l0691k78208l21337k72821
33760B13964M982L41726K53025j93401l08510Q6575K83350j45372o12027m80350
33750e56038l5434J26849O1256J50389L03370J79388j00838j23633J04921J78317
33740B88547m3024k41787j41395J28306K30826K9403k55573k86602l0101J69988
33730a51412P2724q9474L182J96407J05911k07497l15344j34117j7972r8725q5565
$$ plain form
33800 -682757 -601025 -742340 -1037507 -1010063 -410314 305189 473051 63645 -356798 -396377
33790 -396377 -150197 164197 396286 319270 -187137 -780284 -968658 -795276 -700760 -745271
33780 -745271 -604524 -346885 -437527 -806012 -731851 1932 612495 428792 -195707 -596841
33770 -596841 -760121 -939997 -900436 -287647 601765 1117021 1086330 808122 486785 213964
33760 213964 218946 560672 813697 620296 311786 398361 681711 536339 -75688 -556038
33750 -556038 -591472 -464623 -403367 -252978 50392 229780 128942 5309 110230 288547
33740 288547 245523 3736 -137659 -9353 221473 250876 -4697 -291299 -321400 -151412
33730 -151412 -78688 -168162 -164980 31427 137338 -70159 -385503 -519620 -537592 -636317 -721882
33719g21882J49188L02885J53232j04159k21878k24610k07064j55215q7384n1205
33709a168092N7184L10482M22322P1636m63405n48210j08232K83572L12226K79650
33699e50867M14653M82928L18321J23393j4062k89948o09746n08458L0204L60288
33689b43294J79369M0390L56248O19136K85090k19823k09599O6597j05556n78741
33679A89817n30152J17105M95597J74536k05035m7012K54725O4651l81986l37130
33669b04884K53314O17126K63155l62683n56219k64187M1878J31450J85085K62149
33659C66184J16526k73963m36143k9662N35617N56174j8588n33951m97634r2975
33649c08415K14194K10068j5813k41255k34996L4205K58811J22528k13033k61658
$$ plain form
33719 -721882 -572694 -269809 -116577 -220736 -442614 -667224 -874288 -1029503 -1116887 -1168092
33709 -1168092 -1110908 -800426 -378104 -306468 -769873 -1318083 -1426315 -1142743 -830517 -550867
33699 -550867 -136214 346714 665035 788428 774366 484418 -125328 -633786 -603582 -243294
33689 -243294 -63925 -23535 332713 951849 1236939 1017116 807517 874114 768558 189817
33679 189817 -340335 -223230 272367 446903 241868 194856 449581 514232 132246 -204884
33669 -204884 48430 665556 928711 566028 9809 -254378 -212500 -81050 104035 366184
33659 366184 482710 208747 -227396 -257058 278559 834733 816145 282194 -215440 -308415
33649 -308415 -94221 115847 100034 -141221 -376217 -342012 -83201 39327 -173706 -435364
33639d35364J05618M68518M37241J02662k11535l48145l22190j75378K5449J97419
33629a55705K98714K54377n4333m82406n17551O8815O43662M10660l67556n99328
33619e00651N8114O73420M47501j53575k65264M0153P4506k35887l14951J2369
33609a64265K49835R5605q9468Q3632L98441L40613j89738p10173o56968M436
33599f38050O73083P21035K36854p9775J18536L37739L5171m68968m32560J43167
33589F46232M59099Q0825m79069n75050k81363o1917j1718R1421K26081J34252
33579B28793j67586l30077j82746M3102R5987J4524n6073q4682m8669J29515L53250
33568d662L18136l3363k59013K5668M95652M59230j76725p37496o73595k04606
$$ plain form
33639 -435364 -329746 138772 576013 678675 467140 118995 -203195 -378573 -353124 -155705
33629 -155705 143009 397386 343053 -139353 -656904 -588089 55573 466233 98677 -500651
33619 -500651 -442537 230883 678384 524809 259545 299698 374204 138317 -176634 -164265
33609 -164265 85570 181175 91707 175339 573780 914393 724655 14482 -642486 -638050
33599 -638050 35033 756068 992922 913147 1031683 1369422 1404593 935625 503065 646232
33589 646232 1105331 1186156 707087 132037 -149326 -211243 -222961 -131540 94541 228793
33579 228793 61207 -268870 -451616 -408514 -312527 -298003 -354076 -438758 -487427 -357912 -4662
33568 -4662 313474 280111 21098 46766 542418 1001648 824923 87427 -586168 -790774
33558g90774J21104J39564O7338P4248J82738L91919N78454M31444j59996p46248
33548B89791p31404j67968K33725K3995l86207l16135K09278M89721J75401j91446
33538c71249J7213N01926M23530k59812n92870n3234N55916K78585n08136o80218
33528f88349j08632K41917p4815l64269m7209M40091M68786J47014r6771k09431
33518b91668k88912k33693o3837m4353j25182J04466N62166N67445K6991j96615
33508A6808K92528O27939J31909m43026j98214L13454Q9532m94089l81160J83518
33498A39199M9682p06628p78258J64244R04924O60936J34360Q1450J81504j1862
33488H19551j63862L8306J40160k36107n80038l00923K59668L65571M559j98055
$$ plain form
33558 -790774 -669670 -530106 -462768 -388520 -205782 186137 764591 1196035 1036039 289791
33548 289791 -441613 -609581 -375856 -351861 -738068 -1054203 -844925 -355204 -179803 -371249
33538 -371249 -354036 147890 571420 311608 -281262 -334496 221420 500005 -8131 -688349
33528 -688349 -796981 -555064 -629879 -994148 -1041357 -601266 -132480 14534 -82237 -291668
33518 -291668 -580580 -814273 -878110 -922463 -1047645 -943179 -381013 186432 213423 16808
33508 16808 309336 937275 1069184 626158 427944 741398 830930 336841 -44319 139199
33498 139199 188881 -517747 -1296005 -1131761 -226837 434099 568459 649909 831413 819551
33488 819551 655689 693995 834155 598048 18010 -282913 -23245 342326 346885 148830
33478A48830O3604M19810L39007k47304p74793n63198K86908P78258K37622o88090
33468F54r10047m07983J1401J30502L71756O21334L15909k54103j18788O37140
33458C97775P30100k57105j055895o67714J29573J33966m77620o91638k09860
33449a968418M58798Q49788P54635J66168m21530l28429K40685K90296l46900
33440c04907n69627J73800Q42085M94645j62783r8596K58659m3536o30392m42525
33430d83177L48637O25644J89378j27328j6472K1323j35526o6857J64245M3435
33420E63302l05699k38858J50508P9620m89082o67354j55348K38410K017k54350
33410a076834M9388M47857K91742j21073r1429K82028K73539k81841o90018l74495
$$ plain form
33478 148830 212434 632244 971251 723947 -50846 -614044 -327136 451122 688744 654
33468 654 -909393 -1317376 -1305975 -1175473 -803717 -182383 133526 -120577 -239365 397775
33458 397775 1127875 870770 -185125 -852839 -723266 -589300 -1066920 -1758558 -1968418
33449 -1968418 -1509620 -659832 94803 260971 -160559 -488988 -248303 41993 -304907
33440 -304907 -874534 -700734 141351 635996 473213 374617 633276 589740 -40652 -483177
33430 -483177 -134540 491104 680482 553154 536682 558005 422479 355622 519867 563302
33420 563302 257603 18745 169253 248873 -240209 -907563 -1062911 -824501 -822484 -1076834
33410 -1076834 -1027446 -579589 -287847 -408920 -500349 -218321 55218 -226623 -916641 -1291136
33400a291136L50919P36719N59022K76786K50228K23223j19775m48372k42935
33391B94679K19983J50030m29484n69159P6844N90181K41807l30256k22040K70689
33381B93274K96238q2024j73106K9470l6081l44917l48464l9962P4352k2931J32183
33370b21968N22292O14110K64150j70307n23384p97733o59728R0086P48673M85289
33360C51480k61557l27054L14203N09117j59645p52690n56508k1839K89258N00948
33350a14287O80463M41118j36502k53818L14029O90966L14861j42370j9391J78526
33340A953595k12780p39130o11956q5459L2918k54092l20457j07811r3860k73814
33330g12846j43794L45242O45038M55313N4896k18121k62887n0106L07728M08417
$$ plain form
33400 -1291136 -940217 -203498 355524 632310 882538 1105761 985986 537614 294679
33391 294679 514662 664692 235208 -333951 -257107 333074 574881 244625 22585 293274
33381 293274 589512 507488 334382 363852 327771 -17146 -365610 -405572 -331220 -354151 -221968
33370 -221968 300324 914434 1178584 1008277 484893 -312840 -972568 -882482 -133809 351480
33360 351480 89923 -237131 77072 586189 426544 -326146 -882654 -904493 -615235 -114287
33350 -114287 566176 1007294 870792 616974 931003 1621969 1936830 1794460 1775069 1953595
33340 1953595 1740815 1001685 389729 304270 337188 83096 -237361 -345172 -439032 -712846
33330 -712846 -856640 -511398 133640 588953 643849 425728 162841 112735 420463 828880
33320H28880J5354m39888l63819Q4276J89891k26890n57358l52202O5160J79708
33310e76888K1560r022K14428L97325K53794j06806k70215O338M40229M92921
33300H63664N3179l68081k97378P8638K39281R5895K8960K01410K75163l0755
33290A139976m36633m49672o4886K03521L0272k56780j39270L05865M29572j04143
33280F57822p96173r38236n14959j06066k2836K943K42356N26594N62437L70267
33270a5851J84292J17552J12679R2727L4102j2725O2736K64000L56398J15870
33260A311780l00675m98544l81133k44486k70016k45076N7739M85743O75206M49578
33250A040116n7087n09456n64126j80667K22573J94325j29765j76566K06327M65835
$$ plain form
33320 828880 844234 404346 40527 124803 314694 87804 -469554 -821756 -756596 -576888
33310 -576888 -555328 -564350 -349922 47403 301197 194391 -75824 -69486 370743 863664
33300 863664 916843 548762 251384 330022 569303 665198 694158 895568 1170731 1139976
33290 1139976 703343 253671 188785 392306 422578 165798 26528 332393 761965 657822
33280 657822 -138351 -1076587 -1591546 -1697612 -1720448 -1717505 -1475149 -948555 -386118 -15851
33270 -15851 168441 285993 398672 491399 525501 512776 575512 839512 1195910 1311780
33260 1311780 1011105 512561 131428 -113058 -383074 -628150 -570411 -84668 590538 1040116
33250 1040116 983029 473573 -90553 -271220 -48647 145678 15913 -160653 45674 511509
33240E11509J58878l38074l33207J98515N83276L55508j81712m02394j21598K54258
33230F84959K65299o5674l14388k18077J5669N0685j04459j78978q7967k1029
33220B6040r6231j89411j54797j138J97826L72345L95504J54304k41134m74429
33210a1121l40124K4203K57067J13415k60145m07621p8580L72687M10313J33889
33200B13983J51784M82393L03088o97378j434910p86263O41830J184930L86571
33191D46028n37667n62160l7705K94097L96509M82548L39909j87100o54536o07189
33181f27266k42241M0995K55753M65394L48269k34779p03946m94670M0283J77026
33171i75182n3742o5852J94193K21441n0727j06920J70930K10650k51096o05536
$$ plain form
33240 511509 670387 332313 -894 197621 780897 1136405 954693 552299 430701 684959
33230 684959 950258 884584 570196 352119 367788 418473 314014 135036 47069 26040
33220 26040 -70191 -259602 -414399 -415537 -217711 154634 550138 704442 463308 -11121
33210 -11121 -351245 -327042 -69975 43440 -216705 -624326 -702906 -330219 80094 213983
33200 213983 365767 848160 1151248 453870 -981040 -1767303 -1125473 59457 446028
33191 446028 -91639 -653799 -691504 -397407 -898 481650 821559 634459 -20077 -627266
33181 -627266 -869507 -828512 -572759 -107365 240904 6125 -697821 -1192491 -1152208 -975182
33171 -975182 -1028924 -1094776 -900583 -679142 -729869 -836789 -665859 -455209 -706305 -1311841
33161a311841l00706K19900J36222n05206q40682m16601K64028N63770N19296
33152a671820M88274M37406J26245k37759j81794K06000L03783l2066j83580J55963
33142e89348L55162j07071o20717l26928M48840O64113K00847p9201J22412J37059
33132B05168k99676m46244J49759P54652N55209j06180l59679r4897J24323J8651
33122E01086k05753l24279k33511Q9739L66491J45232m55617o34016l612P30710
33112b3530P51480K33031j73400l87026o30283o21265p376O94762O03221j83988
33102B55626o78224m29817J4321J55301J79506L38955M51684L33338J49652N0998
33092H21340q7360l37248n17037m71881k27101J60935N37769N18592o5998o54820
$$ plain form
33161 -1311841 -1612547 -1392647 -1256425 -1761631 -2602313 -3018914 -2754886 -2191116 -1671820
33152 -1671820 -1183546 -746140 -619895 -857654 -1039448 -833448 -529665 -561731 -745311 -589348
33142 -589348 -234186 -341257 -961974 -1288902 -840062 -175949 24898 -54303 68109 205168
33132 205168 -94508 -540752 -390993 363659 918868 812688 453009 358112 482435 501086
33122 501086 295333 -28946 -262457 -172718 193773 339005 -116612 -750628 -754240 -23530
33112 -23530 727950 960981 787581 400555 -229728 -850993 -858369 -163607 439614 255626
33102 255626 -422598 -852415 -838094 -682793 -503287 -164332 287352 620690 770342 821340
33092 821340 733980 396732 -120305 -592186 -819287 -658352 -120583 398009 332011 -322809
33082c22809n05415K23973O12311K90122j09370l0493K15491J27895j71709l10368
33072A9628l28237m25140m37214j21379L11547M57469L10920J51730M5688q7004
33062a01992r3221K18294O05325O15175K50986n7682j48656k79526n04113m59375
33052D5215m3303K01842j60188o75195n38884K22186P22303M34111j46617l04054
33042b42584o4536O7549k7939l5505J40984K16447L2744k15800l26987k88773
33032g44400r5257K51055N06821L64248o3603l34204l08663k43784k08133K3666
33022h52254L65405L60280k3123k16826k0426N19m19166n70525Q8537Q22331O22063
33011A56815j84383m26651R5962M57591J94456j12827j6871J07909q1247k56835
$$ plain form
33082 -322809 -828224 -604251 8060 298182 188812 158319 373810 501705 329996 19628
33072 19628 -308609 -733749 -1170963 -1292342 -980795 -523326 -212406 -60676 -14988 -101992
33062 -101992 -195213 23081 628406 1243581 1494567 1436885 1288229 1008703 504590 45215
33052 45215 1912 203754 43566 -631629 -1170513 -948327 -226024 208087 61470 -242584
33042 -242584 -307120 -239571 -267510 -303015 -162031 54416 87160 -128640 -455627 -744400
33032 -744400 -839657 -588602 -81781 282467 218864 -115340 -424003 -667787 -875920 -852254
33022 -852254 -486849 -126569 -149692 -366518 -386944 -386425 -805591 -1376116 -1287579 -465248 156815
33011 156815 -27568 -454219 -358257 99334 293790 180963 164092 272001 190754 -66081
33001f6081r6327J29590J04443m853N525n0246l04394m55550k46176J03832L02932
32990e77305M08239N01444L85677j4702l48592l11261p6521O1828J04313J05673
32980B38793l9208k29284n8422M91832P34912J79325o55106q94795m65112K318
32970f94747J51396J64157J90269J20012q0181k56735k88988j21538K76630O85270
32960A45545O28785l414o12539o29634l02580j97027k22885J21671P13907Q34212
32950D76041K77314l01392l23871L0860K72704K02432j09969m81085n97435k76131
32940h30532J55266J79397j54877k94494n2055J58186O2328r8657j05134o7141
32930a047713j927K70130N81074M42561q9650k95499Q5094L67802P3403k22535
$$ plain form
33001 -66081 -162408 -32818 71625 66772 72297 22051 -282343 -737893 -984069 -880237 -577305
32990 -577305 -169066 332378 718055 703353 354761 43500 -33021 28807 133120 238793
32980 238793 199585 -29699 -88121 403711 1138623 1317948 662842 -231953 -697065 -694747
32970 -694747 -543351 -379194 -188925 -68913 -149094 -405829 -694817 -816355 -539725 145545
32960 145545 774330 770916 158377 -471257 -773837 -970864 -1193749 -1072078 -358171 476041
32950 476041 753355 451963 128092 158952 431656 634088 524119 43034 -554401 -830532
32940 -830532 -675266 -495869 -650746 -945240 -997295 -839109 -776781 -875438 -980572 -1047713
32930 -1047713 -1049640 -779510 -198436 244125 154475 -141024 -55930 311872 385275 162740
32920A62740J05735N91055M24656j93296m41942k47654k23160m34936l02683K47661
32910c11824N37499K45432j09795q9351L2968o8096j48641Q2702L24454J02588
32900E97936m38935o50971k30217L61266M16123j69349o94893m55622L30902P66862
32890a66898M97909J25691J26733P8976m23454p80958k59983O30860P51641O2497
32880F43014m10228k24562N6259R6004J88068K90910n5724n94621m45718L00086
32870a56512M57872k79531p02583j27427M19341L4204m95389k00547L16353J14532
$$ plain form
32920 162740 268475 859530 1284186 1090890 648948 401294 178134 -256802 -559485 -311824
32910 -311824 225675 471107 361312 271961 304929 236833 88192 170894 495348 597936
32900 597936 159001 -491970 -722187 -360921 55202 -114147 -809040 -1264662 -933760 -166898
32890 -166898 331011 456702 583435 662411 238957 -542001 -801984 -171124 580517 643014
32880 643014 232786 8224 64483 160487 348555 639465 583741 -10880 -456598 -156512
32870 -156512 301360 21829 -680754 -808181 -388840 -354636 -850025 -1050572 -734219 -619687
$$ [...]
##END NTUPLES=NMR SPECTRUM
##END=
