##TITLE=31Pdec_LR-753-R2-H-B
 D2O, 24 sc
 23.9.2022
##JCAMPDX= 6.0         $$ Bruker NMR JCAMP-DX V2.0
##DATA TYPE= NMR SPECTRUM
##DATA CLASS= NTUPLES
##ORIGIN= UXNMR, Bruker Analytische Messtechnik GmbH
##OWNER= root
$$ XWIN-NMR		Version 3.5
$$ Fri Sep 23 13:28:43 2022 Russian Standard Time (UT+4h)  she@DPX200
##.OBSERVE FREQUENCY= 81.013821
##.OBSERVE NUCLEUS= ^31P
##.ACQUISITION MODE= SIMULTANEOUS
##.ACQUISITION SCHEME= undefined
##.AVERAGES= 24
##.DIGITISER RES= 16
##SPECTROMETER/DATA SYSTEM= spect
##.PULSE SEQUENCE= zgpg30
##.SOLVENT NAME= D2O
##.SHIFT REFERENCE= (INTERNAL, D2O, 0, 248.564)
##AUDIT TRAIL= $$ (NUMBER, WHEN, WHO, WHERE, WHAT)
$$ ##TITLE= Audit trail, XWIN-NMR		Version 3.5
$$ ##JCAMPDX= 5.01
$$ ##ORIGIN= Bruker BioSpin GmbH
$$ ##OWNER= she
$$ F:/spectra/data/she/nmr/P31/1/pdata/1/auditp.txt
$$ ##AUDIT TRAIL=  $$ (NUMBER, WHEN, WHO, WHERE, WHAT)
(   1,<2022-09-23 13:27:36.98 +0400>,<she>,<DPX200>,
      <created by zg, POWCHK disabled, PULCHK disabled
       configuration hash MD5:
       00 E9 B6 7A A2 85 ED C7 34 08 36 98 17 FE 4E 26
       data hash MD5: 32K
       A1 D8 BB 05 33 4A 5D 8B 9E FA 24 57 DA 90 64 D8>)
(   2,<2022-09-23 13:27:48.10 +0400>,<she>,<DPX200>,
      <Start of raw data processing
       efp BC_mod = 2 LB = 1 FT_mod = 6 PKNL = 1 PHC0 = -10287.75 PHC1 = 149.8566 SI = 64K 
       data hash MD5: 64K
       E6 99 2D 3B 64 3C 02 FE 3D 4A 6A 0F 1F C6 C1 F6>)
(   3,<2022-09-23 13:28:02.87 +0400>,<she>,<DPX200>,
      <pk PHC0 = -26.63771 PHC1 = 0 
       data hash MD5: 64K
       95 06 43 E7 D0 F7 E2 B0 0D 82 E7 AE 80 DE 57 53>)
(   4,<2022-09-23 13:28:06.26 +0400>,<she>,<DPX200>,
      <abs ABSG = 5 
       data hash MD5: 64K
       3B C9 DE 14 1B AB A0 98 75 B8 00 94 27 EC 70 83>)
$$ ##END=
$$ 
$$ hash MD5
$$ F4 78 56 F0 5E 0F 4E 8F 24 AD 00 58 13 43 7C 4F
##$RELAX= 
##$RELAX= 
##$RELAX= 
##$RELAX= 
##$RELAX= 
##$RELAX= 
##$RELAX= 
##$RELAX= 
##$RELAX= 
$$ Bruker specific parameters
$$ --------------------------
##$DU= <F:/spectra>
##$EXPNO= 1
##$NAME= <P31>
##$PROCNO= 1
##$TYPE= <nmr>
##$USER= <she>
##$AMP= (0..31)
100 100 100 100 100 100 100 100 100 100 100 100 100 100 100 100 100 100 
100 100 100 100 100 100 100 100 100 100 100 100 100 100 
##$AQSEQ= 0
##$AQ_mod= 1
##$AUNM= <au_zg>
##$AUTOPOS= <>
##$BF1= 81.014009
##$BF2= 200.13
##$BF3= 200.13
##$BF4= 200.13
##$BF5= 200.13
##$BF6= 200.13
##$BF7= 200.13
##$BF8= 200.13
##$BYTORDA= 1
##$CFDGTYP= 0
##$CFRGTYP= 5
##$CHEMSTR= <none>
##$CNST= (0..31)
1 1 145 1 1 1 1 1 1 1 1 1 1 1 1 1 1 1 1 1 1 1 1 1 1 1 1 1 1 1 1 1 
##$CPDPRG= <waltz16>
##$CPDPRG1= <>
##$CPDPRG2= <waltz16>
##$CPDPRG3= <>
##$CPDPRG4= <mlev>
##$CPDPRG5= <mlev>
##$CPDPRG6= <mlev>
##$CPDPRG7= <mlev>
##$CPDPRG8= <mlev>
##$CPDPRGB= <>
##$CPDPRGT= <>
##$D= (0..31)
0 1 0 0 0 0 0 0 0 0 0 0.03 2e-05 3e-06 0 0 0 0 0 0 0 0 0 0 0 0 0 0 0 0 
0 0 
##$DATE= 1663925256
##$DBL= (0..7)
120 120 120 11 120 120 24 19 
##$DBP= (0..7)
150 150 150 150 150 150 150 150 
##$DBP07= 0
##$DBPNAM0= <>
##$DBPNAM1= <>
$$ [...]
##$SUBNAM3= <"">
##$SUBNAM4= <"">
##$SUBNAM5= <"">
##$SUBNAM6= <"">
##$SUBNAM7= <"">
##$SUBNAM8= <"">
##$SUBNAM9= <"">
##$SW= 501.771253377433
##$SWIBOX= (0..15)
0 1 3 0 0 0 0 0 0 0 0 0 0 0 0 0 
##$SW_h= 40650.406504065
##$TD= 32768
##$TD0= 1
##$TE= 0
##$TE2= 300
##$TE3= 300
##$TEG= 300
##$TL= (0..7)
0 120 53 12 22 120 120 120 
##$TP= (0..7)
150 150 150 150 150 150 150 150 
##$TP07= 0
##$TPNAME0= <>
##$TPNAME1= <>
##$TPNAME2= <>
##$TPNAME3= <>
##$TPNAME4= <>
##$TPNAME5= <>
##$TPNAME6= <>
##$TPNAME7= <>
##$TPOAL= (0..7)
0.5 0.5 0.5 0.5 0.5 0.5 0.5 0.5 
##$TPOFFS= (0..7)
0 0 0 0 0 0 0 0 
##$TUNHIN= 0
##$TUNHOUT= 0
##$TUNXOUT= 0
##$USERA1= <user>
##$USERA2= <user>
##$USERA3= <user>
##$USERA4= <user>
##$USERA5= <user>
##$V9= 5
##$VALIST= <valist>
##$VCLIST= <CCCCCCCCCCCCCCC>
##$VD= 0
##$VDLIST= <DDDDDDDDDDDDDDD>
##$VPLIST= <PPPPPPPPPPPPPPP>
##$VTLIST= <TTTTTTTTTTTTTTT>
##$WBST= 1024
##$WBSW= 4
##$XGAIN= (0..3)
0 0 0 0 
##$XL= 0
##$YL= 0
##$YMAX_a= 3766
##$YMIN_a= -4057
##$ZGOPTNS= <>
##$ZL1= 120
##$ZL2= 120
##$ZL3= 120
##$ZL4= 120
##$ABSF1= 248.5645
##$ABSF2= -253.2056
##$ABSG= 5
##$ABSL= 3
##$ALPHA= 0
##$AQORDER= 0
##$ASSFAC= 0
##$ASSFACI= 0
##$ASSFACX= 0
##$ASSWID= 0
##$AUNMP= <proc_1d>
##$AZFE= 0.1
##$AZFW= 0.5
##$BCFW= 0
##$BC_mod= 2
##$BYTORDP= 0
##$COROFFS= 0
##$CY= -3
##$DATMOD= 1
##$DC= 0
##$DFILT= <>
##$DTYPP= 0
##$F1P= 0
##$F2P= 0
##$FCOR= 1
##$FTSIZE= 65536
##$FT_mod= 6
##$GAMMA= 0
##$GB= 0
##$INTBC= 1
##$INTSCL= 6.834604e-11
##$ISEN= 30
##$LB= 1
##$LEV0= 0
##$LPBIN= 0
##$MAXI= 10000
##$MC2= 0
##$MEAN= 0
##$ME_mod= 0
##$MI= 50
##$NCOEF= 0
##$NC_proc= -6
##$NLEV= 6
##$NOISF1= 182.463
##$NOISF2= 159.3651
##$NSP= 0
##$NTH_PI= 0
##$NZP= 0
##$OFFSET= 248.5645
##$PC= 4
##$PHC0= -10314.39
##$PHC1= 149.8566
##$PH_mod= 1
##$PKNL= yes
##$PPARMOD= 0
##$PSCAL= 0
##$PSIGN= 0
##$REVERSE= no
##$SF= 81.0140089999694
##$SI= 65536
##$SIGF1= 159.3651
##$SIGF2= -187.1042
##$SINO= 113.3802
##$SIOLD= 16384
##$SREGLST= <1H.CDCl3>
##$SSB= 0
##$STSI= 65536
##$STSR= 0
##$SW_p= 40650.406504065
##$SYMM= 0
##$S_DEV= 0
##$TDeff= 32768
##$TDoff= 0
##$TI= <>
##$TILT= no
##$TM1= 0
##$TM2= 0
##$TOPLEV= 0
##$USERP1= <user>
##$USERP2= <user>
##$USERP3= <user>
##$USERP4= <user>
##$USERP5= <user>
##$WDW= 1
##$XDIM= 65536
##$YMAX_p= 489089061
##$YMIN_p= -26014416
$$ End of Bruker specific parameters
$$ ---------------------------------
##NTUPLES= NMR SPECTRUM
##VAR_NAME=  FREQUENCY,     SPECTRUM/REAL,   SPECTRUM/IMAG
##SYMBOL=    X,             R,               I
##VAR_TYPE=  INDEPENDENT,   DEPENDENT,       DEPENDENT
##VAR_FORM=  AFFN,          ASDF,            ASDF
##VAR_DIM=   65536,         65536,           65536
##UNITS=     HZ,            ARBITRARY UNITS, ARBITRARY UNITS
##FACTOR=    0.620285442955139, 1,           1
##FIRST=     20137.2065510682, 0,            0
##LAST=      -20513.1999529968, 0,           0
##MIN=       -20513.1999529968, -26014416,   0
##MAX=       20137.2065510682, 489089061,    0
$$ Real data points
##PAGE= N=1
##DATA TABLE= (X++(R..R)), XYDATA
$$ [...]
42579 -1190078 -189 919739 881433 -122364 -1256908 -1615442 -1311862 -1370962 -2311690
42570 -2311690 -3288964 -3063177 -1556564 60711 785682 771613 726987 788692 474363 -396681
42560 -396681 -1273492 -1502452 -1001312 -111285 858852 1641599 1893805 1516166 920272 549879
42550 549879 277575 -243214 -756137 -598995 171910 554505 -93985 -1029213 -949584 398520
42540 398520 1968786 2657960 2305851 1454517 625738 75282 -86028 83415 268556
42531 268556 121145 -361760 -847095 -1107389 -1265685 -1463904 -1478434 -968304 -77094 538793
42521 538793 407718 -248676 -810816 -852765 -357583 360500 787775 594252 138345 260299
42511 260299 1238216 2281873 2500922 2035464 1607620 1219550 178924 -1506991 -2675996
42502 -2675996 -2420360 -1312772 -605614 -596700 -493771 199589 877046 701845 -131288 -506402
42492 -506402 227806 1381841 1730385 981429 -19160 -524681 -708264 -973912 -1105147
42483 -1105147 -742992 -250721 -241876 -456341 -68459 840247 1110817 149656 -1110208 -1400175
42473 -1400175 -605362 454485 1117348 1151396 472281 -704575 -1763241 -2333631 -2691833
42464 -2691833 -2962068 -2448679 -640193 1481620 2230294 1305928 79664 -358629 -383461
42455 -383461 -666894 -883300 -414239 338913 352456 -561662 -1580390 -2104033 -2340337 -2501774
42445 -2501774 -2198983 -1112008 203023 767877 347180 -255371 -112433 859026 1904701
42436 1904701 2254210 1858865 1349860 1289720 1535080 1488042 957923 479156 603510 1143779
42426 1143779 1425347 1123683 521155 56900 -18588 337198 842409 887756 208880 -444279
42416 -444279 3185 1408009 2268996 1510486 -239424 -1619510 -2114207 -2032721 -1603039
42407 -1603039 -1027345 -949120 -1717907 -2394668 -1714829 -100543 568949 -406850 -1365583
42398 -1365583 -521464 1541735 2647573 1783512 56260 -933015 -766244 -173295 3001
42389 3001 -439463 -1002115 -1044787 -551258 -207944 -474125 -824156 -388134 788965 1731310
42379 1731310 1856171 1706683 2024971 2560407 2376626 1235063 123714 198817 1482870
42370 1482870 2844956 3118939 2042713 272243 -1171905 -1482430 -513824 1069390 2232155
42361 2232155 2347611 1537617 334507 -713968 -1125620 -651641 373979 1189840 1386439
42352 1386439 1243691 1093177 792237 190539 -337928 -343399 55568 458673 742869 823204
42342 823204 330816 -760839 -1593848 -1324247 -243988 792676 1612261 2365945 2437313
42333 2437313 1189657 -354644 -300633 1336310 2312142 1294864 -265153 -432660 476747
42324 476747 889866 648526 951299 2055577 2726223 2155352 1164053 1026427 1872940
42315 1872940 2717466 2645780 1627302 328519 -622269 -1071260 -1053326 -417438 809716
42306 809716 1908411 2054534 1454104 1121543 1420769 1677807 1403418 897344 347884
42297 347884 -521266 -1411849 -1299392 -91066 760076 285805 -466297 -98996 967466
42288 967466 1363456 935678 517991 201959 -520107 -1271345 -1083016 -62628 656738
42279 656738 572822 136244 -421427 -1219130 -1806558 -1540662 -867099 -815368 -1211721 -891759
42269 -891759 209816 791949 329572 -101264 332887 1033606 1291987 1423137 1770174
42260 1770174 1797932 1108678 367830 291464 510192 291871 -276201 -593594 -475096 -148531
42250 -148531 159856 183580 -256052 -738667 -578212 27055 60899 -726695 -1339529 -1172827
42240 -1172827 -998412 -1509510 -1951100 -1292617 10223 572612 -88840 -1274093 -2220053
42231 -2220053 -2557961 -2032410 -768543 322086 257199 -864915 -1966694 -2175638 -1545012
42222 -1545012 -817864 -799131 -1670582 -2687721 -2948685 -2572449 -2448685 -2685189 -2303498
42213 -2303498 -902872 482111 902248 795182 851051 659622 -284540 -1144748 -787240
42204 -787240 342647 887394 682225 634723 785741 209431 -1069513 -1736528 -1202703
42195 -1202703 -506159 -567669 -803398 -297110 640216 1036245 747513 480486 653418 975652
42185 975652 1026302 712500 197526 -253343 -350479 62231 852722 1614997 1865346 1416518
42175 1416518 697674 448335 822443 1076336 539552 -394088 -795488 -515432 -294815
42166 -294815 -576456 -876180 -517815 505388 1616618 2260906 2282665 1956219 1709599
42157 1709599 1660490 1542028 1268855 1243001 1690581 2051421 1655582 783418 345878 615754
42147 615754 1004356 1074827 1021270 1059970 1083787 1089963 1264059 1445578 1198542 646959 509618
42136 509618 949073 1117266 388012 -575490 -686674 34445 580938 477597 401921 1073032
42126 1073032 2092548 2388802 1643075 728614 500955 578753 -60634 -1377103 -2015173
42117 -2015173 -1151801 182108 442205 -261727 -396256 699970 1829818 1535912 -146265
42108 -146265 -1954375 -2811531 -2559857 -1760297 -1172840 -1139465 -1238211 -825680 25861 608273
42098 608273 669175 771197 1289799 1715703 1428464 642370 44555 -112490 -25100 214893
42088 214893 610616 906872 787956 336998 -98402 -347539 -360789 22851 739191 1137454
42078 1137454 594039 -548188 -1275956 -1189580 -850251 -724652 -560029 -206723 -258353 -1056818
42068 -1056818 -1620120 -719405 1075495 1692161 289566 -1459953 -1597054 -387935 511108
42059 511108 597599 675360 817446 23932 -1752582 -2939005 -2502481 -1404476 -953653
42050 -953653 -982147 -823476 -903417 -1826390 -2756343 -2424082 -1233015 -658626 -874204 -730514
42040 -730514 39101 461332 319392 616397 1567142 1930398 1116490 339171 695437 1507590
42030 1507590 1636661 1181752 749028 213581 -551390 -795147 -108665 424398 -221442
42021 -221442 -1124020 -707267 681964 1253644 509720 -296349 -377811 -275490 -250330 391764
42011 391764 1712419 2428822 1724825 567348 206124 361227 39389 -622201 -647516
42002 -647516 333 223528 -566910 -1662994 -2191167 -2185192 -2089659 -1852484 -1144461 -142704
41992 -142704 563274 787168 897098 1070259 969440 467259 185662 749213 1766198
41983 1766198 2193929 1651610 745355 77232 -362119 -648698 -538031 -27860 342474
41974 342474 270167 212510 570932 885776 528871 -236803 -631013 -429792 95343 916361
41964 916361 1968822 2421967 1427577 -345434 -1133760 -412071 288178 -478389 -2032737
41955 -2032737 -2572270 -1632543 -540453 -537480 -1304118 -1587291 -823254 207875 320063
41946 320063 -605156 -1299791 -534386 1265389 2348219 1693413 164987 -704379 -524490
41937 -524490 -96883 -60607 -219683 -148861 163832 415813 332364 -177705 -885976 -1241165
41927 -1241165 -865016 -99489 333966 316332 516768 1345855 2152501 1932681 645392
41918 645392 -654449 -985274 -362406 467603 823566 496055 -273378 -952852 -1069869
41909 -1069869 -640561 -128136 137744 247488 271908 -44218 -748696 -1217248 -853098 -69863
41899 -69863 136976 -416777 -885905 -675199 -119859 398654 1143968 2248696 2976719 2547393
41889 2547393 1236440 -66274 -971407 -1528878 -1542608 -914537 -351090 -629590 -1252521
41880 -1252521 -929435 526638 1848502 2043662 1442720 785112 351787 376211 1168246
41871 1168246 2244379 2415381 1438382 526189 440804 276657 -770336 -1637044 -955067
41862 -955067 524239 896691 -22662 -713215 -591622 -597934 -1054940 -1081214 -620103 -900616
41852 -900616 -1988147 -2001638 -140539 1475815 855871 -632948 -399837 1195031 1520818
41843 1520818 18103 -1037065 -400118 269948 -554699 -1699023 -1370720 -136550 90499
41834 90499 -924535 -1601252 -1090373 -336428 -454838 -1229320 -1611071 -1051885 -28096
41825 -28096 466625 -137288 -1410358 -2372268 -2510478 -2029676 -1176760 -25733 945602
41816 945602 1001856 342355 254554 1388740 2664106 2690804 1571320 410263 -298988
41807 -298988 -811810 -1240005 -1569939 -2093618 -2817220 -2974514 -2192507 -1488146 -1797334 -2168992
41797 -2168992 -1073666 940763 1812182 1058943 294062 461799 653157 222231 -4205
41788 -4205 425774 460352 -481540 -1113559 -361345 620984 230541 -932598 -1043180 104822
41778 104822 1087095 1211069 1091247 1059159 696866 29039 -308411 -281544 -517896 -923545
41768 -923545 -538370 794251 1751690 1159121 -495056 -1733358 -1685445 -549219 997905
41759 997905 2286211 2803763 2325788 988920 -759091 -2244487 -2830702 -2394451 -1442165
41750 -1442165 -556264 76523 436329 395788 17877 -295611 -379659 -605036 -1133944 -1366321
41740 -1366321 -748201 274352 765747 441680 -272525 -930996 -1251270 -1100308 -894499
41731 -894499 -1399729 -2459710 -2733768 -1620223 -503543 -775004 -1498091 -809074 932114
41722 932114 1479694 117181 -1384698 -1581229 -1104421 -907513 -653084 88802 625052
41713 625052 377091 69480 391419 535768 -535857 -2174375 -2846398 -2397053 -2129211
41704 -2129211 -2749625 -3414054 -2978124 -1409835 240460 861188 272505 -538027 -363597
41695 -363597 822828 1766196 1457989 296819 -574780 -550903 191729 1129509 1565348
41686 1565348 909227 -610600 -1905194 -2211652 -1944552 -1903393 -2098161 -1950863 -1293804
41677 -1293804 -525856 38397 438775 748123 829039 440441 -403707 -1034476 -415013 1540440
41667 1540440 3207740 2848733 967731 -156093 447379 1209107 489069 -1132124 -2041832
41658 -2041832 -1870890 -1335047 -769954 -204106 -174309 -1041002 -1956869 -1845340 -1028776 -607995
41648 -607995 -612249 -189542 561721 458014 -905261 -2404463 -2818522 -2106836 -1095787
41639 -1095787 -661928 -1204081 -2136987 -2084542 -506029 1108732 821317 -1101823 -2429203
41630 -2429203 -1950049 -841061 -670848 -1358331 -1836637 -1739743 -1539167 -1551664 -1554848 -1209769
41620 -1209769 -524705 1863 -201922 -908214 -1004077 43907 1061303 557082 -1023715
41611 -1023715 -1778264 -1088199 -374600 -736595 -1370653 -1144371 -412881 -150235 -251994
41602 -251994 50729 691750 897004 535527 292281 519674 724884 322509 -594560 -1328211
41592 -1328211 -1202062 -212549 829199 1063565 575371 228390 440185 707940 549225
41583 549225 226419 155110 246773 328040 591885 1029279 972449 -41292 -1307204 -1625927
41573 -1625927 -799753 192854 475426 166169 -60326 159046 640943 1047948 1266916
41564 1266916 1345949 1222800 846336 598915 1029856 1814206 1682994 183186 -1137998
41555 -1137998 -533258 1332668 2081775 912900 -458352 -471717 386383 1049334 1527418
41546 1527418 2026943 1933131 1020456 411780 879175 1324393 530407 -636939 -597399 259600
41536 259600 335429 -306308 -100452 1114617 1640602 713529 -315622 -228363 444620 812449
41526 812449 980052 1143326 857319 217657 370832 1681642 2636993 1895395 374757
41517 374757 -167942 195904 -33170 -1172038 -1859010 -1233552 -164384 87375 -616235
41508 -616235 -1516976 -1881147 -1315786 105900 1581890 2021430 1255268 427268 717749
41499 717749 1940341 2833090 2544588 1374459 126753 -752791 -1235322 -1320014 -965104
41490 -965104 -301302 362795 740132 647741 75323 -558183 -449160 763541 2272077
41481 2272077 2823177 2257896 1629606 1575375 1447352 612974 -256977 -140328 683410 995997
41471 995997 326224 -738470 -1636209 -2144371 -1857333 -596546 734932 1015716 652175
41462 652175 1045105 2189603 2490162 1433808 603876 1064844 1519072 534402 -930585
41453 -930585 -1130515 -519478 -891330 -2132359 -2254227 -738405 471293 -8837 -964946
41444 -964946 -647069 703239 1723391 2168379 2736726 3296856 2866785 1326753 -118323
41435 -118323 -477606 -76423 233812 235956 216893 209227 45670 -10885 597521 1767827
41425 1767827 2480673 1974104 858079 457646 1140794 1970434 2113189 1834101 1708316
41416 1708316 1565543 907121 -105329 -854162 -1169040 -1269517 -1051151 -294138 525094
41407 525094 583278 -24570 -291191 176146 543008 116955 -499861 -315583 584226 1263988
41397 1263988 1314419 1226419 1445060 1704511 1481423 722836 -106365 -568995 -695056 -823393
41387 -823393 -1021174 -861187 -26846 996087 1275154 561091 -346169 -555689 -81827
41378 -81827 345082 198407 -370560 -820599 -775102 -350063 -12942 -88788 -481770 -945068
41368 -945068 -1365021 -1581585 -1342367 -863767 -952542 -1851527 -2412697 -1445425 387960 1278488
41358 1278488 800915 271926 393499 260089 -605496 -988168 18212 1266017 1401259
41349 1401259 1182766 2012122 3094984 2407174 173144 -1038284 -20372 1466197 1569355
41340 1569355 890901 950596 1610758 1557189 504875 -520073 -792434 -676022 -831408
41331 -831408 -1355167 -1776067 -1610359 -1004208 -821381 -1671932 -2894050 -3212368 -2465113
41322 -2465113 -1739308 -1564689 -1141370 34506 953517 524410 -657327 -1164968 -782902
41313 -782902 -470980 -634969 -674852 -223022 244038 209789 -227792 -625701 -548037 292823
41303 292823 1645845 2586566 2408084 1518041 817162 426892 -154247 -830258 -870051 -166656
41293 -166656 438018 348455 -79090 -299158 -276376 -108000 318305 892477 1127928 832133
41283 832133 410401 202246 65819 -124404 -221586 -357642 -1001321 -2004850 -2356079 -1529296
41273 -1529296 -410071 -108490 -446965 -525680 -274680 -315664 -532459 -47715 1218204
41264 1218204 2109641 1795395 842338 187673 -129888 -493613 -678894 -274482 279721
41255 279721 167936 -373487 -209547 885402 1636456 1035898 -208869 -788070 -585315
41246 -585315 -312009 60388 1089277 2234776 2043841 392870 -909562 -604165 186575
41237 186575 -217349 -1415726 -1658249 -642581 136851 -196126 -767103 -637589 -240159
41228 -240159 -420345 -1054870 -1406301 -1204282 -770262 -584080 -1088056 -2252013 -3021171
41219 -3021171 -2124933 19170 1235625 305675 -1185327 -919229 952370 2189729 1751752
41210 1751752 1019306 1429939 2413145 2544402 1716269 1034373 1025966 1063065 599478 88914
41200 88914 252581 933305 1247904 772460 56094 -191827 28273 300399 555583 922243
41190 922243 1040082 373247 -705886 -1073915 -503500 -254164 -1276385 -2551104 -2261940
41181 -2261940 -294780 1479244 1425561 -175131 -1752211 -2065045 -1110305 1814 22214
41172 22214 -1093178 -1928769 -1287466 133158 638817 -30251 -347310 707038 2225216
41163 2225216 2826071 2445689 1854857 1304012 695804 439115 913923 1413361 861411
41154 861411 -417060 -818981 334338 1718926 1703063 383406 -812024 -1121354 -1181368
41145 -1181368 -1743174 -2415250 -2180454 -883360 376200 489089 -411667 -1278398 -1456844
41136 -1456844 -1143906 -638146 136991 1079429 1546422 1144241 459482 307875 511914
41127 511914 223742 -606701 -1001061 -449748 203094 -58841 -970661 -1453946 -1167718 -740968
41117 -740968 -548186 -162160 704498 1511011 1713503 1700991 2125336 2628942 2231177 1038818
41107 1038818 507255 1455611 2703364 2605047 1378674 733258 1355420 2086899 1905149
41098 1905149 1438060 1707129 2377702 2431462 1980961 2047911 2652668 2503890 987836 -659171
41088 -659171 -911491 47476 764524 585438 355345 955840 1866818 1700911 13508
41079 13508 -1895052 -2309972 -1128050 -65760 -583750 -2099403 -2895447 -2448695 -1845437
41070 -1845437 -1843909 -1723732 -678427 628514 889234 -33814 -1130778 -1738748 -1990157
41061 -1990157 -1952751 -1407845 -563100 -16468 159665 392433 505428 -293941 -1896880
41052 -1896880 -2806372 -1905530 57620 1510760 1912902 1760399 1370562 679526 -78965
41043 -78965 -460088 -450275 -299593 22686 463232 404375 -438977 -1006294 -57655 1782611
41033 1782611 2600050 1936432 1354788 1757377 1857993 441560 -1323975 -1468038 -197659
41024 -197659 497381 -190403 -1114853 -1383167 -1560331 -2144982 -2368101 -1470068 -135823
41015 -135823 413903 125821 -110774 16678 -2257 -344573 -472073 -135383 74420 -335899
41005 -335899 -844108 -580461 355754 944143 616971 -106577 -628507 -1213732 -2249567
40996 -2249567 -3047235 -2430734 -542443 995659 1111266 506455 237241 68232 -691945
40987 -691945 -1503425 -1235337 -190277 141503 -490636 -561030 725156 1932663 1505141
40978 1505141 146650 -346772 175109 283100 -580641 -1413091 -1545208 -1640600 -2213306
40969 -2213306 -2448902 -1433216 294076 1401941 1495932 1285861 1312693 1365259 1111250
40960 1111250 592443 7149 -468446 -574297 -158675 445014 678189 486946 354949
40951 354949 505420 582005 359293 242966 621025 1121207 1098616 635089 384549 453217
40941 453217 167542 -770891 -1534942 -1130541 231417 1329780 1408207 899112 605357
40932 605357 660814 550250 -152808 -1307669 -2251995 -2187724 -849815 946569 1747076
40923 1747076 871978 -761468 -1621237 -1219990 -334223 286114 712530 1176730 1361767
40914 1361767 923459 276673 162090 564775 717454 243785 -292573 -242160 166847 134645
40904 134645 -610442 -1412803 -1466331 -760005 -31404 208927 314215 856323 1530361 1359191
40894 1359191 208905 -636265 -80800 1150085 1443340 563973 -162251 101762 775870
40885 775870 1255341 1797728 2327983 1799557 -66319 -1622083 -1419339 -547745 -1007935
40876 -1007935 -2412357 -2530634 -980928 77632 -522806 -1149367 -319851 658469 -134296
40867 -134296 -1932688 -2374725 -1110566 -149756 -772668 -2000540 -2371598 -1693112 -617171
40858 -617171 313135 759293 671695 610929 1199295 2089638 2289276 1591533 810941 559092
40848 559092 773145 1464504 2672438 3433884 2234537 -822378 -3509343 -3997476 -2872249
40839 -2872249 -1747278 -935432 249247 1644392 2199723 1587792 602222 -97973 -641068
40830 -641068 -1221885 -1578761 -1423557 -827377 -57634 554049 671205 358511 251288 759734
40820 759734 1340421 1257028 814090 902767 1412342 1223605 29866 -970243 -810064 -245386
40810 -245386 -627444 -1906382 -2757701 -2432690 -1530677 -920855 -739026 -689300 -666396 -682452
40800 -682452 -626827 -520231 -696447 -1292452 -1782259 -1545343 -847147 -690080 -1522475 -2583121
40790 -2583121 -2833910 -2127520 -1033687 96073 1235757 2057339 2007874 1158813 288414
40781 288414 -159673 -573126 -1256995 -1666612 -1173450 -162105 343480 -57603 -876614
40772 -876614 -1573838 -2020653 -2170117 -1903543 -1331313 -797167 -490650 -383185 -478000 -711622
40762 -711622 -737535 -345095 24537 -146667 -417782 222235 1758584 2833947 2445789
40753 2445789 1162029 84391 -631795 -1420436 -2071437 -1892503 -899107 100091 612228
40744 612228 841872 895032 434767 -573277 -1457275 -1630903 -1359797 -1331104 -1735883 -2099553
40734 -2099553 -1831726 -756699 662129 1497116 1116344 1882 -540274 207976 1535804
40725 1535804 2145264 1513259 127606 -1191319 -1715191 -992737 613782 1753484 1312486
40716 1312486 -84018 -598589 516103 1909609 1909115 622544 -461198 -529340 -203990
40707 -203990 -322435 -826287 -1152523 -1115461 -934689 -700759 -295105 203195 409373 90937
40697 90937 -432635 -556473 -64663 643211 1101762 1334667 1555864 1478529 501004 -1240235
40687 -1240235 -2581658 -2593504 -1780476 -1432419 -1944394 -2408998 -1892665 -535417 758511
40678 758511 1220771 612088 -802150 -2331289 -3228720 -3324701 -3135308 -3144234 -3192426 -2800222
40668 -2800222 -1873258 -798977 25202 464300 487533 30484 -828087 -1626595 -1666756 -657683
40658 -657683 722067 1239899 440111 -643710 -596477 639540 1734686 1747068 1195595
40649 1195595 984510 956335 288188 -993836 -1794642 -1398787 -485588 -306515 -1180710
40640 -1180710 -2225669 -2504029 -2065479 -1689507 -1811068 -2040932 -1816782 -1211565 -798050
40631 -798050 -862589 -1116903 -1176090 -965433 -572243 -27141 578439 969340 895597 442734
40621 442734 91141 421291 1529348 2616622 2551106 1226095 -24221 30223 900059
40612 900059 1156174 592996 456964 1391698 2411741 2449019 1786641 1179771 564943 -336924
40602 -336924 -944931 -552081 366386 756694 564772 559108 829979 708107 134273 -129968
40592 -129968 185828 496819 574050 968042 1767351 2022841 1112134 -173544 -688027 -424528
40582 -424528 -151286 -70222 263658 919432 1322630 1044422 282545 -493049 -927482 -793446
40572 -793446 -61269 909171 1559353 1677749 1574628 1604680 1688099 1490298 1014731 761514
40562 761514 1108869 1663403 1583029 658139 -293963 -423768 58213 256319 -110948 -397570
40552 -397570 -102176 330642 141216 -628915 -1064546 -424212 928955 1761402 1236946
40543 1236946 -59312 -649864 102301 1162247 1150813 165725 -416985 156388 1135734
40534 1135734 1458662 1043970 467036 -37990 -630372 -1235628 -1481715 -1241869 -856212
40525 -856212 -760989 -1083582 -1604768 -2017411 -2219574 -2320172 -2305803 -1917150 -1139672 -592226
40515 -592226 -898734 -1729739 -2085595 -1628687 -1088579 -1115773 -1398169 -1319483 -910016 -619632
40505 -619632 -596495 -718536 -944050 -1104248 -770244 52260 511412 -29383 -836629 -652724
40495 -652724 423778 943084 129790 -1136734 -1757814 -1817734 -1848829 -1577067 -479685
40486 -479685 871407 1225262 394234 -477697 -591361 -439700 -637056 -736111 -15347 1156997
40476 1156997 1681769 1194887 319916 -446418 -1262594 -2269091 -3134906 -3501136 -3319279
40467 -3319279 -2623348 -1559804 -736205 -805027 -1473462 -1680427 -1063094 -437252 -419084 -507027
40457 -507027 -197916 -75217 -786105 -1654163 -1500309 -431416 349472 255491 -287341 -941553
40447 -941553 -1736840 -2296505 -2038630 -1304416 -1118591 -1592931 -1721819 -1076596 -491788 -562069
40437 -562069 -654705 -177914 204624 -411454 -1670724 -2416104 -2161353 -1330484 -490643 -64687
40427 -64687 -337794 -1013971 -1203949 -590937 -151125 -886047 -2257205 -2847834 -2306357 -1562704
40417 -1562704 -1171280 -575461 670325 1895431 2116291 1302194 316521 -88073 176793
40408 176793 724258 1056951 894030 444852 267527 628324 1141879 1323145 1317283 1591816
40398 1591816 1928538 1455667 115085 -600716 665777 3016469 4086758 3106652 1837896
40389 1837896 1842355 2209018 1268522 -505632 -1089472 46455 1326450 1540129 1195549
40380 1195549 1067844 1022249 883531 1013210 1267291 725690 -667741 -1474569 -803953
40371 -803953 183484 1687 -961963 -1313568 -879863 -613603 -852020 -1115599 -1268992 -1494146
40361 -1494146 -1354065 -252118 1267881 1967818 1653050 1244246 1110048 644774 -282650
40352 -282650 -770139 -268598 546313 870846 852620 950108 963143 423310 -524372 -1271429
40342 -1271429 -1506414 -1378581 -1154819 -1063893 -1211173 -1318072 -831513 319235 1302356
40333 1302356 1197094 192560 -478424 36999 1208650 1870456 1724601 1528160 1743527
40324 1743527 1760473 991468 114993 292815 1413532 2165805 1868725 1149478 604709
40315 604709 -57908 -1068532 -1856640 -1918442 -1512146 -868679 289303 1694875 2111476
40306 2111476 1024338 -207247 -135048 658866 629444 -200638 -376032 626882 1740065
40297 1740065 2025147 1699872 1301210 979267 807545 834041 706411 72471 -680112 -896497
40287 -896497 -697990 -683429 -860484 -862496 -910944 -1421014 -1936615 -1714962 -1124005 -1087335
40277 -1087335 -1346229 -814768 406719 1038210 742556 508028 633609 166283 -1066568
40268 -1066568 -1652095 -735313 542524 758206 82554 -524986 -798065 -834809 -383229
40259 -383229 497476 974187 566431 -123932 -563525 -1121593 -1943380 -2213311 -1621992 -1379556
40249 -1379556 -2431310 -3674623 -3453169 -2063517 -1231442 -1621434 -2346294 -2558468 -2103326
40240 -2103326 -924245 708920 1573807 619199 -1230373 -1805275 -450630 1210289 1563305
40231 1563305 809419 -3983 -593544 -1248583 -1782173 -1620969 -741519 138966 369370
40222 369370 44158 -245994 -256152 -464065 -1323296 -2238441 -1917706 -55074 1951072
40213 1951072 2518265 1618949 352690 -672389 -1575078 -2183117 -2015715 -1373739 -1284077
40204 -1284077 -1950692 -2262832 -1455802 -385220 -276514 -844670 -777061 155174 693823
40195 693823 33693 -962787 -1153760 -815963 -922638 -1294359 -808728 605723 1570483
40186 1570483 1232792 364447 -166791 -748121 -1792729 -2310127 -1223520 587571 1222666
40177 1222666 426589 -288273 -59244 439702 620768 798856 987875 458643 -856473
40168 -856473 -1825861 -1639124 -779485 -47386 227143 -263997 -1572552 -2459906 -1357037
40159 -1357037 1024337 1975567 611422 -681550 40993 1316442 1009267 -444 456688
40150 456688 1824672 1617226 -360462 -1652091 -1123486 -480717 -1164206 -2158603 -1970809
40141 -1970809 -906299 -172205 -90098 -313320 -775999 -1417992 -1719081 -1329634 -636498
40132 -636498 -179760 -29424 -55129 -192828 -186893 263496 869504 940155 384962 -175697
40122 -175697 -427304 -684353 -1022804 -945727 -223456 642385 1028611 639126 -630831 -2383513
40112 -2383513 -3284483 -2146497 236415 1535218 693084 -852067 -1400811 -1220051 -1489946
40103 -1489946 -2074830 -1844093 -766499 -151193 -661433 -1330519 -1055096 -184898 107483
40094 107483 -404813 -665362 195916 1661315 2445988 2011306 1007762 308778 118058
40085 118058 147984 177675 119862 -101329 -385299 -426182 -132639 201739 397948 702884
40075 702884 1284418 1766201 1620038 759710 -449314 -1397910 -1387689 -240352 1090472
40066 1090472 1364804 755419 625246 1237716 1140098 -329815 -1515748 -861679 528716
40057 528716 616505 -367424 -607765 125886 379939 -184831 -312363 387406 775543 376260
40047 376260 95057 227230 -144245 -1076155 -1186158 -58758 770058 306265 -372319
40038 -372319 -324111 -513510 -1767991 -2769649 -2065231 -652235 -383989 -844865 -146766
40029 -146766 1721704 2683208 1719886 207987 -267283 185737 566948 438572 17723
40020 17723 -293440 -28143 1023667 2311140 2875186 2394759 1493455 1033040 1481144
40011 1481144 2721523 3923319 3892092 2305681 437195 -137578 526776 904083 80298
40002 80298 -1182746 -1664531 -1188443 -514482 -268735 -404606 -442961 25233 858110 1259445
39992 1259445 494857 -1069458 -1989257 -1211063 622757 1790171 1470410 648775 749358
39983 749358 1797276 2569326 2361315 1718045 1265398 817531 183919 -83915 360043
39974 360043 713384 102079 -971485 -1403310 -1179305 -978596 -588319 639010 1977164
39965 1977164 1850213 358353 -539829 167441 1276302 1504912 1186029 1014558 761943
39956 761943 278253 294555 1078936 1586097 1052688 198675 -201390 -573216 -1222844 -1262927
39946 -1262927 -294636 265286 -785219 -2325455 -2605410 -1887662 -1501297 -1364568 -602564
39937 -602564 251616 14897 -750421 -458434 690845 954381 -12153 -765016 -693044 -719670
39927 -719670 -1106641 -854461 132066 421648 -605893 -1672561 -1668658 -1097754 -686315 -245090
39917 -245090 253436 130634 -551818 -619599 177215 409413 -620649 -1374974 -419316 1184719
39907 1184719 1474359 450622 -334871 -227506 113221 137778 -226583 -1118759 -2289016
39898 -2289016 -2619485 -1470139 -10621 216549 -392272 -185659 1070102 1932201 1686545
39889 1686545 1261711 1408100 1607298 1423662 1459202 2038576 2158894 917089 -829179
39880 -829179 -1439499 -682569 165605 191527 -251332 -503510 -454916 -193632 315014 739078
39870 739078 309318 -1077690 -2184199 -1701972 -20386 1119069 801632 -46313 -119273
39861 -119273 554301 930755 437837 -544751 -1365723 -1586161 -1004795 87358 764994
39852 764994 291198 -869843 -1489793 -1087230 -363395 -39990 -10809 56271 9565 -340651
39842 -340651 -598386 -298781 199927 36930 -908828 -1674172 -1371397 -337455 264434
39833 264434 -116186 -820577 -983657 -686872 -597473 -719299 -328328 695739 1332059 739862
39823 739862 -542869 -1372781 -1416108 -1058956 -453310 407224 1057868 1066541 928119 1356820
39813 1356820 1863818 1314368 -70276 -679592 145355 1076693 753261 -402645 -1148498
39804 -1148498 -1211208 -1146375 -1149714 -995887 -669654 -227422 511111 1402645 1682880 1067969
39794 1067969 555640 1077457 1834384 1263738 -496208 -1482744 -515220 1273676 2082841
39785 2082841 1690028 1281483 1625411 2283642 2472720 1969184 1020215 -133330 -1301742
39776 -1301742 -2119173 -2165162 -1439217 -496869 112534 420803 759858 998232 553553 -664341
39766 -664341 -1814174 -2043827 -1536234 -1135266 -1102995 -839881 89960 1189449 1587127
39757 1587127 1076853 278552 -127883 -56713 97601 13950 -224254 -268550 116152 788694
39747 788694 1295825 1244236 689450 126557 12496 339503 775681 1123314 1428769 1704611
39737 1704611 1832374 1763933 1561945 1253650 937858 933921 1341463 1528843 774616 -482737
39727 -482737 -901318 -79164 776272 583593 -152660 -429931 -358158 -549265 -681062 -77407
39717 -77407 794611 945178 688430 1202824 2324302 2537233 1428030 385398 299958
39708 299958 299022 -352802 -736886 86499 1283766 1564213 1257129 1460439 1844595 1088620
39698 1088620 -727144 -1876050 -1373011 -205996 305695 229749 342524 546293 4191
39689 4191 -1305043 -2100293 -1307530 408759 1299478 671829 -375162 -637523 -369328
39680 -369328 -413688 -549684 60775 1179494 1674616 1336663 1064255 1123986 785883 33977
39670 33977 -27626 871408 1451628 1017255 691366 1373178 2028439 1463446 402870 136982
39660 136982 324338 -16076 -389881 231422 1158627 892132 -195260 -332766 689278
39651 689278 1288190 880340 649486 1148520 1310781 571622 24023 506125 1196382 1159624
39641 1159624 878361 1152736 1652735 1645670 1220038 829672 467949 163784 480887 1628642
39631 1628642 2728432 2761812 1761559 560259 -43230 440974 1860882 2984910 2456425
39622 2456425 695491 -311105 255819 843135 -51008 -1637550 -2313714 -2153749 -2290759
39613 -2290759 -2706875 -2476748 -1746681 -1629111 -2198237 -2283730 -1466731 -783267 -1033988 -1665118
39603 -1665118 -1847135 -1594793 -1224948 -601670 371113 1108241 886363 -228167 -1406542
39594 -1406542 -1840032 -1327122 -349987 297319 209270 -228444 -348827 -28450 329712 499452
39584 499452 620509 716009 577439 269048 279568 911940 1762935 2006470 1165162 -336737
39574 -336737 -1354502 -1036694 195186 1078265 1113599 1081797 1499841 1449739 -9584 -1912199
39564 -1912199 -2330538 -1093065 -22341 -222997 -661149 -100985 920564 1111194 430207
39555 430207 -128675 -178116 -202136 -473647 -738642 -880938 -1035649 -1060837 -641975 58921
39545 58921 512362 606204 720835 983391 1035178 653558 98022 -309947 -552815 -751472
39535 -751472 -956978 -1148969 -1158606 -668125 353413 1316544 1543876 1063529 458760 98446
39525 98446 53571 542416 1633931 2543248 2190715 715518 -478754 -578481 -323995 -532431
39515 -532431 -648266 200554 1390810 1373018 -103779 -1552370 -1712475 -941526 -301992
39506 -301992 -164617 -286029 -584876 -1088306 -1443695 -1201768 -526883 -68241 -80178 -159953
39496 -159953 -22191 -71004 -787156 -1785836 -2063831 -1302870 -402062 -303822 -654873 -274359
39486 -274359 1132800 2434942 2437214 1203408 -261163 -1111562 -1120547 -584260 -195826 -498781
39476 -498781 -1033089 -638033 858896 2032543 1781017 1054795 1420305 2528888 2669185
39467 2669185 1595789 873172 1101056 817535 -876829 -2391244 -1854710 20334 1036469
39458 1036469 682095 359328 785687 1043934 421503 -444425 -826687 -995951 -1285006
39449 -1285006 -1114597 55254 1430165 1589975 359733 -834790 -630043 737696 1764991
39440 1764991 1308622 -314859 -1785716 -2157922 -1646384 -1089499 -919553 -916121 -813252
39431 -813252 -723981 -821937 -888852 -483943 434843 1261524 1271344 377047 -783073 -1521040
39421 -1521040 -1650109 -1303038 -591152 225521 591409 244498 -250194 -189010 193457 79076
39411 79076 -584776 -991329 -793724 -515542 -430598 -136863 352019 267297 -550498 -1154901
39401 -1154901 -1163328 -1616519 -3016464 -3806667 -2458495 -110632 797905 -36309 -743263
39392 -743263 -449583 -333750 -1228114 -2173137 -2106795 -1413837 -933475 -661183 -259554 124956
39382 124956 251313 177787 -165805 -911687 -1487898 -1027652 130498 601218 21662 -422165
39372 -422165 -72458 170989 -258928 -316782 767224 1750255 1129174 -413354 -991150
39363 -991150 -253523 435986 97279 -1001620 -2199704 -2894608 -2534565 -1351692 -635860
39354 -635860 -1084089 -1476420 -376899 1449330 1958503 774303 -519931 -832972 -534837
39345 -534837 -9833 918829 1882164 2006450 1420729 1126486 1065170 66730 -1831039 -2911843
39335 -2911843 -2382463 -1562604 -1455311 -1028662 619686 2094915 1630471 -4025 -580503
39326 -580503 302217 1029486 744383 345880 592668 915262 587776 -168981 -754918 -964564
39316 -964564 -840604 -475482 -152541 -28756 337773 1377180 2451796 2345509 948944
39307 948944 -466604 -908242 -695727 -483495 -160149 639941 1563530 1819890 1204639
39298 1204639 338962 -41353 203814 538220 317646 -458832 -1108454 -1175768 -1022216 -1057315
39288 -1057315 -871008 35452 1034586 1031392 207767 -182538 163527 246909 -211819 -44550
39278 -44550 1239768 2173144 1440633 -30710 -610626 -495037 -915543 -1661596 -1481236
39269 -1481236 -585918 -557661 -1605790 -1989893 -736283 889845 1401793 989940 526866
39260 526866 151683 -110183 359790 1648172 2550113 2136814 1143414 655536 441966
39251 441966 -92818 -359818 358086 1174485 839532 94406 621378 1927241 1733761
39242 1733761 -211049 -1249939 218056 2167931 2029901 570049 494778 2164233 3077572
39233 3077572 1579597 -944738 -2137464 -1473219 -194762 595223 847499 971188 1106358
39224 1106358 1063065 676428 142136 21828 806282 2376092 3899655 4306056 3036385
39215 3036385 632121 -1408650 -1789453 -689934 422032 486520 -45274 -165971 142104
39206 142104 63481 -580136 -950321 -502147 106288 -52016 -792879 -1032477 -278270 681609
39196 681609 789323 47861 -550528 -345861 183099 186073 -300243 -404104 239373 788982
39186 788982 250258 -1131587 -2110575 -1999127 -1410478 -1267930 -1564460 -1546217 -920029 -346592
39176 -346592 -565245 -1354581 -1705299 -982647 358734 1285739 1197337 329882 -614931 -1060092
39166 -1060092 -952166 -779731 -1032726 -1468374 -1220682 10270 1224377 1196967 115883
39157 115883 -627966 -332374 193626 27655 -492843 -479149 25083 174509 -272022 -575059
39147 -575059 -209985 258287 -61693 -1078886 -1679851 -1082446 82257 396147 -623031
39138 -623031 -1849378 -1930919 -987730 -327472 -637879 -1234996 -1187731 -396632 698026 1697316
39128 1697316 2147532 1630564 448101 -499284 -987101 -1719891 -2679554 -2413862 -221449
39119 -221449 1958164 1633114 -701251 -2053441 -1029098 520456 501606 -603664 -1007123
39110 -1007123 -266077 715791 1390841 1844422 1914260 1356207 615846 281534 -26688 -1068845
39100 -1068845 -2382386 -2520927 -1118751 439791 902015 700892 911177 1459961 1390322
39091 1390322 534260 -157775 -44429 366015 402097 336169 811921 1565270 1594353 625558
39081 625558 -432896 -829757 -980167 -1496190 -1884892 -1270020 -126040 -3077 -1269263
39072 -1269263 -2350415 -1932070 -928325 -1169359 -2708221 -3702862 -2900326 -1084169 199918
39063 199918 379548 -150115 -931285 -1580994 -1500199 -340364 1216437 1809255 826881
39054 826881 -836916 -1750176 -1512823 -1031829 -1190026 -1624507 -1260161 46655 1047458
39045 1047458 648376 -586384 -1144873 -540363 236569 256257 -270880 -811810 -1514681
39036 -1514681 -2606018 -3364164 -2744019 -959656 466263 462063 -440881 -996419 -730351
39027 -730351 -142428 201298 305156 537406 1051545 1475114 1227205 251437 -741044 -1061094
39017 -1061094 -881575 -799129 -734296 -49859 1153718 1773096 1162523 84010 -373530
39008 -373530 -144210 176272 333426 250098 -454481 -1742907 -2499020 -1788397 -392568
38999 -392568 222031 137335 587987 1435298 1008528 -1004658 -2461651 -1695184 61314
38990 61314 637742 33007 -172383 400571 683323 320990 184484 644681 973835 767452
38980 767452 560520 661527 656579 479982 695941 1168222 732043 -990208 -2546965 -2439621
38970 -2439621 -1121888 -176435 -134941 -223867 125233 636006 946658 1054062 946107 537657
38960 537657 63361 -44112 280227 736373 1137332 1418002 1360893 897919 489563 517648
38950 517648 505553 -182480 -988136 -642017 803113 1651703 871067 -408315 -607518
38941 -607518 55028 261549 -159280 -199510 371446 618393 206134 52265 677069 1243438
38931 1243438 1018866 578611 550623 284039 -901649 -2012043 -1526405 221357 1459289
38922 1459289 1576403 1599712 2020157 1976093 1108258 510602 973570 1741812 1997143 2198162
38912 2198162 2782127 2864035 1724455 527678 850321 2218776 2832527 2210376 1343415
38903 1343415 614198 -447567 -1391368 -930662 746091 1630979 633200 -903248 -1265903
38894 -1265903 -566264 66056 228739 133614 -224610 -732278 -821883 -403062 -305869 -915331
38884 -915331 -1283746 -622903 228928 33062 -925548 -1428383 -1197378 -828281 -387952 456254
38874 456254 1244026 1155283 499196 339000 683637 507835 -370827 -961828 -889758 -945090
38864 -945090 -1351986 -1048538 442262 1771275 1533899 300181 -323774 38050 423859
38855 423859 257094 -45285 -95985 -115538 -309423 -422658 -202560 125368 66045 -643087
38845 -643087 -1768695 -2707138 -2964281 -2574683 -1867077 -895782 396983 1431258 1214148
38836 1214148 -244216 -1480745 -1266321 -201375 202758 -374655 -867705 -581307 -111217
38827 -111217 -286722 -977095 -1328893 -751574 565372 1803621 2123671 1462348 701684
38818 701684 678437 1154898 1254565 735768 151198 -172821 -494388 -901784 -1058021 -975005
38808 -975005 -1232488 -2001853 -2560934 -2276408 -1452929 -705790 -117233 380226 379296 -452943
38798 -452943 -1552573 -1936647 -1348546 -393257 238955 211476 -443141 -1187288 -1215818 -426678
38788 -426678 243187 108724 -149500 423279 1309284 1087686 -392049 -1710792 -1904562
38779 -1904562 -1509089 -1187779 -580935 712147 2002116 2350423 1942357 1678627 1746167
38770 1746167 1481680 557497 -457858 -878904 -786429 -889258 -1602623 -2395537 -2245550
38761 -2245550 -877888 750810 1588155 1742390 1936527 2080607 1484193 414530 89128
38752 89128 752398 1089507 236283 -861293 -1005323 -531225 -416801 -615054 -601457 -746082
38742 -746082 -1612685 -2456541 -2022495 -528742 700881 1339085 2093289 2719297 1949542
38733 1949542 -136421 -1494112 -763487 901973 1636019 1227684 584168 -27149 -796983
38724 -796983 -1203286 -560167 537430 706443 -226148 -879820 -243253 1003987 1521189
38715 1521189 954608 20940 -617499 -964023 -1265778 -1454109 -1211022 -464982 355065
38706 355065 631350 109749 -873137 -1675721 -1846835 -1433051 -899587 -719112 -970037 -1348992
38696 -1348992 -1537615 -1422072 -1005962 -398522 64337 47564 -285746 -370089 -21544 271327
38686 271327 63157 -506701 -1165464 -1931677 -2669264 -2825638 -2211232 -1506653 -1339897 -1387353
38676 -1387353 -1111367 -812054 -1045287 -1485156 -1350328 -565932 440857 1583666 2659452
38667 2659452 2657179 959802 -1164133 -1829783 -1049015 -377964 -341883 -126868 254431 -263051
38657 -263051 -1483594 -1681511 -403345 636199 463859 474990 1776299 2950055 2248181
38648 2248181 359799 -866557 -1043509 -750877 145847 1592362 2037345 405707 -1541454
38639 -1541454 -1290675 618464 1430843 457305 -205818 631729 1544357 1186504 356215
38630 356215 277210 662503 683698 479701 574846 810395 758034 414344 -76770 -588895
38620 -588895 -632200 131869 787238 -60643 -2010603 -2903122 -1812562 -434628 -503794
38611 -503794 -1351531 -1394762 -754904 -690568 -1270381 -1427912 -980706 -900701 -1547759 -2087509
38601 -2087509 -1928733 -1543640 -1475296 -1523317 -1408686 -1447933 -1933995 -2339566 -1808755 -348699
38591 -348699 916525 817998 -633903 -2174551 -2489807 -1477664 -157580 672583 1324079
38582 1324079 2494582 3986197 4704434 3976334 2414309 1243553 1064161 1557655 2176998
38573 2176998 2641082 2715537 2073452 828241 -102311 201056 1486961 2538495 2654503
38564 2654503 2315940 2168709 2083094 1743850 1530200 2020370 2950356 3407725 2898776 1653784
38554 1653784 154186 -1006137 -1144953 -232443 596969 195652 -1005236 -1493874 -782059
38545 -782059 6484 -144020 -845513 -1165341 -923613 -559388 -338005 -273654 -409595 -694085
38535 -694085 -879938 -849410 -721297 -481451 30281 601932 687977 227822 -132273 72468
38525 72468 580015 1031049 1451961 1660694 961646 -750554 -2103414 -1515801 684926
38516 684926 2348132 1999420 538823 -113459 398703 533440 -767389 -2287863 -2010859
38507 -2010859 31008 1628916 1336996 224913 -92631 59610 -661544 -2007822 -2319211
38498 -2319211 -1210378 -220399 -356213 -689675 -245401 196226 -554042 -1968049 -2470812
38489 -2470812 -1743020 -981504 -955273 -1033361 -452970 378491 476589 -252447 -812708 -452752
38479 -452752 317783 501018 149524 347734 1477493 2439476 2294101 1823753 2313499
38470 2313499 3360975 3381277 2123611 1086885 1165544 1383043 568197 -948776 -2032105
38461 -2032105 -2157405 -1513951 -574361 -70243 -503720 -1286163 -1359352 -931539 -1240134 -2207544
38451 -2207544 -2120245 -552706 278110 -1367231 -3849316 -4320252 -2668174 -1183051 -1024571
38442 -1024571 -1241354 -1025795 -784573 -792333 -625879 -297415 -407090 -830340 -679085 112767
38432 112767 597623 591632 1149371 2623683 3658296 3059035 1571846 736363 770788 714898
38422 714898 187465 -144921 191006 679246 563428 -99282 -537848 -323191 48892 -101874
38412 -101874 -538541 -340368 667676 1472271 1313738 831251 1011451 1638093 1814333
38403 1814333 1569227 1702051 2199479 2140725 1335264 792768 1141202 1666697 1501955 867439
38393 867439 485091 500217 671748 1029787 1601404 1892709 1395702 459941 52396 613728
38383 613728 1514148 1715122 831088 -462461 -1070615 -624814 83130 -1362 -985405 -1998376
38373 -1998376 -2237017 -1667602 -791626 -147537 -4742 -137057 61866 852394 1650815
38364 1650815 1694403 1037157 342535 -136636 -688282 -1352338 -1788709 -1981744 -2292144 -2656309
38354 -2656309 -2501919 -1701317 -884207 -506486 -297476 44414 323773 444641 828246
38345 828246 1631376 2116311 1541516 368486 -147736 491008 1465299 1699844 1045096
38336 1045096 200767 -265623 -461989 -654797 -561552 296127 1497551 1711637 320883
38327 320883 -1475177 -1958381 -986652 60786 241798 -28588 -38884 260158 630011
38318 630011 992565 1145277 791111 182568 -17170 187857 46804 -576141 -771430 -128766
38308 -128766 314246 -414401 -1629996 -2046826 -1746384 -1758882 -2096072 -1724674 -517170
38299 -517170 280453 -40089 -610846 -593132 -636845 -1627608 -2844999 -2813247 -1630915 -886560
38289 -886560 -1085713 -739081 1200955 3319559 3487504 1853672 552069 701001 1282154
38280 1282154 1157983 641205 472449 587754 729369 1126672 1622273 1209240 -402702
38271 -402702 -1715929 -1287049 141251 822626 636395 808981 1459421 1426797 585726
38262 585726 334666 1276954 2188983 2060044 1609267 1821890 2290632 2100176 1338842 661322
38252 661322 179376 -192436 -32481 859346 1565031 951112 -793784 -2359656 -2844418
38243 -2844418 -2419115 -1715714 -1186339 -918197 -615980 76699 965546 1335637 848361
38234 848361 13117 -472109 -422582 -74198 151955 -271975 -1366805 -2035852 -1122508 652630
38224 652630 1071859 -666757 -2694695 -2999302 -1943547 -1090148 -699538 -9906 777821
38215 777821 640842 -338242 -841064 -277513 468599 569006 403365 720211 1443634 1822516
38205 1822516 1406312 622880 467837 1415909 2537178 2330134 817027 -99188 806732
38196 806732 2118827 1698876 -142847 -1118110 -362451 503740 16675 -1181256 -1790752
38187 -1790752 -1791348 -1831169 -1720654 -815540 585095 1364935 1032796 237814 -171606 2408
38177 2408 465436 935220 1279757 1436578 1431243 1385252 1319674 972060 69466 -1060117
38167 -1060117 -1465642 -626733 643073 1027512 461630 190769 791801 1161803 236194
38158 236194 -1173825 -1412543 -339393 611534 567876 160129 191411 514644 629816 472246
38148 472246 103525 -628698 -1537313 -1790993 -854188 579701 1259562 909159 489930
38139 489930 765306 1130622 432198 -1216295 -2250862 -1700149 -690914 -1010704 -2579861
38130 -2579861 -3564982 -2971787 -1765976 -1092941 -803423 -435909 -293162 -533494 -414044
38121 -414044 364873 701306 -130041 -824218 132165 1855649 2223242 1077691 227211
38112 227211 513443 998623 1114556 1482500 2184214 2196763 1229321 429882 555011 966150
38102 966150 1086149 1268535 1487746 818933 -790660 -1765786 -1086022 122060 415196
38093 415196 202543 670838 1601406 1868795 1454469 1384620 1939529 2278738 1820827 963141
38083 963141 379917 325064 612078 792150 499442 -55731 -275720 -94820 -127037 -582301
38073 -582301 -779759 -220400 599133 993698 981685 824549 475774 111798 372395 1321051
38063 1321051 1923786 1330386 -1750 -1089416 -1506985 -1088659 354431 2131984 2601550
38054 2601550 1146722 -706636 -1297484 -965832 -896767 -878992 126714 1916921 3263292
38045 3263292 3729216 3695027 3081599 1723575 561514 637275 1164630 448364 -1416280
38036 -1416280 -2646283 -2513124 -1978598 -1488257 -328861 1293479 1699961 256304 -1330472
38027 -1330472 -1345580 -237477 603530 880866 1074538 1263601 1401279 1781030 2230681
38018 2230681 1852964 557401 -246550 354467 1148997 556505 -853556 -1182744 -47778
38009 -47778 977998 670092 -437724 -1079007 -684424 371349 1245443 1319866 917204
38000 917204 1071167 2047365 2594153 1498930 -541872 -1625047 -978918 408251 1345875
37991 1345875 1567417 1303431 795160 443540 553039 693156 96985 -1129027 -2011241
37982 -2011241 -2116852 -2045506 -2170769 -1850962 -542286 1060542 1817092 1619560 1296913
37973 1296913 1327626 1424204 1311012 1183857 1240740 1261998 877139 -27248 -1242327 -2286546
37963 -2286546 -2495974 -1501022 157043 1244686 1041636 129119 -396376 -305393 -291379
37954 -291379 -687423 -867553 -290463 507616 655774 291958 296373 798189 918733 226064
37944 226064 -483893 -395105 88924 52739 -505690 -816349 -647313 -605036 -1110699 -1790634
37934 -1790634 -2024400 -1568485 -547204 671150 1504887 1577666 1235265 1190054 1588981
37925 1588981 1973695 2214774 2717367 3381493 3174304 1440124 -886551 -2179159 -1963974
37916 -1963974 -1125318 -486363 -75975 165405 -90832 -909974 -1648512 -1683483 -1133376 -424184
37906 -424184 335151 971719 813791 -423062 -1602644 -1191676 532493 1474562 476000
37897 476000 -1007270 -952007 371953 992757 279134 -307410 247714 922328 555524
37888 555524 -38110 647223 2209150 2789484 1947687 1275075 1728671 2058119 925259
37879 925259 -737695 -994381 203538 1045634 605451 -74985 54784 523479 553089
37870 553089 580114 1377026 2396103 2339575 1160504 244080 455092 1087162 1147498 772021
37860 772021 714245 1048165 1163566 810199 461057 606077 1132032 1507573 1348622 763981
37850 763981 273242 322797 775859 1038905 841025 636215 924371 1382874 1159558 66367
37840 66367 -963511 -867059 314081 1459066 1597191 918286 459047 858768 1623420
37831 1623420 1766496 1047913 272334 309657 1130646 1996644 2342810 2187335 1829409 1489186
37821 1489186 1253602 1123357 1026896 895187 757787 728756 926223 1394846 1986728 2333119
37811 2333119 2162499 1702601 1485440 1618443 1559944 861863 -137942 -692903 -541457 -90631
37801 -90631 197475 296619 512238 1095803 1946814 2589870 2543123 1810354 905694 377188
37791 377188 486375 1255583 2387751 3126751 2810252 1801141 1292655 1861310 2771574
37782 2771574 3055970 2631936 1914368 1091635 434729 537053 1350797 1662102 590813
37773 590813 -911171 -1203832 -195206 753582 812641 299462 -388811 -1017493 -845594
37764 -845594 679919 2457354 2595206 1085021 15177 618002 1720017 1865546 1388514
37755 1388514 1315223 1568965 1510334 1232000 1132409 1052573 884074 1169826 2066551 2610766
37745 2610766 2119567 1432583 1596145 2214723 2384936 2345800 2713805 2918413 2133311 1164984
37735 1164984 1541390 3014316 3826443 3388920 2856253 2918076 2871007 2309179 2017013 2481520
37725 2481520 2948399 2746756 2384849 2565087 3082834 3376409 3300992 2799724 1708600
37716 1708600 455487 53505 772337 1618259 1710109 1368348 1278141 1439879 1626355 2056241
37706 2056241 2822666 3331970 3101293 2558348 2348798 2420206 2495207 2850571 3789150 4774005
37696 4774005 4901970 3979461 2556149 1282568 743940 1311659 2431998 2686093 1488805
37687 1488805 223447 637264 2495225 4000896 4311483 4292293 4691479 4959187 4414511
37678 4414511 3467445 2919777 2845088 2950761 3436543 4607277 5970296 6574660 6179048
37669 6179048 5460316 5194116 5865449 7864434 11046415 13896677 14229492 11528931 7990127
37660 7990127 6353001 7010679 8088522 8096555 7400854 6989385 6965613 6875277 6709836 6811398
37650 6811398 7207950 7660110 8066146 8364027 8375765 8150338 8047994 8092258 7757469 6864636
37640 6864636 6089175 5990748 6166708 6075368 6031401 6481955 6911292 6565884 5819705 5634844
37630 5634844 5958258 5865637 5136767 4485970 4292432 4282666 4468624 5204270 6203084 6639359
37620 6639359 6416104 6320521 6763396 7290052 7410795 7046415 6255292 5438537 5502519 6699684
37610 6699684 7758204 7552225 7081837 7967994 9447228 9221071 7297701 6378278 7819770
37601 7819770 9715529 10015156 9294098 9152216 9836411 10800744 11897186 12740511 12508224
37592 12508224 11501218 11245484 12050109 12368389 11656649 11714234 13801520 16547106 18253894
37583 18253894 19232833 20343701 21416825 22699806 25499335 29701363 33224212 35697774
37575 35697774 39739206 46578681 53827007 60022331 67572090 78288266 90481190 104221799
37567 104221799 124431812 154215202 191643909 239641900 309508728 399753674 475559686
37560 475559686 489089061 427464790 328340899 241013458 183168578 143112123 110246688
37553 110246688 86491626 73058496 63494997 53059254 44174163 39053876 34798297
37546 34798297 29048985 24097848 22048716 20899999 18413010 15716410 14364073 13362128
37538 13362128 11608532 10217515 10113162 9953544 8516172 6825508 6130220 5967954 5816757
37529 5816757 6424134 7857260 8372207 6952523 5092716 4434080 4433493 4012882 3769561
37520 3769561 4720790 6275356 7277114 8006344 9518264 11798771 13902397 15196310
37512 15196310 15429006 14370338 12310565 10158335 8395760 6839656 5801122 6075777
37504 6075777 7193844 7294457 5631386 3664219 2745672 2417991 2085988 2470046 3838205
37495 3838205 4583839 3524169 2159662 2524677 4004926 4590429 4333486 5008594 6795915
37486 6795915 7881096 7427013 6601083 6222912 5471626 3667732 1660779 592647 533613
37477 533613 1038426 1933624 2895448 3254611 2896264 2554636 2697412 2906416 2797415 2667510
37467 2667510 2707549 2492965 1958169 2017654 3276739 4739665 4895730 3844419 3269127
37458 3269127 4180293 5588294 5846078 4703131 3410163 3030631 3323854 3449702 3198946
37449 3198946 2999372 2987276 2801642 2380275 2229223 2534717 2666461 2157445 1610738 1805156
37439 1805156 2309754 2057977 1181347 1043944 2159280 3269603 3197044 2616229 2972916
37430 2972916 4331886 5518125 6068860 6741661 8005522 9216482 9639820 9286498 8324691
37421 8324691 6687674 4864542 4035172 4504226 4878357 3908546 2411124 2053363 2835411
37412 2835411 3342416 3124810 3007521 3053514 2232334 600607 -133771 888393 2344362
37403 2344362 2923637 3119911 3552082 3307269 1764495 502037 1160996 2578020 2495417
37394 2495417 1292721 1320426 2904435 3860348 3160641 2339470 2628735 3222628 3279287
37385 3279287 3294437 3391030 2504340 638952 -178085 1139321 2690488 2396160 1250471
37376 1250471 1641145 3631624 5160026 5195661 4555983 4001032 3507717 3270832 3618929
37367 3618929 3930140 3221322 1862165 1240442 1663776 2031866 1741976 1491049 1831615
37358 1831615 2216617 2018473 1492326 1158373 967614 584475 -6201 -510245 -584104 13991
37348 13991 1148063 2192703 2589251 2424643 2126103 1877254 1755606 1977661 2374220
37339 2374220 2117911 809396 -559551 -657697 449092 1534246 1926219 2011966 2212433
37330 2212433 2453734 2579013 2398165 1493677 -92224 -1199962 -649511 1117521 2511215
37321 2511215 2735210 2186491 1218815 -102705 -1109637 -923729 66216 529410 209892
37312 209892 181962 859409 1360274 1281405 1378672 1778865 1299084 -368516 -1461553 -588318
37302 -588318 999087 1230234 268784 -55104 825119 1699031 1726061 1386861 1234832 1156978
37292 1156978 1118597 1456359 2131378 2621891 2763996 2871725 2919828 2483554 1649977 1141336
37282 1141336 1304283 1722442 2018616 2283381 2506317 2392860 2075750 2243104 3107483
37273 3107483 3893427 3861112 3328451 3173712 3745836 4754372 5869296 6930162 7861978
37264 7861978 8883595 10550171 13046353 15544527 16738864 16015095 13818065 11051717
37256 11051717 8511458 6704924 5652802 4837691 3808535 2840669 2512931 2652642 2376065
37247 2376065 1374247 456848 385785 781434 803061 444903 401530 904382 1448886 1561275
37237 1561275 1153018 270730 -718983 -859432 428878 2037705 2040567 300030 -1005204
37228 -1005204 -236273 1434773 1756193 549508 -326407 229499 1340784 1823762 1699184
37219 1699184 1560529 1473509 1148998 561077 -149810 -933296 -1587960 -1683818 -1102567 -340961
37209 -340961 4925 -195332 -665570 -974005 -646046 460903 1693412 2026346 1251161
37200 1251161 290550 3969 127321 -175153 -1073652 -1905454 -2052603 -1494782 -534289
37191 -534289 580535 1611887 2192136 2023086 1284625 686904 848756 1554457 1902319
37182 1902319 1375808 474052 2882 97750 407339 886953 1687900 2411758 2321729 1435472
37172 1435472 666942 617275 871449 814830 521228 372971 313996 62457 -215643 -2780
37162 -2780 845639 1824702 2242101 1807076 837878 -4839 -278029 -104014 116094 246655
37152 246655 459313 817764 1136921 1263742 1229891 1114635 958406 755990 397006 -163598
37142 -163598 -518506 -54423 1051552 1678272 1239609 687041 1097137 1848487 1525907
37133 1525907 299694 -219513 424718 826130 156298 -340494 674628 2460148 3275267
37124 3275267 2770111 2028222 1786463 1820666 1814425 1776523 1651199 1281074 723489 105826
37114 105826 -636554 -1465105 -2023831 -2133111 -2059071 -1878993 -1170199 133112 1243813
37105 1243813 1590684 1720708 2255100 2566425 1647755 -26885 -747815 261046 1924619
37096 1924619 2767538 2454484 1608185 806901 238127 -12956 186079 791015 1344378
37087 1344378 1215388 318028 -600608 -833687 -680841 -831303 -946943 9836 1844220
37078 1844220 2856885 2149984 952794 707393 1011846 727583 125409 331032 1215980
37069 1215980 1494786 754698 -72476 -288760 -210802 -253571 -323648 -301465 -277855 -245473
37059 -245473 -239381 -594702 -1321225 -1592014 -769300 474261 1099145 1294400 1903294 2726503
37049 2726503 2895321 2647916 3072355 4112177 4499374 3832609 3105409 2921933 2809197
37040 2809197 2619020 2907936 3433359 3002488 1507068 430717 513289 600803 -168987
37031 -168987 -752104 -126289 699910 275004 -855303 -1061939 -182489 580106 771417
37022 771417 983404 1272351 900191 -215264 -1087412 -1004060 -406632 -212115 -854777 -2023555
37012 -2023555 -2875358 -2664441 -1591976 -726854 -688355 -925757 -772752 -471632 -432509 -291633
37002 -291633 282471 573665 -143528 -1086205 -874400 337284 1072712 791103 474994
36993 474994 805941 1173331 960289 607475 744401 1156571 1258424 945011 469947 34656
36983 34656 -122544 201794 703874 809826 691461 1249080 2551651 3124992 1737193
36974 1737193 -580582 -1437660 -74829 1539328 1113878 -1096333 -2614650 -1778807 400954
36965 400954 1765003 1655732 1206964 1326924 1554645 1196177 535553 209660 147434 -14185
36955 -14185 -47794 346750 567515 -206946 -1501044 -1863115 -841421 383841 614698
36946 614698 -39575 -791091 -1215672 -1152083 -376911 900322 1772118 1604875 941383 773729
36936 773729 1174996 1349006 933849 515701 657995 1019896 890498 290532 -45050 166040
36926 166040 196940 -609225 -1585188 -1378508 110470 1313681 940353 -465482 -1580038
36917 -1580038 -2130966 -2644052 -2960009 -2416198 -1376272 -1088606 -1725108 -1952071 -1035167
36908 -1035167 -55148 -125029 -565539 -122947 828690 839117 -183815 -647576 396019
36899 396019 1877293 2212890 1262322 116766 -423686 -403818 -71814 532040 1247959
36890 1247959 1578808 1138286 207358 -399884 -133463 697640 1256254 1081294 480358
36881 480358 17013 -74139 199525 865971 1745540 2188797 1690238 800945 813443 2247195
36871 2247195 4099616 4996674 4773571 4452937 4833186 5619777 5986022 5550152 4646576
36862 4646576 3971661 4132597 5196308 6382420 6473824 4966207 2753598 1309905 1183298
36853 1183298 1628982 1740769 1520147 1626588 2405727 3480068 4161737 4055294 3370151
36844 3370151 2791089 2887491 3501242 3883111 3541388 2699449 1802564 1006876 455595 538951
36834 538951 1266266 1761961 1224378 251405 270137 1521207 2599870 2437931 1788774
36825 1788774 1918474 2528471 2145151 393086 -1270281 -1371655 -123327 1120579 1444427
36816 1444427 879062 -112084 -923500 -880758 158067 1265295 1252289 200122 -520465
36807 -520465 -97934 579104 254652 -861805 -1557724 -1530663 -1587828 -1883776 -1354462 450694
36797 450694 2173530 2363260 1549825 1305575 1774532 1669646 623447 -114566 232866
36788 232866 688606 207005 -574230 -471920 196253 119649 -829245 -1352689 -713353 301736
36778 301736 740789 736879 851628 1040099 984273 841986 885260 787385 70056 -919922
36768 -919922 -1247857 -627844 209373 473601 88713 -578365 -1160042 -1267793 -671740 118983
36758 118983 52214 -1101783 -2027056 -1255803 911584 2640866 2706579 1671633 806924
36749 806924 576532 563020 330059 -138428 -582468 -722304 -589408 -715305 -1553066 -2550962
36739 -2550962 -2449622 -939363 593216 645688 -506002 -1248884 -691719 515199 1299396
36730 1299396 1296293 780606 176025 -116126 149109 871076 1721453 2361797 2364917 1366822
36720 1366822 -157775 -743346 528037 2530272 3126999 1723345 -143811 -816491 -119786
36711 -119786 1160849 2255862 2485020 1472011 -86944 -758446 -79159 884902 1186653
36702 1186653 1203430 1511076 1634895 942536 -75223 -524950 -430240 -272225 68592 723031
36692 723031 905209 13390 -877789 -241086 1470256 2309064 1711167 1121601 1500767
36683 1500767 1999117 1745287 1292772 1304610 1169947 131177 -1221453 -1814683 -1724772
36674 -1724772 -1755872 -1925557 -1571160 -676328 40828 308653 592426 1097357 1290514 681111
36664 681111 -447286 -1335647 -1505325 -1116537 -757650 -878747 -1330121 -1571361 -1367006
36655 -1367006 -983820 -647349 -287696 -31331 -365010 -1373342 -2295894 -2379584 -1821212
36646 -1821212 -1375885 -1395711 -1756879 -2309628 -2767372 -2538893 -1421707 -187856 284252
36637 284252 207566 374621 705224 407064 -406361 -505531 608282 1745271 1659042 760888
36627 760888 228821 29364 -902058 -2595713 -3456793 -2290183 -49232 1263389 1002666
36618 1002666 294646 179689 356161 96551 -501297 -899239 -1102645 -1331791 -1157734
36609 -1157734 -109045 1054249 1018881 27916 -132151 1194831 2314450 1609977 -95481
36600 -95481 -938135 -730125 -654341 -984737 -972737 -678939 -978569 -1679467 -1538883 -524781
36590 -524781 -176127 -986671 -1234146 416879 2621343 3110655 1726754 240154 -181940
36581 -181940 89228 356048 447787 451503 539265 976141 1643448 1897339 1561444 1501125
36571 1501125 2355973 3315527 3238747 2445841 2121895 2369671 2331890 2007192 2245971 2822821
36561 2822821 2316177 526349 -617817 384122 2365141 3038471 1978192 806285
36553 806285 825183 1610430 1921350 1196652 15913 -541652 -17265 840634 949759 412601
36543 412601 452978 1541254 2492520 2108283 868703 30235 -248405 -655273 -1081153
36534 -1081153 -692584 377741 827241 21753 -1109043 -1456949 -1003162 -222441 747384
36525 747384 1650802 1753166 821902 -216877 -489794 -417722 -770817 -1107376 -452880 793743
36515 793743 1125535 193212 -667269 -614369 -572377 -1460284 -2399744 -2000992 -653923 -50632
36505 -50632 -716828 -1443333 -1223769 -440993 182451 612321 944612 871999 436241 448944
36495 448944 1305233 2069899 1713018 742304 528919 1289212 1867230 1522310 863839 760668
36485 760668 1204633 1606576 1513722 725248 -605281 -1642956 -1386349 6074 1078685
36476 1078685 842487 26857 -150746 165448 -105511 -1021840 -1311333 -236692 1233335
36467 1233335 1637038 753152 -438354 -1100934 -1262077 -1374428 -1665442 -1961540 -1898021
36458 -1898021 -1290223 -419949 136206 78572 -353960 -790882 -1140068 -1374407 -1216729 -481802
36448 -481802 401703 731892 465666 346948 912675 1757649 2057265 1512259 473037
36439 473037 -589496 -1341623 -1515508 -1061552 -368211 49185 125348 225279 558746 934403
36429 934403 1111101 1067860 876356 585689 245164 -201982 -900019 -1577639 -1354354 192680
36419 192680 1876709 1854276 16128 -1604709 -1381575 -72616 559706 176026 -244438
36410 -244438 -233949 -138816 86753 881781 1795267 1608893 142332 -1208473 -1229056 -254700
36400 -254700 623043 779916 85337 -1240585 -2192374 -1441709 908987 2865575 2756179
36391 2756179 1228962 129196 68836 216350 -23385 -412633 -785680 -1317732 -1787487
36382 -1787487 -1617997 -890148 -441631 -668613 -987563 -822275 -448538 -422599 -684223 -722482
36372 -722482 -350070 120418 379376 491108 704280 1022602 1130022 855200 533974 549750
36362 549750 633054 249080 -288191 -29107 894322 893871 -775549 -2327133 -1514422 1160913
36352 1160913 2988659 2652877 1519103 1068508 910863 203222 -570269 -565766 -220118
36343 -220118 -470233 -1026451 -892916 -253469 -353384 -1421465 -2008098 -860362 1401802
36334 1401802 3000784 2889767 1553162 296715 62632 718753 1287523 981057 56387
36325 56387 -505955 -144193 686496 1058813 510956 -564217 -1299517 -1152341 -471399 -183727
36315 -183727 -758422 -1625972 -1860463 -1291739 -614188 -449357 -656771 -661176 -210903 354395
36305 354395 535961 294747 143022 488805 997952 977331 425734 163200 623557 1096821
36295 1096821 765687 34786 -35338 576257 745931 -26910 -758075 -455449 345786 404721
36285 404721 -313160 -574458 280386 1395092 1649773 1073737 369781 -428113 -1890012
36276 -1890012 -3851471 -5079769 -4689004 -3264827 -2036447 -1370480 -731409 163374 943416
36267 943416 1307131 1389845 1279583 857313 330422 230435 560720 634096 176761 -119867
36257 -119867 268450 707012 330177 -599167 -1178236 -1296852 -1564611 -2064248 -2257893 -2055691
36247 -2055691 -1913760 -1861195 -1523203 -1176580 -1545514 -2291110 -2049461 -531894 729793
36238 729793 567285 -130462 -12809 553631 347891 -459522 -612345 9315 158763 -706422
36228 -706422 -1653454 -1921463 -1963093 -2247623 -2206577 -1229181 94375 636599 241593 -144956
36218 -144956 328729 1565888 2740083 3101291 2686397 2291848 2531243 3032306 2968120
36209 2968120 2196945 1264162 476495 -163925 -238947 707418 1931128 1941163 649117
36200 649117 -267584 126485 546619 -342211 -1551443 -1184620 598234 1855732 1767275
36191 1767275 1431339 1650282 1642913 596716 -781360 -1149824 -286490 749333 900466
36182 900466 167260 -472129 -130845 878979 1297063 564492 -315157 -156473 764672
36173 764672 1318937 1223894 1042882 929311 637686 485366 933992 1390206 862593 -280003
36163 -280003 -724869 -333888 -160391 -315058 232760 1391705 1590013 408911 -467775
36154 -467775 46564 742678 369569 -277351 -39651 516034 389309 33053 156454 19600
36144 19600 -1138388 -2204202 -1812019 -815788 -960488 -1960785 -2185819 -1552152 -1322941
36135 -1322941 -1481176 -799591 607756 1241986 839141 722936 1281217 1334290 459343
36126 459343 -186685 40467 299125 -12129 -380092 -582484 -1113329 -1620264 -862046 1004067
36116 1004067 2008969 1200039 82505 158515 735064 454209 -469197 -934106 -795544
36107 -795544 -784925 -1343949 -2344216 -3216914 -2989793 -1266611 652239 1082416 513612
36098 513612 939969 2381443 2544425 738237 -622015 87415 949537 -269970 -2469329
36089 -2469329 -3243030 -2639680 -2195993 -1775848 -276822 1549648 1841315 619243 -444098
36080 -444098 -707413 -691906 -202292 1182368 2249447 1363037 -736668 -1801460 -1468663
36071 -1468663 -1256321 -1417710 -622932 1077942 1819690 1001805 196269 274855 120632
36062 120632 -922505 -1706045 -1476395 -1249470 -1784208 -2152302 -1596215 -1000389 -1161459
36053 -1161459 -1226211 -277020 923333 1179367 679951 259721 -112346 -845803 -1581015
36044 -1581015 -1645150 -998310 32208 1174686 1821347 1281779 48135 -379391 368847
36035 368847 835469 -23517 -1238377 -1441810 -801811 -238981 90205 334916 61651
36026 61651 -913342 -1715701 -1642205 -1377964 -1855042 -2692709 -2885282 -2310192 -1524977 -799279
36016 -799279 -294791 -406140 -996835 -1148287 -554665 -194179 -701338 -1203887 -846609 -277153
36006 -277153 -371428 -658680 -396845 -70889 -326760 -543312 -94159 83344 -999659 -2318719
35996 -2318719 -2259188 -1224437 -747457 -805510 -295196 463809 213922 -569693 -100862 1556466
35986 1556466 2274763 1179691 -181168 -515917 -357669 -246598 439484 1832014 2703622
35977 2703622 2389111 1896674 2003702 1845227 610440 -787517 -1042599 -304042 495011
35968 495011 1103547 1615837 1679206 1221451 1126022 2051014 3274936 3701670 3305651 2660415
35958 2660415 1810952 635996 -352974 -633643 -587318 -883863 -1441623 -1782175 -1833774 -1601853
35948 -1601853 -735826 658645 1445974 749670 -698372 -1516679 -1506652 -1476414 -1671413
35939 -1671413 -1561582 -995714 -457974 -198617 -47513 -82886 -608890 -1402912 -1744375 -1310858
35929 -1310858 -488449 211563 562416 563882 448716 554275 748340 351648 -808925 -1750359
35919 -1750359 -1510851 -537321 36112 102325 415089 923578 655709 -533387 -1420600
35910 -1420600 -1181349 -609554 -816073 -1552606 -1741318 -1143698 -552736 -509644 -662823 -494916
35900 -494916 -83962 99403 -177674 -708787 -1129226 -1230136 -1019239 -576017 65924 858713
35890 858713 1630799 2142747 2255184 1987244 1462338 910716 688521 1084571 1934855 2470715
35880 2470715 1822356 -26664 -1833283 -2103933 -786241 470885 270233 -679252 -493261
35871 -493261 1215127 2677377 2346424 926514 286942 1081925 2361947 3081441 3008964
35862 3008964 2349100 1421372 759501 750077 1042072 904572 206609 -527067 -968733 -1179274
35852 -1179274 -960101 87855 1578612 2254776 1432495 -25330 -701301 -149960 1032283
35843 1032283 2161666 2823035 2615525 1395913 -158241 -905270 -438758 470358 852229
35834 852229 583238 159649 -211628 -763339 -1489844 -1894628 -1645660 -1066604 -609616 -149555
35824 -149555 679894 1595571 1763414 936926 -72865 -399649 -164219 -105362 -502373 -967697
35814 -967697 -1152978 -1165753 -1267664 -1514697 -1761694 -1818786 -1608346 -1295520 -1144862 -1117852
35804 -1117852 -854189 -274409 112772 -123500 -654431 -879174 -861234 -1110745 -1492104 -1153039
35794 -1153039 146046 1287934 998274 -461456 -1413058 -693300 924002 1567324 441314
35785 441314 -1225411 -1640221 -561822 556680 481179 -421241 -967782 -659340 138414
35776 138414 963400 1469055 1242314 284767 -475763 -65554 1097115 1535952 690100
35767 690100 -329998 -355901 299081 552517 173450 -126708 78372 409123 385688 46302
35757 46302 -282178 -427677 -403943 -218545 191383 857251 1587760 1883432 1285252 23145
35747 23145 -892453 -619813 476401 1122955 628428 -275515 -433856 128106 216652 -766477
35737 -766477 -1732371 -1225723 498231 1637060 1194122 221086 173903 849727 922225 97622
35727 97622 -435368 198918 1340160 1812269 1449269 1015713 1029941 1272980 1318994 1048364
35717 1048364 581469 43003 -425414 -548088 -56465 894591 1570788 1275927 253615
35708 253615 -393229 11127 825632 929614 217800 -303316 138639 1193374 1955321
35699 1955321 1984576 1577950 1292732 1357634 1464196 1168470 554101 265582 723456 1619459
35689 1619459 2400877 2819636 2704749 1800937 374468 -647753 -865475 -1082563 -1889354
35680 -1889354 -2311669 -1221563 451651 664390 -666544 -1384216 -276493 1220673 1286994
35671 1286994 152364 -785315 -1047880 -1086218 -1083963 -924804 -782761 -775224 -495536 306365
35661 306365 1045250 1021877 387010 -204634 -431942 -335534 -94664 -171244 -950680 -1883351
35651 -1883351 -1908307 -1121497 -858357 -1577929 -2055092 -1490972 -891463 -1160793 -1362605 -457358
35641 -457358 623578 550992 81949 780613 2089464 2072177 693330 -38359 763657
35632 763657 1741058 1591140 535830 -817795 -2238947 -3124453 -2743506 -1659678 -1297299
35623 -1297299 -1769189 -1801869 -1080319 -769271 -1251356 -1361033 -607742 -191735 -830092 -1426063
35613 -1426063 -1048504 -489478 -542762 -367428 910447 2354514 2595385 1934514 1494756
35604 1494756 1233536 402741 -759997 -1348011 -1266374 -1054840 -722736 15950 809554
35595 809554 1070155 833219 309829 -700505 -1985452 -2432452 -1568333 -651771 -839248
35586 -839248 -1205983 -265874 1371086 1863598 1171403 1055802 2092356 2807807 2171062
35577 2171062 1031253 419890 94343 -355828 -363395 562891 1618429 1643428 746988 99838
35567 99838 394792 1192132 1681140 1618240 1444120 1612737 1902311 1626846 644307 -263842
35557 -263842 -379590 7535 145207 -93964 -268424 -164541 79917 336499 426228 119330
35547 119330 -275284 55345 1121121 1616325 640845 -822410 -1255798 -675841 -70374
35538 -70374 438648 1264666 1846108 1354988 536813 847371 1937139 2109289 1266776 1070171
35528 1070171 1855630 1895863 510206 -553645 -71423 613482 104208 -528620 299038
35519 299038 1843053 2275940 1549480 888617 414187 -517234 -1300225 -703098 794228
35510 794228 1461599 1079071 1156055 2213380 2900917 2353875 1552599 1501601 1644200 1118141
35500 1118141 307287 2204 -13819 -361333 -725131 -289622 845672 1728072 1892095
35491 1892095 1753957 1672100 1405641 707502 -120397 -572317 -539391 -337575 -297414 -473753
35481 -473753 -681425 -738575 -677970 -657758 -632861 -325132 257155 478293 -280516 -1617360
35471 -1617360 -2287074 -1645120 -428210 328739 655841 1223316 1946908 2075278 1644081
35462 1644081 1633471 2280062 2411265 1228161 -283350 -767512 -466171 -495469 -824527
35453 -824527 -518686 323264 546727 -68663 -399578 84544 481143 131147 -276764 -109736
35443 -109736 -63268 -967199 -2232727 -2606175 -1876832 -851856 -95345 394778 597745
35434 597745 418622 87116 -1401 259204 700869 1041241 827893 -210290 -1476499
35425 -1476499 -1889951 -1352801 -1012580 -1527111 -1999461 -1452080 -488930 -389153 -1123547 -1432571
35415 -1432571 -611928 763727 1742381 1835045 1175177 544712 929340 2320835 3331382
35406 3331382 2803229 1424364 824973 1373174 1910791 1583144 884578 690757 1056197
35397 1056197 1318909 995055 368417 280977 1162739 2220103 2126489 739766 -606096
35388 -606096 -910781 -687438 -697159 -562979 306599 1327706 1588622 1409964 1662088 2064863
35378 2064863 1683993 761126 428623 705956 402609 -816812 -1768457 -1530380 -651806
35369 -651806 -163016 -356211 -841619 -979075 -187628 1306632 2180355 1534490 457834
35360 457834 713046 2041746 2452638 1299604 216821 460979 1121142 893883 102446
35351 102446 -216596 -72783 -165708 -569427 -811764 -711007 -375008 123210 566263 683764
35341 683764 712516 1066658 1290400 490407 -911311 -1291689 -253407 605975 184180
35332 184180 -477540 -204121 253661 -225027 -856456 -180541 1322357 1856502 1063504
35323 1063504 239059 66554 -5637 -199764 -87150 -24911 -1099671 -3093791 -4098982
35314 -4098982 -2979704 -1004249 -154937 -759092 -1654319 -1933648 -1579663 -823036 204778
35305 204778 1231592 1853392 1880118 1452216 856685 330606 -78643 -505978 -966756 -1119465
35295 -1119465 -627113 254768 808784 649957 73752 -458430 -817082 -1016912 -879391
35286 -879391 -248343 547139 804230 219350 -580919 -596982 324323 1123857 737891 -530062
35276 -530062 -1387081 -1273506 -1043170 -1682544 -2962751 -3821039 -3656943 -2746570 -1650806
35267 -1650806 -720433 -79790 287779 435887 298621 -191492 -727279 -691709 164108 1341452
35257 1341452 2069133 1945333 1072102 -76768 -857197 -960684 -789771 -872237 -972852
35248 -972852 -509380 179832 28285 -1032216 -1696367 -1230389 -658670 -1107646 -1964429
35239 -1964429 -1864777 -809518 -18953 -79468 -442801 -574883 -528937 -450511 -394727 -530456
35229 -530456 -791393 -606660 238988 889269 503577 -368014 -604988 -312704 -471363 -1038300
35219 -1038300 -944782 -71362 349989 -261383 -871723 -561097 28290 -133433 -803553 -984477
35209 -984477 -487011 -42948 -192881 -811139 -1540773 -2111104 -2313561 -2063777 -1459408 -640653
35199 -640653 244516 918354 1126132 931936 533578 -120178 -1048964 -1720049 -1507790 -673688
35189 -673688 -141089 -236621 -476721 -688938 -1304267 -2180075 -2232213 -961999 521285 876814
35179 876814 294288 -22233 349904 746709 675849 440793 443516 539010 253083 -683224
35169 -683224 -1970365 -2693584 -1985723 -170434 1139528 725592 -721334 -1495759 -1099315
35160 -1099315 -671868 -1146157 -1945770 -1974394 -1146922 -260594 194958 353497 309473 -79570
35150 -79570 -612307 -600574 335063 1657331 2409648 2117171 989705 -456653 -1613613
35141 -1613613 -1881896 -1115857 42056 759934 1010626 1465644 2261460 2494790 1428025
35132 1428025 -206143 -777835 344978 1956044 2292546 964465 -643771 -971133 -109004
35123 -109004 334144 -681005 -2188844 -2424699 -1102266 367996 850447 684604 693847
35114 693847 955427 1030021 652022 -252242 -1486711 -2162112 -1319590 486225 1323231
35105 1323231 378052 -824583 -717544 -932 -238339 -1221903 -1559863 -1160917 -1087274
35096 -1087274 -1289448 -652539 655528 1040139 98360 -653616 -344240 -73203 -686639
35087 -686639 -1079174 -152631 966526 363876 -1831918 -3590521 -3523415 -2061435 -416714
35078 -416714 547747 572075 -15074 -595432 -987535 -1577818 -2410490 -2768279 -2175205 -1168125
35068 -1168125 -459173 20037 571653 925802 805216 690270 1107688 1630013 1508350
35059 1508350 929235 722750 1087138 1463932 1466938 1142483 537790 -190230 -470095 21470
35049 21470 554407 102403 -1127784 -1798825 -1178654 6406 651486 547559 324723
35040 324723 636372 1638485 2868491 3421173 2591144 610901 -1399204 -2368609 -2106449
35031 -2106449 -1200536 -255892 606924 1448344 1908602 1411083 210736 -358057 578568
35022 578568 2017654 2209410 1073612 295656 872192 1882978 2172354 1907038 1656785
35013 1656785 1173988 192785 -576710 -494972 -210335 -535448 -834867 17231 1592677
35004 1592677 2357628 1892530 1170633 742781 149517 -771605 -1435116 -1640889 -1875076
34995 -1875076 -2142538 -1710249 -456424 616322 723660 236613 -137011 -184188 189697
34986 189697 1154693 2241084 2408398 1482880 628819 667147 825405 87093 -1008097
34977 -1008097 -1108925 -159145 507455 154813 -388809 -36885 1127710 2161250 2416494
34968 2416494 1939953 1120723 438291 344276 893447 1500803 1474930 885156 544295 967012
34958 967012 1701080 1979654 1698673 1292828 898322 274646 -487418 -863354 -671684 -384642
34948 -384642 -443307 -767620 -1149952 -1604875 -2090289 -2393416 -2496966 -2526038 -2255454 -1435693
34938 -1435693 -705364 -1091204 -2231584 -2366435 -834772 705548 656663 -119005 235553
34929 235553 1633708 2341013 1693199 696222 63473 -597752 -1498277 -2128854 -2307061
34920 -2307061 -2437750 -2509127 -2136104 -1767924 -2372687 -3563461 -3581374 -1800641 142503
34911 142503 550960 -211894 -713442 -482424 17219 607866 1425662 2145629 2146096 1321686
34901 1321686 201680 -524234 -342601 716024 1746340 1637618 470063 -409574 -160382
34892 -160382 393934 -17969 -1315662 -2192842 -1744213 -417509 524360 236721 -837074
34883 -837074 -1345578 -632505 284970 50001 -1022543 -1436543 -949789 -987121 -2199088
34874 -2199088 -3205383 -2708177 -1486075 -1021587 -1209400 -894364 14918 515262 298857
34865 298857 147275 479330 669092 87065 -1004786 -1923685 -2417139 -2764698 -3246803
34856 -3246803 -3643685 -3331297 -2091850 -714273 -260930 -744848 -1231275 -1296507 -1452390
34847 -1452390 -1904804 -2016310 -1524721 -1175429 -1401035 -1451790 -768475 -191886 -653727 -1535525
34837 -1535525 -1645046 -1167026 -1231122 -1930028 -2166617 -1378948 -229334 460566 525626 212857
34827 212857 -100627 -1972 543298 1086262 1462527 2101456 2957447 2943059 1403342 -571048
34817 -571048 -1458263 -1314367 -1245724 -1486308 -1413983 -1026025 -892519 -906338 -525196 -24415
34807 -24415 -60349 -245601 274374 1041494 801951 -289294 -825740 -577942 -783480 -1696449
34797 -1696449 -1934094 -962569 -228220 -767516 -1479323 -1074717 -230572 -311628 -1091577 -1267047
34787 -1267047 -483572 489259 1049689 1098068 570279 -353751 -986446 -913070 -603547 -561040
34777 -561040 -457925 116408 669261 452985 -356211 -933185 -879753 -364631 365186 964767
34767 964767 927750 162001 -748325 -1268651 -1387355 -1129391 -484332 -165582 -1207894 -3087997
34757 -3087997 -3598472 -1762160 354317 261191 -1483133 -2183893 -780779 1153733 1941305
34748 1941305 1499537 437587 -842115 -1717290 -1393261 53397 1556905 2213992 1758960
34739 1758960 85464 -2440956 -4225623 -3564711 -973241 966374 681053 -681415
34731 -681415 -1235470 -765724 -244971 -90945 -104491 -381796 -1052550 -1539964 -1199180 -453599
34721 -453599 -301334 -831872 -1175519 -890868 -460359 -250301 127842 985889 1760614 1688026
34711 1688026 974352 641857 1157235 1731187 1308826 -22604 -1095965 -1123832 -560698
34702 -560698 -237022 -145959 293238 1018039 1172831 334652 -752960 -1033475 -330939 641365
34692 641365 1168713 1112122 815650 737547 1056140 1460145 1477057 1116260 907990 1112657
34682 1112657 1252776 847336 357499 751615 2008471 2668010 1412037 -1140792 -2869892
34673 -2869892 -2524469 -1084708 -357669 -749939 -1202222 -1029947 -698450 -562441 -42108
34664 -42108 1158506 1954164 1178467 -514034 -1327396 -790547 -285218 -900529 -1929310
34655 -1929310 -2063200 -1227798 -507488 -686213 -1433873 -1763259 -1048763 228100 814566
34646 814566 194751 -453169 371458 2256541 3192489 2393906 1443252 1829647 2640502
34637 2640502 2064894 345824 -455293 548871 1887167 1833665 448147 -1006852 -1718607
34628 -1718607 -1715888 -1279476 -741751 -604590 -1185585 -2076181 -2329282 -1399690 158012 1106718
34618 1106718 812080 9241 -81407 604111 848525 -42765 -1083721 -980288 -34840
34609 -34840 380871 -80161 -419812 -79543 247184 -37436 -438086 -339127 -11761 64531
34599 64531 28150 -18303 -657147 -2123887 -3278428 -2819809 -1194160 -116028 -347115
34590 -347115 -1080057 -1430031 -1297196 -660339 643175 2008808 2166154 857364 -581466
34581 -581466 -983885 -709787 -490674 -22195 1160973 2314971 2385580 1690109 1289205
34572 1289205 1164617 608227 82426 776438 2208595 2314400 556924 -975652 -614903
34563 -614903 508253 545026 -148691 -3651 940276 1251855 584781 -29205 -104172 -54631
34553 -54631 241187 1289811 2296387 1681552 -233504 -1067434 234804 1726662 1394952
34544 1394952 113419 37382 1254550 1891509 962439 -611076 -1665113 -2043840 -2094507
34535 -2094507 -2009759 -1864507 -1590882 -886555 316928 1481370 2079178 2243247 2250473 1882707
34525 1882707 1054008 520423 984456 1885462 2106460 1588290 1201858 1273066 1350148 1287121
34515 1287121 1411264 1630885 1464422 981396 666436 354046 -561440 -1772879 -2112931
34506 -2112931 -1218835 -81058 331906 10403 -679573 -1403541 -1508750 -500369 857269
34497 857269 1213436 730517 1017252 2416763 3048428 1605294 -421985 -780641 415940
34488 415940 1210553 699025 -242299 -739749 -870430 -864511 -669061 -467562 -644592 -1076607
34478 -1076607 -1214868 -923750 -582401 -406970 -311342 -331724 -523382 -535979 22095 824818
34468 824818 1068972 515318 -225028 -497523 -306246 -156380 -399318 -716051 -322901 960233
34458 960233 2003981 1506294 -134685 -1132637 -763729 -240813 -575970 -1024260 -685670
34449 -685670 -235306 -586528 -1041641 -558625 100465 -477571 -1721018 -1814449 -750597
34440 -750597 -279602 -739786 -393846 1445234 2894045 2223424 313666 -878565 -914425
34431 -914425 -665729 -602433 -537336 -368570 -101397 314212 552841 53973 -902941 -1205972
34421 -1205972 -567408 -87758 -413135 -485072 793704 2600093 3193116 2323263 1415575
34412 1415575 1555136 2252580 2225384 870191 -1000828 -1776755 -802949 527173 271493
34403 271493 -1426928 -2403316 -1474980 44544 514818 185632 178564 544418 652121 519758
34393 519758 456491 220527 -275086 -320494 337305 643875 -30905 -502470 254978 995179
34383 995179 150094 -1188624 -797849 831306 1051386 -649998 -1911468 -1499850 -1042852
34374 -1042852 -1678923 -1817240 -21317 2187874 2612723 1775435 1681805 2347455 2047644
34365 2047644 533094 -424230 102631 787836 168917 -1265667 -1924843 -1154771 292481
34356 292481 1278977 1206959 290471 -648049 -866728 -503041 -512557 -1543405 -3003250 -3553744
34346 -3553744 -2556814 -771036 527395 871550 734196 527444 101882 -604416 -1110564
34337 -1110564 -1084429 -939308 -1093807 -1126607 -499311 275398 235543 -431719 -540724 261611
34327 261611 945823 668501 -148234 -705286 -834108 -658602 -186115 218511 -148675 -1194706
34317 -1194706 -1740425 -1066948 19575 396950 120210 -121228 -263808 -576944 -752464
34308 -752464 -416313 -85352 -450847 -1056266 -931820 -349133 -578073 -1786477 -2536368
34299 -2536368 -1852202 -672307 -521032 -1512982 -2457071 -2490288 -1890242 -1427699 -1430135 -1517081
34289 -1517081 -1091806 -153773 449439 -67012 -1277226 -1850836 -1176930 -90286 365500
34280 365500 277307 349927 552820 192064 -774574 -1435555 -1194152 -563688 -258670 -167613
34270 -167613 130502 383672 87410 -418904 -313907 277732 347147 -265762 -426778 402643
34260 402643 1097454 760673 504244 1687476 3169585 2495102 -232157 -1973613 -972625
34251 -972625 776372 638916 -836300 -1135414 307788 1631017 1564666 768451 -3119
34242 -3119 -1041653 -2301571 -2609812 -1422166 -156723 -419975 -1634609 -1847067 -611390
34233 -611390 340497 -447704 -2167825 -2858779 -1857120 -397829 17989 -766011 -1657961
34224 -1657961 -1623672 -692077 186351 126972 -834643 -1842696 -2137505 -1736308 -1156994 -762439
34214 -762439 -680636 -1078388 -1897380 -2396764 -1771469 -461017 27452 -849167 -1668294 -970047
34204 -970047 528713 906162 -175029 -1138477 -982176 -560736 -924046 -1762714 -2264372
34195 -2264372 -2348520 -2154841 -1351403 -19038 672562 -91945 -1322555 -1493994 -718698
34186 -718698 -258299 -303160 79735 822230 499691 -1345557 -3105438 -3300816 -2670972
34177 -2670972 -2861422 -3847785 -4081358 -2940171 -1703779 -1827897 -3184524 -4433889 -4493792
34168 -4493792 -3197317 -1053176 990012 1826328 1030394 -437473 -953372 13030 1269664
34159 1269664 1390321 435612 -345796 -245430 199373 209643 -254448 -761420 -1105958 -1390321
34149 -1390321 -1711891 -1991348 -1945023 -1297397 -328773 61179 -552100 -1262184 -1003295 -333996
34139 -333996 -702897 -1895252 -1954819 -283498 1007471 117201 -1662708 -1922639 -637654
34130 -637654 386094 671629 1236661 1929183 1226316 -886563 -2227479 -1530511 -216248
34121 -216248 122023 162031 1206027 2539220 2377972 723812 -578526 -444760 315188
34112 315188 527764 34340 -723742 -1471118 -2030348 -2167815 -1882817 -1435108 -913589 -201585
34102 -201585 510035 677078 145790 -435752 -310191 485154 1249939 1549403 1593189 1589279
34092 1589279 1193531 98912 -1044921 -1055990 210977 1408690 1319720 373050 -149781
34083 -149781 58613 243158 63470 13581 238553 41828 -935273 -1885205 -1819091 -841045
34073 -841045 118800 453843 290868 52876 18760 154282 197573 96307 274729 998114
34063 998114 1585167 1017216 -596134 -2033012 -2640633 -2991546 -3463562 -3332749 -2109858
34054 -2109858 -761692 -453200 -794270 -615054 5343 -75033 -977596 -1380127 -501317
34045 -501317 720623 1015891 411518 -209425 -444540 -470047 -292278 203126 615182 310136
34035 310136 -496935 -678781 334167 1516438 1333804 -313537 -1946842 -2398926 -2104652
34026 -2104652 -2095326 -2390475 -2183737 -1271840 -347978 149112 609319 1403345 2149770 2224958
34016 2224958 1551618 557700 -300241 -765196 -889515 -1051486 -1479020 -1729960 -1192036
34007 -1192036 -153433 330763 -149386 -810529 -868549 -549758 -453281 -581083 -589850 -493080
33997 -493080 -531303 -711114 -904139 -1020087 -779257 148429 1450495 2264751 2353753 2445368
33987 2445368 2916880 3002541 2051741 789152 388963 875747 1378292 1497647 1507020 1599796
33977 1599796 1821790 2367346 3091512 3147160 2005025 440147 -382688 -358721 -63360
33968 -63360 485016 1488482 2264776 1865074 611231 -269897 -396555 -327240 -94303 842359
33958 842359 2108364 2418870 1407399 123141 -595523 -897433 -791316 183656 1578269
33949 1578269 1915787 885011 228353 1248950 2632793 2206650 53525 -1664336 -1607235
33940 -1607235 -536397 286078 687625 1167536 1715582 1669007 620692 -800131 -1271729
33931 -1271729 -169752 1482872 1981158 931563 -356755 -684457 -398757 -536804 -1249757
33922 -1249757 -1841173 -1949068 -1881185 -1893621 -1784067 -1265143 -360884 614577 1277401 1405527
33912 1405527 1049264 374608 -478563 -1174447 -1118516 -167533 813307 869230 343319 425744
33902 425744 1277435 1709275 1037261 90304 -235841 -334289 -919248 -1587210 -1398593 -354480
33892 -354480 661225 1049118 821097 139242 -716941 -1237536 -1188765 -927339 -744363 -442990
33882 -442990 -91204 -404388 -1530495 -2196861 -1196028 758938 1828603 1404270 550097
33873 550097 286591 572117 973836 1289844 1355703 1064927 697757 579549 491864 100039
33863 100039 -259372 -57604 376400 269779 -220702 -84594 1010974 2196801 2538938
33854 2538938 1903815 681136 -495765 -775289 193734 1483999 1762819 1015539 448682
33845 448682 658309 1010431 974608 858852 898686 789844 536139 608278 813494 261819
33835 261819 -914655 -1117275 496040 2455181 2776369 1465839 76005 -531935 -731915
33826 -731915 -897194 -890256 -683534 -481026 -218755 283803 722610 551083 -202515 -923927
33816 -923927 -1164334 -960446 -563585 -272247 -330265 -612785 -675361 -410941 -211515 -140467
33806 -140467 388287 1522718 2271067 1753207 619098 229684 774849 1238724 1058930
33797 1058930 775467 960552 1369106 1367079 680382 -332470 -845403 -320060 520065 130189
33787 130189 -1729201 -3121695 -2359692 -581491 -297060 -1747091 -2625194 -1540684 226790
33778 226790 1055467 1217005 1698449 2295171 2272833 1906099 1929467 2077931 1480944 177650
33768 177650 -840611 -903922 -175615 807619 1378443 934048 -301220 -1076069 -481310
33759 -481310 827658 1533788 1322357 772375 121242 -717276 -1274556 -985529 -410120
33750 -410120 -650611 -1459865 -1309661 291458 1854814 1913682 869813 79101 21930
33741 21930 281115 635003 1161955 1601782 1488640 826421 58864 -501198 -795217 -819813
33731 -819813 -719652 -797443 -1030393 -920079 -261058 342992 264706 -251419 -613976 -901761
33721 -901761 -1541669 -2249742 -2266181 -1625000 -1222380 -1428408 -1532073 -939465 -124039 158320
33711 158320 -15425 -23234 322705 690998 849587 821404 618900 319000 234551 525677
33701 525677 787963 541361 24160 -64243 404548 807001 714616 427549 343724 365338
33691 365338 281206 216070 205794 -244677 -1530091 -3095606 -3889840 -3614735 -2915597 -2355372
33681 -2355372 -1901749 -1533920 -1545610 -1852635 -1730562 -865088 -101323 -376393 -1273204 -1487429
33671 -1487429 -571772 628417 1247019 1251356 934804 432999 11769 24039 224270 -89386
33661 -89386 -856562 -1083040 -487391 -324840 -1561386 -3053977 -2918876 -1250107 69077
33652 69077 161012 70415 517629 472112 -951763 -2489253 -2188353 -296687 904928 186453
33642 186453 -1085794 -974967 483166 1588722 1300779 325667 -117057 158382 412749
33633 412749 189622 -252401 -667574 -1250514 -1990309 -2248734 -1674112 -1081461 -1465450 -2322365
33623 -2322365 -2105211 -508023 932443 1028284 508902 514663 679464 74193 -782632 -601737
33613 -601737 315310 277025 -1011570 -1699763 -583724 945725 936593 -339477 -1081862
33604 -1081862 -687867 -225425 -455374 -869656 -856423 -598847 -432596 -251365 7296 33626
33594 33626 -251627 -390684 -123978 118556 -87979 -479791 -606476 -563826 -657950 -696361
33584 -696361 -262792 476105 854916 586561 82643 -113167 153506 650818 949874 709476
33574 709476 119597 -100768 440385 1174971 1343797 1160796 1441842 2192010 2547803 2271285
33564 2271285 2206769 2768483 3044153 2232806 1071281 728056 953224 663787 -9066
33555 -9066 190391 1400724 2023904 970483 -694599 -1266180 -718123 -475756 -1328900
33546 -1328900 -2567945 -3082053 -2517095 -1284434 -26282 758601 928563 719336 465059
33537 465059 356892 517806 1024949 1653955 1908767 1600201 1119107 822487 460471 -367865
33527 -367865 -1437514 -2060724 -1918949 -1337753 -820913 -629854 -693971 -649447 -158143 536788
33517 536788 678414 -12715 -765191 -656053 250218 1204697 1840730 2241187 2284760 1816138
33507 1816138 1293583 1296932 1416441 672472 -798168 -1555841 -776512 605692 1251418
33498 1251418 1067592 785473 589990 78362 -761808 -1363665 -1305209 -691186 86812 570216
33488 570216 402655 -293735 -847867 -708663 -67530 446712 498002 217995 -106484 -253665
33478 -253665 -199927 -231388 -636636 -1160446 -1225976 -894387 -972755 -1767721 -2397622 -1971638
33468 -1971638 -885001 -166603 21287 341234 992266 1387473 1103888 379119 -393998
33459 -393998 -1014303 -1271975 -1008398 -447047 16006 305023 483175 304628 -381760 -985141
33449 -985141 -785463 -138679 -123290 -862201 -1189523 -362974 771675 885530 -204464
33440 -204464 -1548176 -2189460 -1794281 -645768 435718 533709 -440024 -1450461 -1409956
33431 -1409956 -437120 266085 -275154 -1786925 -2944126 -2566873 -793732 1009396 1734140
33422 1734140 1651544 1608326 1561637 889254 -43330 22946 1244851 2087292 1459335 315762
33412 315762 167966 963073 1629597 1969639 2573994 3237097 2983482 1784068 946141
33403 946141 1370752 2357930 2625430 1858161 806266 296271 508191 971883 1084745
33394 1084745 781390 626237 1005938 1456073 1220658 284874 -666890 -1171119 -1316254
33385 -1316254 -1296710 -1238496 -1390932 -1905876 -2471625 -2662925 -2483359 -2048479 -1124333 232777
33375 232777 1015819 399928 -678170 -431279 1223565 2474920 2306573 1814344 2101665
33366 2101665 2367495 1316071 -635759 -1971639 -2194450 -1964230 -1594873 -802781 217482
33357 217482 727309 493966 -93068 -897984 -1981129 -2681745 -1955929 58323 1838948
33348 1838948 2287781 1894194 1656232 1713388 1701665 1717648 2027164 2212182 1548903 210449
33338 210449 -685541 -442221 356190 662117 258059 -171878 -48475 525086 1205770 1880693
33328 1880693 2378482 2176767 1013738 -405933 -1026043 -766959 -494852 -543058 -180829
33319 -180829 997725 2083468 2071535 1363540 1041364 1151499 892495 244179 89155
33310 89155 620808 909920 452421 8379 274408 687322 385747 -329286 -441050 216764
33300 216764 705412 250122 -854002 -1681002 -1671447 -1159617 -1045739 -1818031 -2850180 -2992924
33290 -2992924 -1958422 -652180 55103 277107 452245 421846 -88018 -523028 -2526
33281 -2526 1281160 2020177 1369634 -56225 -1061488 -1249508 -1114568 -1046190 -777910 36776
33271 36776 1020673 1279517 548962 -225435 100518 1429941 2551071 2667963 2105455
33262 2105455 1369623 410807 -680622 -1122096 -471061 360125 117815 -1078456 -1986792
33253 -1986792 -1967459 -1453556 -878013 -301340 -155358 -1085387 -2645848 -3289670 -2309517
33244 -2309517 -899717 -585506 -1350142 -2069778 -2150363 -1886200 -1654249 -1576605 -1689273 -1767859
33234 -1767859 -1300203 -253302 549414 530913 375932 1030327 2051068 2063095 770825
33225 770825 -582716 -883124 -299209 379662 600077 51928 -1146636 -1955696 -1192954
33216 -1192954 681677 1632203 601356 -1022386 -1379699 -583238 5449 97917 517495
33207 517495 1305147 1456333 681159 -32766 -22681 121324 -227800 -683082 -703812 -595465
33197 -595465 -830743 -1045492 -565703 472992 1248842 1214867 443182 -567858 -943326
33188 -943326 104874 2108021 3148586 1811333 -906711 -2569563 -2073389 -519904
33180 -519904 625161 1140235 1497866 1727950 1564651 1178143 1013108 1059765 824172 46819
33170 46819 -863208 -1207149 -730900 59136 387607 57755 -386087 -488381 -550122 -1079283
33160 -1079283 -1852472 -2121686 -1674416 -1059062 -694221 -368863 179295 721947 846089
33151 846089 418253 -431780 -1397338 -1930301 -1558706 -500358 421019 658538 387617
33142 387617 462 -332323 -449209 -135843 441876 777970 804413 1069440 1752851 2078833
33132 2078833 1285637 -192959 -1082483 -615476 851637 2314704 2848390 2117754 586992
33123 586992 -837791 -1539037 -1482772 -941447 -351130 -272106 -774825 -956005 -29641 1082693
33113 1082693 538205 -1713690 -3475526 -3286447 -2319398 -2143999 -2153405 -988334 669717
33104 669717 929452 -280515 -1226881 -1209989 -1204007 -1593489 -1504775 -834829 -758546 -1408630
33094 -1408630 -1134484 730137 2230260 1503000 -328226 -764410 553244 1756805 1608818
33085 1608818 699553 -40138 -493432 -881532 -1273293 -1747026 -2208603 -2047475 -802008
33076 -802008 844641 1581762 1085688 376007 404393 931620 1054601 417159 -343057 -219664
33066 -219664 1047977 2421442 2485854 1146980 -112515 -77271 705771 898327 222156
33057 222156 -536376 -886746 -939483 -642734 122613 753629 417514 -530735 -782357 -24296
33047 -24296 524657 84695 -310445 641498 2377410 3050534 1988943 538665 336136
33038 336136 1487482 2765121 3149552 2772053 2430951 2491126 2501825 1943790 1085999 742993
33028 742993 1236428 2019221 2422109 2351360 2063923 1706168 1420825 1507024 1959615 2099707
33018 2099707 1277841 -96775 -845327 -491004 108992 -88874 -1006988 -1747424 -1836340
33009 -1836340 -1542665 -1129136 -523021 194508 711591 1154017 2070612 3290134 3595065
33000 3595065 2346562 776367 544581 1409073 1659755 774779 121770 657350 1447381
32991 1447381 1312263 665924 567738 911898 882895 562956 697849 1209236 1283301 816848
32981 816848 520093 570382 372960 -196299 -484122 -296838 -355650 -1052193 -1669162 -1387445
32971 -1387445 -352080 751971 1544685 1920539 1795518 1391939 1293138 1766340 2404040
32962 2404040 2709927 2586251 2042680 1027408 -164888 -940927 -1188639 -1380147 -1610384
32953 -1610384 -1326951 -446296 156663 -57526 -368925 -44701 277380 -415681 -1707198
32944 -1707198 -2263878 -1892298 -1688759 -2060946 -1994784 -798697 585387 859216 223374
32935 223374 26838 882046 1968796 2232146 1639365 1003765 920002 1222170 1439283 1460762
32925 1460762 1510692 1601396 1421761 894066 443865 401639 463913 199623 -143850 78141
32915 78141 871223 1447158 1255186 688468 526241 1009039 1680386 1896297 1363533 437816
32905 437816 -43689 413756 1210666 1193177 164170 -682284 -283113 804057 1110612
32896 1110612 220908 -758065 -745980 47593 748732 1108904 1579344 2342893 2868913 2557817
32886 2557817 1550130 741124 992686 2250271 3422780 3346700 1964025 289319 -868918
32877 -868918 -1651076 -2290911 -2207371 -863214 804837 1044282 -399054 -1756434 -1583183
32868 -1583183 -606425 -363371 -873969 -916080 -134739 554153 653389 785428 1304203 1435470
32858 1435470 590581 -335586 13748 1536305 2704404 2464517 1352875 554666 427397
32849 427397 365174 -93002 -513379 -178978 775245 1355337 995125 322560 186419 386695
32839 386695 121579 -579432 -827119 -300799 264133 264640 -9404 -189059 -502841 -1084563
32829 -1084563 -1432280 -1256851 -1143990 -1567900 -1888708 -1274614 -144506 329514 -108108
32820 -108108 -596854 -490089 22613 550275 891484 814154 281375 -95336 337066 1172090
32810 1172090 1307221 516306 -208918 -74391 619456 1241549 1600198 1576521 859067 -411697
32800 -411697 -1434342 -1715553 -1627182 -1541522 -1162167 -325871 299496 149858 -233242 -78890
32790 -78890 255762 -111561 -986866 -1334428 -1016933 -995474 -1568232 -1704811 -755637 252764
32780 252764 -48803 -1441636 -2504575 -2542157 -2180031 -2183527 -2552440 -2838844 -2635800 -1639978
32770 -1639978 83884 1686790 2023297 924691 -461163 -932973 -462951 100145 96592
32761 96592 -527675 -1403920 -1879627 -1399700 -280693 317331 -158226 -653031 166304 1865541
32751 1865541 2607907 1578255 -69483 -934267 -932793 -678956 -383002 -107578 -199655 -572929
32741 -572929 -332108 899684 1972500 1663678 549212 104944 395519 243365 -461218
32732 -461218 -461819 476129 718573 -714009 -2283720 -1990008 -264852 744122 212834
32723 212834 -632505 -677429 -260690 -61283 31824 289999 331548 -267720 -1111092 -1475150
32713 -1475150 -1361771 -1389707 -1748927 -1847523 -1115254 171188 1018606 618267 -820480
32704 -820480 -2098435 -2115041 -1078552 -352378 -843334 -1868816 -2064658 -1150126 -157149
32695 -157149 10925 -482305 -1027917 -1365531 -1409946 -1006593 -400338 -306477 -820512 -851618
32685 -851618 434647 2056812 2237652 801466 -657781 -1024312 -777914 -616474 -374088
32676 -374088 49382 -3259 -756011 -1231826 -798407 -497135 -1477643 -2876848 -2819578 -1117761
32666 -1117761 582997 1174420 1086287 923415 630064 276060 308335 624246 560038 125114
32656 125114 93162 582791 794484 489567 375400 591007 318512 -434974 -263191 1417999
32646 1417999 3027778 2925231 1571932 286126 -860231 -2298257 -3274323 -2838204 -1781642
32637 -1781642 -1657330 -2341317 -2443624 -1743030 -1224957 -937142 35591 1382002 1557615
32628 1557615 418014 -213611 686867 1924061 2268202 2197726 2391226 2223077 1074063
32619 1074063 -338177 -1257792 -2105579 -3038002 -2831646 -938981 763226 409479 -779571
32610 -779571 -281697 1603311 2138179 500214 -1082883 -1058307 -699759 -1385838 -2126613
32601 -2126613 -1567221 -655393 -1189608 -2786468 -3437059 -2606625 -1762694 -1804884 -1818756 -917236
32591 -917236 157074 197440 -608882 -1014171 -520981 75031 12335 -291658 123352 1288269
32581 1288269 2097438 1763753 958431 907695 1573315 1550919 -367 -2054662 -2860456
32572 -2860456 -1912100 -223049 1018008 1433212 1287135 997519 898730 1075340 1320710
32563 1320710 1410776 1272606 736692 -447239 -1931667 -2604589 -1854504 -686802 -624773
32554 -624773 -1573895 -1867938 -682824 718303 792074 -174433 -725717 -394562 -26757
32545 -26757 -139878 -168601 346797 798793 399442 -541007 -965234 -477021 287151 707782
32535 707782 971955 1532924 2222354 2365265 1664143 605656 -38029 96404 738470
32526 738470 1246289 1143653 618389 403147 883106 1452235 1185776 82245 -918963
$$ [...]
##END NTUPLES=NMR SPECTRUM
##END=
