##TITLE=31Pdec_LR-753-R2-C1
 CDCl3, 24 sc
 26.7.2022
##JCAMPDX= 6.0         $$ Bruker NMR JCAMP-DX V2.0
##DATA TYPE= NMR SPECTRUM
##DATA CLASS= NTUPLES
##ORIGIN= UXNMR, Bruker Analytische Messtechnik GmbH
##OWNER= root
$$ XWIN-NMR		Version 3.5
$$ Tue Jul 26 15:59:14 2022 Russian Standard Time (UT+4h)  she@DPX200
##.OBSERVE FREQUENCY= 81.013821
##.OBSERVE NUCLEUS= ^31P
##.ACQUISITION MODE= SIMULTANEOUS
##.ACQUISITION SCHEME= undefined
##.AVERAGES= 24
##.DIGITISER RES= 16
##SPECTROMETER/DATA SYSTEM= spect
##.PULSE SEQUENCE= zgpg30
##.SOLVENT NAME= CDCl3
##.SHIFT REFERENCE= (INTERNAL, CDCl3, 0, 248.564)
##AUDIT TRAIL= $$ (NUMBER, WHEN, WHO, WHERE, WHAT)
$$ ##TITLE= Audit trail, XWIN-NMR		Version 3.5
$$ ##JCAMPDX= 5.01
$$ ##ORIGIN= Bruker BioSpin GmbH
$$ ##OWNER= she
$$ F:/spectra/data/she/nmr/P31/1/pdata/1/auditp.txt
$$ ##AUDIT TRAIL=  $$ (NUMBER, WHEN, WHO, WHERE, WHAT)
(   1,<2022-07-26 15:58:19.00 +0400>,<she>,<DPX200>,
      <created by zg, POWCHK disabled, PULCHK disabled
       configuration hash MD5:
       00 E9 B6 7A A2 85 ED C7 34 08 36 98 17 FE 4E 26
       data hash MD5: 32K
       98 F7 80 2D 2F E5 9C 02 E9 DE AE 40 C6 93 38 F3>)
(   2,<2022-07-26 15:58:21.60 +0400>,<she>,<DPX200>,
      <Start of raw data processing
       efp BC_mod = 2 LB = 1 FT_mod = 6 PKNL = 1 PHC0 = -10218.23 PHC1 = -22.94316 SI = 64K 
       data hash MD5: 64K
       C5 4F 96 9E 7E 77 81 64 EB 13 7E B4 09 67 5E 9F>)
(   3,<2022-07-26 15:58:36.67 +0400>,<she>,<DPX200>,
      <pk PHC0 = 1.898916 PHC1 = 0 
       data hash MD5: 64K
       B6 81 79 AF 28 DA 01 DD E8 18 FC 43 F3 27 84 B8>)
(   4,<2022-07-26 15:58:39.68 +0400>,<she>,<DPX200>,
      <abs ABSG = 5 
       data hash MD5: 64K
       00 6B F5 08 41 E8 1F 66 17 B5 8D B5 FF A1 CF 4B>)
$$ ##END=
$$ 
$$ hash MD5
$$ C6 36 F6 89 67 EF 67 49 D2 DC 28 8C 64 CF 90 52
##$RELAX= 
##$RELAX= 
##$RELAX= 
##$RELAX= 
##$RELAX= 
##$RELAX= 
##$RELAX= 
##$RELAX= 
$$ Bruker specific parameters
$$ --------------------------
##$DU= <F:/spectra>
##$EXPNO= 1
##$NAME= <P31>
##$PROCNO= 1
##$TYPE= <nmr>
##$USER= <she>
##$AMP= (0..31)
100 100 100 100 100 100 100 100 100 100 100 100 100 100 100 100 100 100 
100 100 100 100 100 100 100 100 100 100 100 100 100 100 
##$AQSEQ= 0
##$AQ_mod= 1
##$AUNM= <au_zg>
##$AUTOPOS= <>
##$BF1= 81.014009
##$BF2= 200.13
##$BF3= 200.13
##$BF4= 200.13
##$BF5= 200.13
##$BF6= 200.13
##$BF7= 200.13
##$BF8= 200.13
##$BYTORDA= 1
##$CFDGTYP= 0
##$CFRGTYP= 5
##$CHEMSTR= <none>
##$CNST= (0..31)
1 1 145 1 1 1 1 1 1 1 1 1 1 1 1 1 1 1 1 1 1 1 1 1 1 1 1 1 1 1 1 1 
##$CPDPRG= <waltz16>
##$CPDPRG1= <>
##$CPDPRG2= <waltz16>
##$CPDPRG3= <>
##$CPDPRG4= <mlev>
##$CPDPRG5= <mlev>
##$CPDPRG6= <mlev>
##$CPDPRG7= <mlev>
##$CPDPRG8= <mlev>
##$CPDPRGB= <>
##$CPDPRGT= <>
##$D= (0..31)
0 1 0 0 0 0 0 0 0 0 0 0.03 2e-05 3e-06 0 0 0 0 0 0 0 0 0 0 0 0 0 0 0 0 
0 0 
##$DATE= 1658836698
##$DBL= (0..7)
120 120 120 11 120 120 24 19 
##$DBP= (0..7)
150 150 150 150 150 150 150 150 
##$DBP07= 0
##$DBPNAM0= <>
##$DBPNAM1= <>
##$DBPNAM2= <>
$$ [...]
##$SUBNAM3= <"">
##$SUBNAM4= <"">
##$SUBNAM5= <"">
##$SUBNAM6= <"">
##$SUBNAM7= <"">
##$SUBNAM8= <"">
##$SUBNAM9= <"">
##$SW= 501.771253377433
##$SWIBOX= (0..15)
0 1 3 0 0 0 0 0 0 0 0 0 0 0 0 0 
##$SW_h= 40650.406504065
##$TD= 32768
##$TD0= 1
##$TE= 0
##$TE2= 300
##$TE3= 300
##$TEG= 300
##$TL= (0..7)
0 120 53 12 22 120 120 120 
##$TP= (0..7)
150 150 150 150 150 150 150 150 
##$TP07= 0
##$TPNAME0= <>
##$TPNAME1= <>
##$TPNAME2= <>
##$TPNAME3= <>
##$TPNAME4= <>
##$TPNAME5= <>
##$TPNAME6= <>
##$TPNAME7= <>
##$TPOAL= (0..7)
0.5 0.5 0.5 0.5 0.5 0.5 0.5 0.5 
##$TPOFFS= (0..7)
0 0 0 0 0 0 0 0 
##$TUNHIN= 0
##$TUNHOUT= 0
##$TUNXOUT= 0
##$USERA1= <user>
##$USERA2= <user>
##$USERA3= <user>
##$USERA4= <user>
##$USERA5= <user>
##$V9= 5
##$VALIST= <valist>
##$VCLIST= <CCCCCCCCCCCCCCC>
##$VD= 0
##$VDLIST= <DDDDDDDDDDDDDDD>
##$VPLIST= <PPPPPPPPPPPPPPP>
##$VTLIST= <TTTTTTTTTTTTTTT>
##$WBST= 1024
##$WBSW= 4
##$XGAIN= (0..3)
0 0 0 0 
##$XL= 0
##$YL= 0
##$YMAX_a= 6646
##$YMIN_a= -7569
##$ZGOPTNS= <>
##$ZL1= 120
##$ZL2= 120
##$ZL3= 120
##$ZL4= 120
##$ABSF1= 248.5645
##$ABSF2= -253.2056
##$ABSG= 5
##$ABSL= 3
##$ALPHA= 0
##$AQORDER= 0
##$ASSFAC= 0
##$ASSFACI= 0
##$ASSFACX= 0
##$ASSWID= 0
##$AUNMP= <proc_1d>
##$AZFE= 0.1
##$AZFW= 0.5
##$BCFW= 0
##$BC_mod= 2
##$BYTORDP= 0
##$COROFFS= 0
##$CY= -3
##$DATMOD= 1
##$DC= 0
##$DFILT= <>
##$DTYPP= 0
##$F1P= 0
##$F2P= 0
##$FCOR= 1
##$FTSIZE= 65536
##$FT_mod= 6
##$GAMMA= 0
##$GB= 0
##$INTBC= 1
##$INTSCL= 5.30512e-09
##$ISEN= 30
##$LB= 1
##$LEV0= 0
##$LPBIN= 0
##$MAXI= 10000
##$MC2= 0
##$MEAN= 0
##$ME_mod= 0
##$MI= 50
##$NCOEF= 0
##$NC_proc= -5
##$NLEV= 6
##$NOISF1= 182.463
##$NOISF2= 159.3651
##$NSP= 0
##$NTH_PI= 0
##$NZP= 0
##$OFFSET= 248.5645
##$PC= 4
##$PHC0= -10216.33
##$PHC1= -22.94316
##$PH_mod= 1
##$PKNL= yes
##$PPARMOD= 0
##$PSCAL= 0
##$PSIGN= 0
##$REVERSE= no
##$SF= 81.014009
##$SI= 65536
##$SIGF1= 159.3651
##$SIGF2= -187.1042
##$SINO= 113.3802
##$SIOLD= 16384
##$SREGLST= <1H.CDCl3>
##$SSB= 0
##$STSI= 65536
##$STSR= 0
##$SW_p= 40650.406504065
##$SYMM= 0
##$S_DEV= 0
##$TDeff= 32768
##$TDoff= 0
##$TI= <>
##$TILT= no
##$TM1= 0
##$TM2= 0
##$TOPLEV= 0
##$USERP1= <user>
##$USERP2= <user>
##$USERP3= <user>
##$USERP4= <user>
##$USERP5= <user>
##$WDW= 1
##$XDIM= 65536
##$YMAX_p= 286311030
##$YMIN_p= -26631060
$$ End of Bruker specific parameters
$$ ---------------------------------
##NTUPLES= NMR SPECTRUM
##VAR_NAME=  FREQUENCY,     SPECTRUM/REAL,   SPECTRUM/IMAG
##SYMBOL=    X,             R,               I
##VAR_TYPE=  INDEPENDENT,   DEPENDENT,       DEPENDENT
##VAR_FORM=  AFFN,          ASDF,            ASDF
##VAR_DIM=   65536,         65536,           65536
##UNITS=     HZ,            ARBITRARY UNITS, ARBITRARY UNITS
##FACTOR=    0.620285442955139, 1,           1
##FIRST=     20137.2065510759, 0,            0
##LAST=      -20513.1999529892, 0,           0
##MIN=       -20513.1999529892, -26631060,   0
##MAX=       20137.2065510759, 286311030,    0
$$ Real data points
##PAGE= N=1
##DATA TABLE= (X++(R..R)), XYDATA
$$ [...]
40708C91487m55176r37442n03094N55813J038409L58897n25829l78858N42561
$$ 391487 -63689 -1001131 -1504225 -948412 89997 448894 -76935 -455793 86768
40699H6768Q88833K15630m82177l84896M6939M5418k58075k70027K7130J82384
$$ 86768 975601 1191231 709054 324158 371097 416515 158440 -111587 -84457 97927
40689I7927N8374r0137p5519J14969L95326M58047K641o01290m87881M05730R31632
$$ 97927 156301 66164 -9355 105614 500940 958987 961628 360338 -127543 278187 1209819
40678A209819L16869n70078m97416K16944K95126m01875p72389l79173m036r6371
$$ 1209819 1526688 956610 459194 676138 971264 569389 -203000 -582173 -586209 -682580
40668f82580q1926L18572M10554j37900m67670P5286P18439M55511l49366o44990
$$ -682580 -764506 -445934 -35380 -173280 -640950 -565664 152775 608286 258920 -386070
40658c86070l45571j46516j50964J08229N14302M28932j14988l68163j06325Q4314
$$ -386070 -731641 -878157 -1029121 -920892 -406590 22342 -92646 -460809 -567134 -482820
40648d82820o3421n5627L56477O11157K42737l43071n01035k24221O8907J89890
$$ -482820 -546241 -601868 -245391 365766 608503 265432 -235603 -459824 -390917 -201027
40638b01027J93165Q1816j13972k21566j62574n9106M4743K19590K97185k7041
$$ -201027 -7862 73954 -40018 -261584 -424158 -483264 -438521 -218931 78254 51213
40628E1213n36332n13135K24350Q58786O35300r0590m43741k72915j30926k64988
$$ 51213 -485119 -998254 -773904 84882 720182 629592 185851 -87064 -217990 -482978
40618d82978l50219j77239M1505J28230J80852K44052J69574o2652k26852j73452
$$ -482978 -833197 -1010436 -968931 -840701 -659849 -415797 -246223 -308875 -535727 -709179
40608g09179K002J77524L29345L89835K48829k7522j99179j44000J4134Q8706
$$ -709179 -707177 -529653 -200308 189527 438356 410834 211655 67655 81789 170495
40598A70495L995j79944k80891j25396J81584K67217l4744m07857m84930l13872
$$ 170495 174490 -5454 -286345 -411741 -230157 37060 2316 -405541 -890471 -1204343
40588a204343r1503K49705P23362Q62927K76734n23175o03335N9751N00955J77099
$$ -1204343 -1295846 -1046141 -322779 540148 816882 293707 -309628 -249877 251078 428177
40578D28177l26943l31908o2428q6447l34957l15240M6348L59259L72678J77740
$$ 428177 101234 -230674 -293102 -379549 -714506 -1029746 -983398 -624139 -251461 -73721
40568g3721k3979k1711K92229O11733L70372m18405q86725l93988M94077P37707
$$ -73721 -97700 -119411 172818 784551 1154923 736518 -150207 -544195 -50118 687589
40558F87589K28934k59460l14637k42622k40048q6679J83676J29880k79495m33735
$$ 687589 916523 657063 342426 99804 -140244 -226923 -43247 86633 -192862 -626597
40548f26597n3529K84532Q2379k57819j69600P4218j08637m51038j53165P18778
$$ -626597 -680126 -395594 -313215 -571034 -740634 -666416 -775053 -1226091 -1379256 -660478
40538f60478J105560M62222m26467n92149j96161o0913l16706l06357K43493P20837
$$ -660478 445082 907304 480837 -111312 -307473 -368386 -685092 -991449 -747956 -27119
40528b7119N36373l6025l32119k38631j62126k34610j16364L24793O34469L80816
$$ -27119 509254 473229 141110 -97521 -259647 -494257 -610621 -285828 348641 729457
40518G29457j58332l16691M8289L58137J13078m26773n92613j78844L27844M02593
$$ 729457 571125 254434 302723 660860 773938 347165 -245448 -424292 -96448 306145
40508C06145R8243j50245j43065n6386l0617L0121J47969J07226j56321k97451
$$ 306145 404388 254143 111078 54692 24075 54196 202165 309391 153070 -144381
40498a44381n3093K33658M9624m46086n65600j04252L62248L53294R6786j3564
$$ -144381 -197474 36184 85808 -360278 -925878 -1030130 -667882 -314588 -217802 -231366
40488b31366m0981j70608k05252P7759L82674K65827j41196l05071o7471K36727
$$ -231366 -272347 -442955 -648207 -570448 -187774 78053 -63143 -368214 -435685 -198958
40478a98958L46387K94569J35843r2049j92373l4881J12853p0373l76267l35230
$$ -198958 147429 441998 577841 485792 293419 258538 371391 301018 -75249 -410479
40468d10479P787J54902k7935j60201m9824P5352J22171K69339M14573J71355
$$ -410479 -402692 -247790 -275725 -435926 -485750 -410398 -288227 -18888 395685 567040
40458E67040l61183n25126j17426K07109m7691m48385l69416P6366L78608L90064
$$ 567040 205857 -319269 -436695 -229586 -277277 -725662 -1095078 -1018712 -640104 -250040
40448b50040K13534j75291o35314o75196j47282L45348L24090J80105L70037M77289
$$ -250040 -36506 -211797 -847111 -1522307 -1669589 -1324241 -1000151 -820046 -450009 27280
40438B7280k7990o21440m02473M00163P47262M15453J10624L8775l37930r78881
$$ 27280 -710 -622150 -1024623 -624460 122802 538255 648879 687654 349724 -629157
40428f29157j019847k47928L81328K50562J2436L54323Q27109O96806J34823k65258
$$ -629157 -1649004 -1896932 -1515604 -1265042 -1252606 -898283 -71174 625632 760455 495197
40418D95197m55283o04114m51475J53021O19035L84783j51692k82031q2759k4847
$$ 495197 39914 -564200 -1015675 -862654 -243619 141164 -10528 -292559 -375318 -400165
40408d00165n067K82205M77242J18881l11294n9412M81984K90076n03126p08924
$$ -400165 -405232 -123027 354215 473096 161802 102390 584374 874450 371324 -337600
40398c37600l4536M57038J46832k26752J4228L83180K54554n3344j7704J49543
$$ -337600 -372136 84902 231734 4982 19210 402390 656944 603600 585896 735439
40388G35439J09066J43256M61940N11090r7664o31742k40706O12037Q17445L42988
$$ 735439 844505 987761 1449701 1960791 1863127 1231385 990679 1602716 2420161 2763149
40378B763149J21757L97875L86725k94665r35605q30950k64992L1076j51866m53768
$$ 2763149 2884906 3282781 3669506 3374841 2439236 1608286 1343294 1374370 1222504 768736
40368G68736m93279j82246K66704N15439M65079M00701N43829O41067L53773j49976
$$ 768736 275457 93211 359915 875354 1340433 1741134 2284963 2926030 3279803 3129827
40358C129827m42037m77179m96146n00685l80961l27047m68053l67995L24189
$$ 3129827 2687790 2210611 1714465 1213780 832819 505772 37719 -330276 -6087
40349f087R63045O29934l35384o44067J3240N28240J54760m63801n42630l01361
$$ -6087 956958 1586892 1251508 607441 620681 1148921 1303681 839880 297250 -4111
40339d111k05868j06024J08800k5319n72952o47551J83252Q75112M56493k77803
$$ -4111 -209979 -316003 -207203 -232522 -805474 -1453025 -1269773 -394661 61832 -215971
40329b15971l9058P13240N00750n89516r17096M7598Q88485N48321j60115j37068
$$ -215971 -255029 458211 958961 369445 -547651 -500053 388432 936753 776638 639570
40319F39570K71275J50196l71287m93516j15204J71209J03056m4372o3368j9945
$$ 639570 910845 1061041 689754 196238 81034 252243 355299 310927 247559 227614
40309B27614j7292j48128m37437n80288j67489N60797P71211K21392k79467j04474
$$ 227614 210322 62194 -375243 -955531 -1123020 -562223 208988 430380 150913 46439
40299D6439K19763j0363m20811k40047K72634J93717m97461q33775l62393K74756
$$ 46439 266202 255839 -164972 -405019 -132385 61332 -436129 -1269904 -1632297 -1357541
40289a357541M37527K87696K23053K50611K40263K19196J49872q4088l06813j97147
$$ -1357541 -920014 -632318 -409265 -158654 81609 300805 450677 366589 59776 -137371
40279a37371P5138k1918m58379n39504J536N10463M06121R976j12629m1996j35043
$$ -137371 -62233 -84151 -542530 -1082034 -1080498 -570035 -163914 -153938 -266567 -308563 -443606
40268d43606k55518m9034L35406M46936K51599Q3322N0816J5757m005Q4592J28417
$$ -443606 -699124 -748158 -412752 34184 285783 369105 419921 435678 431673 516265 644682
40257F44682j9052j13602Q3278K43855n2900m64294k65892M40726P29840K17972
$$ 644682 625630 512028 595306 839161 786261 321967 56075 496801 1226641 1444613
40247A444613l73400l47221L764M1585j98010k26908M1296K52245K16977N7123
$$ 1444613 1071213 723992 727756 769341 571331 344423 385719 637964 854941 912064
40237I12064j22746k87047k99269p5297J71265J59104o2299k21804k24223j58389
$$ 912064 789318 502271 203002 127705 298970 458074 395775 173971 -50252 -208641
40227b08641m0507J32431J87853j2807k35980j02603L54068O73924N35214P5634
$$ -208641 -249148 -116717 71136 58329 -177651 -280254 73814 747738 1282952 1358586
40217A358586l48144m81184k82971L1302J05873j55116l90869k63579J5354L0187
$$ 1358586 1010442 529258 246287 277589 383462 228346 -162523 -426102 -410748 -380561
40207c80561j12721M6091M42414M37151j60775o53824m35208J08169K07946j33592
$$ -380561 -493282 -447191 -4777 432374 271599 -382225 -817433 -709264 -501318 -634910
40197f34910k42662J21563M20712K02574k29263l06949j3908J82670Q8329M9883
$$ -634910 -877572 -756009 -335297 -132723 -361986 -668935 -682843 -500173 -411844 -361961
40187c61961L38169N97035K80200m71920q75817n62530r3390n9470j58921J79689
$$ -361961 -23792 573243 853443 381523 -494294 -1056824 -1150214 -1209684 -1368605 -1188916
40177a188916O25631L54275m28081m96176M88508J187006M80160p53212q75627
$$ -1188916 -563285 -209010 -637091 -1133267 -644759 542247 1022407 269195 -606432
40168f06432Q3478N93830L4931n08677j60034L96285K25215k60492r9424M78730
$$ -606432 -522954 70876 105807 -402870 -562904 -166619 58596 -201896 -301320 177410
40158A77410L79591m65965p97924P8097J128829R95138j22875q23692m34582K91782
$$ 177410 557001 91036 -706888 -628791 500038 1495176 1372301 548609 114027 405809
40148D05809M31397K8024l35061m49847m43890k58343K01204N97965M80654K0346
$$ 405809 837206 865230 530169 80322 -363568 -621911 -420707 177258 657912 678258
40138F78258j64505M7076J26136j70856l65406q6662K48277Q7747l46189l89440
$$ 678258 513753 560829 686965 516109 150703 64041 312318 400065 53876 -335564
40128c35564O0801M44416L60971J3643j82783p9601J57059K44724M7568k23168
$$ -335564 -274763 169653 530624 544267 361484 281883 438942 683666 731234 508066
40118E08066k03217J10056K87117Q0658k18870k77811j77895p2650J50802M41780
$$ 508066 304849 414905 702022 782680 563810 285999 108104 35454 186256 628036
40108F28036L33674k86328o60217j78409N23505M19689k84275m79764M6811L63785
$$ 628036 961710 675382 15165 -163244 360261 779950 495675 15911 62722 426507
40098D26507L4143k53991n5617M1932l85050o74962j78138N52845N76985k5544
$$ 426507 460650 206659 151042 192974 -192076 -867038 -1045176 -492331 84654 59110
40088E9110m41704l89926k48549k10405r0940J65963M01486N22879M31314l1276
$$ 59110 -382594 -772520 -1021069 -1231474 -1322414 -1156451 -754965 -232086 199228 167952
40078A67952o13332n83620K52663R29289N06384m86027p30322l6163M75902J38132
$$ 167952 -445380 -1029000 -776337 152952 659336 173309 -557013 -593176 -117274 20858
40068B0858l77896k64746K35731L86719N4286l27724m67910l60912j8721M33328
$$ 20858 -357038 -621784 -386053 666 54952 -272772 -740682 -1101594 -1120315 -686987
40058f86987N79609J39351m71923m75423K52612Q73578N77982l46560q49929m91214
$$ -686987 -107378 31973 -439950 -915373 -662761 210817 788799 442239 -407690 -898904
40048h98904L5939K051k57207M0282P21472P80275l4001o99618m06058K83802
$$ -898904 -862965 -860914 -1118121 -1077839 -356367 423908 389907 -309711 -715769 -431967
40038d31967M02837J6362j45550R492l4383l21598l49623m4456Q6965r7360q4889
$$ -431967 -29130 -12768 -158318 -148826 -183209 -504807 -854430 -898886 -811921 -909281 -994170
40027i94170L83102P91113N79369r0510o04879n85883j09032M57678O94654M76879
$$ -994170 -611068 180045 759414 668904 64025 -521858 -630890 -173212 521442 998321
40017I98321J23904m1061j62501n04543q14775o08288n034L64455L03712K28922
$$ 998321 1122225 1081164 918663 414120 -400655 -1008943 -1013977 -649522 -345810 -116888
40007a16888L34413L10691P6213M1122L22954L93476p7564o32497p26630m70769
$$ -116888 217525 528216 604429 645551 968505 1361981 1284417 651920 -74710 -545479
39997e45479k11283R0177N11204O81181K75952l24805m87660k10197Q85n0215
$$ -545479 -756762 -666585 -155381 525800 801752 476947 -10713 -220910 -220025 -270240
39987b70240j03694j0662P7981P5240R1278J87050K96396L59598L00896J949m42875
$$ -270240 -373934 -384596 -306615 -231375 -140097 46953 343349 702947 1003843 1005792 562917
39976E62917o22683k86027K28805L81703J28607j09833p5323Q2408J34770L6565
$$ 562917 -59766 -345793 -116988 264715 393322 283489 208166 290574 425344 461909
39966D61909j20414j88469p1519P1291p8715m66508n13327J07189Q07206P51172
$$ 461909 341495 153026 81507 152798 74083 -392425 -905752 -798563 8643 759815
39956G59815N2840l30951M7410N24606L35578l15166o21535k84350K29317M16714
$$ 759815 812655 481704 529114 1053720 1389298 1074132 452597 168247 397564 814278
39946H14278K85393J00339p1523l30129n95398n69680j28043M23259O41463M25708
$$ 814278 1099671 1200010 1128487 798358 202960 -366720 -494763 -71504 569959 995667
39936I95667L8079k73797m36418l81231o3136K74149K22193k04121m44339j39601
$$ 995667 1033746 759949 323531 -57700 -120836 153313 375506 171385 -272954 -412555
39926d12555L11876L16745o0168k69809j37871j2767q0162q1926J37236K82927
$$ -412555 -100679 216066 155898 -113911 -251782 -264549 -344711 -426637 -289401 -6474
39916f474Q6828k10596j81516J74024M37422L21019k8884k66654k17555M757J43077
$$ -6474 80354 -130242 -311758 -137734 299688 620707 591823 325169 107614 112371 255448
39905B55448K5609k96902n98281o42143l28792K14061O24384N30543k6228m69605
$$ 255448 281057 -15845 -614126 -1256269 -1585061 -1371000 -746616 -216073 -242301 -711906
39895g11906k56220M06680P07244K35306m46772n27138k6747K77038j6147l75403
$$ -711906 -968126 -561446 145798 381104 -65668 -592806 -619553 -342515 -358662 -734065
39885g34065j52405M58934P10952L40024j82880l99119l52099k31446k9671K02240
$$ -734065 -886470 -427536 283416 623440 440560 41441 -310658 -542104 -571775 -369535
39875c69535K03021m6210j00161K90500O27098K99679m55554q27551n41367q7438
$$ -369535 -166514 -212724 -312885 -22385 604713 904392 448838 -378713 -920080 -1007518
39865a007518J25360K01570K63302J68351n7275o8378K31875M42553K63441q3240
$$ -1007518 -882158 -680588 -417286 -248935 -306210 -374588 -142713 299840 563281 480041
39855D80041k85796l58134l59048j72697J18276J38931j23826j02278M30409P54029
$$ 480041 194245 -163889 -522937 -695634 -577358 -438427 -562253 -664531 -234122 519907
39845E19907J86529p39047q89907j22010N74870N12954R6482j3964J47728J11161
$$ 519907 706436 -32611 -922518 -1044528 -469658 43296 139778 125814 273542 384703
39835C84703k42093n39153m05642J25727O25310O41325J79065k35790j50860K31511
$$ 384703 142610 -396543 -802185 -676458 -51148 590177 769242 533452 382592 614103
39825F14103L19165p2678m92927m60206l0393L37377L13142J3106j46283Q3750
$$ 614103 933268 860590 367663 -92543 -122936 214441 527583 540689 394406 478156
39815D78156M49505M71813J00973j81508p2906Q8632j04520m23021l49614O5918
$$ 478156 927661 1399474 1500447 1318939 1246033 1334665 1230145 807124 457510 523428
39805E23428K55752j0339l46081l75472j66707N7916K14087K22669j6111l37822
$$ 523428 779180 768841 422760 47288 -119419 -61503 152584 375253 359142 21320
39795B1320l55008Q487L24039K26088q4000j67072P520N4831k26358n15393l44704
$$ 21320 -333688 -325201 -1162 224926 140926 -26146 -18626 36205 -190153 -705546 -1050250
39784a050250K96542Q85990R32722M91799k0670l98752p28903r22623o21205J93854
$$ -1050250 -753708 132282 1065004 1556803 1536133 1137381 408478 -514145 -1135350 -941496
39774i41496Q74569P89326J23444l86821l76087j22531Q145j0629k0521M8217
$$ -941496 -66927 722399 845843 459022 82935 -39596 -31451 -42080 -62601 -14384
39764a4384J34913J29980L179r0815J7778J85386Q6949k08321k07412K20243N09786
$$ -14384 120529 250509 253688 162873 180651 366037 452986 244665 37253 257496 767282
39753G67282K43078j68873j71793M4440J5550q0050J86437N07070K16867m82781
$$ 767282 1010360 841487 669694 714134 729684 649634 836071 1343141 1560008 1077227
39743A077227p09421l30073j48975m75153n84145l5051M82945K74834k14713j80000
$$ 1077227 367806 37733 -111242 -586395 -1170540 -1205591 -722646 -447812 -662525 -842525
39733h42525K29483K57779j47692k75801J63830N80274M03231j16510l21818n4432
$$ -842525 -613042 -355263 -502955 -778756 -614926 -34652 368579 252069 -69749 -124181
39723a24181K13541J02109j48290q3040K15327K06074k21529m56539q2383M11012
$$ -124181 89360 191469 43179 -39861 175466 381540 160011 -296528 -378911 32101
39713C2101L62564l4265j44303m244j52151m98776l53186L41580P54997M10556
$$ 32101 394665 360400 216097 211853 59702 -439074 -792260 -450680 304317 714873
39703G14873j70261l81851k91036j27200J82993N32228M42181j38690n38474l70995
$$ 714873 544612 162761 -128275 -255475 -72482 459746 901927 763237 224763 -146232
39693a46232j43941l08680m42890p9704L33060J53316l04938k60139K49231M79166
$$ -146232 -290173 -598853 -1041743 -1121447 -788387 -635071 -940009 -1200148 -950917 -471751
39683d71751J93919r1643l3779J32843J62214J48400K00298K21206J04872j33158
$$ -471751 -277832 -369475 -403254 -270411 -108197 40203 240501 461707 566579 433421
39673D33421l83788m07588N604N92190O83284Q8797m78733l52090J14836J47763
$$ 433421 49633 -357955 -352351 239839 923123 1011920 533187 181097 295933 443696
39663D43696k05546k17950K71913N86185K86321j89029k44210L4103J17938j68236
$$ 443696 238150 20200 292113 878298 1164619 975590 731380 765483 883421 715185
39653G15185m38067k84112J68383L68446K4129m80052n72868k66394m7761q4126
$$ 715185 277118 -6994 161389 529835 553964 73912 -498956 -765350 -813111 -897237
39643h97237q1815M2754K2840q0570J77307P06369P29938K3734n20409k04932
$$ -897237 -979052 -936298 -913458 -994028 -816721 -110352 619586 643320 122911 -82021
39633h2021L96351M48902J74964K05770L03984j16876o86698n38835J83281M97167
$$ -82021 314330 763232 938196 1143966 1447950 1331074 644376 105541 288822 785989
39623G85989J51356j45907o0814m6525l05294m21762k41304j29697j43268R6555
$$ 785989 937345 791438 730624 684099 378805 -42957 -284261 -413958 -557226 -460671
39613d60671M70618L08115l96375p00639j26363N46797M79628k0777j67398O2599
$$ -460671 9947 318062 -78313 -778952 -905315 -358518 121110 100333 -67065 -4466
39603d466R2973k28140m55496k49131K28822N67891N06401J49027j26226j11277
$$ -4466 88507 -139633 -595129 -844260 -615438 -47547 458854 607881 481655 370378
39593C70378n3737k41144m54394k69544K18600N07710M47949L11253J61575j87327
$$ 370378 316641 75497 -378897 -648441 -429841 77869 525818 837071 998646 811319
39583H11319n78175n58910j08689L07795M52571M53719K75246k02373n94693l57194
$$ 811319 233144 -325766 -434455 -126660 325911 779630 1054876 852503 257810 -99384
39573i9384K40174L74048m1014k99352k14767l45703p14958n76375J39442M62148
$$ -99384 140790 514838 473824 174472 -40295 -385998 -1100956 -1677331 -1537889 -1075741
39563a075741N6942p2552O34715J134841M76545n21611n82745J8978J77699j03557
$$ -1075741 -1018799 -1091351 -456636 678205 1154750 633139 50394 69372 247071 143514
39553A43514k0335L40141J94932l42064l93950O3485J83308j37800p0238N35489
$$ 143514 123179 463320 658252 316188 -77762 -14277 169031 31231 -39007 496482
39543D96482P42107J16095n38193n43755l12257l39101k86096J81944N26667J69523
$$ 496482 1238589 1354684 816491 272736 -39521 -378622 -664718 -482774 43893 213416
39533B13416m49361n16812r5718J12077n9725j40617L9737J13796n7916p1661
$$ 213416 -235945 -752757 -848475 -736398 -796123 -936740 -897003 -783207 -841123 -912784
39523i12784L26543P39284O51368J63216j66210p8458J17839N3293k17209l79288
$$ -912784 -586241 153043 804411 967627 801417 722959 840798 894091 676882 297594
39513B97594l07981j28726N4230K13807K23719m7818m06494m32840p3920J86010
$$ 297594 -10387 -139113 -84883 128924 352643 304825 -101669 -534509 -608429 -422419
39503d22419r119l36895k48796K25204N25622L61258P0633Q5332L08820K56045
$$ -422419 -431538 -768433 -1017229 -792025 -266403 94855 165488 250820 559640 815685
39493H15685k35080o42021l19606N73128J038850M22117o47746r94067m30457
$$ 815685 580605 -61416 -381022 192106 1230956 1653073 1005327 11260 -419197
39484d19197R8783m2495l71103k22143K25251M02517K81248K08813J97460L3827
$$ -419197 -320414 -362909 -734012 -956155 -730904 -328387 -47139 161674 359134 392961
39474C92961j47325l2782K56397K87807n793k52505k08271n43J46982J05879j47689
$$ 392961 245636 212854 469251 757058 751265 498760 290489 289946 436928 542807 395118
39463C95118m32083m24532r1092J78244J36602N8265K08727L24363P8995k97258
$$ 395118 -36965 -461497 -552589 -374345 -237743 -179478 29249 353612 432607 135349
39453A35349l93564k76703k13164p5688L40607P23318O52130L30303K05035J55828
$$ 135349 -258215 -534918 -748082 -823770 -483163 240155 892285 1222588 1427623 1583451
39443A583451j51127m09270j18037L39557J45137n00837n40822K08186O93406
$$ 1583451 1432324 1023054 905017 1244574 1389711 888874 348052 556238 1249644
39434A249644L28774j29192K8912K94903l8032n69651m61544J76144N16566K90327
$$ 1249644 1578418 1449226 1478138 1773041 1735009 1165358 703814 879958 1396524 1686851
39424A686851k7534j12936j12191j31647n6648Q9865J08131j5859r6575j07874
$$ 1686851 1659317 1546381 1434190 1302543 1245895 1335760 1443891 1428032 1331457 1223583
39414A223583j97708l18257j89679K37898N28132J86056o76283j273286r28971
$$ 1223583 1025875 707618 517939 755837 1283969 1470025 793742 -479544 -1408515
39405a408515P9851P34714M72408j57597l27926m0332J32633Q2500J73514L54594
$$ -1408515 -1328664 -593950 -121542 -279139 -607065 -647397 -514764 -432264 -258750 95844
39395I5844J52632l60033m86842m9690K57107K7822k08043j9235J04977l08430
$$ 95844 248476 -111557 -598399 -648089 -390982 -363160 -571203 -590438 -485461 -793891
39385g93891p03000l24217M69513P03977K70274o2547M5285J43141l4885j14338
$$ -793891 -1496891 -1821108 -1351595 -647618 -377344 -439891 -394606 -251465 -286350 -400688
39375d00688J81232N19557M69513M9480m37190p34430o76864k60974K23545M33522
$$ -400688 -219456 300101 769614 819094 381904 -352526 -1029390 -1290364 -1066819 -633297
39365f33297L71651K67261J49269p6051k25740j8230L68021M32798R1162k37287
$$ -633297 -261646 5615 154884 78833 -146907 -165137 202884 635682 726844 489557
39355D89557l24058l61360m07534k25723J27962J96799r0033j63106K36136M96133
$$ 489557 165499 -195861 -603395 -829118 -701156 -504357 -594390 -757496 -521360 -25227
39345b5227J18273l38118j00289M67567L51715m47852q23796k67404L82162L15185
$$ -25227 93046 -245072 -345361 122206 473921 26069 -797727 -1065131 -682969 -367784
39335c67784o5579j4800K72635J44349k53821k18669K40285L91865M9290j37325
$$ -367784 -433363 -448163 -175528 -31179 -285000 -503669 -263384 128481 177771 40446
39325D0446J55311M00593K14687m665O8256K0604m43516p24586k59117L58376
$$ 40446 195757 596350 811037 806372 874628 895232 451716 -272870 -531987 -173611
39315a73611J82897n38745p12915j12210L66974K09971k9736J78766N13523M79667
$$ -173611 9286 -529459 -1242374 -1354584 -987610 -777639 -807375 -628609 -115086 364581
39305C64581J63452j18612k91054k79191P0491M81502L32311l45155o46987p1722
$$ 364581 528033 409421 118367 -160824 -90333 391169 723480 378325 -268662 -340384
39295c40384O68292O95747J78277j88924k99957m37107m60496r3427L29140K81568
$$ -340384 327908 1023655 1201932 1013008 713051 275944 -184552 -277979 51161 332729
39285C32729l5278n3581J26467j5092l20032j39460M07545M56150j50105n04537
$$ 332729 297451 243870 370337 355245 35213 -104247 303298 759448 609343 104806
39275A04806j06683L25446P7012m14851l68659P4049K23443J4826n3176J01815
$$ 104806 -1877 323569 400581 -14270 -382929 -308880 -85437 -70611 -123787 -21972
39265b1972O0326k54280l81397r3891K11093J01643l03326n45622l69945R9002
$$ -21972 38354 -215926 -597323 -691214 -480121 -378478 -681804 -1227426 -1597371 -1498369
39255a498369N42827P02058N51413K71222M234k62417m80739m17833k89L99160
$$ -1498369 -955542 -253484 297929 569151 573385 310968 -169771 -587604 -587893 -188733
39245a88733L86676J52372K01587M92420L82032l76146j089999r63363j20085
$$ -188733 197943 350315 551902 1044322 1426354 1050208 -39791 -1003154 -1123239
39236a123239O37091Q33165O12315K17995k38798n19906l61743L1561J25403j25355
$$ -1123239 -486148 347017 959332 1177327 938529 418623 56880 88441 213844 88489
39226H8489j43138K87382M99635m9642p52645n95612L17755Q39747L83581l70596
$$ 88489 -54649 232733 732368 682726 -69919 -665531 -347776 491971 875552 504956
39216E04956n83975l05841j9083J85928M09274M16361J113m16929k58743K67557
$$ 504956 -79019 -384860 -403943 -218015 191259 607620 608733 191804 -66939 200618
39206B00618L61069k02110p28411o09655j06949J70455J22710Q5948J85391K17142
$$ 200618 561687 359577 -368834 -978489 -1085438 -914983 -792273 -706325 -520934 -303792
39196c03792Q4747l7823r546J01747K05485L00871L13891O6468m14169p35353
$$ -303792 -219045 -256868 -266414 -164667 40818 341689 655580 722048 307879 -427474
39186d27474n33137M4318M81436N07711L33295K47741K40840J39833q7866l26371
$$ -427474 -960611 -916293 -434857 72854 406149 653890 894730 1034563 946697 620326
39176F20326m49630l42080L0067M18603L93278j28011o51204o74921k97314L7924
$$ 620326 170696 -171384 -141317 277286 670564 542553 -108651 -783572 -1080886 -1042962
39166a042962J78946K54337K18817p7154m32926m40228j03146J78368K74531M34565
$$ -1042962 -864016 -609679 -390862 -468016 -900942 -1341170 -1444316 -1265948 -991417 -556852
39156e56852O50803N25070j1463m26639l52696j04136p2327j05146P2203K72285
$$ -556852 93951 619021 607558 180919 -171777 -275913 -348240 -453386 -381183 -108898
39146a08898J97716J5478L8450J26421l2525k71207j70306J87666K76333p1893
$$ -108898 88818 104296 142746 269167 236642 -34565 -204871 -17205 259128 187235
39136A87235m26644l75225J7112L93053M28190J3244n61237o97111j42740N48482
$$ 187235 -239409 -614634 -597522 -204469 223721 236965 -324272 -1021383 -1164123 -615641
39126f15641O36521J60018k16955k22227j95528k64613o2397M49879O05457J9343
$$ -615641 20880 180898 -36057 -258284 -453812 -718425 -780822 -330943 274514 293857
39116B93857o07837l95390L40996M62975k77583p79049j74323Q55649J000217
$$ 293857 -313980 -709370 -368374 94601 -182982 -962031 -1136354 -280705 719512
39107G19512J31927n97308m00557K08474L76786J17307K7500K55935M01867K59319
$$ 719512 851439 254131 -146426 62048 438834 556141 583641 839576 1241443 1500762
39097A500762M6182q3219k18880l42995k71383l0850J19113J14003J42412K37024
$$ 1500762 1546944 1463725 1244845 901850 630467 599617 718730 832733 975145 1212169
39087A212169K24011J07824N0780m5491m03430p71837n93570Q1901N01529K58012
$$ 1212169 1436180 1544004 1594784 1549293 1145863 374026 -219544 -137643 363886 621898
39077F21898j95365l48186k89673k16834L7050N13961P60342M52186q6018m03048
$$ 621898 426533 78347 -211326 -428160 -391110 122851 883193 1335379 1249361 846313
39067H46313m67620l60107l3930K62358N5136m48372l71481M00566P81870J80317
$$ 846313 378693 18586 -15344 247014 302150 -146222 -517703 -117137 664733 845050
39057H45050m40004j45646M02777K19948j84919J83477P93023L99281o31680p76379
$$ 845050 405046 259400 662177 882125 697206 880683 1673706 2072987 1441307 664928
39047F64928M9846L61504k98884o52781n7731L50027k68920r35036n11618M63811
$$ 664928 714774 1076278 777394 124613 66882 416909 147989 -787047 -1298665 -834854
39037h34854P97066M30579O1935j64900m38207m31124J86888Q46796P14310n8664
$$ -834854 -37788 392791 454726 289826 -148381 -579505 -392617 454179 1168489 1109825
39027A109825n69917m27048m4006J29272M0359j66458k89692j32658K35855M60864
$$ 1109825 539908 112860 68854 198126 238485 72027 -217665 -350323 -114468 346396
39017C46396L51725Q0862j77968l94349l90106K1919M86818L71594k38932n50091
$$ 346396 698121 778983 601015 206666 -183440 -161521 325297 696891 457959 -92132
39007i2132k71488J5168k6453L9362M10956N22180J11741j57775J46748L97277
$$ -92132 -363620 -348452 -374905 -335543 75413 597593 709334 551559 698307 1095584
38997A095584K6168m29800l14021k1249j69246l81445k4492M88340L23015l33092
$$ 1095584 1121752 691952 377931 356682 187436 -194009 -218501 269839 592854 259762
38987B59762o18827m05149k33547j84606P2513L57895K04617j68037j18918L31627
$$ 259762 -359065 -764214 -997761 -1182367 -1109854 -751959 -547342 -715379 -834297 -502670
38977e02670O14723N99039N44278L46313j94330o46496n24921k72182n42504q56723
$$ -502670 112053 711092 1255370 1601683 1407353 760857 235936 -36246 -578750 -1435473
38967a435473k91534P36562Q76439J8644m78640L5689O05126L71476k01909l91080
$$ -1435473 -1727007 -990445 -114006 -95362 -574002 -538313 66813 438289 236380 -154700
38957a54700k76373j27794J68018M52212J37044o48042q17078L4305P90772M73841
$$ -154700 -431073 -558867 -390849 61363 198407 -449635 -1266713 -1232408 -441636 32205
38947C2205k41264j90647M15728M74319j99981p21485n53629n1991L39951N69128
$$ 32205 -209059 -399706 16022 490341 290360 -431125 -984754 -1036745 -696794 -127666
38937a27666O12677L46337j14231m33651m87525m27540l47185j91418N5152L29390
$$ -127666 485011 831348 717117 283466 -204059 -631599 -978784 -1170202 -1115050 -785660
38927g85660N45158N42097J99358k45356l08921Q0726L85261J93538j87503k21794
$$ -785660 -240502 301595 500953 255597 -53324 27402 412663 606201 418698 196904
38917A96904Q0678K63162Q5969k54342m27422k49607J76735M45099K00460l50944
$$ 196904 277582 540744 626713 372371 -55051 -304658 -127923 317176 517636 166692
38907A66692n89773k83861J21596J83628J6213o6601l8746k103P6093J68526Q8511
$$ 166692 -423081 -706942 -585346 -401718 -385505 -452106 -490852 -492955 -416862 -248336 -159825
38896a59825j50189k49247j29057p2132j40473p996L24872L08155k09133m93672
$$ -159825 -310014 -559261 -688318 -760450 -900923 -908919 -584047 -275892 -485025 -978697
38886i78697l2760N11314K71916m11328n21037K7719L67465J71654Q3063M72376
$$ -978697 -1011457 -500143 -228227 -639555 -1160592 -1132873 -765408 -593754 -510691 -38315
38876c8315P57156L87190k55740m86503l03488j68727j61322K3153L44717K99461
$$ -38315 718841 1106031 850291 363788 60300 -108427 -269749 -246596 98121 397582
38866C97582k88712p83220m49853M75804R22912L56179m45677m32560K38463M85403
$$ 397582 108870 -674350 -1124203 -648399 274513 630692 185015 -247545 -9082 476321
38856D76321l9666m70238j48893L61129K60428k14931k83170J12008L57430K09960
$$ 476321 436655 -33583 -182476 178653 439081 224150 -59020 52988 410418 620378
38846F20378k1594j65020l01959l07671k910L07380J73417j71316q5095L79575
$$ 620378 598784 433764 131805 -175866 -178776 128604 302021 130705 45610 425185
38836D25185M77675p608l98795k42250K5888o9924k76027k10150q7779k35181
$$ 425185 902860 895252 496457 254207 280095 210171 -65856 -276006 -363785 -598966
38826e98966l88985j56609J92571J01476l19191m00588O4963N29490M99677J46398
$$ -598966 -987951 -1144560 -951989 -850513 -1169704 -1570292 -1505329 -975839 -476162 -329764
38816c29764n9004M2036K35040K65879Q3370j43090j92774m7589P2618K3452m2035
$$ -329764 -388768 -346732 -111692 154187 237557 94467 -98307 -145896 -73278 -49826 -91861
38805i1861O1726K13834J76786Q885m9049l5991k10306m93849m41074M7545M20434
$$ -91861 -30135 183699 360485 369370 320321 284330 74024 -419825 -860899 -813354 -392920
38794c92920K13708k65510m22056k45273j49696j33496K00954P48603P88448R4495
$$ -392920 -179212 -444722 -866778 -1112051 -1261747 -1395243 -1194289 -445686 342762 437257
38784D37257n15425k90384L19712L57255j63531l41376J22812M47783M1726n53667
$$ 437257 -78168 -368552 -48840 308415 144884 -196492 -73680 374103 415829 -137838
38774a37838n08205O8025L81415J49870r7360J22268O00731P91190M96603K6385
$$ -137838 -646043 -578018 -196603 -46733 -144093 -21825 578906 1370096 1866699 1893084
38764A893084k23140k07691j98746l21813l04468J10134O32746O84353J86904
$$ 1893084 1669944 1462253 1263507 941694 637226 747360 1380106 2064459 2251363
38755B251363l19315m44040l78782l69704k51049J42153N11265M94759K38793
$$ 2251363 1932048 1488008 1109226 739522 488473 630626 1141891 1636650 1875443
38746A875443J25293J74691J60086Q6627Q0945m58l35403o53245n37848j37155
$$ 1875443 2000736 2175427 2335513 2422140 2503085 2502627 2167224 1513979 976131 838976
38736H38976k43k05525k40663J30529M40974K15959l26820n80121k95929K10412
$$ 838976 838733 633208 392545 523074 964048 1180007 853187 273066 -22863 187549
38726A87549M49092K12461k28011l50768K8382M54306L73173j09294l84985k20780
$$ 187549 636641 849102 621091 270323 298705 753011 1126184 1016890 631905 411125
38716D11125K205L186J1858K10509K74572r4668n38502m72642K3760K90024M6506
$$ 411125 413330 416516 428374 638883 913455 818787 280285 -192357 -168597 121427 167933
38705A67933k34410q1747K75583K94344m7782k25281M9112M10696L86471N3381
$$ 167933 -66477 -148224 127359 421703 373921 148640 197752 608448 994919 1048300
38695A048300j45930p4201j5314j50591l02548k96173k32551k27303j69180L3226
$$ 1048300 902370 828169 812855 662264 359716 63543 -169008 -396311 -565491 -532265
38685e32265K00061J29582p0749j38907j3598J63422K71644K63702J23819p4241
$$ -532265 -332204 -202622 -273371 -412278 -425876 -262454 9190 272892 396711 322470
38675C22470j93242k04675j68544l1529K62053M59080K42755j49675j32979K40772
$$ 322470 129228 -75447 -243991 -275520 -13467 445613 688368 538693 405714 646486
38665F46486K22452l68156o42626l1357O24872K76513o58204r00134k09851M48341
$$ 646486 868938 500782 -141844 -173201 451671 728184 69980 -830154 -1040005 -591664
38655e91664M51959J13723k12337n16844n67047k1067P29300Q28101K46753j74092
$$ -591664 -139705 -25982 -238319 -755163 -1322210 -1343277 -613977 214124 460877 286785
38645B86785j27499j89681n13791l85136M17239R64939N81850r2747k05479L8281
$$ 286785 159286 -30395 -544186 -929322 -512083 452856 1034706 941959 736480 774761
38635G74761K0731j73491j69620j46664l80214n27230k31756R2799n9044l43050
$$ 774761 795492 622001 452381 305717 -74497 -601727 -833483 -740684 -799728 -1142778
38625a142778j73762K21314K71939J30115K90199N36134K97947k27093l49199
$$ -1142778 -1316540 -1095226 -823287 -693172 -402973 133161 431108 204015 -145184
38616a45184q4807m6777k63206j60921K81236M00842K928k94675p8581K99136
$$ -145184 -229991 -276768 -539974 -700895 -419659 -18817 -15889 -310564 -389145 -90009
38606i0009L91457K03000q8294l36900k97267R3964L42078r62m57977k01989N57396
$$ -90009 301448 504448 416154 79254 -218013 -124049 218029 217067 -240910 -442899 114497
38595A14497P67904J81573k88630r9006J71514L7134l9044L26933N43706L3004
$$ 114497 882401 1063974 775344 676338 847852 884986 845942 1172875 1716581 1749585
38585A749585o60471o86224k45296j61021m68734m25121J90548O80785M59204
$$ 1749585 1089114 402890 157594 -3427 -472161 -897282 -706734 -25949 433255
38576D33255j87418n82985m70272j18117J17618J39620Q7954Q8168J12439J36866
$$ 433255 245837 -337148 -807420 -925537 -807919 -668299 -580345 -492177 -379738 -242872
38566b42872K60408M49927L70797j32599n56615k99831L62997N42817K9644m21500
$$ -242872 17536 467463 838260 705661 149046 -150785 212212 755029 784673 363173
38556C63173k94133j2457p2602k26434o3904K19313K36465R5813R5802J62075
$$ 363173 69040 56583 -16019 -242453 -306357 -87044 149421 245234 341036 503111
38546E03111J21798J23245K73395K93090L6982j25940J2479p636n04881r03093
$$ 503111 624909 748154 1021549 1314639 1351621 1225681 1238160 1230524 725643 -177450
38536a77450n67268J04705L01296Q7478J17036L82105K94345j51126l34583j05144
$$ -177450 -744718 -640013 -338717 -251239 -134203 247902 542247 391121 56538 -48606
38526d8606N7459l638N4157K44236J79518q3056o1960J82359Q5435k71346j31273
$$ -48606 8853 5215 59372 303608 483126 400070 338110 520469 605904 334558 203285
38515B03285N35700P42552Q1231n01016k07991L30541J59814m53428n71163r8569
$$ 203285 738985 1481537 1562768 1061752 853761 1184302 1344116 890688 319525 220956
38505B20956K46474J15977k03564m57031n72889l70205J70596N52374L54707l6941
$$ 220956 467430 583407 379843 -77188 -650077 -1020282 -849686 -297312 57395 20454
38495B0454J3389L29015J86176m68838q64685n26472J27686M51774L07467Q834
$$ 20454 33843 362858 549034 80196 -784489 -1310961 -1183275 -731501 -424034 -415200
38485d15200p4897J85016M91620L61519j61326l76106L1117K99073k88093j032476
$$ -415200 -490097 -305081 186539 548058 386732 10626 41743 340816 52723 -979753
38475i79753o62712O39845J312790O57468k52825l39604K0995K8494j19496J62544
$$ -979753 -1642465 -1002620 310170 967638 714813 375209 396204 424698 305202 467746
38465D67746N77490L97864k46991n77167m04022k05153j21183J53840M99971L52463
$$ 467746 1045236 1443100 1196109 618942 214920 9767 -111416 42424 542395 894858
38455H94858k70712n84820j96822K84488K02076j95520k43185J47604N05309N28635
$$ 894858 624146 39326 -157496 126992 329068 133548 -109637 37967 543276 1071911
38445A071911L20375M5826k22480l74409l10908j24755K187O7986K05710L71508
$$ 1071911 1392286 1438112 1215632 841223 530315 405560 407747 475733 681443 1052951
38435A052951K99146j33571o20687o72306j76645L93338M80776J20854j19590
$$ 1052951 1352097 1218526 597839 -74467 -251112 142226 623002 743856 624266
38426F24266M5661J98858j09142n72634n31817j4718K71462N9081p9910K29374
$$ 624266 669927 868785 759643 187009 -344808 -359526 -88064 -28983 -108893 120481
38416A20481M18566j14970q49666p30792K43737Q98208M92426l00694m24851J32169
$$ 120481 539047 424077 -425589 -1156381 -912644 -14436 477990 177296 -247555 -115386
38406a15386N12761K68906j70835k78577j10557k2328q6965j05313j3379L0840
$$ -115386 397375 666281 495446 216869 106312 83984 -2981 -108294 -121673 -90833
38396i0833n5808j37100o5528J25133K96260L37865J71208k08269n75964n56227
$$ -90833 -146641 -283741 -349269 -224136 72124 409989 581197 372928 -203036 -759263
38386g59263p2401M17305M15067M0819j36559Q1030K64114M3548l32980l95399
$$ -759263 -831664 -414359 708 41527 -95032 -14002 250112 293660 -39320 -434719
38376d34719j04722K12535L73724M35627M12780K47825O387j90819l69523n60267
$$ -434719 -539441 -326906 46818 482445 895225 1143050 1149437 958618 589095 28828
38366B8828n59960j86389K94146M03584J31852m1670J14418K68674J25570r9543
$$ 28828 -531132 -717521 -423375 -19791 112061 70391 184809 453483 579053 479510
38356D79510j04452k7038j42603k96578j26483K50101K77748k12408o49506m48211
$$ 479510 375058 348020 205417 -91161 -217644 32457 310205 97797 -551709 -999920
38346i99920J88061N27002K71076j00450m6506K89892L37268n1282l89001k63959
$$ -999920 -811859 -284857 -13781 -114231 -160737 129155 466423 415141 26140 -237819
38336b37819J01562K18696o367k65597l17185j48525J83241N30520N84360K04156
$$ -237819 -136257 82439 76072 -189525 -506710 -655235 -471994 58526 642886 847042
38326H47042k44637k82073k998P2261j69267k84208o7299Q0048j44229l75356
$$ 847042 602405 320332 317334 389595 220328 -63880 -131179 -51131 -195360 -570716
38316e70716j31133M29466P28257N25000R2735j87029j19301K16478M26239J04550
$$ -570716 -701849 -272383 455874 980874 1073609 886580 767279 983757 1409996 1514546
38306A514546n55183p69660j46529O46402O59197r5549o78026m23826L43163Q16452
$$ 1514546 959363 189703 43174 689576 1348773 1253224 575198 151372 494535 1310987
38296A310987N82180m4323l43331R7920Q57524J058740M53173k02952j61130L05913
$$ 1310987 1893167 1848844 1505513 1603433 2460957 3519697 3972870 3769918 3608788 3914701
38286C914701L77016j35506o58805p44790n05590k39226j30026k63308m97961
$$ 3914701 4291717 4156211 3497406 2752616 2247026 2007800 1877774 1614466 1116505
38277A116505m48965k8664K30585p5124m55069k15471L47574L33973k98410o37103
$$ 1116505 667540 638876 869461 794337 339268 123797 471371 805344 506934 -130169
38267a30169k44193K89903M10578K76046J05402k11753n04898k55212M23884O52753
$$ -130169 -374362 -84459 326119 602165 707567 495814 -9084 -264296 159588 812341
38257H12341J33348k97045m7119K65510j0823l79429j50507K64275J40953j60982
$$ 812341 945689 648644 601525 867035 856212 476783 326276 590551 731504 570522
38247E70522J44872P10044N04263m03699q63284m33551J00523J50835Q5202K60268
$$ 570522 715394 1425438 1929701 1526002 662718 229167 329690 480525 565727 825995
38237H25995L55310J08470j49082j40737r8801j77550r0751K84752N83110N87508
$$ 825995 1181305 1289775 1140693 999956 901155 723605 632854 917606 1500716 2088224
38227B088224N60096N81045K41557n54972j144193r99231n08466k82067k15770
$$ 2088224 2648320 3229365 3470922 2915950 1771757 772526 264060 -18007 -233777
38218b33777R7500M74387M11583j9375k66302j49912Q582K3234K0198L4075j9170
$$ -233777 -136277 338110 749693 730318 464016 314104 322686 345920 366118 400193 381023
38207C81023n949K36019M04589M5261n92242o85148l9639M99095K33211l64678
$$ 381023 375074 611093 1015682 1060943 468701 -216447 -256086 243009 476220 111542
38197A11542l77593K20181O36618M74766J59258J25038K25441J38750j47171m77981
$$ 111542 -266051 -45870 590748 1065514 1224772 1349810 1575251 1714001 1566830 1088849
38187A088849p21019o32410n0494N57720L93448m35509p18733J43205R86209M79662
$$ 1088849 367830 -264580 -315074 242646 636094 200585 -518148 -374943 611266 1090928
38177A090928p26873q52416K80452R95370M36836k12285J32495O89877L00784
$$ 1090928 364055 -488361 -207909 787461 1224297 1012012 1144507 1834384 2135168
38168B135168n92698q21320m07998j81166j60034K05385O61166M84486j02073
$$ 2135168 1542470 721150 313152 131986 -28048 177337 838503 1322989 1220916
38159A220916k38168R6854K80040M28387J052728J542202P55733q24827j382640
$$ 1220916 982748 1079602 1359642 1788029 2840757 4382959 5138692 4313865 2931225
38150B931225n09398K21385n6484k33220M50298P89979k49615j453226j156392
$$ 2931225 2421827 2643212 2586728 2353508 2803806 3593785 3344170 1890944 734552
38141G34552Q5692M77812k07216o57620l52812n0008j15059l1648L25353L52218
$$ 734552 820244 1298056 1090840 433220 80408 30400 -84659 -116307 209046 561264
38131E61264j04624m02021k00433O1063J8060j39819k27755l36766l94758j59162
$$ 561264 456640 54619 -145814 -84751 -66691 -206510 -434265 -771031 -1165789 -1324951
38121a324951K28302L18965P5637o5344J17362M05856N59761M66533M3214m94342
$$ -1324951 -1096649 -777684 -702047 -767391 -650029 -244173 315588 782121 825335 330993
38111C30993n50083O2523O19245M74578Q4710J62406L42296j31270q01041n32789
$$ 330993 -219090 -156567 462678 937256 1021966 1184372 1526668 1395398 594357 61568
38101F1568M76768P83763l7132p38824m39841J24991M3138l63202l73547p5158
$$ 61568 538336 1322099 1284967 546143 106302 231293 274431 -88771 -462318 -537476
38091e37476R4733J60061K19994M0983l04253k11335L85784O07041K9486m31086
$$ -537476 -442743 -282682 -62688 -21705 -325958 -537293 -151509 455532 485018 53932
38081E3932N3091P96294O84648n4356l79714j78316j79566m51723l05963L36307
$$ 53932 107023 903317 1587965 1533609 1153895 975579 796013 344290 38327 374634
38071C74634O91782M22611J90980N78315J201147J261814N01204o16811j335621
$$ 374634 1066416 1489027 1680007 2258322 3459469 4721283 5222487 4605676 3270055
38062C270055j185018m54867l56k42676o03953l77593J85805L23119O196r9796
$$ 3270055 2085037 1630170 1629814 1387138 783185 405592 591397 914516 920712 820916
38052H20916J62619J91135k79711o63331m39296P3584K76102J28084k337J2611
$$ 820916 983535 1174670 894959 231628 -207668 -134084 142018 270102 267765 280376
38042B80376p146j27785j66259Q789K21128J39530k74619n69035k95658K97774
$$ 280376 273230 145445 -20814 -12025 209103 348633 74014 -495021 -790679 -492905
38032d92905M78511P7462j95842J64556O25288M38692j81986m58468k52682l1904
$$ -492905 -14394 63068 -132774 31782 657070 1095762 913776 455308 202626 170722
38022A70722J00800L88376N74671J30989o25732p16405k3001M28163P5289l32055
$$ 170722 271522 659898 1234569 1365558 739826 23421 420 428583 503872 171817
38012A71817n0494M69438M59536P5458r8931j24429l47052m76579k9567O22064
$$ 171817 121323 590761 1050297 1125755 1026824 902395 555343 78764 49197 671261
38002F71261O50574Q5401k26396L3423K64259L8753k72773k59062j11002j11919
$$ 671261 1321835 1407236 1180840 1214263 1478522 1517275 1244502 985440 874438 762519
37992G62519q8255J57956L23918L9022m51308n44525j22508K93245K49721r5555
$$ 762519 674264 832220 1156138 1195160 743852 199327 76819 370064 619785 524230
37982E24230k50196j6426L05761L13222j0374k86130k11850R1854K93326K68336
$$ 524230 274034 257608 563369 876591 866217 580087 368237 460091 753417 1021753
37972A021753J33588k7204k14531l16178j42415K57967N33992M07048k3214m19799
$$ 1021753 1155341 1128137 913606 597428 455013 712980 1246972 1654020 1630806 1211007
37962A211007n27193l11238N2040K64040J51256r6354j11535J38581K46103o5340
$$ 1211007 683814 372576 424616 688656 839912 743558 632023 770604 1016707 951367
37952I51367m72204m34099N3040M06589K07006k74047m58145j97333J20516J75188
$$ 951367 479163 45064 98104 504693 711699 437652 -20493 -217826 -97310 77878
37942G7878J44944L64357P41767Q50175N96013M07911N62136O91119L63049j21287
$$ 77878 222822 587179 1328946 2179121 2775134 3183045 3745181 4436300 4799349 4678062
37932D678062r0759M13997N87023L6160o32486p42236m61935l03650k37155J9730
$$ 4678062 4587303 5001300 5588323 5624483 4991997 4249761 3787826 3484176 3247021 3266751
37922C266751K15459j08653o73204p00582j37595J89305j58619n84132m21890
$$ 3266751 3482210 3373557 2700353 1999771 1862176 2051481 1892862 1308730 886840
37913H86840J22065M49409M26877K67631K4463k71069l36288j4050L94201O20484
$$ 886840 1008905 1458314 1885191 2152822 2177285 1906216 1569928 1555878 1950079 2570563
37903B570563Q66556J231107J150223J47484j145655j555802q93108j44375q6630
$$ 2570563 3437119 4668226 5818449 5965933 4820278 3264476 2371368 2226993 2140363
37894B140363m17315m45203n6016K84361J39516m36456q47808m81984M47934R18970
$$ 2140363 1723048 1277845 1221829 1506190 1645706 1209250 361442 -120542 327392 1246362
37884A246362M22248j95542K7084N80789K91603n93861o34721L83274Q98777L1090
$$ 1246362 1668610 1473068 1500152 2080941 2372544 1778683 1143962 1527236 2426013 2457103
37874B457103r79947p66532J05621L39358L7346J19501M41253J70283m29468l01789
$$ 2457103 1477156 710624 816245 1155603 1192949 1312450 1753703 1923986 1494518 1192729
37864A192729M54687N97402j64220o39980j17907N46700M05782j90190m01243
$$ 1192729 1647416 2244818 2080598 1440618 1322711 1869411 2275193 2085003 1683760
37855A683760j79572n005k9827j31122k67159k95066J6129M21571L11132k52555
$$ 1683760 1504188 1499183 1469356 1338234 1071075 776009 792138 1213709 1524841 1272286
37845A272286m02447J51065M97139k7540o40965l02057O14709R30378M62833N1769
$$ 1272286 869839 1020904 1518043 1490503 849538 547481 1162190 2092568 2555401 2607170
37835B607170N0800j6998l25996l97132o1028K04291J73874K45796N75160O55074
$$ 2607170 2657970 2640972 2314976 1917844 1856816 2061107 2234981 2480777 3055937 3711011
37825C711011K16664j68769N0140N16214N63344K69796K13968M27801L34646k60654
$$ 3711011 3927675 3758906 3809046 4325260 4888604 5158400 5372368 5800169 6134815 5874161
37815E874161p80320p08589l31960k50439m25173k37804M64433R10286L91788
$$ 5874161 5093841 4385252 4053292 3802853 3377680 3139876 3604309 4514595 4906383
37806D906383o02609q85715k05875L59363q344o14823l23889O32996R55948K60891
$$ 4906383 4303774 3418059 3212184 3571547 3563203 2948380 2624491 3257487 4213435 4474326
37796D474326l55813q386P32709Q49329L26666j26904k16395j25340J27362N63547
$$ 4474326 4118513 4110127 4842836 5692165 6018831 5891927 5675532 5550192 5677554 6241101
37786F241101P59412L37113k03971j0368P97325J192989P40013J35581K3397J49148
$$ 6241101 7000513 7337626 7133655 7123287 7920612 9113601 9853614 9989195 10012592 10161740
37776A0161740J18810J61227N22513Q05441O51466N19462R66655J599313J653039
$$ 10161740 10280550 10441777 10964290 11769731 12421197 12940659 13907314 15506627 17159666
37767A7159666J311416J435812K105247K511872K424812K653418L653714M686276
$$ 17159666 18471082 19906894 22012141 24524013 26948825 29602243 33255957 37942233
37759C7942233N027886N207593O179121P813274R168299J0013942J1173298J3335500
$$ 37942233 42970119 48177712 54356833 62170107 71338406 81352348 92525646 105861146
37751A05861146J6281058J9406456K2356801K4867106K6402989K6164286K3155289
$$ 105861146 122142204 141548660 163905461 188772567 215175556 241339842 264495131
37744B64495131J6338137N477762p701581j9689124k7262091k9587398k8193729
$$ 264495131 280833268 286311030 278609449 258920325 231658234 202070836 173877107
37737A73877107k5141877k1603787j8010539j4778285j2314686j0516105q837606
$$ 173877107 148735230 127131443 109120904 94342619 82027933 71511828 62674222
37730F2674222p061236n664569n132461n123919m761275l743352k717540k351921
$$ 62674222 55612986 49948417 44815956 39692037 34930762 31187410 28469870 26117949
37722B6117949k428872k229435j583564j069195j159599j564272j607594j080527
$$ 26117949 23689077 21459642 19876078 18806883 17647284 16083012 14475418 13394891
37714A3394891n01290m92134r87874j242664p54090L923J33674m49873q57057
$$ 13394891 12893601 12401467 11413593 10170929 9416839 9420762 9554436 9104563 8247506
37705H247506m75825J70281K32820k58108n87808m49896j91662j19181j99520
$$ 8247506 7771681 7941962 8174782 7916674 7328866 6878970 6687308 6568127 6368607
37696F368607l96059o83763p54333l34841J95828J82529k68914l83576J8019K00816
$$ 6368607 5972548 5288785 4534452 4199611 4395439 4577968 4309054 3925478 3943497 4144313
37686D144313k15018n49935k01510L09869K16145k05219j59447K52225K07222
$$ 4144313 3929295 3379360 3177850 3487719 3703864 3498645 3339198 3591423 3798645
37677C798645l65444n48257J24205Q87252Q31595J06892m61764n00551k94765
$$ 3798645 3433201 2884944 3009149 3896401 4727996 4834888 4373124 3872573 3577808
37668C577808j42079l8957L5809m0565l00961n45741n73849m31056l03295k25892
$$ 3577808 3435729 3396772 3432581 3392016 3091055 2545314 1971465 1540409 1237114 1011222
37658A011222n2484K48505M24037K36726j39718k78099q2493O5123j23184m01369
$$ 1011222 958738 1207243 1631280 1868006 1728288 1450189 1367696 1432819 1309635 908266
37648I08266l65449n0972J60755J04728k7705n1540K3318J47392K73490K37272
$$ 908266 542817 491845 652600 757328 729623 678083 701401 848793 1122283 1359555
37638A359555r4809n05293n52449j24669L79797N38895L48140P0038j18116j74377
$$ 1359555 1264746 759453 207004 82335 462132 1001027 1349167 1419205 1301089 1126712
37628A126712j03015m06k8631j72315j77901Q0917L32944K36456j29614l53174
$$ 1126712 1023697 1023291 994660 822345 644444 725361 1058305 1294761 1165147 811973
37618H11973k22103O9696K44730K44940J76885J45393J92208K49213J38955k03946
$$ 811973 589870 659566 904296 1149236 1326121 1471514 1663722 1912935 2051890 1847944
37608A847944n17286m59909j12338O8831r1689k13750L2020L79797L83994J07811
$$ 1847944 1330658 870749 758411 827242 735553 521803 553823 933620 1317614 1425425
37598A425425n2115l8560j08063k34445j27175J45879J78891k4148R300L20910
$$ 1425425 1373310 1334750 1226687 992242 865067 1010946 1189837 1165689 1174989 1495899
37588A495899L02500k34265n37182q9425L98326M2793p07152o98905P7324M67684
$$ 1495899 1798399 1564134 1026952 937527 1335853 1378646 671494 -27411 49913 517597
37578E17597L761m28658j09841M06584L15399j60270k72612L5974J99312j0138
$$ 517597 521358 92700 -17141 389443 704842 544572 271960 307934 507246 497108
37568D97108k70329l08648j68299M4061K61511L64450K81150J08442l9804j39781
$$ 497108 226779 -81869 -250168 -206107 55404 419854 701004 809446 769642 629861
37558F29861j11792J27571L49142J76709k46629l00591J00506J87870m41516r38429
$$ 629861 518069 645640 994782 1171491 924862 624271 724777 912647 471131 -467298
37548d67298l50957Q07388J140969L37389m88317m85020r0014k4411j57813J4194
$$ -467298 -818255 -10867 1130102 1467491 979174 494154 404140 379729 221916 236110
37538B36110L69566L67781k0008k59629r3579J21556M0817j46168r5343P8410
$$ 236110 605676 973457 953449 693820 600241 721797 762614 616446 521103 599513
37528E99513j5911l23736k99370K29952O28211L25862k36278k13429K86192L24727
$$ 599513 583602 259866 -39504 190448 818659 1144521 908243 694814 981006 1305733
37518A305733l10502o61335j21252N44291M24240q9909n4888L99172L49911k75933
$$ 1305733 995231 333896 212644 756935 1181175 1091266 1036378 1435550 1785461 1509528
37508A509528n51141j01543L00235J0261n45073o66687l96484j99298j55025j2748
$$ 1509528 958387 856844 1157079 1167340 622267 -44420 -440904 -640202 -795227 -807975
37498h07975K59625M34153L74577J43729j10427k15042p7848J66274K79359K26492
$$ -807975 -548350 -114197 260380 404109 293682 78640 792 167066 446425 672917
37488F72917J72947K02161K60245L11626K94842N2895l75020n73989k80021J08036
$$ 672917 845864 1048025 1308270 1619896 1914738 1967633 1592613 1018624 738603 846639
37478H46639N7181k45036j94223K06186L66641J34096j3167J04567P2076k52011
$$ 846639 903820 658784 464561 670747 1037388 1171484 1158317 1262884 1334960 1082949
37468A082949l72658k1077L42916L07723J38356J83240K54506Q2751j38996j47751
$$ 1082949 710291 689214 1032130 1339853 1478209 1661449 1915955 1998706 1859710 1711959
37458A711959q0716j15130r8497N0745N9820j64881k38957J8040J52697j55321
$$ 1711959 1631243 1516113 1417616 1468361 1528181 1363300 1124343 1142383 1295080 1139759
37448A139759m53977k51708J31885J39105n2535J01061M91797N00373j286m82784
$$ 1139759 685782 434074 565959 705064 652529 753590 1245387 1745760 1744474 1261690
37438A261690n23829k07938J58099K79305k695m36554m81175n5363K46589R3648
$$ 1261690 737861 529923 688022 967327 964632 528078 46903 -8460 238129 331777
37428C31777j3890L00707M54261j12288p36399m37565M20716O40047J17916j11205
$$ 331777 317887 618594 1072855 960567 224168 -213397 207319 847366 965282 854077
37418H54077K41985K64863m13507q36210l21830L51343K22254l37259l52801J80137
$$ 854077 1096062 1360925 947418 111208 -210622 140721 362975 25716 -327085 -146948
37408a46948M53646J86964j07679m0896K10139L35953K33166o0186l76744m51212
$$ -146948 306698 493662 385983 345087 555226 891179 1124345 1064159 687415 236203
37398B36203k44666p9291j76414l05065k06775p6153k01203l78908j89785K87295
$$ 236203 -8463 -87754 -264168 -569233 -776008 -852161 -1053364 -1432272 -1622057 -1334762
37388a334762N45313M03110K15981K68314L68064K08944j53550l88594l07589
$$ -1334762 -789449 -386339 -170358 97956 466020 674964 521414 132820 -174769
37379a74769m4068J25816N7036j52818k89601k44620q8371N7993J50879K08379
$$ -174769 -218837 -93021 -35985 -188803 -478404 -723024 -811395 -753402 -602523 -394144
37369c94144K38386K19717J26376l1807j86903k79866l42304l94510k81715J43023
$$ -394144 -155758 63959 190335 158528 -28375 -308241 -650545 -1045055 -1326770 -1183747
37359a183747O22993O41068J45423k62083j69645M3466r1855k79715R917M84551
$$ -1183747 -560754 80314 225737 -36346 -205991 -162525 -254380 -534095 -524178 -39627
37349c9627L61222l51651p78902m44943J94775N97728P07991N51738J03623k55549
$$ -39627 321595 -30056 -808958 -1253901 -1059126 -461398 246593 798331 901954 646405
37339F46405l8215L69042K8209r23415j136221j14994Q05291M48971l89096l30286
$$ 646405 608190 977232 1005441 82026 -1054195 -1169189 -363898 85073 -304023 -634309
37329f34309L60844M21152j94480l71194J72479N43542L35027J47018K49616R7820
$$ -634309 -273465 147687 -46793 -417987 -245508 298034 633061 780079 1029695 1127515
37319A127515m59658p25483l65559K5103M1348R5046M03056M08812j24968m30214
$$ 1127515 667857 -57626 -423185 -398082 -356734 -261688 141368 550180 425212 -5002
37309e002P1960P40701P23912K51105K1998l0729l67529p40893n35421P5659L20082
$$ -5002 66958 807659 1531571 1782676 1804674 1773945 1406416 665523 130102 205761 525843
37298E25843M7025j40547P2425L51346M00254K90524Q6192j99569k86020P6453
$$ 525843 572868 432321 504746 856092 1256346 1546870 1633062 1433493 1147473 1223926
37288A223926N04816L67498k21084n14054k99643j77174m82899p12493l56947
$$ 1223926 1728742 2096240 1875156 1361102 1061459 884285 401386 -311107 -668054
37279f68054L28145P69497P64433L96026k01814o48357m37436L26095Q18542N66133
$$ -668054 -339909 429588 1194021 1590047 1388233 739876 302440 628535 1447077 2013210
37269B013210J07390R1456K75165J01606k01516K3524O69377R57707O97971N48238
$$ 2013210 2120600 2212056 2487221 2588827 2387311 2410835 3080212 4037919 4735890 5284128
37259E284128Q72606J200817J153783J126639J550146K115285K355788K496619
$$ 5284128 6156734 7357551 8511334 9637973 11188119 13303404 15659192 18155811
37251A8155811K964273L346802K690898Q57873j142600k363700k870259l199794
$$ 18155811 21120084 24466886 27157784 28015657 26873057 24509357 21639098 18439304
37243A8439304l417801l180315k431832j557466r41474p21612q73758j188015
$$ 18439304 15021503 11841188 9409356 7851890 6910416 6188804 5315046 4127031
37235D127031j243436q00526k17475q4347l93174m98446n6173M37682L52647j93945
$$ 4127031 2883595 2083069 1865594 1781247 1388073 889627 833454 1271136 1623783 1429838
37225A429838n80504n61959m09020k74324K2453M73761O52403K98949j83181j90769
$$ 1429838 849334 287375 -121645 -395969 -373516 100245 752648 1051597 868416 677647
37215F77647K57348N16258J63125m24651n16239M6991O02380M63710j79670m63798
$$ 677647 934995 1451253 1614378 1189727 673488 720479 1322859 1786569 1606899 1143101
37205A143101R34N55433L65278m23680q95345o14264q3570J26957J04334J53544
$$ 1143101 1144035 1699468 2064746 1641066 745721 131457 47887 174844 279178 432722
37195D32722J75573l2870k27354l1792L77505M55353R4781k58789l09657k34499
$$ 432722 608295 575425 348071 316279 693784 1149137 1243918 985129 675472 440973
37185D40973k17816j44586N4417J62600L8035j11463q1279j7292j20921k57336
$$ 440973 223157 78571 132988 295588 333623 222160 140881 123589 2668 -254668
37175b54668j98261o2651j21050k62415q7910M30339P87562O02098J21659j48593
$$ -254668 -452929 -515580 -636630 -899045 -986955 -556616 230946 833044 954703 806110
37165H06110r7689j7550r0194j68241p4088J23791K18465J04665j55052l94253
$$ 806110 708421 690871 600677 432436 358348 482139 700604 805269 650217 255964
37155B55964m36929k54097n1315l1699m5657K47937P39732P51864p0566j027347
$$ 255964 -180965 -435062 -486377 -518076 -563733 -315796 423936 1175800 1105234 77887
37145G7887j086201k58744L95181K57319o6623J53208N62542L43797l63971n85135
$$ 77887 -1008314 -1267058 -871877 -614558 -681181 -527973 34569 378366 14395 -570740
37135e70740q061N27762L10823k29783k75507J71196M48597K96286R8754J43026
$$ -570740 -578801 -51039 259784 30001 -245506 -74310 374287 670573 769327 912353
37125I12353K23737J04435p6671o8221J23213L13779L70543K02948k32439p09399
$$ 912353 1136090 1240525 1163854 1095633 1218846 1532625 1903168 2106116 1873677 1164278
37115A164278p48215j68827N09594N80901K0748n28351o46433n51807m85875k20083
$$ 1164278 416063 247236 756830 1337731 1358479 830128 183695 -368112 -853987 -1074070
37105a074070M09977R07963O75116l9656m08223j83305R2129P5796O1296K03882
$$ -1074070 -664093 243870 918986 879330 471107 287802 379931 455727 517023 720905
37095G20905J13776l28160m87712M6238O19963M29247k12457m05274j00373j0342
$$ 720905 834681 506521 18809 65047 685010 1114257 901800 496526 396153 385811
37085C85811k77243l12631P534P7944k72916l92408J4149K72753j13561n55964
$$ 385811 108568 -204063 -196529 -118585 -391501 -783909 -769760 -497007 -610568 -1166532
37075a166532l36245K10656K81770j11830k73476N8839M67423N65730L33263j14548
$$ -1166532 -1502777 -1292121 -1010351 -1122181 -1395657 -1336818 -869395 -303665 29598 -84950
37065h4950n47431n76882j08871L41845K91419R815N1902L25455L02505k0715
$$ -84950 -632381 -1209263 -1318134 -976289 -684870 -675055 -623153 -297698 4807 -15908
37055a5908j36025N2825R4461j41958k21589K3165J20415k36613o01360m25552
$$ -15908 -151933 -99108 -4647 -146605 -368194 -345029 -224614 -461227 -1062587 -1488139
37045a488139J26614M60118L63625J37000P0407J38380J54851J3219k06919k90282
$$ -1488139 -1361525 -901407 -537782 -400782 -330375 -191995 -37144 -23925 -230844 -521126
37035e21126j20804J18627J34921p1603j89215k3736K49116L21114Q5162k91882
$$ -521126 -641930 -523303 -388382 -459985 -649200 -672936 -423820 -102706 -17544 -309426
37025c09426m83809k28082L72140Q11679O71344J05884l71102n03964m26851k88828
$$ -309426 -793235 -1021317 -649177 162502 833846 939730 568628 64664 -362187 -651015
37015f51015j15307J48l7185n2005K08204N71276N57489J00766k77801k06874
$$ -651015 -766322 -766174 -803359 -855364 -647160 -75884 481605 582371 304570 97696
37005I7696J1560j06259m85805n72850p4757O00296P20790O1286p09086p01392
$$ 97696 109256 2997 -482808 -1055658 -1130415 -530119 190671 251957 -457129 -1158521
36995a158521O6226O06128K77193l22559k81314K83107N61411L78512K27289J63115
$$ -1158521 -1092295 -486167 -208974 -531533 -812847 -529740 31671 410183 637472 800587
36985H00587k25891p05246m52528M63313Q45775J51976o06377m63769N5081K8036
$$ 800587 574696 -130550 -583078 -119765 726010 877986 271609 -192160 -137079 -109043
36975a09043k70285m0888M66930L61392k97133n82483k28715J11821J12397J50775
$$ -109043 -379328 -420216 46714 408106 110973 -471510 -700225 -588404 -476007 -325232
36965c25232L42187K54223j76784l88682j53877M3075r5476k00403j3034J23882
$$ -325232 16955 271178 94394 -294288 -448165 -405090 -500566 -700969 -714003 -590121
36955e90121j4271l1655L57839P15834N66101J81755P9814J45449q5282n41340
$$ -590121 -604392 -636047 -278208 437626 1003727 1185482 1265296 1410745 1325463 784123
36945G84123o77102l24017Q5626J69191K5165n5581L1257K09428L62066L66349
$$ 784123 107021 -216996 -131370 37821 62986 7405 38662 248090 610156 976505
36935I76505J53760j66368l33632j85217J17473J86682j52682n34438l88956K74392
$$ 976505 1130265 963897 630265 445048 562521 749203 596521 62083 -326873 -52481
36925e2481P21912M24365j71887k83548M5645J10587k09790k44262K27828M41941
$$ -52481 669431 1093796 921909 638361 684006 794593 584803 340541 568369 1010310
36915A010310j07315o91777m30511K49368K46443m34553o74371m4762N17048K40291
$$ 1010310 902995 211218 -219293 30075 276518 -158035 -832406 -877168 -360120 -119829
36905a19829k75559j20957L97053K75518m77594p30375O9224J005618R63001J29280
$$ -119829 -395388 -516345 -119292 156226 -321368 -1051743 -982519 23099 986100 1115380
36895A115380l94416j34075K87342J63022m06317p93097o16473k8397N17692O05856
$$ 1115380 720964 586889 874231 1037253 630936 -162161 -778634 -807031 -289339 316517
36885C16517J54538m64457p18139m12260J80513O48726P25253L49852k29758m87131
$$ 316517 471055 6598 -711541 -1123801 -943288 -294562 430691 780543 550785 63654
36875F3654j63971K46706Q7324m02899l38118L49641O10603q1101p35447l41152
$$ 63654 -100317 146389 233713 -169186 -507304 -157663 452940 371839 -363608 -704760
36865g04760M67492M10613l29003m15326M01166Q58133K40547n32563m63007N7260
$$ -704760 -237268 173345 -155658 -570984 -169818 688315 928862 396299 -66708 -9448
36855i448J28107k13500l31063j43906n5303j15154m3918J34765J29097r5985
$$ -9448 118659 -94841 -425904 -569810 -625113 -740267 -784185 -649420 -520323 -616308
36845f16308k93044k64501Q3040O96388J105647O83191m21781j137290p77849
$$ -616308 -909352 -1173853 -1090813 -394425 711222 1394413 972632 -164658 -942507
36836i42507K1036K81609N8278O0396L48426L43932n6808k88819m9427L07909
$$ -942507 -921471 -639862 -581584 -521188 -172762 171170 114362 -174457 -223884 84025
36826H4025L65137O2401m31016p63929m90176L24215Q17361L31078n46198p20437
$$ 84025 449162 511563 80547 -683382 -1173558 -849343 -31982 299096 -247102 -967539
36816i67539j57948K16068O7382L4982M50724P33201M02313j81645m81904m44079
$$ -967539 -1125487 -909419 -842037 -807055 -356331 376870 779183 597538 115634 -328445
36806c28445j66029L44479P58563N45516j30180m09402l1582K08245k06385o05716
$$ -328445 -494474 -149995 608568 1154084 1023904 614502 582920 791165 584780 -20936
36796b0936k68968L22606K63731l11800n00263l6790M43919M15403J1141l60623
$$ -20936 -289904 32702 296433 -15367 -515630 -552420 -108501 306902 318043 -42580
36786d2580m06960n9963L75243L80129q8951l86345o8066M05243L76165j2443
$$ -42580 -449540 -509503 -134260 245869 156918 -229427 -297493 107750 483915 471472
36776D71472j54646L6610J63518R0946k824r7824k36506k01405J08205K76593
$$ 471472 316826 353436 516954 607900 605076 507252 270746 69341 177546 454139
36766D54139j6699l42901j93168J08635J0935j63756K40617Q87333Q49519J90105
$$ 454139 437440 94539 -98629 10006 20941 -142815 97802 985135 1834654 2024759
36756B024759j19732J35609J47339l56648o29928l42396j68064m11352l42268
$$ 2024759 1905027 2040636 2187975 1831327 1201399 859003 690939 279587 -62681
36747f2681L83977Q65651M06241k59353k06931J67762J5471m01497k58476L07262
$$ -62681 321296 1186947 1593188 1333835 1126904 1294666 1310137 908640 650164 957426
36737I57426M79010J64924p8041k04981n62241q30237l42286N82317Q42151K06023
$$ 957426 1436436 1601360 1523319 1318338 756097 -74140 -416426 165891 1008042 1214065
36727A214065l70852k88251n8312j77346k78804N0368M44716L68992m6488l27900
$$ 1214065 843213 554962 496650 319304 40500 90868 535584 904576 858088 530188
36717E30188l48279k32688R640L21646M07292R7406l41067n38587m30655j66636
$$ 530188 181909 -50779 -41139 280507 687799 785205 444138 -94449 -525104 -691740
36707f91740R4213J75615J8202r6046J36556M49739K75791k95316m91631l5710
$$ -691740 -597527 -421912 -403710 -499756 -363200 86539 362330 67014 -424617 -460327
36697d60327L73311J71286j78401j2502M02130L36060j86623m57811k07709J05661
$$ -460327 -87016 84270 -94131 -106633 295497 631557 444934 -12877 -220586 -114925
36687a14925J26147M3193P9585R0116r8280l17240k71084O0140L77889L59724
$$ -114925 11222 54415 134000 224116 125836 -191404 -462488 -402348 -24459 335265
36677C35265o624l38071k20454K63295N62683L41942j15910l61555l32949k02981
$$ 335265 328641 -9430 -229884 33411 596094 938036 822126 460571 127622 -75359
36667g5359p793K09740J89935j60124m14880j60247L08537L54143n9453l54512
$$ -75359 -83152 126588 316523 156399 -258481 -418728 -110191 243952 184499 -170013
36657a70013k24041L7170J12300L6481p4082j61148l4448M23635P89785M41617
$$ -170013 -394054 -356884 -244584 -208103 -282185 -443333 -477781 -54146 735639 1177256
36647A177256m59664r53023n31593J83349L99650K05037J46697K63033J97117
$$ 1177256 717592 -235431 -767024 -583675 -184025 21012 167709 430742 627859
36638F27859l3932p4491R0236J13280q0345j92580j11952n9162r9546p630K35974
$$ 627859 593927 519436 609672 722952 642607 450027 338075 278913 179367 171737 407711
36627D07711K75310o0904m05339l32072Q2904M31159M74645K52054r8553l82156
$$ 407711 683021 622117 216778 -115294 -32390 398769 873414 1125468 1026915 644759
36617F44759m00558j98862q0940j66543j74779O9850K09300j22231n72320m72983
$$ 644759 244201 45339 -35601 -202144 -376923 -307073 -97773 -220004 -792324 -1265307
36607a265307J02661L77435P3152j67545J06654L67245L6087m23469k08017M27855
$$ -1265307 -1162646 -785211 -712059 -879604 -772950 -405705 -369618 -793087 -1001104 -573249
36597e73249N06932m0824j99269M48961R39948M11443n26622p36341k34437M5110
$$ -573249 -66317 -107141 -306410 142551 1082499 1493942 967320 230979 -3458 41652
36587D1652j73729k12211K89275P37172M99363k16900p36608p14016k95415J49846
$$ 41652 -132077 -344288 -55013 682159 1181522 964622 228014 -486002 -781417 -631571
36577f31571K60308l2760l22149j61336K59940L19511q1265l32968r5016J67458
$$ -631571 -371263 -404023 -726172 -887508 -627568 -308057 -389322 -722290 -817306 -649848
36567f49848N157k54409j21856J78114J36293r8729j80L13525K00692l47119n40128
$$ -649848 -644691 -899100 -1020956 -842842 -706549 -805278 -805458 -491933 -291241 -638360 -1178488
36556a178488j4686N66298N41251J95832J35448K77195J63940r8835k0383L13377
$$ -1178488 -1193174 -626876 -85625 110207 245655 522850 686790 587955 567572 880949
36546H80949K73991k38770n30017j84330K74351K35433n7913k4394K09597L2410
$$ 880949 1154940 916170 386153 201823 476174 711607 653694 629300 838897 871307
36536H71307n38124p51572k60188L32106L71819O1612K1749L26455M98339K88887
$$ 871307 333183 -418389 -678577 -346471 25348 86960 108709 435164 933503 1222390
36526A222390l0695j54587j28477j56137k71398l19248j59064J49833L35829J74975
$$ 1222390 1191695 1037108 908631 752494 481096 161848 2784 152617 488446 663421
36516F63421j83396l18552p3231K27079K54130J17944P1364M4672j40317k91363
$$ 663421 480025 161473 88242 315321 569451 687395 758759 803431 663114 371751
36506C71751n4736M61612P26762M73344k6273l76190l97963r0764L50676N04641
$$ 371751 317015 778627 1505389 1978733 1952460 1576270 1178307 1087543 1438219 1942860
36496A942860J41138l48177m06686j52116j66617m48783l43191K71633N51379
$$ 1942860 2083998 1735821 1329135 1177019 1010402 561619 218428 490061 1041440
36487A041440o2709q57140p94805L0559O26938M98349P3636j33891j09051l0850
$$ 1041440 978731 121591 -673214 -642655 -15717 482632 556268 422377 313326 282476
36477B82476O7101J84352K42446J96619Q0812m0018n4205Q9658J46880k23372
$$ 282476 349577 533929 776375 972994 1053806 1013788 959583 1049241 1196121 972749
36467I72749q13835q68210j01159P35225Q21763L74479J29393J37185q6758m75274
$$ 972749 158914 -709296 -810455 -75230 746533 1121012 1250405 1387590 1300832 825558
36457H25558m49564q334J89756n2016k00219n8334j36582n72683o39227N9525
$$ 825558 375994 367660 557416 505400 305181 246847 110265 -462418 -1101645 -1042120
36447a042120P21997M63212l24854n81703j17073L40612L80897L02873L15246
$$ -1042120 -320123 143089 -181765 -763468 -880541 -539929 -159032 143841 459087
36438D59087J78826j84598l86151j47941K61851M18733K44178o0118k89022k82913
$$ 459087 637913 453315 67164 -80777 181074 599807 843985 783867 494845 211932
36428B11932K5367M19294M71029J9882n47518o80515k68527K71174M73620K79654
$$ 211932 237299 656593 1127622 1147504 599986 -80529 -349056 -77882 395738 675392
36418F75392p01r6214o8827j72056m60992o47096m02353K31108Q01683Q49490
$$ 675392 674691 578477 509650 337594 -123398 -770494 -1172847 -941739 -140056 709434
36408G09434L63113j80401l00755m2410J15310q4604l38102k60780N4137K67945
$$ 709434 1072547 892146 591391 548981 664291 579687 241585 -19195 34942 302887
36398C02887L54548M76710M61840m585o51883p42461j18147M76050M29652O2446
$$ 302887 657435 1134145 1595985 1591400 939517 197056 78909 554959 984611 1047057
36388A047057l4612Q4667L1931j20651l8227J48668K8614k95127l05980J5066
$$ 1047057 1012445 1097112 1129043 1008392 970165 1118833 1147447 852320 546340 561406
36378E61406Q6650k88658m86686L2896Q63987J149796O66183l0821m11391m95773
$$ 561406 648056 359398 -127288 -94392 769595 1919391 2585574 2554753 2143362 1647589
36368A647589n30653n14596k93533L9640J65880J4230o6529J85301M81771L53389
$$ 1647589 1116936 602340 308807 348447 514327 528557 462028 647329 1129100 1482489
36358A482489j44848m96594m59326k84829j65926J8681K57983K61124K5093N44
$$ 1482489 1337641 841047 381721 96892 -69034 -50353 207630 468754 493847 494391
36348D94391L28414M68708O7841l56513k18162J46131M8914l69460m05994j1477
$$ 494391 822805 1291513 1359354 1002841 784679 930810 979724 610264 204270 192793
36338A92793J77749l5598j56777M6738J86177M1790n1713J13960K02806r8108
$$ 192793 370542 334944 178167 224905 411082 452872 401159 515119 717925 619817
36328F19817n97091q99921p63194j02364Q17004J226878O01860m19244o68397
$$ 619817 22726 -877195 -1640389 -1742753 -925749 301129 902989 483745 -184652
36319a84652p9275K68765q0519k86260K17844O46338J92095n38177m77592K01331
$$ -184652 -263927 4838 -75681 -361941 -144097 502241 694336 156159 -321433 -120102
36309a20102M66311O9558k88312k11986j0571Q6556K12714L34565K03357j01318
$$ -120102 346209 415767 127455 -84531 -95102 -8546 204168 538733 742090 640772
36299F40772k10171p1210L4753L5231O5476J6538l13432o77569o01852j29302
$$ 640772 430601 359391 394144 429375 494851 511389 197957 -479612 -1081464 -1210766
36289a210766K29137K57984J96573J99545K21438L60883O86247P90407K27850
$$ -1210766 -981629 -723645 -527072 -327527 -106089 254794 941041 1731448 1959298
36280A959298o17298q57321l63584P1341k5958k21586r9432L4206j67503l74094
$$ 1959298 1342000 484679 121095 192436 166478 -55108 -154540 -120334 -287837 -661931
36270f61931j18589L97351N94873L34679j6261j51819j03477o2757j56408l13558
$$ -661931 -780520 -383169 211704 546383 530122 378303 274826 212069 55661 -257897
36260b57897k88235K9316L59184L55700J09337l7625p3224k27706l86155k00484
$$ -257897 -546132 -516816 -157632 198068 307405 269780 196556 -31150 -417305 -617789
36250f17789K04155L05489N1196n8629J00364L8893m05301o84565m62701j48524
$$ -617789 -413634 -108145 -56949 -115578 -15214 23679 -381622 -1066187 -1528888 -1677412
36240a677412q4141J7711L26106L98198N5312p0598L65275N93382k9126o94668
$$ -1677412 -1761553 -1743842 -1417736 -1019538 -964226 -1034824 -669549 -76167 -105293 -799961
36230g99961k80086P28384Q51357n6587n69673O6482Q45926O54341j45477n10773
$$ -799961 -1080047 -351663 499694 443107 -126566 -60084 785842 1440183 1294706 783933
36220G83933k66301l8482j46698l14612k59684q559K67986L76414J86468j54925
$$ 783933 517632 479150 332452 17840 -241844 -250403 17583 393997 580465 425540
36210D25540k83437j09109j0175k83898o45887n95027j12025L42208M56108L80744
$$ 425540 142103 32994 22819 -261079 -906966 -1501993 -1614018 -1271810 -815702 -434958
36200d34958L79433M15884K41444j94521n74295n20855l2602M84121O23241L31799
$$ -434958 -55525 360359 601803 407282 -167013 -687868 -720470 -236349 386892 718691
36190G18691j26846m05335k68459K08068N72063L95409j55115m50883k34095O9824
$$ 718691 591845 186510 -81949 126119 698182 1093591 938476 487593 253498 323322
36180C23322P8616J2472J57967K64898K7525k46659j17671J63981O9927k21550
$$ 323322 401938 414410 572377 837275 864800 618141 500470 664451 734378 512828
36170E12828j13789K75366K29022k97627n33708k20859n8109m24992o58501k11328
$$ 512828 399039 674405 903427 605800 72092 -148767 -206876 -631868 -1290369 -1501697
36160a501697L59137L37243M1526J61085M68748K21162m77850p45836k71317L30157
$$ -1501697 -1142560 -805317 -763791 -602706 -133958 87204 -390646 -1136482 -1407799 -1077642
36150a077642N51675N38169M58135J44942l46254n22051j87040J49752K4838k73480
$$ -1077642 -525967 12202 470337 615279 269025 -253026 -440066 -290314 -265476 -538956
36140e38956k10955J30321K16230r7531l89447l05166M8314L86013N72299N55151
$$ -538956 -749911 -619590 -403360 -500891 -890338 -1195504 -1147190 -761177 -188878 366273
36130C66273K69652j90328m79248l11542J68978M93497L54689j08107m98727n30622
$$ 366273 635925 445597 -33651 -345193 -176215 317282 671971 563864 65137 -465485
36120d65485k08514K12671L97005J83658k33111m66647l52573r6452O0760J51912
$$ -465485 -673999 -461328 -64323 119335 -113776 -580423 -932996 -1029448 -968688 -816776
36110h16776L01595M07713K67846n4082k60217k08419l7332Q5410J09761K3533
$$ -816776 -515181 -107468 160378 106296 -153921 -362340 -399672 -314262 -204501 -180968
36100a80968j18989j21581J03442K51659j3306m08292k48569N14675J010263N62048
$$ -180968 -299957 -421538 -318096 -66437 -79743 -488035 -736604 -221929 788334 1350382
36090A350382l57249p76358n02714j62916j39296j24493J90565N56443N51394
$$ 1350382 993133 216775 -285939 -448855 -588151 -712644 -522079 34364 585758
36081E85758J62411k81901n17278m65167j58679K21386L92789K83466J77123L15668
$$ 585758 748169 466268 -51010 -516177 -674856 -453470 -60681 222785 399908 715576
36071G15576M73218K41897k85701n07532j36048L24593K50348j98618l10587J05511
$$ 715576 1188794 1430691 1144990 637458 501410 826003 1076351 877733 567146 672657
36061F72657M18425J17356m22788m84464M165M62876M74097J75202r9108j79525
$$ 672657 1091082 1208438 785650 301186 305351 768227 1242324 1417526 1318418 1138893
36051A138893p1734P4414J6879k73911m37525j84268J74631J01665l13793m09394
$$ 1138893 1067159 1141573 1158452 884541 447016 262748 437379 539044 225251 -184143
36041a84143O8936N76757N54072J28191k08220k18892J6335K93719L18652p5037
$$ -184143 -115207 461550 1015622 1143813 935593 716701 733036 1026755 1345407 1270370
36031A270370n33879m44898J71421N17541J04963n18278n80291j62272J04823
$$ 1270370 736491 291593 463014 980555 1085518 567240 -13051 -175323 -70500
36022g0500M6362j0118L9949r237j21425j6062K58411L09508L9737j90847j56532
$$ -70500 -24138 -34256 5693 -3544 -124969 -141031 117380 426888 466625 275778 119246
36011A19246q0470j96856l67418l32100p9984K03097L69186L58865J65629j30208
$$ 119246 38776 -158080 -525498 -857598 -937582 -734485 -365299 -6434 159195 28987
36001B8987l62286l81297j65982J25545K36925R0923k2157K23329O37501O48820
$$ 28987 -333299 -714596 -880578 -755033 -518108 -427185 -449342 -226013 411488 1060308
35991A060308J23466l55720k88485O4077J60338k5207j32240n3999L4561P8797
$$ 1060308 1183774 828054 539569 603646 763984 738777 606537 552538 587099 665896
35981F65896J14504J5548k89499n23649m08077j15232K9314N5220J28931J36666
$$ 665896 780400 795948 506449 -17200 -425277 -540509 -511195 -455975 -327044 -190378
35971a90378j2366k2018K51089K96068k48102o80008j22467R21518J071809J32220
$$ -190378 -202744 -224762 26327 322395 74293 -605715 -728182 193336 1265145 1397365
35961A397365n96486l33141J04939j75973o70020m20541L52210O16128J20969
$$ 1397365 800879 467738 572677 396704 -273316 -693857 -341647 274481 395450
35952C95450l42943j95691K06995K46416p6565k13988J32946N29934L11754m35727
$$ 395450 52507 -143184 63811 310227 233662 19674 152620 682554 994308 558581
35942E58581p98047k61222M26990K72931m42353n83196O1769N35797L44586J26859
$$ 558581 -239466 -500688 -73698 199233 -243120 -826316 -764547 -228750 115836 242695
35932B42695L26371L90572p7879m63472k32651Q9148n7339j75059K95319P10854
$$ 242695 569066 959638 881759 418287 185636 274784 217445 42386 337705 1048559
35922A048559K06710o73767o93963J03807N30514J95445p3452J72204L25726k3540
$$ 1048559 1255269 581502 -112461 -8654 521860 717305 643853 816057 1141783 1118243
35912A118243l43900j77147N5530j42149m66931l57777J06604M06633L43943J69953
$$ 1118243 774343 597196 652726 510577 43646 -314131 -207527 199106 543049 713002
35902G13002J57280L13686L85885Q8214m73158p09232k46726M20416M91347k5492
$$ 713002 870282 1183968 1569853 1658067 1184909 475677 228951 649367 1140714 1115222
35892A115222l70401j77770J26816J46488J5030q9798k39574l38933j01759K97235
$$ 1115222 744821 567051 693867 840355 855385 765587 526013 187080 85321 382556
35882C82556K54359k62998m91671o1887L62368J91543j11131P8484L55387k9691
$$ 382556 636915 373917 -117754 -179641 182727 374270 263139 341623 697010 667319
35872F67319p53344q03572j08582L50549J45238R521M71385Q82906M97160k51301
$$ 667319 -86025 -889597 -998179 -647630 -502392 -492871 -21486 861420 1358580 1107279
35862A107279m22519n0823M4367k63162k06374M17063O67419n1235q18730m73424
$$ 1107279 684760 633937 678304 415142 208768 625831 1293250 1242015 423285 -50139
35852e0139N20015O87325j68400o51942p41P23480L80229m72113o20604j56696
$$ -50139 469876 1157201 988801 336859 336118 1059598 1439827 967714 347110 190414
35842A90414p1299m10747k96914L45482N39816m9249n08647k24320J60776n237
$$ 190414 119115 -291632 -588546 -243064 296752 247503 -261144 -485464 -324688 -329925
35832c29925k34775J29497O30222M02483l64147o97749l10085J51896K21179J05125
$$ -329925 -564700 -435203 195019 597502 233355 -464394 -774479 -622583 -401404 -296279
35822b96279P670k37783o00218n58805J95113J129794J377977P39727j50788o32490
$$ -296279 -288609 -526392 -1126610 -1685415 -1490302 -360508 1017469 1757196 1606408 973918
35812I73918o74823o04125m72520r1940L78389M13852q2866m63030k21975K23974
$$ 973918 299095 -305030 -777550 -869490 -491101 -77249 -160115 -623145 -845120 -621146
35802f21146K14869q7394n6046K62771K77373l911L5506M23823M57112j6559k50934
$$ -621146 -406277 -493671 -549717 -286946 -9573 -13484 22022 445845 902957 886398 635464
35791F35464O6933K30075j74055m36060K1566N51853L75000j07082j34930L4795
$$ 635464 702397 932472 758417 322357 343923 895776 1270776 1163694 1028764 1063559
35781A063559k41979o16871l03204L92236M33185k27328n78268j87569K94819
$$ 1063559 821580 204709 -98495 293741 726926 499598 -78670 -266239 28580
35772B8580L68882K96458K92342J35278j62634k22443p3105j80975m91749l60820
$$ 28580 397462 693920 986262 1121540 958906 736463 663358 482383 -9366 -370186
35762c70186K80329O13674J83447l89413l93584J7281L07038L14278R6365l28617
$$ -370186 -89857 523817 707264 317851 -75733 -58452 248586 562864 659229 330612
35752C30612o64848m21120K56399N04363k3509n23867k24144M46127N65449Q9612
$$ 330612 -334236 -755356 -498957 5406 -18103 -541970 -766114 -319987 245462 335074
35742C35074k60120j47626R3759J76958J99783K66553K58046N2352k87545n55343
$$ 335074 74954 -72672 21087 198045 397828 664381 922427 974779 687234 131891
35732A31891n29302j87511J63844K13509Q5390R3097J11571k23328o45718l65522
$$ 131891 -397411 -584922 -421078 -207569 -122179 -29082 82489 -140839 -786557 -1152079
35722a152079O57011J314683P60620m02241r34105m74737L35900Q20730P47150
$$ -1152079 -495068 819615 1580235 1177994 243889 -230848 105052 925782 1672932
35713A672932J96625m64341p34342n40567l47135l70092k06047L09757N35868
$$ 1672932 1869557 1405216 670874 130307 -216828 -586920 -792967 -483210 52658
35704E2658J5481n63970k96295M98421P42735K38934j99012j45255m5929k05611
$$ 52658 68139 -495831 -792126 -293705 449030 687964 488952 343697 297768 92157
35694I2157k65836J5093K59675J22630j54954j92489j1676J52565K06301J43853
$$ 92157 -173679 -158586 101089 223719 68765 -123724 -135400 17165 223466 367319
35684C67319l3298j88147j30746P5484J62990M7360j05641j66824j08430J17534
$$ 367319 334021 145874 15128 90612 253602 300962 195321 28497 -79933 37601
35674C7601M21577M35255n1973o32847p12845k99205R2782J82601P3396j68427
$$ 37601 459178 894433 842460 209613 -503232 -802437 -709655 -527054 -453658 -622085
35664f22085m80075m88297Q6627P80120Q54214L92573J53717L14412K42762l00785
$$ -622085 -1102160 -1590457 -1503830 -723710 130504 523077 676794 991206 1233968 933183
35654I33183o52922l16445K65907M75505L50106J53920k01244o99213p88385j38481
$$ 933183 280261 -36184 229723 705228 1055334 1209254 1008010 308797 -479588 -618069
35644f18069N94573N17840k27724o59887l12291K60532L66944L686l54110l73263
$$ -618069 -23496 494344 266620 -393267 -705558 -445026 -78082 -74396 -428506 -801769
35634h01769o5826L57599O12374M54132r8513o34534o33213m5096N07833L91015
$$ -801769 -867595 -509996 102378 556510 457997 -176537 -809750 -854846 -347013 44002
35624D4002j87540l75726J31553N97035L00922l90835o00076k07343J64497K04904
$$ 44002 -143538 -519264 -387711 209324 510246 119411 -480665 -688008 -523511 -318607
35614c18607J76522K15218J39074l8314j05124j50453l76787m99251j22543L87629
$$ -318607 -142085 73133 212207 173893 68769 -81684 -458471 -957722 -1080265 -692636
35604f92636L43263k9141J06708O31191N00274m12909q98685l41423L10041K22600
$$ -692636 -349373 -378514 -271806 359385 859659 446750 -451935 -793358 -483317 -260717
35594b60717l3257J73090K21708m72775r93111k34522J104679J390474M08274
$$ -260717 -293974 -120884 100824 -371951 -1365062 -1599584 -494905 895569 1303843
35585A303843n99809q78762p19321l36212L60221R20429O36351k26900o42986
$$ 1303843 704034 -174728 -894049 -1230261 -870040 50389 686740 459840 -183146
35576a83146l53036q1397j63314j02498L28569O33682N02822K35367L3276k49498
$$ -183146 -536182 -617579 -780893 -883391 -554822 78860 581682 817049 850325 600827
35566F00827m98615l71162n3307p0679k74805l5677M80029L93136l25336o37523
$$ 600827 102212 -268950 -322257 -392936 -667741 -703418 -223389 169747 -155589 -793112
35556g93112j61558J82115j76509m35011J28377Q15491O44308o3431l17578l0378
$$ -793112 -954670 -772555 -949064 -1384075 -1255698 -440207 204101 140670 -176908 -207286
35546b07286J18034o0764j37271N5187K41554K46152R6119j99462m87069m17902
$$ -207286 -89252 -150016 -287287 -232100 9454 255606 351725 152263 -334806 -752708
35536g52708q592J97058k719j6747N25790R56395N53791k27138m52035j79625
$$ -752708 -761300 -564242 -566961 -583708 -57918 898477 1452268 1225130 773095 593470
35526E93470j96203n76457o23977j66669J76210J35341K05653O46046R16963N20315
$$ 593470 397267 -179190 -803167 -969836 -793626 -658285 -452632 193414 1110377 1630692
35516A630692k27005o62787n87388k86556p2798l8694m8517J13847M06327M37701
$$ 1630692 1403687 740900 153512 -133044 -205842 -244536 -293053 -179206 227121 664822
35506F64822Q840m39850l64753N8839J94036q2201k75949j34038M0587K5428J6793
$$ 664822 673662 233812 -130941 -72102 121934 39733 -236216 -370254 -329667 -304239 -287446
35495b87446J51740K23287Q0911j19221k19293k25155j05465J45629K50407k8708
$$ -287446 -135706 87581 168492 49271 -170022 -395177 -500642 -355013 -104606 -133314
35485a33314l35530j26929L71954L95801r3333k80650J05558K80628k15903o30600
$$ -133314 -468844 -595773 -223819 171982 78649 -202001 -96443 184185 -31718 -662318
35475f62318k47980L54819K77791j84034j13269M28583N72239J52653j47442q8484
$$ -662318 -910298 -555479 -277688 -461722 -574991 -146408 425831 578484 431042 342558
35465C42558j39669l86421l21357O2151Q7314l48727m30244J64798N68501J30934
$$ 342558 202889 -183532 -504889 -442738 -355424 -704151 -1134395 -969597 -401096 -270162
35455b70162m38737k20985M12891M66253q0408l96771j87502P6561J29122J60755
$$ -270162 -708899 -929884 -516993 -50740 -131148 -527919 -715421 -638860 -509738 -348983
35445c48983J89176M7487o1664J64739L90203N8149n13754m60251J74582M10623
$$ -348983 -159807 -112320 -173984 -9245 380958 439107 -74647 -534898 -360316 50307
35435E0307l9172k90060J42847M87223J20015k82464K9848M32272q0978j064031
$$ 50307 11135 -278925 -136078 351145 471160 188696 218544 650816 569838 -494193
35425d94193j119015j4030R54087Q12157O5322k91998q1227J66801P7414k18620
$$ -494193 -1613208 -1627238 -673151 139006 204328 -87670 -168897 -2096 75318 -143302
35415a43302l46984q7714L65194N61397L45120M5298r1609k89351o81324q02223
$$ -143302 -490286 -578000 -212806 348591 693711 739009 647400 358049 -323275 -1125498
35405a125498k45340N25260P37521M23680K06093K10702P2973j28913N5934M42619
$$ -1125498 -1370838 -845578 -108057 315623 521716 732418 805391 676478 732412 1175031
35395A175031L01970l76427p17540l37696Q3228j4560k53769j67500K2396M5417
$$ 1175031 1477001 1100574 383034 45338 128566 114006 -139763 -307263 -284867 -239450
35385b39450J81586N75635O96452J87267l98817m36423j96807k27984l43565p0331
$$ -239450 -57864 517771 1214223 1401490 1002673 566250 369443 141459 -202106 -272437
35375b72437L69847M10164J22657R3M4010q8975k81453j59785Q6730k6344l19270
$$ -272437 97410 507574 630231 630324 674334 585359 303906 144121 230851 204507 -114763
35364a14763j71863L30977M25058o3327m06278j73887J30010L348k69603k58082
$$ -114763 -286626 44351 469409 406082 -196 -174083 -44073 -40725 -310328 -568410
35354e68410j38981k21950k46384J71917P24039P42918K40194n2853K33437N54413
$$ -568410 -707391 -929341 -1175725 -1003808 -279769 463149 703343 650490 883927 1438340
35344A438340K57578m65711q57237o29240k40176j12880q5764R7599K12515l0782
$$ 1438340 1695918 1230207 372970 -256270 -496446 -609326 -695090 -597491 -384976 -415758
35334d15758k98934l1094N74928P08890J67177l36645l24139k18898m12759m44798
$$ -415758 -714692 -745786 -170858 538032 705209 368564 44425 -174473 -587232 -1032030
35324a032030J73991R09982Q48114N8814n06898l35480J67757M30060K89843j18530
$$ -1032030 -858039 51943 900057 958871 451973 116493 284250 714310 1004153 885623
35314H85623m79127l80735J67956M73590P109o91026o71815K7413M77817K72655
$$ 885623 406496 25761 193717 667307 674416 -16610 -688425 -661012 -183195 89460
35304H9460o3287j30868j61946k43513J2430O11119Q35934L10303l04028k65358
$$ 89460 26173 -104695 -266641 -510154 -497724 113395 949329 1259632 955604 690246
35294F90246J77416L00174R665k28591k28320j98796k16284j40422L8197J85583
$$ 690246 867662 1167836 1177501 948910 720590 521794 305510 165088 203285 388868
35284C88868K46364J64671j92485o84698p62312j53908N41043N03369j72045n67045
$$ 388868 635232 799903 607418 -77280 -839592 -993500 -452457 50912 -121133 -688178
35274f88178j81266M62977O03251J69000l05222l73579l4793L86065M83089N5858
$$ -688178 -869444 -406467 196784 365784 60562 -313017 -347810 38255 521344 577202
35264E77202o30772r72768o13826J36309O21282N28059J09437k16038k60550n5347
$$ 577202 -53570 -1026338 -1640164 -1503855 -882573 -354514 -245077 -461115 -721665 -777012
35254g77012K86575N54335N02508J49321j33959p0207J16354L7340k19668j91437
$$ -777012 -490437 63898 566406 715727 581768 511561 627915 665255 445587 254150
35244B54150K03297M46109J32037m56430p23998m52800Q6465M79293M45856J6345
$$ 254150 457447 903556 1035593 579163 -144835 -597635 -511170 -31877 413979 430324
35234D30324m02771l76630J7887K82070K01891N9082L1970o7167k31237p3700
$$ 430324 27553 -349077 -331190 -49120 152771 211853 243823 176656 -54581 -128281
35224a28281L97757M77310j92335q61146o65434J26004O39453P02803P22055O41139
$$ -128281 269476 746786 554451 -306695 -972129 -846125 -206672 496131 1218186 1859325
35214A859325Q2849o58394q48490n23530m31181o97889o14460M3668N29193L31647
$$ 1859325 1942174 1283780 435290 -88240 -519421 -1217310 -1831770 -1788102 -1258909 -927262
35204i27262n8012n5856J57661J97117J73432K94104L53359J38032j40361k39075
$$ -927262 -985274 -1041130 -883469 -686352 -512920 -218816 134543 272575 132214 -106861
35194a06861k45787k18393Q300L38732L30573n3051k30849N7283K61697m0789
$$ -106861 -352648 -571041 -562741 -224009 106564 53513 -177336 -120053 141644 100855
35184A00855l93353k45356J14433R9923j99901l05190j84839r6049N6826M65868
$$ 100855 -292498 -537854 -423421 -323498 -523399 -828589 -1013428 -1109477 -1052651 -586783
35174e86783P96002N52359r8019n26381n11175l00902l270M14723O50570L15400
$$ -586783 209219 761578 663559 137178 -373997 -674899 -678169 -263446 387124 702524
35164G02524l33777n73138k08467J97509K11025O6282R9506J53410q5795m58195
$$ 702524 368747 -204391 -412858 -215349 -4324 61958 161464 314874 229079 -229116
35154b29116m49841Q4927O09780M93947j49232m84568j8619O15990M22928n01693
$$ -229116 -678957 -594030 15750 509697 360465 -124103 -142722 473268 896196 394503
35144C94503r64934l31803N40270N28677j86541n12012m8171N07624M99174J14882
$$ 394503 -570431 -902234 -361964 166713 -19828 -531840 -580011 -72387 426787 541669
35134E41669j06441l5550L7964j35019m84642o83937m67356J8086K93281J30613
$$ 541669 435228 399678 437642 302623 -182019 -865956 -1333312 -1315226 -1021945 -891332
35124h91332j20019j8529L34136M56816J59778k62700m61565l77075j60657L2144
$$ -891332 -1011351 -1029880 -695744 -238928 -79150 -341850 -803415 -1180490 -1341147 -1309003
35114a309003J50154K57568M14677N26628M34678J67163r0282k70028m13965m21842
$$ -1309003 -1158849 -901281 -486604 40024 474702 641865 551583 281555 -132410 -554252
35104e54252j71145J17724R3159j14980m2119K63965K14934k75765m71645M4201
$$ -554252 -725397 -607673 -514514 -629494 -671613 -407648 -192714 -468479 -940124 -895923
35094h95923O17816M94483p1423l33836j59869Q0909K71391M45288L21802k65728
$$ -895923 -278107 216376 144953 -188883 -348752 -267843 3548 448836 770638 504910
35084E04910p69580n50103J12413L90891J16607j57284j55029j33582j71895J0127
$$ 504910 -264670 -814773 -702360 -311469 -194862 -352146 -507175 -640757 -812652 -802525
35074h02525M24130O55080M61305M5647k98066l78865o0161M86661O46090N4983
$$ -802525 -378395 276685 737990 783637 485571 106706 46545 533206 1179296 1234279
35064A234279p22861q46759l66644m5175j49596k19182k1776Q1702j33099l74318
$$ 1234279 511418 -335341 -701985 -747160 -896756 -1115938 -1137714 -1056012 -1189111 -1563429
35054a563429l65647j68594J32730M95640O24232K31414l57255m95227j37753
$$ -1563429 -1929076 -2097670 -1964940 -1469300 -845068 -613654 -970909 -1466136 -1603889
35045a603889J93861L48519O32891R08586N54483l85150r24914m76870K93149
$$ -1603889 -1410028 -1061509 -428618 479968 1034451 649301 -275613 -752483 -459334
35036d59334M63841O0523k88619l34629k50353j08657J06986K38479J65033P7156
$$ -459334 4507 65030 -223589 -558218 -808571 -917228 -810242 -571763 -406730 -329574
35026c29574J84601L43636K62925q1372m27245m77544j26686L44557L83975j56115
$$ -329574 -144973 198663 461588 380216 -47029 -524573 -651259 -306702 77273 -78842
35016g8842n95737k24298N94302Q33220K99571j48153k0604J34978j38167l77849
$$ -78842 -674579 -898877 -304575 528645 828216 680063 659459 794437 656270 278421
35006B78421j21669J73816q7842n74128n57145n9811L28668M37758N37200O12557
$$ 278421 156752 330568 242726 -331402 -888547 -948358 -619690 -181932 355268 967825
34996I67825L72577j16761m34723m02092k00677k852J04551O582k20007k13833
$$ 967825 1340402 1223641 788918 386826 186149 183297 287848 294430 74423 -139410
34986a39410J17120K68145j13421n09481k49541L32139L03031l84691p20068j22993
$$ -139410 -22290 245855 132434 -377047 -626588 -294449 8582 -376109 -1096177 -1219170
34976a219170O97123P64104J22131l78680k20184L13706O32637M53316l7112m22009
$$ -1219170 -522047 242057 364188 -14492 -234676 79030 711667 1164983 1127871 705862
34966G05862m53122k57151j07015n8122J8050J10919O5516q2891q1844J21882
$$ 705862 252740 -4411 -111426 -169548 -151498 -40579 24937 -57954 -139798 -17916
34956a7916K31220M9018j70694q0232K24819L38703J50463j7883O2529J76500
$$ -17916 213304 262322 91628 11396 236215 574918 725381 707498 770027 946527
34946I46527K9256k72440l81354k17669k980J39271K46128J88876k39642p67864
$$ 946527 975783 703343 321989 104320 101340 240611 486739 675615 435973 -331891
34936c31891p06856P0500O86209L41387n03195p11925n4521N67680M89242Q3765
$$ -331891 -1038747 -968247 -282038 59349 -443846 -1155771 -1210292 -642612 -153370 -69605
34926f9605l4649J02280J50350J20014J95831K57035Q8343j56476j57611M7502
$$ -69605 -104254 -1974 148376 268390 464221 721256 809599 653123 495512 543014
34916E43014J42063K8153j19321k26745l83812n27833m09986R283L72168L06808
$$ 543014 685077 713230 593909 367164 -16648 -544481 -954467 -945184 -573016 -266208
34906b66208r9625l70545j97317J86552K97256K3475k31604j05304K30526L23252
$$ -266208 -365833 -736378 -933695 -747143 -449887 -426412 -658016 -763320 -532794 -209542
34896b09542M8923k69766k91027N531L54912M22804Q3841l63611m24103k2314
$$ -209542 -160619 -430385 -721412 -715881 -360969 61835 145676 -217935 -642038 -664352
34886f64352L43468K94715R0694R5629J10657j98527n18304k77761L03438L74976
$$ -664352 -320884 -26169 64525 160154 270811 72284 -446020 -723781 -420343 -45367
34876d5367k49816p31246l89731L91826P90537N64504J00249j90266k01687q9993
$$ -45367 -295183 -1026429 -1416160 -1024334 -233797 330707 430956 240690 39003 -50990
34866e0990q5077k16550k58622j28536r7895k56620j49284M45495P87860J44403
$$ -50990 -136067 -352617 -611239 -739775 -837670 -1094290 -1243574 -798079 -10219 134184
34856A34184q06944p12150L65835R10682K49978m86161k56407L61771L88864M9234
$$ 134184 -672760 -1384910 -1019075 -108393 141585 -344576 -600983 -239212 149652 198886
34846A98886Q0002L12984J28470k81339k71107L1208l2688m10211l80352K18511
$$ 198886 278888 591872 720342 439003 167896 199104 166416 -243795 -624147 -405636
34836d05636O99904N29756p0942n66150o14521j85769L59794M27407j25266o37374
$$ -405636 294268 824024 753082 186932 -427589 -613358 -253564 173843 48577 -588797
34826e88797m41419K10854N20932K33427j71976k25984P6156M48593N53103K15773
$$ -588797 -1030216 -819362 -298430 -65003 -236979 -462963 -386807 61786 614889 830662
34816H30662k89712m22860j01388J39604K44j10565J26788K89822l0958m00060
$$ 830662 540950 118090 16702 156306 156550 45985 172773 462595 431637 31577
34806C1577k14872K46134K67771j54519m19800l07401q5766J25621L51218L46272
$$ 31577 -183295 62839 330610 176091 -243709 -551110 -636876 -511255 -160037 186235
34796A86235n5574l95047j49500L54830L73112q1366k95418M94L26176K76694
$$ 186235 130661 -264386 -413886 -59056 314056 232690 -62728 -62234 263942 540636
$$ [...]
##END NTUPLES=NMR SPECTRUM
##END=
