##TITLE=31Pdec_LR-753-R1-C1OST
 DMSO-d6, 24 sc
 26.7.2022
##JCAMPDX= 6.0         $$ Bruker NMR JCAMP-DX V2.0
##DATA TYPE= NMR SPECTRUM
##DATA CLASS= NTUPLES
##ORIGIN= UXNMR, Bruker Analytische Messtechnik GmbH
##OWNER= root
$$ XWIN-NMR		Version 3.5
$$ Tue Jul 26 16:12:02 2022 Russian Standard Time (UT+4h)  she@DPX200
##.OBSERVE FREQUENCY= 81.013821
##.OBSERVE NUCLEUS= ^31P
##.ACQUISITION MODE= SIMULTANEOUS
##.ACQUISITION SCHEME= undefined
##.AVERAGES= 24
##.DIGITISER RES= 16
##SPECTROMETER/DATA SYSTEM= spect
##.PULSE SEQUENCE= zgpg30
##.SOLVENT NAME= DMSO
##.SHIFT REFERENCE= (INTERNAL, DMSO, 0, 248.564)
##AUDIT TRAIL= $$ (NUMBER, WHEN, WHO, WHERE, WHAT)
$$ ##TITLE= Audit trail, XWIN-NMR		Version 3.5
$$ ##JCAMPDX= 5.01
$$ ##ORIGIN= Bruker BioSpin GmbH
$$ ##OWNER= she
$$ F:/spectra/data/she/nmr/P31/1/pdata/1/auditp.txt
$$ ##AUDIT TRAIL=  $$ (NUMBER, WHEN, WHO, WHERE, WHAT)
(   1,<2022-07-26 16:10:45.03 +0400>,<she>,<DPX200>,
      <created by zg, POWCHK disabled, PULCHK disabled
       configuration hash MD5:
       00 E9 B6 7A A2 85 ED C7 34 08 36 98 17 FE 4E 26
       data hash MD5: 32K
       77 CE B1 22 D2 23 85 D1 FF F1 EE AD 9F F4 F6 A8>)
(   2,<2022-07-26 16:10:47.85 +0400>,<she>,<DPX200>,
      <Start of raw data processing
       efp BC_mod = 2 LB = 1 FT_mod = 6 PKNL = 1 PHC0 = -10216.33 PHC1 = -22.94316 SI = 64K 
       data hash MD5: 64K
       55 9E A2 BA D0 66 AA 12 D8 52 3A AD E2 41 74 42>)
(   3,<2022-07-26 16:11:08.96 +0400>,<she>,<DPX200>,
      <pk PHC0 = -4.578256 PHC1 = 0 
       data hash MD5: 64K
       5D BF 1C F0 E1 F6 AC 80 F6 4E 36 E1 66 35 C5 62>)
(   4,<2022-07-26 16:11:12.17 +0400>,<she>,<DPX200>,
      <abs ABSG = 5 
       data hash MD5: 64K
       C8 C3 51 AB 81 81 E6 21 73 F7 E1 F3 C4 E7 EB D2>)
(   5,<2022-07-26 16:11:22.34 +0400>,<she>,<DPX200>,
      <abs ABSG = 5 
       data hash MD5: 64K
       DF 5C E3 B7 0B 13 CB DB 95 4B 5D 76 A6 06 13 73>)
$$ ##END=
$$ 
$$ hash MD5
$$ 0C E6 C7 8C 83 B9 5E B8 CC 41 0E 8E 55 8B BE 85
##$RELAX= 
##$RELAX= 
##$RELAX= 
##$RELAX= 
##$RELAX= 
##$RELAX= 
##$RELAX= 
##$RELAX= 
$$ Bruker specific parameters
$$ --------------------------
##$DU= <F:/spectra>
##$EXPNO= 1
##$NAME= <P31>
##$PROCNO= 1
##$TYPE= <nmr>
##$USER= <she>
##$AMP= (0..31)
100 100 100 100 100 100 100 100 100 100 100 100 100 100 100 100 100 100 
100 100 100 100 100 100 100 100 100 100 100 100 100 100 
##$AQSEQ= 0
##$AQ_mod= 1
##$AUNM= <au_zg>
##$AUTOPOS= <>
##$BF1= 81.014009
##$BF2= 200.13
##$BF3= 200.13
##$BF4= 200.13
##$BF5= 200.13
##$BF6= 200.13
##$BF7= 200.13
##$BF8= 200.13
##$BYTORDA= 1
##$CFDGTYP= 0
##$CFRGTYP= 5
##$CHEMSTR= <none>
##$CNST= (0..31)
1 1 145 1 1 1 1 1 1 1 1 1 1 1 1 1 1 1 1 1 1 1 1 1 1 1 1 1 1 1 1 1 
##$CPDPRG= <waltz16>
##$CPDPRG1= <>
##$CPDPRG2= <waltz16>
##$CPDPRG3= <>
##$CPDPRG4= <mlev>
##$CPDPRG5= <mlev>
##$CPDPRG6= <mlev>
##$CPDPRG7= <mlev>
##$CPDPRG8= <mlev>
##$CPDPRGB= <>
##$CPDPRGT= <>
##$D= (0..31)
0 1 0 0 0 0 0 0 0 0 0 0.03 2e-05 3e-06 0 0 0 0 0 0 0 0 0 0 0 0 0 0 0 0 
0 0 
$$ [...]
##$SUBNAM3= <"">
##$SUBNAM4= <"">
##$SUBNAM5= <"">
##$SUBNAM6= <"">
##$SUBNAM7= <"">
##$SUBNAM8= <"">
##$SUBNAM9= <"">
##$SW= 501.771253377433
##$SWIBOX= (0..15)
0 1 3 0 0 0 0 0 0 0 0 0 0 0 0 0 
##$SW_h= 40650.406504065
##$TD= 32768
##$TD0= 1
##$TE= 0
##$TE2= 300
##$TE3= 300
##$TEG= 300
##$TL= (0..7)
0 120 53 12 22 120 120 120 
##$TP= (0..7)
150 150 150 150 150 150 150 150 
##$TP07= 0
##$TPNAME0= <>
##$TPNAME1= <>
##$TPNAME2= <>
##$TPNAME3= <>
##$TPNAME4= <>
##$TPNAME5= <>
##$TPNAME6= <>
##$TPNAME7= <>
##$TPOAL= (0..7)
0.5 0.5 0.5 0.5 0.5 0.5 0.5 0.5 
##$TPOFFS= (0..7)
0 0 0 0 0 0 0 0 
##$TUNHIN= 0
##$TUNHOUT= 0
##$TUNXOUT= 0
##$USERA1= <user>
##$USERA2= <user>
##$USERA3= <user>
##$USERA4= <user>
##$USERA5= <user>
##$V9= 5
##$VALIST= <valist>
##$VCLIST= <CCCCCCCCCCCCCCC>
##$VD= 0
##$VDLIST= <DDDDDDDDDDDDDDD>
##$VPLIST= <PPPPPPPPPPPPPPP>
##$VTLIST= <TTTTTTTTTTTTTTT>
##$WBST= 1024
##$WBSW= 4
##$XGAIN= (0..3)
0 0 0 0 
##$XL= 0
##$YL= 0
##$YMAX_a= 3552
##$YMIN_a= -3606
##$ZGOPTNS= <>
##$ZL1= 120
##$ZL2= 120
##$ZL3= 120
##$ZL4= 120
##$ABSF1= 248.5645
##$ABSF2= -253.2056
##$ABSG= 5
##$ABSL= 3
##$ALPHA= 0
##$AQORDER= 0
##$ASSFAC= 0
##$ASSFACI= 0
##$ASSFACX= 0
##$ASSWID= 0
##$AUNMP= <proc_1d>
##$AZFE= 0.1
##$AZFW= 0.5
##$BCFW= 0
##$BC_mod= 2
##$BYTORDP= 0
##$COROFFS= 0
##$CY= -3
##$DATMOD= 1
##$DC= 0
##$DFILT= <>
##$DTYPP= 0
##$F1P= 0
##$F2P= 0
##$FCOR= 1
##$FTSIZE= 65536
##$FT_mod= 6
##$GAMMA= 0
##$GB= 0
##$INTBC= 1
##$INTSCL= 5.30512e-09
##$ISEN= 30
##$LB= 1
##$LEV0= 0
##$LPBIN= 0
##$MAXI= 10000
##$MC2= 0
##$MEAN= 0
##$ME_mod= 0
##$MI= 50
##$NCOEF= 0
##$NC_proc= -7
##$NLEV= 6
##$NOISF1= 182.463
##$NOISF2= 159.3651
##$NSP= 0
##$NTH_PI= 0
##$NZP= 0
##$OFFSET= 248.5645
##$PC= 4
##$PHC0= -10220.91
##$PHC1= -22.94316
##$PH_mod= 1
##$PKNL= yes
##$PPARMOD= 0
##$PSCAL= 0
##$PSIGN= 0
##$REVERSE= no
##$SF= 81.014009
##$SI= 65536
##$SIGF1= 159.3651
##$SIGF2= -187.1042
##$SINO= 113.3802
##$SIOLD= 16384
##$SREGLST= <1H.CDCl3>
##$SSB= 0
##$STSI= 65536
##$STSR= 0
##$SW_p= 40650.406504065
##$SYMM= 0
##$S_DEV= 0
##$TDeff= 32768
##$TDoff= 0
##$TI= <>
##$TILT= no
##$TM1= 0
##$TM2= 0
##$TOPLEV= 0
##$USERP1= <user>
##$USERP2= <user>
##$USERP3= <user>
##$USERP4= <user>
##$USERP5= <user>
##$WDW= 1
##$XDIM= 65536
##$YMAX_p= 488419451
##$YMIN_p= -143446987
$$ End of Bruker specific parameters
$$ ---------------------------------
##NTUPLES= NMR SPECTRUM
##VAR_NAME=  FREQUENCY,     SPECTRUM/REAL,   SPECTRUM/IMAG
##SYMBOL=    X,             R,               I
##VAR_TYPE=  INDEPENDENT,   DEPENDENT,       DEPENDENT
##VAR_FORM=  AFFN,          ASDF,            ASDF
##VAR_DIM=   65536,         65536,           65536
##UNITS=     HZ,            ARBITRARY UNITS, ARBITRARY UNITS
##FACTOR=    0.620285442955139, 1,           1
##FIRST=     20137.2065510759, 0,            0
##LAST=      -20513.1999529892, 0,           0
##MIN=       -20513.1999529892, -143446987,  0
##MAX=       20137.2065510759, 488419451,    0
$$ Real data points
##PAGE= N=1
##DATA TABLE= (X++(R..R)), XYDATA
$$ [...]
41601 225380 -1016633 -500856 1690754 2245789 -175796 -2774436 -2613824 -301517 1633931
41592 1633931 2207355 2312341 2660542 2805671 2021975 445117 -772603 -567631 565169
41583 565169 736103 -1030977 -3181208 -3297145 -1048827 1541930 2570071 2025392 1296279
41574 1296279 1767280 3669772 5557481 5356016 2757463 -33013 -910357 -503182 -966505
41565 -966505 -2809106 -4380926 -4143252 -2129400 525012 2378981 2527331 1693734 1680872
41556 1680872 2704612 2663198 551318 -1241351 -422805 1216144 615040 -1110643 -173682
41547 -173682 3376520 5189865 3317382 1001611 1270420 2718793 2763011 1602883 519047
41538 519047 -707180 -2060006 -1737850 857667 3006262 2427573 921792 1224364 2358357
41529 2358357 1570349 -800573 -2065651 -1610979 -940913 -218826 1451325 2828731 1567664
41520 1567664 -1529721 -3141474 -2713483 -3231948 -5764096 -7129010 -4850751 -1100684
41512 -1100684 688032 541151 690893 1563352 1735139 731805 -559982 -1619290 -2440930
41503 -2440930 -2504556 -1437824 -385902 -1033169 -3268255 -5092387 -4871582 -2804080 -408499
41494 -408499 603328 -607338 -3046308 -4346568 -3208540 -1085525 -460028 -1802585
41486 -1802585 -3359455 -3649552 -2805608 -1392103 694558 3538531 6308696 7747709
41478 7747709 7249102 5218916 2727936 909759 299838 594150 1134407 1365828 687731
41469 687731 -1345534 -3932377 -4919064 -3048860 112927 1861824 1584945 669367 -435011
41460 -435011 -2621936 -5180466 -5239340 -1795303 1923357 2314408 -17465 -1891234 -2261815
41451 -2261815 -2375204 -2270276 -727451 1340145 1192212 -1074305 -1660095 1316043 4354857
41442 4354857 3289127 -796497 -3289215 -2266458 -23693 912059 485379 -165620 -420203
41433 -420203 -252450 -50568 -330054 -568612 855288 4053199 6124747 4521345 973098
41424 973098 -686993 31089 255341 -1011190 -1463382 -106025 587229 -1030359 -2723710
41415 -2723710 -2111542 -600320 -651630 -1491800 -942768 214894 -502615 -2575768 -2941478
41406 -2941478 -1151970 -323438 -2085737 -3935118 -3229767 -1145322 -548709 -1829489 -3163951
41397 -3163951 -3747330 -4286380 -4578084 -2990667 873441 4616059 5466007 3618626 1900623
41388 1900623 2174937 3315819 3298448 2190190 1748641 2469195 2668773 955905 -1675522
41379 -1675522 -3069972 -2430045 -844141 107335 -324693 -1512805 -1797447 -226557 1666773
41370 1666773 1180699 -1649027 -3142622 -600281 3637787 5081782 3118924 1318371
41362 1318371 1832539 2577107 1011430 -1905838 -3414209 -2901560 -2069866 -2016595 -2099175
41353 -2099175 -1523733 -540453 110713 -66931 -1248757 -3101329 -4562721 -4559363 -3170451
41344 -3170451 -1585443 -810830 -881733 -1320556 -1691632 -1547570 -614306 491512 441441
41335 441441 -1110492 -2530989 -2018717 -226736 293962 -1442227 -3435554 -3575939 -2483107
41326 -2483107 -2051633 -2424905 -2499583 -2669511 -4412395 -7029473 -7519520 -4679739 -1033702
41317 -1033702 669240 853544 1416750 2507253 3057818 3139433 3553389 3946487 3369359
41308 3369359 2043161 767452 -591987 -2107292 -2310297 -149804 2309814 1955996
41300 1955996 -822159 -2523144 -1652110 -486411 -1020978 -2090196 -1945545 -1212488 -1373122
41291 -1373122 -2062669 -1841135 -583252 542226 776670 251324 -574266 -1035370 -549383
41282 -549383 468358 775076 -17856 -927142 -1345217 -2062364 -3670309 -5113009 -4911551
41273 -4911551 -2984996 -360389 2091872 3834204 4438000 3958680 2835644 1130647
41265 1130647 -967443 -1772453 682151 5154198 7188625 4368707 -266069 -2158325
41257 -2158325 -982199 124663 -126799 144574 2054084 3738454 3108657 742874 -1220739
41248 -1220739 -1776507 -1487753 -1025979 -369805 617590 1406690 1015684 -682770 -2115766
41239 -2115766 -1459446 766721 1771849 -40473 -2881937 -4006223 -3149996 -2034502
41231 -2034502 -1535888 -1373574 -1898543 -3765999 -5805067 -5536885 -2476481 876220 2126219
41222 2126219 1623427 1246435 1820105 2647424 2717584 1581705 -390984 -2133324 -2752165
41213 -2752165 -2458614 -2024285 -1408451 58108 2057644 3091366 2342072 702031 -539628
41204 -539628 -1072333 -1102159 -497687 800976 2147478 2718741 2367227 1498023 438688
41195 438688 -695774 -1778789 -2585177 -2824147 -2339795 -1501541 -1073580 -1269517 -1406410
41186 -1406410 -1136780 -1378233 -2955165 -4862321 -5297438 -4175607 -3102895 -2921558 -2907691
41177 -2907691 -2496587 -2000260 -1233146 647938 3126885 3972830 2092287 -739954 -2232073
41168 -2232073 -2265503 -1871154 -948785 1078714 3215038 3568804 1887856 -256407 -1729564
41159 -1729564 -2685576 -3096416 -2164991 74109 1850274 1500228 -247551 -817892 1231240
41150 1231240 4310797 5334141 3112784 -282651 -1935522 -1373285 -579062 -961959 -1707952
41141 -1707952 -1644932 -1350970 -2072073 -3241925 -2699890 383804 3924578 4926671 2651073
41132 2651073 -723687 -2458674 -1757163 265136 2441459 4295930 4935367 2906996
41124 2906996 -1526294 -5205189 -5233356 -2813838 -1673530 -2796067 -3404754 -1683031 530015
41115 530015 1227890 1487480 2793765 3562023 1636987 -1265210 -1367900 1349927 2811804
41106 2811804 752680 -2380557 -3531444 -3047530 -2863160 -3104413 -2782128 -2314346 -2967429
41097 -2967429 -4441464 -5020025 -3969335 -2274852 -1038851 -394441 -20104 370663 1143288
41088 1143288 2372224 3228621 2675536 1016366 -171697 -85922 198282 -598179 -1902984
41079 -1902984 -2025625 -655669 686702 942074 928258 1661456 2412662 1818336 278060
41070 278060 -402944 341069 1139399 818816 -294210 -1495521 -2447837 -2332326 -260183
41061 -260183 2480771 2759122 -99331 -2350115 -640581 2761524 2726834 -1405123 -4785501
41052 -4785501 -3842665 -786536 257365 -983061 -1435441 382193 2466330 2395733 538346
41043 538346 -609299 312491 1721848 959649 -2241971 -5022230 -4644162 -1682151 956496
41034 956496 1480831 470536 -694849 -1090258 -223533 1577375 2750782 1990485 168292
41025 168292 -672847 -71569 776213 1408854 2389183 3170491 2186825 -304032 -1846933
41016 -1846933 -1161901 320371 1205276 1999133 2975097 2668684 305728 -2385517 -3710770
41007 -3710770 -4435136 -5710897 -6536530 -5578208 -3807847 -2856728 -2238897 -792979 475449
40998 475449 -193990 -2096183 -3082563 -2996855 -3292379 -3973322 -3904601 -3621975 -4646954 -6201771
40988 -6201771 -5879132 -3780687 -2751776 -3905154 -4973447 -4001082 -1859166 -74740
40980 -74740 1163859 1694849 682425 -1371778 -2230337 -1004327 397383 250810 -546343
40971 -546343 -368327 754405 1990936 3041126 3329382 1892680 -586446 -1774330 -1110282
40962 -1110282 -841421 -2022043 -2282498 69518 2517845 2077643 256444 561102 2730395
40953 2730395 3515435 2237379 1368146 1817101 1730185 339953 -821264 -1244119 -2247584
40944 -2247584 -3429119 -2084868 2153091 5641497 5895202 5156979 6040534 6685445 4068363
40935 4068363 51661 -400642 3462578 6898096 6345486 3674862 2220733 1700315 -301630
40926 -301630 -3585383 -5095439 -3249169 -161365 1167306 397757 -458804 -117312 445216
40917 445216 -399704 -2646484 -4522611 -4366953 -2189662 567139 2390705 2723009 2055589
40908 2055589 1406286 1614259 2757546 4024658 4262181 2937215 734614 -903271 -1022381
40899 -1022381 80600 1429868 2450744 3129374 3393880 3096372 2630643 2662453 2906973
40890 2906973 2111621 -79297 -2081888 -2133136 -505720 994313 1202587 247946 -1322681
40881 -1322681 -2687008 -2527102 -444003 1524827 789822 -2044581 -3372385 -1343777
40873 -1343777 1603424 2319081 1154940 616401 1232028 1307843 236094 -534664 -83465
40864 -83465 604262 481203 -109866 -582144 -1120478 -1675532 -1451898 -522624 -547185 -2372821
40854 -2372821 -4011384 -2856577 596159 3075504 2504818 -5092 -2242940 -3288217
40846 -3288217 -3343133 -2764056 -2141969 -2159656 -2492120 -1906481 -289707 644632 -214181 -1522840
40836 -1522840 -1624026 -1362071 -2604552 -4648086 -4705343 -2098444 563795 1089133 263548
40827 263548 -313764 -678759 -1255617 -1216530 -99611 560641 -529158 -1825497 -1002900
40818 -1002900 1389273 2917407 3133300 3521000 3976286 2697185 -44194 -1442020 -599248
40809 -599248 -207777 -2036568 -3751964 -2741585 -619858 -777186 -3074685 -4339863 -3305443
40800 -3305443 -1724677 -755530 520122 2462955 3665658 3393257 2835082 2758116 2118024
40791 2118024 456324 -376896 1118014 3235637 3193219 1277292 454932 1972100 3630465
40782 3630465 3038781 713375 -1134937 -1570445 -1335742 -1057206 -539145 242163 697890
40773 697890 520659 133497 -189789 -905742 -2309555 -3667973 -4013529 -3427569 -2740979
40764 -2740979 -2280518 -1861542 -1777885 -2512384 -3319949 -2518717 162086 2753639 3450025
40755 3450025 2740292 2098411 1722479 1118021 946372 2136563 3454237 2349579 -1205574
40746 -1205574 -3848465 -2971881 -112111 1308029 437428 -597500 -177683 821653 811662
40737 811662 -145892 -520023 724377 2885696 4127899 3282578 1245842 330945 1732118
40728 1732118 3863752 4010164 1655889 -742268 -702400 1397151 3112883 2991419 1769983
40719 1769983 747643 206236 -191237 -505140 -755063 -1243738 -1759976 -1194867 827951
40710 827951 2493620 1631552 -1030605 -2309227 -794384 1240944 1282449 158950 353569
40701 353569 1975415 2739158 1562497 -75325 -608542 -312980 -203863 -530311 -1007298
40692 -1007298 -1359420 -1177173 -374561 -40450 -1391599 -3480397 -3645480 -1061972 1823713
40683 1823713 2555459 1766781 1458394 1595693 607336 -1367894 -2071160 -303179 2197137
40674 2197137 2810827 1014086 -1345579 -2208842 -1242064 201261 755868 443228 159170
40665 159170 131848 -156548 -466699 419609 2691949 4493067 4059183 2034935 474406
40656 474406 239352 593274 700991 172042 -1352246 -3708327 -5651592 -6145617 -5857002
40647 -5857002 -5997830 -6163808 -5027334 -2893395 -1620130 -1894169 -2489875 -2564683 -2761078
40638 -2761078 -3381575 -3330671 -1932022 -334642 48848 -578399 -1072444 -941834 -392706
40629 -392706 269576 446577 -570355 -2330336 -3090744 -1938360 -190286 310985 -527295
40620 -527295 -1511613 -2035653 -2193708 -1640183 199356 2871180 4948785 5386810 4161354
40611 4161354 1892662 -355215 -1272393 -328126 1470722 2620364 2735589 2371698 1628930
40602 1628930 125384 -1656329 -2314639 -1386384 -315363 -729316 -2251690 -2964312 -2007789
40593 -2007789 -790352 -1072777 -2492218 -3042907 -1959795 -811047 -1044464 -1669385 -767344
40584 -767344 1434843 2748370 2066332 435274 -1017036 -2323568 -3369354 -3283601 -2089898
40575 -2089898 -1283320 -1649692 -2031758 -1404870 -567541 -411491 -208747 650214 878755
40566 878755 -556596 -1944230 -1086897 999253 1532373 435725 133607 994593 525728
40557 525728 -2047653 -3767091 -2258252 618264 1630671 699550 178786 1004814 2047323
40548 2047323 2573714 2978173 3159511 2232395 228090 -1449513 -1768328 -1180755 -641795
40539 -641795 -548855 -1082670 -2554629 -4600490 -5714575 -4646803 -2172425 -555173 -929587
40530 -929587 -1895164 -1320949 877486 2636248 2375849 769773 -466635 -639871 -260312
40521 -260312 57564 -55697 -918638 -2291053 -3038144 -2384089 -1214007 -944146 -1318977
40512 -1318977 -755926 1060027 2471149 2175708 828068 -374233 -1353889 -2427212 -3081334
40503 -3081334 -2764664 -2133053 -2152524 -2396244 -1620142 49644 874808 -149668 -1756560
40494 -1756560 -1922899 -333890 1412685 1785378 735153 -863048 -2308243 -3090071 -2496607
40485 -2496607 -254485 2522027 4080996 4050240 3798446 4338454 4844398 4017790 2074264
40476 2074264 371053 -316572 -123132 725495 1898639 2533106 1995955 854949 145878
40467 145878 108502 598244 1905135 3672355 3864748 1009862 -2814183 -3670491 -825231
40458 -825231 2161759 2207019 462570 72318 1882916 3965044 4425396 3310242 2082263
40449 2082263 1932776 2387411 1689058 -701516 -2581420 -1603282 1077069 2152735 1161290
40440 1161290 1074402 3039944 3911891 1099744 -3034413 -4514633 -3302066 -2210272 -1808390
40431 -1808390 -158503 2835260 4507765 3484649 1711261 1363479 2027259 2255830 2189223
40422 2189223 3063828 4999826 6582696 6444248 4612857 2417368 1342447 1862945 3267393
40413 3267393 4510655 4961026 4448776 3309060 2481430 2662974 3142660 2565946 1137604
40404 1137604 627729 1620051 2430414 1725587 473721 -26095 -284314 -1090076 -1518966
40395 -1518966 -529291 889111 1359444 1542745 2521254 3147649 1868569 78950 441276
40386 441276 2572814 3778742 3608368 3982955 4872000 3959300 1317159 260200 2052421
40377 2052421 3647282 2731465 1310528 1583238 1699933 -746304 -3601100 -2758961 1416000
40368 1416000 4321081 3353342 327626 -2299356 -4049332 -4613213 -2835615 806178
40360 806178 3164757 1933277 -1199616 -2636729 -1141721 1494639 3244439 3651077
40352 3651077 3176806 2267848 1249991 224476 -900062 -1527016 -132969 3554664 6504020
40343 6504020 4871042 -758170 -5051089 -4475391 -1876143 -1952699 -4172701 -4078024 -823632
40334 -823632 1297430 -239565 -2289813 -1373426 895734 1010691 -670538 -1226267 -424480
40325 -424480 -741562 -2931537 -4985682 -5144988 -3255853 88203 3089877 2756986 -1291198
40316 -1291198 -4335613 -1946336 3092256 4003163 -163828 -3352478 -1878325 748421
40308 748421 513753 -987898 -595679 646166 -29092 -1963043 -2625720 -2127050 -2197048
40299 -2197048 -2280670 -499003 2477198 3992171 3305796 2013836 1105045 301336 -115973
40290 -115973 600382 1916338 2466226 1996640 1166484 84825 -1197819 -1639596 -581258
40281 -581258 733319 946294 816240 1538168 2080063 804021 -1247504 -1600898 -323307
40272 -323307 187202 -855516 -1788039 -1679592 -1592116 -2294137 -3160232 -3739857 -4191159 -3905138
40262 -3905138 -2008231 464953 1275394 296810 -209352 867881 2109577 2399946 2568839
40253 2568839 3097499 2654478 533581 -1466732 -1448305 -205553 193939 -513864 -912468
40244 -912468 -333700 553061 1219459 1810314 2173150 1630092 158416 -1006323 -672570
40235 -672570 587310 823275 -712690 -2117520 -1248439 744224 378259 -3031992 -5584962
40226 -5584962 -3878475 185459 2223576 1389443 392626 501149 255822 -831250 -1030992
40217 -1030992 263197 1222774 880390 796712 1938614 2690699 1851153 1083634 2141806
40208 2141806 3705742 3359699 1125857 -1247291 -3113394 -4740544 -5507572 -4694518 -3237004
40199 -3237004 -2462491 -1839288 -200823 1570404 1628324 523498 767644 2881091 4441085
40190 4441085 3699357 1871195 876615 792734 791655 961242 1643269 2037268 1064301 -810229
40180 -810229 -1847232 -985346 1254446 3528401 4609065 3910651 1963790 308040 170090
40171 170090 1160648 1778110 1143070 -314454 -1762898 -2764430 -3042269 -2326867 -924788
40162 -924788 202366 506166 456572 445371 -287077 -2602632 -5696597 -7635849 -7718592
40153 -7718592 -7062682 -6546231 -5490019 -3168624 -543667 664791 109673 -979874 -1448495
40144 -1448495 -1257241 -1043774 -1281624 -1812463 -1917721 -1125970 -56778 147691 -648266
40135 -648266 -1525125 -2160976 -3171306 -4265433 -3794644 -1386573 592327 32171 -1739381
40126 -1739381 -1949861 -602042 -93983 -941134 -704266 2141500 5539245 6256698 3592659
40117 3592659 -301911 -2905653 -3460429 -3234955 -3943962 -5523922 -5925411 -3891798 -1100053
40108 -1100053 -126401 -1060241 -1962970 -1997496 -1817501 -1293016 403533 2351032 2405889
40099 2405889 749824 29738 1010585 1088639 -1284732 -3552596 -2707019 241702 1998693
40090 1998693 1520801 218712 -1114707 -2816517 -4390064 -4596007 -3498174 -2414936
40082 -2414936 -1770994 -731554 901540 2029084 1863292 1001058 491849 660825 1158653
40073 1158653 1639635 2175883 3103553 4232643 4314616 2228514 -982500 -2456475 -778540
40064 -778540 2036029 2869025 1089076 -1228817 -2042297 -1181617 133660 563881 -386874
40055 -386874 -1922208 -2650370 -2180020 -1594992 -1979267 -3149643 -4258707 -4745996 -4120475
40046 -4120475 -1899757 1263658 3302475 2772111 700320 -538697 151275 1755036
40038 1755036 2498660 1493745 -515176 -1728770 -1182476 -47703 -83541 -1003609 -1046422
40029 -1046422 -212970 -658877 -3141137 -5515869 -6119921 -6240541 -7277533 -7664956 -5215582
40020 -5215582 -965025 2057214 2845493 2608797 1865251 166229 -1715416 -2105442 -1030802
40011 -1030802 -175471 -124028 172105 1026405 1326922 701662 444973 1550569 3224704
40002 3224704 3970372 3178631 1419977 -8169 9131 1045226 1160247 -633508 -2647107
39993 -2647107 -2624623 -794223 827009 1388795 1530916 1426456 731300 125292 607212
39984 607212 1348605 512675 -1668468 -2787120 -1504567 1022950 3174051 4462116 4921396
39975 4921396 4680748 4344328 4293845 3817265 2442726 1347554 1393300 836374 -2177992
39966 -2177992 -5772545 -6504790 -4841336 -4392695 -5684983 -5327810 -2277411 -64082 -843962
39957 -843962 -1851016 -529030 1023690 162658 -1471451 -1225450 -445434 -1782952 -3865897
39948 -3865897 -3402573 -1078255 -567999 -2397262 -3422564 -2406752 -1726065 -2847598 -4002236
39939 -4002236 -3557337 -2467917 -1962988 -1435834 -89134 1403173 2147946 2248596 1835707
39930 1835707 556667 -1109705 -1678752 -749571 145831 -329527 -1555586 -2080795 -1440002
39921 -1440002 -231650 702051 802641 341066 416240 1423427 1975155 876024 -395234
39912 -395234 559721 2977175 3346414 469815 -2631479 -2991214 -1329065 48005 517324
39903 517324 426299 -637408 -2505555 -3175447 -1497366 295701 -468524 -2459860 -1905152
39894 -1905152 1796778 5102144 5298051 3659707 2711340 2664199 2067911 592667 -343311
39885 -343311 658222 3241274 5228613 4577299 1922019 342687 1450449 2824201
39877 2824201 1383320 -1668713 -2318820 32395 1515125 -53058 -1746098 -533522
39869 -533522 1588012 807547 -2431919 -4387377 -3756372 -2558346 -1780306 -178541 2071509
39860 2071509 2346328 -266529 -2798451 -2425600 -450239 -44077 -1557358 -2443786 -1203944
39851 -1203944 690596 950678 -774878 -2680835 -2788642 -936501 1172093 1968472 1663249
39842 1663249 1351778 1154817 517595 -115791 259634 1123564 825396 -557868 -947661
39833 -947661 340646 1163974 -180248 -2325570 -3161627 -2945706 -3101896 -3480499 -3081481
39824 -3081481 -2337265 -2277328 -2180458 -474307 2351104 3988383 3527441 2523594 2618242
39815 2618242 3595818 4061499 2996048 658623 -1280277 -982726 1384030 3542739 3981287
39806 3981287 3571640 3228381 1986508 -544897 -1922135 -159540 2246105 1305404 -2252937
39797 -2252937 -3797586 -1726190 642863 818087 541236 1746162 2837465 1525754
39789 1525754 -1272803 -2903223 -2540603 -1263328 -89025 421761 70433 -175838 1107084
39780 1107084 3290969 3942315 2594453 1690703 2348655 2222463 -156647 -1952110 -168624
39771 -168624 3181443 3838378 1579008 -241695 -423820 -982924 -2607836 -3198380 -1803898
39762 -1803898 -518560 -1030547 -2045135 -1739380 -612666 -248793 -867627 -1652158 -2309340
39753 -2309340 -2926408 -3133412 -2564385 -1566210 -645609 189458 881473 769280 -647303
39744 -647303 -2701835 -3863630 -3029199 -585188 1515465 1133659 -1792513 -4621021 -4667371
39735 -4667371 -2346973 -465771 -501512 -1255856 -1547563 -2231301 -4213039 -6055627 -5613152
39726 -5613152 -3334449 -1774724 -1858516 -1817994 -475622 635033 43386 -515287 1669418
39717 1669418 5533879 6706926 3420045 -682181 -1249925 1285480 3076321 2253984
39709 2253984 390289 -739461 -1207102 -1669563 -2255754 -3018696 -3741972 -3297791 -1089879
39700 -1089879 1022275 542028 -1906665 -3256435 -2674580 -2525148 -3885820 -4442933 -2507614
39691 -2507614 -79179 327385 -650606 -1142221 -1351574 -2318452 -3285636 -2992643 -2032507
39682 -2032507 -1453880 -661634 801618 1230286 -640808 -2776224 -2688255 -1436449 -1378463
39673 -1378463 -1646787 103623 2753187 3032088 1101473 194616 907171 671088 -775736
39664 -775736 -470397 2095682 3288992 1167225 -1483650 -2108204 -2035484 -2552686 -1591152
39655 -1591152 2174560 5466714 4589706 835634 -2025403 -3230682 -4086361 -3788647 -757126
39646 -757126 3157166 4433754 3411463 3674984 5827579 6263033 3149249 -347541 -688368
39637 -688368 1281448 2411060 1766776 687475 -106056 -952444 -1487816 -738866 889691
39628 889691 1500212 260466 -1095017 -364598 2034158 3315930 1885332 -546939 -1333418
39619 -1333418 -440294 -15269 -780820 -986899 498735 2164644 2289840 1745977 2499152
39610 2499152 4366845 5305169 4446466 2893485 1562209 89236 -1732557 -2967768
39602 -2967768 -2715222 -1313918 251018 1493712 2446155 2958224 2528255 932079 -1055785
39593 -1055785 -1862197 -576921 1782606 3222925 3174190 2979583 3609395 4131519 3341707
39584 3341707 1740171 592674 -47318 -828573 -1253296 -121902 2250620 3857106 3368135
39575 3368135 1581271 234386 206597 1041361 1572139 982751 -273733 -861298 -273943
39566 -273943 510186 717921 1098346 2391310 3477220 2704585 425846 -1544223 -2537421
39557 -2537421 -3239325 -3650639 -2969158 -1537723 -817725 -1125429 -1317378 -977836 -860472
39548 -860472 -845122 171301 1654749 1222521 -1713245 -4421681 -4572596 -3379468 -3157514
39539 -3157514 -3658566 -3103556 -1436431 -185797 -20834 -542835 -1647736 -3112272 -3765191
39530 -3765191 -3129801 -2851830 -4203329 -5327199 -3803538 -970451 -206572 -1373180 -1006462
39521 -1006462 1574716 2749944 736107 -989879 828001 3820838 3683734 786795
39513 786795 -903638 -59291 868351 166044 -1241888 -2437454 -3556923 -3726735 -1272516
39504 -1272516 2996342 5622343 4944485 3225673 2987942 3644734 3456570 2593659 2120837
39495 2120837 1655882 327702 -1114304 -1325594 -667907 -501360 -871437 -831082 -520987
39486 -520987 -996119 -2261671 -3210490 -3309979 -2843319 -1867797 -526503 103369 -684794
39477 -684794 -1488581 -420446 1779802 2538146 1370696 519574 1208565 1835992 937693
39468 937693 -403048 -609818 -148762 -281095 -767218 -598982 67909 407167 536527
39459 536527 1108965 1949730 2460478 2724773 2913349 2327211 503018 -1340050 -1572384
39450 -1572384 -540006 -84592 -765739 -1128343 -40648 1509880 1560410 -528084 -3292067
39441 -3292067 -4437407 -2961041 -236638 1343601 985702 63550 -148764 -70533 -383187
39432 -383187 -461063 307450 838160 -89808 -1429828 -1221223 122059 315019 -1033703
39423 -1033703 -1800183 -1052679 -661910 -1829586 -2434887 -73850 3810420 5384373 3412636
39414 3412636 446177 -988619 -1234541 -1900285 -3199502 -4133811 -4273826 -3940841 -3036566
39405 -3036566 -1111716 1246907 2409868 1832260 1244354 2572438 5153618 6364047
39397 6364047 4975139 2481765 786017 29907 -551453 -1047334 -1266836 -1494012 -1525299
39388 -1525299 -151725 2693865 4356396 2296755 -1997436 -4359878 -3161296 -736044
39380 -736044 629050 1359102 2275966 2365309 769116 -1005084 -1107307 -242278 -329831
39371 -329831 -1244019 -1236996 -147408 179614 -1180576 -2935502 -3718614 -3843024 -4189320
39362 -4189320 -4686098 -4755948 -4301038 -3434086 -2001448 -183401 1048873 976700 310594
39353 310594 461571 1686786 2711611 2369262 998686 -155442 -461049 -243447 104705
39344 104705 526866 701505 -43215 -1606468 -2612620 -1925779 -235641 832547 845722
39335 845722 669784 722957 587642 432924 1168765 2639006 3209987 1977925 -44807
39326 -44807 -1849325 -3882036 -6162605 -6592310 -3390508 1589840 4308338 3187795 418390
39317 418390 -1284698 -1244288 -17931 1827423 3397980 3660960 2890093 2602480 3272313
39308 3272313 3470424 2199190 709140 717220 1887766 2532727 2100195 1484786 1264993
39299 1264993 1100187 799066 595152 118901 -1633275 -4638489 -7004171 -6661306 -3642424
39290 -3642424 -60016 2062630 2386925 1726091 686409 -608573 -1863693 -2547459 -2582866
39281 -2582866 -2399963 -2121260 -1507588 -1021858 -1805544 -3733492 -4639004 -2973246 -427390
39272 -427390 57079 -1445986 -1912264 -45479 1632737 671092 -1509595 -1807100 -38557
39263 -38557 1117699 280753 -960637 -876813 -99444 -335084 -1801822 -2988396 -2433179
39254 -2433179 -96760 2640941 3915278 2745445 -17769 -2355121 -3091114 -3000815 -3433184
39245 -3433184 -4062391 -2936024 726002 4540942 5069863 2027972 -990140 -822340 1430575
39236 1430575 2271965 527006 -1821643 -3065674 -3545744 -3634874 -2550708 -439187 557395
39227 557395 -894028 -3080434 -3661381 -2897141 -2467490 -2407338 -1619947 -501135 -389149
39218 -389149 -788294 230837 2821921 5017159 5868723 6549036 7769787 8427531 7765978
39209 7765978 6898193 7051563 7886012 8538597 8843388 8617604 7346805 5684585 5698763
39200 5698763 8194047 10975486 11236024 8839457 5975414 4339243 3950392 4183416 4614768
39191 4614768 4904519 4706033 3810864 2202609 272885 -1043091 -1038271 -183062 455294
39182 455294 604241 627607 362584 -423758 -823449 -49057 359656 -1725029 -4853825
39173 -4853825 -4863819 -1051518 1939103 513913 -2745653 -3302426 -1367767 -695608 -2368213
39164 -2368213 -3725992 -2879567 -799005 1009399 1995483 1796512 568831 -111123 849089
39155 849089 1727486 299293 -2079548 -1941764 951628 3269468 3313920 2845081 3048831
39146 3048831 2650994 1480981 2007999 5025642 7204222 5818229 3122664 2775089 4121710
39137 4121710 3722762 1204647 -283130 784090 2155672 1439649 -742501 -2209557
39129 -2209557 -1968773 -563128 994012 1801704 1529461 906397 1025865 1806233 1969406
39120 1969406 952660 -95834 -21643 344987 -832892 -3404771 -4558076 -2109121 2293334
39111 2293334 4732377 3718588 1652276 1069151 1303984 349650 -1516931 -2214704 -1267589
39102 -1267589 -410407 -803434 -1630601 -1707171 -863543 366716 965717 -374554 -3480315
39093 -3480315 -5542344 -4022508 -491298 1027588 -510600 -2329521 -2543004 -2209767
39085 -2209767 -1988350 -673279 1307447 825396 -3031289 -6437738 -6181395 -4338630 -4174311
39076 -4174311 -4397232 -1835423 2373288 4153206 3012873 2464591 4108950 5648953
39068 5648953 5202176 3701779 2285700 795324 -246966 591041 2848253 4074723
39060 4074723 3584229 3426265 4454145 4421588 1761079 -1318677 -1685696 567161 2814024
39051 2814024 3347286 2352979 589119 -1162688 -2004987 -1656501 -892793 -505576 -403075
39042 -403075 -149544 518570 2026401 4564567 6928541 7182734 5125213 2703157 1363526
39033 1363526 583813 -217067 -237398 876376 1510327 286530 -1422302 -1234863 663502
39024 663502 1728300 691447 -833755 -704052 1176421 3166634 3855426 3168471 2089577
39015 2089577 1800043 2808834 4454396 5255255 4129606 1534971 -823429 -1804541 -2079467
39006 -2079467 -2858993 -3719304 -3140466 -1326032 -449501 -1188835 -1378029 21177 98689
38997 98689 -3622151 -7845248 -6967230 -1384338 2461238 1122275 -1563040 -1236559 470168
38988 470168 -336354 -3020969 -3736292 -1676292 271078 448190 187346 544408 558329
38979 558329 -481954 -1529875 -1522442 -919481 -674374 -869853 -1012204 -909626 -905216 -1577368
38969 -1577368 -2943756 -3672641 -2032881 1608147 4388890 4235364 2408656 1376178
38961 1376178 1407952 1172186 563872 523421 703991 -63619 -1168981 -744032 957591
38952 957591 1338556 -585020 -2358850 -1470070 1290485 3241216 3209723 2118107 1118213
38943 1118213 478312 -83050 -840229 -1644981 -1759916 -546465 1589783 3574624 4907256
38934 4907256 5637462 5330852 3501372 1214893 546473 1735322 2468761 1104892 -773493
38925 -773493 -554555 1572043 2812888 1662444 -83731 153896 2241039 3402060 1680210
38916 1680210 -1561199 -3237450 -2291915 -790239 -943043 -2219000 -2531330 -1429438 -396308
38907 -396308 -162384 400033 2178407 4197123 5031874 4732029 4343591 4333052 4445264
38898 4445264 4507903 4445649 3930277 2863239 1885811 1630188 1685238 1044593 -481278 -1907853
38888 -1907853 -2186975 -1274151 -21449 736797 871006 748197 449495 -415048 -1829200
38879 -1829200 -2827436 -2613240 -1936374 -2276838 -3595195 -4091821 -2647952 -371264 1027058
38870 1027058 1332573 1202876 338094 -2035954 -4986024 -5994191 -4110484 -1712452 -1734684
38861 -1734684 -3800605 -4902187 -4019105 -3867635 -6616826 -9678590 -8537945 -3281090
38853 -3281090 894358 485798 -2024803 -2449312 -700268 436153 202267 -7889 -263943
38844 -263943 -1951796 -4191157 -4203060 -1813627 -42971 -237918 -149454 1632737 2842310
38835 2842310 1435978 -722577 -976583 -298453 -1414532 -4179957 -6003411 -5798254 -4579962
38826 -4579962 -2999289 -1140194 -67658 -670079 -1433475 -301971 1543157 907717 -2284170
38817 -2284170 -4349570 -3147083 -1004491 -973385 -2721511 -3963202 -4019656 -3880368 -3886806
38808 -3886806 -3313063 -1836844 -17284 1587844 2889174 3878740 4253975 3438704 1057138
38799 1057138 -2227069 -4573827 -4452413 -2300810 -49813 943344 853530 549018 635805
38790 635805 1159040 1493217 817173 -612894 -1262502 -243667 1363576 2125446 2094480
38781 2094480 1734404 484850 -1609110 -2356748 -302552 1983433 823651 -2969738
38773 -2969738 -5016590 -3666928 -1478768 -242686 1094173 2614499 2134774 -403945
38765 -403945 -1532036 321490 2007823 1110068 253132 2386212 5335890 5338423 3178189
38756 3178189 2270426 2807981 2426390 1029460 349470 -27815 -1655858 -3314763 -2708296
38747 -2708296 -1155663 -1735554 -3421949 -2372585 1031971 2095857 -455292 -2252263
38739 -2252263 -453040 2112519 2278295 1234517 1079692 949443 -246910 -909350 165224
38730 165224 1029543 150401 -405385 1213448 2679240 1288511 -872441 8418 3090906
38721 3090906 4185272 2409555 1013821 1807004 3038845 3323029 3825918 5325667 6108888
38712 6108888 4431265 1178657 -1273822 -1733754 -935246 -377963 -757980 -1156958 -179253
38703 -179253 1740987 2395310 1033063 -198517 338959 825440 -1069970 -3873012 -4142189
38694 -4142189 -1743059 194809 365629 712247 2235306 2900487 1160911 -1260485 -1957253
38685 -1957253 -1178604 -757773 -1144868 -1246214 -427885 660933 967882 128363 -1059591
38676 -1059591 -1307933 -514256 -155635 -950369 -1118207 1088890 3938380 3991734 1076109
38667 1076109 -1582342 -2442550 -3364885 -5184389 -5327868 -2208926 1127698 969949 -1555829
38658 -1555829 -2341979 -338358 1707758 1933992 1406199 1364928 1501313 1678570 2722711
38649 2722711 4350764 4447080 1854739 -1608309 -3315588 -2908921 -1925746 -1332993 -960228
38640 -960228 -869501 -1644664 -3110155 -3988523 -3425381 -2188998 -1765209 -2546894 -3368428
38631 -3368428 -2778653 -572591 1873762 2762461 1619820 -61076 -358514 719421 1087578
38622 1087578 -642014 -2981396 -3314900 -1436411 218357 66877 -572938 210753 2008421
38613 2008421 2868039 2116008 931120 503459 879976 1418521 1333235 40681 -2009898
38604 -2009898 -3084111 -1758827 1337506 4128692 5085387 3953483 1324733 -1367997
38596 -1367997 -2259723 -1007510 266760 -345511 -1522354 -418612 2960551 5500721
38588 5500721 5284330 3716945 2687817 1989878 787432 -392874 -780157 -1001085 -1890824
38579 -1890824 -2610029 -1565441 1226175 3924269 4831624 3839083 2176494 1204659 1155883
38570 1155883 927516 -395181 -2014421 -2386192 -1513129 -855354 -897899 -492889 970997
38561 970997 2499091 3281076 3819150 4362088 3955233 2286846 927459 1279634 2554881
38552 2554881 3221776 3305547 3736638 4409390 4450921 3680825 2430647 675478 -1291978
38543 -1291978 -2095829 -674203 2068020 4248726 5054602 4652805 2959168 102247 -2441840
38534 -2441840 -2890483 -1277984 693866 1763312 1999560 1918501 1869255 2099549 2426364
38525 2426364 2064213 614267 -1170629 -2375518 -3034039 -3383211 -2893689 -1273702 348476
38516 348476 700974 261084 415552 1221435 1534943 1012932 415599 99107 -295728 -738139
38506 -738139 -779942 -540935 -410435 18178 1266307 2451533 2155191 845171 638336
38497 638336 2240047 3770063 3337213 1462829 177745 706029 2642458 4509984 4651432
38488 4651432 2559994 -103636 -770151 1077710 3021838 2542752 68384 -1650882
38480 -1650882 -794250 1741633 3688680 3837676 2941558 2565194 3339823 4399742 4413376
38471 4413376 2943904 747592 -984714 -1507110 -940323 -116849 149473 -166448 -418761
38462 -418761 -232819 6835 -259398 -1033680 -1739803 -1667728 -541614 915559 1240875
38453 1240875 -187836 -2021574 -2329804 -955028 623183 1504556 1899760 1575976 -161367
38444 -161367 -2508422 -3368909 -2422301 -1879889 -2994954 -3945085 -2741047 -213657 1723979
38435 1723979 2822686 3412881 2586027 110883 -1515460 8596 2952207 3677545 1642909
38426 1642909 -868635 -3024225 -5598857 -7257624 -5119238 80902 3487023 2541927
38418 2541927 431879 908439 2767964 2414806 -354982 -2506417 -2524740 -1747978 -1211936
38409 -1211936 -191247 1453962 1929309 -35395 -2793218 -3482165 -1603028 550532
38401 550532 1033158 411646 208980 493346 342960 -91586 225964 1157128 1416465 909762
38391 909762 1078862 2318834 3113167 2690744 2380732 2964468 2915463 1164091 -498568
38382 -498568 -146272 973926 512534 -1158265 -2034414 -1994264 -2123299 -1764455 311436
38373 311436 2731645 3233701 2867743 4388323 6748473 5875157 1591181 -1038274 954790
38364 954790 4081790 3938337 1422342 220560 901345 1131107 145558 -436521 312793
38355 312793 1440336 1883492 1461993 151542 -2045569 -4352386 -5429414 -4622023 -2597383
38346 -2597383 -738901 29269 -778 66577 208752 -533910 -1952755 -2041777 2321
38337 2321 1679229 422766 -2297327 -3009501 -1467260 -446905 -786979 -453516 1230132
38328 1230132 2304797 1898987 1551847 1856948 1464797 526460 1208661 3288227 3314358
38319 3314358 199176 -2361795 -1524192 544322 951639 578368 847691 -136484 -3851740
38310 -3851740 -6927483 -5432778 -1422298 -167940 -2304064 -3785164 -2886450 -2085163
38302 -2085163 -2761146 -2887903 -1247385 55843 -873428 -2609896 -2761555 -1461421 -775345
38293 -775345 -1784717 -3562407 -4497942 -3897225 -2431357 -1162768 -277117 608041 1051403
38284 1051403 179317 -1237167 -1052561 1027543 2565719 2015930 1077598 1756414 3170975
38275 3170975 3286762 1948778 199175 -1475454 -2234945 -567963 2712738 3706532 693012
38266 693012 -2288900 -788841 3261874 4351819 1475834 -1169656 -907999 491023
38258 491023 708550 -229613 -1402156 -2124653 -1425953 788596 2320348 1240521 -875783
38249 -875783 -1387284 -1043496 -2126090 -3420616 -1983826 689426 -63716 -4191935 -6165500
38240 -6165500 -3588966 -892749 -1945424 -4227470 -3759610 -1415537 -383359 -755617
38232 -755617 -654735 -176367 -448285 -795995 -294240 -315021 -2156301 -3765707 -2358465
38223 -2358465 810796 1748591 -735756 -3839131 -4853104 -3708273 -1533716 716488
38215 716488 1873611 971843 -1294876 -2942778 -2882529 -1695313 -314361 826738 1302665
38206 1302665 619170 -941745 -2138549 -1875905 -356225 892138 240108 -2349588 -4885285
38197 -4885285 -5227182 -3371169 -1120471 272152 944375 1066564 316739 -907449 -1350521
38188 -1350521 -624514 320470 1041978 2418509 4856172 7134313 7902165 7003759 4637786
38179 4637786 877577 -2978788 -4395787 -2511544 279074 1242801 677833 740537 1925166
38170 1925166 2624890 1750629 62576 -1081627 -1065261 -154011 698452 302030 -1599122
38161 -1599122 -3662826 -4210450 -3115972 -1825041 -1532304 -1916809 -1871072 -1170714 -971434
38152 -971434 -2284243 -4221669 -4782001 -3682404 -2996693 -3942170 -4616050 -2869844 -101815
38143 -101815 594129 -626702 -568895 1709079 3291373 2116322 36477 -479094 209404
38134 209404 817515 1822454 3683801 4588482 2934431 494353 43604 952205 405716
38125 405716 -1519269 -1550609 1444045 4042095 2899300 -369576 -1233687 1706307 5008007
38116 5008007 5093550 2800449 1694866 2764588 3205900 1067792 -1414959 -1207636 673334
38107 673334 828878 -890774 -1191406 958494 2393888 1008088 -737118 -62873 1437067
38098 1437067 681328 -1485629 -1562727 978493 3106114 3169234 2911256 3766747 4190587
38089 4190587 2346139 -619739 -2072176 -1663326 -1536735 -2773530 -3529769 -1833936 926648
38080 926648 1307536 -1362383 -3651386 -2679978 -61915 910110 300847 685876 2233462
38071 2233462 2369600 468602 -895745 -282097 648642 847224 1861696 4048433 4400402
38062 4400402 1117408 -2618601 -2859400 -605322 258993 -1036856 -1960869 -1327153 -397295
38053 -397295 129121 754173 945629 -520798 -2736647 -3024187 -650241 2122190 3107507
38044 3107507 2293917 612062 -1345098 -2902648 -3338243 -2875456 -2411209 -2100270 -1368539
38035 -1368539 -232561 640323 1104226 1671121 2634032 3878127 5076438 5379771 3904393
38026 3904393 1429940 295079 1414824 2894182 2999888 2710718 3454206 4214045 3338561
38017 3338561 1622838 920351 1064827 855105 618711 849583 -98149 -3445567 -6529026
38008 -6529026 -5932496 -3073901 -2229213 -3506116 -2686378 1568077 5277749 5162390 2639803
37999 2639803 148206 -2337318 -4950943 -5884281 -4344015 -2569326 -2365141 -2257872 -569091
37990 -569091 1171584 607025 -1604028 -2954946 -2649985 -1731054 -928429 -391887 -426506
37981 -426506 -811012 -528648 504448 922565 358271 487344 2040950 2839527 896022
37972 896022 -2322227 -4044725 -4062211 -3987819 -3995174 -3040895 -1563702 -1233204 -2153082 -2590276
37962 -2590276 -1618787 -244740 248503 -326089 -1377811 -2111871 -1896134 -916821 -94198
37953 -94198 344729 1380082 3389341 4898725 4416455 2558982 966068 33056 -727347
37944 -727347 -951291 100507 1800629 2604773 2034955 859758 -297197 -1166592 -1179583
37935 -1179583 -139270 864730 747125 244834 865471 2395200 3161388 2511625 1243811
37926 1243811 -218660 -2040410 -3292163 -2297730 664080 2947782 2763965 1148613
37918 1148613 -261548 -1658101 -3746800 -5413165 -4730176 -1793495 1181913 2470640
37910 2470640 2133501 907850 -515684 -913939 900543 3982784 5276509 3216668
37902 3216668 228907 -202978 1669823 2225312 -311449 -3426717 -4057025 -2633738 -1693614
37893 -1693614 -1987870 -2069110 -955281 800540 2365990 3262473 3041246 1927950 1441723
37884 1441723 2651807 4101598 3351974 506378 -1736047 -1653909 -256182 717197 687723
37875 687723 -103534 -1004898 -829482 830315 2143725 1008615 -1584617 -2686024 -1853621
37866 -1853621 -1330106 -1441113 240594 3765120 4981409 1482491 -3138928 -4290915
37858 -4290915 -2782983 -2531595 -4159102 -4983245 -3932240 -2362887 -728427 1707527
37850 1707527 4113289 4589157 3413739 2624089 2474982 1530122 162058 408903 2009629
37841 2009629 2189628 213516 -1342214 -1058120 -963528 -2575172 -3805165 -2290839 569251
37832 569251 1598860 297942 -1200511 -1613476 -1636634 -2062182 -2684171 -3044647 -3011602
37823 -3011602 -2627197 -2077006 -1564198 -926784 -62328 164039 -1237608 -3183676 -2868960
37814 -2868960 542365 4056902 4242866 1453039 -959403 -911168 608093 1622674 1386729
37805 1386729 389705 -555405 -832346 -362446 339719 833362 1319534 2078607 2662883
37796 2662883 2368178 1409286 921635 1610709 2802098 3103894 2003443 658445 728764
37787 728764 2236134 3237212 2344329 862790 1028787 2503368 2586274 245931 -2200194
37778 -2200194 -2521037 -1743624 -2130601 -3462851 -3617359 -2145387 -881273 -911464 -1097785
37769 -1097785 -332492 442306 -312364 -2207480 -3187168 -2184124 -479153 92421 -229997
37760 -229997 671170 3566784 5941731 4772775 852645 -1733992 -956328 551666 -421725
37751 -421725 -3063652 -4270451 -3433755 -2600710 -2579084 -1996120 -302149 1311912 2587223
37742 2587223 4809782 7631250 8234518 5569954 2876488 3464010 5892885 6203285 3666471
37733 3666471 1257485 971044 1709399 1941975 1657139 1014841 -484990 -2422590 -3031404
37724 -3031404 -1614657 100254 227665 -857773 -1497046 -1101565 -375096 49308 134612
37715 134612 106693 353193 1182351 2234467 2799319 2982521 3534050 4216479 3777934 2198471
37705 2198471 1328888 2190699 3249313 2867502 1962904 2295907 3331266 3058726 1191248
37696 1191248 -700293 -1728458 -2095243 -1353633 1228847 4549891 6370701 6379880 6130068
37687 6130068 5634248 2936706 -1873333 -5087729 -3758198 426872 3684601 4879728
37679 4879728 5525054 6341238 6343581 4975214 3028273 1309899 -96524 -1065440 -1116168
37670 -1116168 -192831 913793 1156535 120616 -1423915 -1882617 -412771 1863306 3116883
37661 3116883 3133437 3020056 2816938 1567727 71573 819292 3975258 6170708 5210281
37652 5210281 3359480 3433149 4119944 2533589 -549812 -1928731 -1241597 -877875 -1253395
37643 -1253395 -516831 985786 455191 -2265911 -3633182 -1969416 -93683 -377573 -1033763
37634 -1033763 -38308 760376 -1037062 -3622691 -3445924 -744549 1164638 1045264 547553
37625 547553 489962 -14279 -727673 -32541 1938578 2940310 2229831 1844099 3185785
37616 3185785 4784996 4838363 3872833 3294915 3036528 2402901 1912989 2425389 3307314
37607 3307314 3264101 2482975 2305003 3022682 3558015 3337243 3050534 3266511 3528301 3332090
37597 3332090 3040932 3218758 3731364 4012994 3610730 2061363 -886299 -4140205 -5254902
37588 -5254902 -2948459 719477 2231858 763801 -1132640 -1328104 -646580 -532315 -289608
37579 -289608 1127328 2069732 64218 -3637511 -4759512 -2000444 863871 491210 -1348053
37570 -1348053 -1143636 655042 722427 -1599899 -3515157 -3397256 -2785015 -3115499 -3521033
37561 -3521033 -3104268 -2798197 -3333845 -3499324 -2315634 -1269933 -2317875 -4795249 -6280047
37552 -6280047 -5752371 -4148646 -2488555 -1230054 -934459 -1764975 -2614573 -2329625 -1469892
37543 -1469892 -1331982 -1794025 -1960043 -2326738 -3964360 -5848795 -5749755 -3954068 -3118063
37534 -3118063 -3718926 -2929397 465560 3336798 2895759 1249266 1974950 4352988 4955174
37525 4955174 3635145 3538916 5373982 6016336 3617089 251675 -1779960 -2758302 -3093568
37516 -3093568 -1638200 1285538 2442791 202692 -2249767 -1568815 272211 -823527
37508 -823527 -4086534 -4747162 -1433616 1946853 2356675 1370383 1303550 1455198 542942
37499 542942 -134493 1182766 3361905 3832769 2221963 321863 -592025 -455083 605667
37490 605667 2017039 2328986 997400 -177931 576361 1979343 1423435 -748257 -1459998
37481 -1459998 366481 2052751 1140858 -1170018 -2039738 -722448 1351422 2969389
37473 2969389 3843511 3659838 2208917 393609 -253792 703477 2191470 3001835 2844130
37464 2844130 1971399 546749 -1239358 -2836253 -3506505 -2821206 -980773 1224236 2796033
37455 2796033 3083928 2166198 841169 210150 856349 2048926 2087987 140868 -2321733
37446 -2321733 -2729126 -301441 2911900 4187195 2766483 142876 -1582624 -1322773
37438 -1322773 232326 1039896 -312173 -2603142 -2981654 -651040 1688919 1303659 -811435
37429 -811435 -1414217 411076 2270057 2011218 216641 -1320303 -1825059 -1540838 -1033543
37420 -1033543 -1288489 -3083897 -5415863 -5964424 -4133364 -2189865 -2122813 -2807682 -1993313
37411 -1993313 84474 1205807 663819 35936 484768 1306724 1552062 1383329 1217112
37402 1217112 889572 323884 -105444 -475386 -1546818 -3453368 -5040419 -5163906 -3971639
37393 -3971639 -2414214 -1183289 -572521 -636024 -929487 -681993 307796 1444567 2255521
37384 2255521 2858870 3240779 2885438 1614856 141272 -675399 -609138 68649 780512
37375 780512 622910 -759214 -2007674 -1084975 1911004 4326797 4266260 2965178 2577118
37366 2577118 2885247 2080977 71581 -1126322 -358775 1089303 1386411 334710 -901989
37357 -901989 -1309886 -750423 145541 426353 -308455 -1288138 -1363631 -488883 284449 407410
37347 407410 531249 1139265 1344484 75407 -1796148 -1743988 1288786 4705055 4469626
37338 4469626 -139200 -5080614 -5860285 -2603319 539011 658746 -1082563 -2133725
37330 -2133725 -1919712 -1299958 -408406 1020221 2078290 1478433 -274669 -1233533 -684952
37321 -684952 -59307 -809861 -2509194 -3569413 -3138025 -1808953 -771307 -487936 -226458
37312 -226458 881912 2423796 3094057 2595683 1995313 1793359 1194890 229884 764960
37303 764960 3578227 5952472 4743371 1092115 -655687 1349162 4465319 5662715
37295 5662715 5125704 4790465 5298462 5730729 5182499 3631106 2007570 1734135 3241746
37286 3241746 4965996 5077240 3978108 3356910 3042158 1265199 -1671447 -2874131 -1170917
37277 -1170917 739292 264776 -1217121 -736759 1744438 3686515 3772288 2912960 1996556
37268 1996556 888913 -334658 -926766 -465908 754829 2204430 3139877 2728371 1208248
37259 1208248 303347 1278572 3163348 4140419 4043665 4013013 4199592 3526217 1650502
37250 1650502 -373346 -1588406 -2102304 -2380495 -2539457 -2479544 -1991949 -802848 854484
37241 854484 2042986 2219332 2035865 2204540 2230943 1428716 531335 758967 1615724 1318396
37231 1318396 -444254 -1714444 -718457 1978346 4252904 4593754 3180397 1421270
37223 1421270 628431 769319 624151 -563070 -2177210 -3426433 -4394762 -4882268 -3418763
37214 -3418763 674779 4892680 5489334 2002891 -2073650 -3544442 -2698709 -1712283 -1612127
37205 -1612127 -1872568 -1826639 -1346952 -663458 -138039 142716 640535 1655844 2582763
37196 2582763 2800118 2904815 3651484 3987160 2091694 -1435455 -3520702 -2465632 -9303
37187 -9303 1269421 753479 -951541 -3457253 -5752325 -5817070 -3147946 -374500 -296192
37178 -296192 -2298696 -3709962 -3689076 -3378772 -2915013 -1156419 1448065 2450222 799707
37169 799707 -1451367 -2006569 -1207494 -759472 -987095 -1000633 -791521 -1415118 -3084781
37160 -3084781 -4387328 -3887505 -1931779 -424808 -896116 -2919013 -4544524 -4395198 -3098777
37151 -3098777 -2284965 -2481641 -2851236 -2983153 -3703213 -5387994 -6519523 -5279814 -2263952
37142 -2263952 -188914 -616041 -2146570 -2509213 -1419363 -292049 202440 755945 1544976
37133 1544976 1326046 -711338 -3273182 -4379334 -3854841 -3070870 -2524792 -1291753 860939
37124 860939 2404646 1954753 137022 -1357897 -1652668 -720031 1357696 3786527 4554815
37115 4554815 2302197 -1511832 -3864219 -3535875 -1787160 84818 1890751 3042029
37107 3042029 2210575 -389504 -2268656 -1749731 -381945 -640838 -2394435 -3481097 -2936217
37098 -2936217 -1706106 -690704 3276 181351 -184939 -58221 1374984 2716216 1866265
37089 1866265 -440155 -1123530 682121 2150150 913785 -1757160 -3408364 -3708527
37081 -3708527 -3423193 -2247382 -65129 1366413 722169 -150775 1348929 4291841 5328410
37072 5328410 3582583 1338919 -25219 -1466585 -3127357 -3120486 -860188 1176419 868059
37063 868059 -465982 -301577 1384336 2541548 2052142 612111 -628154 -981257 -438822
37054 -438822 82544 -491256 -1694099 -1755848 -280989 823534 220242 -649784 161546
37045 161546 1919993 2201693 352698 -1772960 -2167900 -463385 2202631 4026404 3782839
37036 3782839 2145255 1075309 1200190 959598 -754700 -2637352 -2974900 -2079886 -1108072
37027 -1108072 7234 1495204 2106943 853783 -799382 -888369 -23047 44569 -137870
37018 -137870 1303279 3793242 4641477 3022396 790085 -566386 -1027569 -413397 1259903
37009 1259903 2014939 -15590 -2695431 -1915263 1972252 3925488 1606235 -1312857
37001 -1312857 -1224937 231401 -37651 -1317362 -1252849 -401533 -607189 -855903 1081330
36992 1081330 3976023 4108826 723469 -2786046 -3358096 -1359431 965894 1943380 1154223
36983 1154223 -594738 -1871929 -2277628 -2881059 -3969010 -3823885 -1493135 880955 944419
36974 944419 -134395 231232 1452839 859922 -1212716 -1387225 1361697 3999581 4093768
36965 4093768 2840789 2134428 1729838 1054091 1069934 2230340 2835932 1687534 560484
36956 560484 1683469 4119021 5043164 3753108 2127640 1570035 1627267 1596847 1592530 1597005
36946 1597005 892935 -848751 -2662983 -3068290 -1555442 875788 2622709 3020506 2941142
36937 2941142 3532922 4504874 4393696 2631274 426897 -851395 -1324076 -1891633 -2445953
36928 -2445953 -1712599 1065748 4769650 7041571 6499216 4335874 3215569 4268885
36920 4268885 5928746 6347973 5811852 5354438 4143004 700783 -3561680 -4906228 -2129401
36911 -2129401 1612637 3039477 2561378 2338478 2688541 2578609 2129689 2250049 2662737
36902 2662737 2422389 1765075 1560631 1577666 1178536 1061564 2231979 3756578 3775417
36893 3775417 2472072 1736669 1975386 1758832 899985 1171890 3001993 3928688 1963482
36884 1963482 -1299358 -2679809 -1322825 967802 2402961 2686513 2358755 2025404 2131875
36875 2131875 2714987 3520923 4594103 6038811 6991591 6109550 3756914 2287342 3001274
36866 3001274 4152491 3534447 1902561 1814940 3743611 5595931 6035190 6036291 6610369
36857 6610369 6982115 6119600 4674501 4155072 4967628 6271840 7189929 7322803 6568843
36848 6568843 5257562 4206340 4043662 4648332 5543338 6405849 6859576 6370209 4927475
36839 4927475 3410235 2751848 3117591 4279901 6149285 8289601 9587777 9381819 8511877
36830 8511877 8247056 8503946 8312604 7853869 8500105 10459560 11900880 11417300 10232651
36821 10232651 10576688 12509828 14010428 14230570 14973024 18074442 22487628 25306045
36813 25306045 25284646 24075137 23962616 25619313 28486046 32133807 36276716 40278663
36805 40278663 43883311 47995868 53492389 59606702 65081225 70876269 79716494 92186553
36797 92186553 105264161 116345710 127285977 142366642 163110747 187467737 213909847
36790 213909847 243749714 278625082 317751558 358843474 399982612 438727651 470224935
36783 470224935 488200890 488419451 470938919 439614304 400209325 358410173 318240092
36776 318240092 281637306 249339029 221658212 198222700 177869072 159652112 143526219
36769 143526219 129407496 116275668 103239553 91004104 81065459 73659064 67731701
36762 67731701 62853261 59670842 58049035 56169259 52463815 47572555 43310449 40242593
36754 40242593 37451668 34495096 32262398 31446949 31176466 29999598 27669940 25014229
36746 25014229 22375903 19425292 16625382 15442938 16270898 17340957 17017209 16269978
36738 16269978 17132083 19230361 20063289 18891388 17963849 18890019 19975941 18885357 16311188
36729 16311188 14876203 15362767 16212086 16299984 16107106 16168761 16240492 16232239 16391794 16326820
36719 16326820 15328730 13931785 13687701 15026992 16723689 17845237 18779949 19841170
36711 19841170 20417121 20377366 20968438 23177501 26180108 28578906 30563059 33782714 39380095
36702 39380095 46872657 54690825 61173535 65141923 65961996 63368113 57714256 50616802
36694 50616802 44388048 39809741 35327511 29888166 25482715 24415212 24758093 22104581
36686 22104581 16406426 13117238 15488275 19317734 18701301 14330135 11845692 13359928
36678 13359928 15223914 14259004 11861414 10579816 10067930 8540077 5999740 3942600
36670 3942600 3225805 3872292 5860721 8569924 10260097 9561954 7119189 4777612 3550592
36661 3550592 3191187 3292133 3849424 4815533 5748975 6076838 5639619 5041678 5184956
36652 5184956 6026342 6218124 4809094 2907489 2441960 3490361 4387890 4556540 5310572
36643 5310572 7124365 8004399 6099029 2704560 964098 2124077 4504200 5855094
36635 5855094 5445773 3930536 2340953 1456630 1430615 1743378 1773918 1376984 823994
36626 823994 550792 1030630 2224062 3025813 2300615 905201 1358649 4464308 7445104
36617 7445104 7012989 3600013 782526 720888 1972246 2152821 1141789 713059 1939380
36608 1939380 4002631 5337792 5279043 4442493 3693049 3021553 1819030 208209 -684550
36599 -684550 -245975 585540 599598 74867 305667 1720225 3438420 4504663 4682513
36590 4682513 4202966 3531779 3179565 3076822 2618556 2018186 2634558 4711145 5946769
36581 5946769 4322700 1483391 716021 2017346 2322457 821803 334374 2101516 3045803
36572 3045803 819660 -1712457 -676278 2538405 3508341 1825974 1098250 2214481
36564 2214481 1795086 -1372496 -3176956 -264286 4346201 5287182 2201182 -524619
36556 -524619 -23757 2548408 5121052 6854172 7009798 4830651 1512886 -87376 1087387
36547 1087387 2860778 2856071 1407414 395885 599209 1413770 2094067 2023289 602752
36538 602752 -1909580 -4015750 -4437295 -3496292 -2312120 -1316573 -383023 359186 840485
36529 840485 1473621 2260638 2298717 1340984 857330 1893495 2778312 1264966 -1371937
36520 -1371937 -1129145 3136021 7386034 7153501 2824525 -1474499 -2823815 -1422091
36512 -1422091 1346378 4308152 6039915 5243610 2417843 -145386 -806624 -149089 428824
36503 428824 662767 1033829 1213593 308234 -1330790 -1860416 -226472 2178332 3233411
36494 3233411 3016348 3521358 5268056 5958273 3730526 365696 -765091 644220 1540946
36485 1540946 37800 -2143121 -2706592 -2135893 -2330868 -3382984 -3691177 -2523500 -655748
36476 -655748 1120420 2517646 3084458 2567070 1796764 1795114 2126051 1568636 326360
36467 326360 7818 1277334 2994164 3906231 3804036 2828485 1201285 -40807 245561
36458 245561 1275901 752020 -1794236 -3787235 -3013492 -694331 507876 327170 692233
36449 692233 2292631 3482200 2794236 904381 -424355 -250238 1127717 2781603 3733628
36440 3733628 3520070 2541214 1542714 760160 18856 -489693 -286022 444600 678511
36431 678511 -352496 -2273673 -3907852 -4182759 -2784911 -462829 1294542 1492181 696010
36422 696010 323638 769057 960952 103215 -953186 -792681 633692 2009992 2319045
36413 2319045 1621474 322145 -1222512 -2127184 -1249312 1092185 2588127 1410571 -1198335
36404 -1198335 -2177480 -440360 1991921 2913003 2482306 2126438 2299482 2551390 2791241
36395 2791241 3055141 2712901 1405894 327989 1010482 3015295 4361743 4215448 3612794
36386 3612794 3399394 3067623 2053512 710865 -536677 -1662482 -2183433 -1357031 93399
36377 93399 79151 -1952259 -3677174 -2824816 -258292 1397411 1267270 670775 635336
36368 635336 763594 578834 500464 1071274 2100432 2908796 3015726 2641226 2815354 4511275
36358 4511275 7142906 8519318 7082408 3765873 914849 -128950 407474 1881393
36350 1881393 3722812 5023846 4860189 3265689 1269631 -58622 -249812 482658 1263115
36341 1263115 1144674 333570 306040 1970824 4259474 5381086 4975637 4161167 3956623
36332 3956623 4549701 5567355 6096640 5048168 2637604 915956 1465158 2965776 2557684
36323 2557684 -450858 -3635142 -4381973 -2598965 -242239 888764 499590 -457350 -1020517
36314 -1020517 -1182189 -1387763 -1332390 -335787 970745 935156 -491646 -1279680 -606917
36305 -606917 -531882 -2561699 -4631125 -4056862 -1750679 -439890 -139212 1015789 2409235
36296 2409235 1547208 -1155377 -2418453 -1448843 -1080645 -2491401 -2953928 -678286 1994067
36287 1994067 2674888 2772068 4359407 6126883 5697463 3703125 2238900 1060691 -1304902
36278 -1304902 -4003903 -4790367 -3680113 -2494478 -1376768 957875 3634000 3637186 243581
36269 243581 -3195484 -3164048 -5198 3039169 3670032 2482062 1662095 2389076 3596144
36260 3596144 3491116 2133384 1454639 2405961 3517373 3131355 1573646 -44998 -1557224
36251 -1557224 -2727309 -2247767 83585 1629702 -18188 -3193049 -4137541 -2217768
36243 -2217768 -190987 507348 1460540 3622426 5074265 3993559 1654112 641695
36235 641695 1425125 2339308 2203100 1548478 1454888 2068168 2435040 1630759 4066 -1022764
36225 -1022764 -619391 568644 1610766 2470943 3205426 2980245 1129753 -1476647 -3247925
36216 -3247925 -3382465 -1777717 1196599 3657552 2874558 -953414 -3498404 -1716921
36208 -1716921 1276881 431253 -3438367 -4679000 -1416003 1925925 1802608 303642
36200 303642 432719 1053513 -96179 -1748775 -1355333 292586 547820 -485693 -590483
36191 -590483 171501 -581534 -3179151 -4756636 -3277102 -360715 860961 -713090 -3323148
36182 -3323148 -4086007 -1510250 2796288 5232456 4054087 1565601 1175578 2984723
36174 2984723 4151755 3271250 2123174 2601325 3877740 3753470 1673100 -728794 -1593692
36165 -1593692 -629651 833480 1240420 421609 -215520 581003 2214137 2902481 1940872
36156 1940872 517315 73344 549200 808980 511089 812003 2747808 5235170 5682601
36147 5682601 3142237 -25663 -797923 756330 1914585 1233296 32693 -353897 -536126
36138 -536126 -1188204 -1341415 -292273 473214 -628326 -2452703 -2606779 -934752 682151
36129 682151 1373393 1742573 1634445 97973 -2096429 -2421062 -41412 2631679 2974393
36120 2974393 1297139 -83620 232133 1664476 2564689 1441932 -1810449 -5266889
36112 -5266889 -6455691 -5066403 -3236241 -2689800 -2824940 -2308891 -1159941 -99908 953080
36103 953080 2293505 3189107 2770949 1612970 923619 573102 -470960 -1943061 -2289359
36094 -2289359 -1113034 88046 218334 52293 518387 993248 623703 139764 636682
36085 636682 1345278 624408 -1112004 -1639922 -353835 789605 557492 371867 1441540
36076 1441540 2150266 728408 -1073565 -110097 3042342 4482307 2721204 652171
36068 652171 751271 1530821 660125 -1121259 -1736141 -1396424 -1753176 -2818175 -3420327
36059 -3420327 -3637514 -4061480 -3608430 -1095332 1600695 1290473 -1623706 -3352657 -2304538
36050 -2304538 -1015761 -1399630 -1553200 607295 3409840 3853070 1984676 57713 -1304905
36041 -1304905 -3227401 -5588939 -6703516 -5996712 -4741139 -3839373 -2722932 -895746
36033 -895746 905717 1649574 1184439 252869 10703 1277048 3351202 4004022 1879381
36024 1879381 -1425480 -3080980 -2590427 -2008373 -2606204 -3197464 -2343220 -522370 893875
36015 893875 1582371 2106905 2699365 3179670 3429269 3139891 1781899 -312778 -1486803
36006 -1486803 -464790 1720075 2485370 540035 -2531709 -3672351 -1289393 2966370
35998 2966370 5346401 3440507 -1369124 -5367427 -6367213 -5265539 -3803965 -2320291
35990 -2320291 -509107 1039098 1554092 1521018 1872028 2248425 1622736 375898 89092
35981 89092 1150319 2119307 1865785 949340 290509 -259263 -1159523 -1942616 -1729439 -496034
35971 -496034 946686 1936051 2362246 2347347 1976548 1254383 209206 -748167 -720439 832106
35961 832106 3122705 4512787 4005749 1823426 -1099822 -3297681 -3009968 112422 3600080
35952 3600080 4363561 2665306 1868171 3557959 5325308 4820251 3523149 4033166 5524630
35943 5524630 5084343 2614544 1045280 1705863 2606443 1932770 527348 -102120 63146
35934 63146 554842 1586563 2956252 3470326 2706740 1829327 1490970 579780 -1529764
35925 -1529764 -3102736 -2260091 140341 1758006 1973664 1854425 1659752 670761 -636047
35916 -636047 -511234 1427189 3246033 3234345 2127133 1884176 3101767 4548477 4827583
35907 4827583 3715668 1963638 393828 -535227 -541163 487525 1894100 2190875 703158
35898 703158 -770110 501608 4242107 6373017 3780506 -1197208 -3214520 -546472
35890 -546472 3026303 3395022 954288 -1027663 -1142897 -915606 -1743373 -2763382 -2245246
35881 -2245246 47433 2577361 3632606 2787143 1087280 84050 410669 1062852 382575
35872 382575 -1930550 -4150465 -4440530 -3179453 -2451767 -3103871 -3480500 -1880190 724979
35863 724979 1814078 748985 -482951 -95616 1395771 2419215 2399909 1786408 1081217
35854 1081217 762968 1328555 2442036 2728522 1411335 -394247 -994825 -244197 631510
35845 631510 903958 953159 1228490 1619405 1834331 1650407 910904 -96895 -602667 -407427
35835 -407427 -489858 -1643768 -3053163 -3450444 -3273716 -4085073 -5814792 -6297190 -4241794
35826 -4241794 -1347237 -364405 -1705438 -3022858 -2096199 570486 2387194 1768122 51776
35817 51776 -263471 1109128 1950065 978986 -113612 552092 1768352 1075510 -924900
35808 -924900 -1002231 1675376 3799384 2457179 -913988 -2926544 -2871515 -2739779 -3589805
35799 -3589805 -4240025 -3529796 -1949678 -492668 795617 2360647 3949787 4645187 4013694
35790 4013694 2846985 2506733 3437395 4599950 4806631 4344009 4442280 5218966 5358294
35781 5358294 4200229 2845201 2389851 2339169 1990339 2224087 4127439 6510369 6929402
35772 6929402 5215709 3898354 4511021 5394412 4346013 1937005 592551 1292676 2881865
35763 2881865 4207756 5197708 5717364 4957826 2604361 -383642 -2723022 -3814649 -3549107
35754 -3549107 -2142545 -663039 -581300 -1903552 -2689137 -1491636 543123 1280106 589675
35745 589675 177621 791951 1306857 670188 -738360 -1887702 -1915431 -191755 2862601
35736 2862601 5056908 4509844 2662961 2867962 5357674 6386526 3747217 256033
35728 256033 -561524 333058 -233512 -2111388 -2364281 -413506 1210804 1147365 600105
35719 600105 117791 -1424825 -3682115 -4057953 -1631093 958327 1271601 278290 58538
35710 58538 638351 1093619 1680238 2647803 2761326 1356423 291110 1363455 3113761
35701 3113761 2863195 943977 94290 1206236 2497022 2761609 2656054 2407653 873869
35692 873869 -2212555 -5084310 -6030490 -5194559 -3651016 -2178219 -1520227 -2221782 -3347874
35683 -3347874 -2871945 -367340 1993851 2209808 983333 234069 205986 -332050 -1693843
35674 -1693843 -2848437 -3247610 -3447821 -3603626 -2780426 -562305 1619725 1813974 -152037
35665 -152037 -2588370 -4054674 -4623288 -4744435 -3803787 -879640 3227369 5872802 5127912
35656 5127912 1987785 -583937 -640523 1122692 2493322 1996304 116411 -1292416 -816545
35647 -816545 1018435 2147879 1108738 -1414312 -3435957 -3718161 -2584698 -1156534
35639 -1156534 -470423 -1028778 -2323929 -2869523 -1588016 745637 2257855 2241124 1745953
35630 1745953 1804047 2244763 2703722 3481854 4483201 4485792 2827171 996909 1003392 2649974
35620 2649974 4034386 4364304 4383332 4170535 2915499 1390498 1990229 4844266 6329421
35611 6329421 3788103 -174607 -1092725 894183 1523229 -923586 -3273165 -2714626 -867924
35602 -867924 -674096 -2039943 -3058507 -3477553 -4196103 -4698985 -3817278 -2323588 -2163031
35593 -2163031 -3392432 -4179948 -3689857 -2807690 -2080006 -1135309 -317282 -724360 -2116380
35584 -2116380 -2667727 -1425058 623214 2470016 4371106 6366991 7049698 5110419
35576 5110419 1497784 -904024 157194 3926308 6706416 5174246 327362 -3090950
35568 -3090950 -2278158 132769 185855 -1692857 -2258285 -1248783 -1353511 -2746277 -2406078
35559 -2406078 267734 1843032 626489 -363247 1294273 3232442 2646480 1215030
35551 1215030 1822263 3315494 2809392 1012479 769348 1743632 1062172 -1426498 -2796006
35542 -2796006 -1873326 -653302 -632624 -1008542 -889595 -502412 -5215 446861 -262275
35533 -262275 -2539367 -4123375 -2830713 -497145 -570849 -2369409 -2034073 795368 2079238
35524 2079238 110711 -1711339 -800411 422373 -958475 -3468919 -4175680 -3430292 -3170351
35515 -3170351 -2900125 -1028118 1468575 2254889 1428223 885643 724078 -562141 -2647958
35506 -2647958 -3160898 -1186388 1352007 2243010 1193174 -677722 -1976781 -1585047 453964
35497 453964 2392296 2295912 248070 -1795353 -2171775 -758820 1478725 3230563 3549237
35488 3549237 2737179 2142214 2424141 2775299 2524293 2293828 2468358 1896690 -214132
35479 -214132 -2270986 -2190620 -554102 262408 -365742 -819334 -102849 981706 1644604
35470 1644604 2011773 1895625 677481 -981893 -1141339 868683 3337701 4368149 3891166
35461 3891166 2895102 2047664 1813221 2519079 3367708 2694396 286346 -1780839 -1868638
35452 -1868638 -1162277 -1724500 -3083166 -2849259 -558475 1268745 580888 -1434109 -2267633
35443 -2267633 -1578259 -1116352 -1668550 -1916100 -694675 1163738 2162069 2184600 2076069
35434 2076069 2083423 2131010 2935456 5027558 6976106 6701400 4742659 3947946 5260422
35425 5260422 6268797 5213667 3834749 4049545 4167817 1623489 -2077449 -3029206 -1139509
35416 -1139509 -631963 -3585353 -6729620 -6463521 -3947581 -2665485 -3143237 -3055244 -1443218
35407 -1443218 37079 -71959 -1179710 -1871971 -1450100 -25803 1714310 2651112 2110393
35398 2110393 757825 -88888 -16819 209491 -298658 -1840067 -4041840 -5729229 -5403130
35389 -5403130 -2890305 -148784 705320 -68271 -413496 670291 2209365 3095907 3301576
35380 3301576 2996070 1999240 724053 307015 989748 1536633 1153528 882439 1989155
35371 1989155 3891516 4980161 4873237 4544503 4599844 4714876 4600542 4312173 3658808
35362 3658808 2489285 1627646 2312802 4358993 5862487 5210433 2715409 -9720 -1621105
35353 -1621105 -1790409 -1123586 -611752 -606183 -329913 911651 2299202 2439043 1565955
35344 1565955 1183077 1337037 317631 -2067365 -3115535 -902655 2362873 2956951 589226
35335 589226 -1670988 -1867962 -1062772 -792927 -1052320 -1299832 -1435509 -1127426 57623
35326 57623 1284861 1042899 -257080 -270216 1735409 3353660 2445572 194285 -1006516
35317 -1006516 -1087398 -1560805 -2410039 -2166637 -668520 491087 357261 -297806 -461618
35308 -461618 -53326 491917 621505 -243259 -1821222 -2485801 -1088839 1040292 1597732
35299 1597732 627744 405077 1882788 3368141 3289287 2214883 1218939 217759 -818265
35290 -818265 -856368 345719 965194 -294554 -1525443 130012 4089219 6558717 5241184
35281 5241184 1736329 -1157212 -2543159 -2925275 -2331726 -532899 1612208 2500476 1514208
35272 1514208 -370785 -1724333 -1903541 -1220956 -383567 90473 136975 7401 -35404
35263 -35404 201890 877299 1847394 2416928 1892072 556834 -430140 -434834 -129921 -383833
35253 -383833 -840019 -387779 1109491 2409869 2397019 1307647 196260 -135204 750697
35244 750697 3095905 6294443 8500168 8127537 5909680 4327405 4467042 4527525 2448345
35235 2448345 -827119 -2247768 -633885 1866141 2722095 1899745 844551 -43913 -1277543
35226 -1277543 -2339649 -1865167 87317 1652026 1608395 754881 96311 -789066 -2274751
35217 -2274751 -2937624 -1253375 1606044 2821486 1757865 617734 804096 847419 -783928
35208 -783928 -2684257 -2295848 338521 2630080 2776875 1139505 -1449464 -4561082 -6921355
35199 -6921355 -6406933 -2624777 1742261 3554974 2546731 924470 216249 -136426 -1059131
35190 -1059131 -1986108 -1466869 769043 3080019 3553019 2098331 330398 -664911 -1481154
35181 -1481154 -2672068 -3050141 -1351855 1037407 1354390 -310736 -618566 2025356 4560614
35172 4560614 3485001 36638 -1680169 -595406 570972 220088 106258 1753517
35164 1753517 3609909 3521695 1957269 848799 680984 605482 373812 277305 -127670
35155 -127670 -1391833 -2597512 -2092451 167104 2293250 2569074 960577 -1240868 -2305014
35146 -2305014 -1004534 2043615 4224647 3501509 1030740 -257620 390656 847846 -328783
35137 -328783 -1693412 -1388893 -86862 251640 -535084 -866247 -128495 525342 255558
35128 255558 -159506 255345 1031781 918482 -330814 -1616890 -1840595 -1045414 -134008
35119 -134008 169771 -188184 -919222 -1719146 -2153197 -1782318 -901687 -674807 -1723267
35110 -1723267 -2926706 -2756303 -1664731 -1602300 -2771434 -2652780 515442 4708666 6291218
35101 6291218 4415747 1537283 69692 289015 1239166 1835343 1049538 -1193890 -3115750
35092 -3115750 -2789954 -910664 33059 -465071 -315418 1355002 2427393 1277839 -439285
35083 -439285 -582265 36421 -424666 -1242678 -589081 588191 -292381 -2717025 -3148035
35074 -3148035 -443810 2174758 1928513 318147 237622 1609269 2275098 1705930 1390404
35065 1390404 2241336 3592036 4394106 3935083 1921744 -679948 -1510617 765582 4217006
35056 4217006 5480823 3749691 1366654 477009 769760 839225 152245 -1026683 -2370774
35047 -2370774 -3350051 -3337621 -2548420 -1967292 -1731253 -648440 1813030 4121072 4495962
35038 4495962 3348529 2473540 2333876 1840871 752945 404000 1411037 2288174 1518603
35029 1518603 -110522 -587929 631253 2387520 3744331 4583796 4450077 2529541 -779080
35020 -779080 -3650530 -4762391 -4337679 -2943944 -754348 1361957 1787939 469410 -320326
35011 -320326 808002 1893621 577510 -1775441 -1859089 254976 1030386 -862819 -2295390
35002 -2295390 -643809 2023061 2107534 -380956 -2566428 -3034464 -2520004 -1243496 1270755
34993 1270755 3780411 3716607 775928 -2163616 -2723538 -1799349 -1578289 -2370082 -2783767
34984 -2783767 -2043015 -819538 -279385 -1183575 -3442770 -5886359 -7012239 -6523763 -5504601
34975 -5504601 -4678898 -3542046 -1921455 -1091208 -1948172 -3088691 -2524413 -751507 -19515
34966 -19515 -621688 -269359 2154900 4503795 4479645 2974313 2271979 2272750 1067242 -1278614
34956 -1278614 -2309197 -960393 735837 763326 -161934 -433516 -356746 -1236373 -2860355
34947 -2860355 -3903388 -4124277 -4180006 -3700723 -1700314 1023372 1996380 262411 -2112731
34938 -2112731 -2584094 -1046563 559352 698079 -363340 -989717 339680 3328007 5545435
34929 5545435 4766403 1789587 -207167 511495 2236364 2212632 -46637 -2643294 -3697150
34920 -3697150 -3051563 -1974058 -1644565 -1819230 -1241018 181337 520385 -1436585 -3501467
34911 -3501467 -2548018 591675 1709498 -667018 -2962511 -1920437 774343 1654991
34903 1654991 652853 14868 -72152 -1237623 -3221726 -3820370 -2423478 -820337 -412245
34894 -412245 -923218 -1706855 -2084286 -787459 2409861 4895032 3898832 787713 -454838
34885 -454838 892116 1458385 -530635 -2564786 -2397906 -1630507 -2305817 -3018203 -1541193
34876 -1541193 881761 1257861 -456002 -1574763 -900050 203477 589576 445794 -310212
34867 -310212 -2080159 -3678443 -2881632 266272 2752104 2264081 -67636 -1661867 -1689074
34858 -1689074 -949474 133143 1577763 2549540 1980807 680156 1086741 4014671 6832166
34849 6832166 6271627 2637933 -224687 570091 3683146 5473990 4268210 1626101
34841 1626101 -157051 -485155 -191069 101295 591710 1539940 2411126 2099272 263817
34832 263817 -1654301 -1484840 1147408 4012480 4714964 3379404 2014682 1748947 1899110
34823 1899110 1535471 661297 -300416 -1148010 -1798032 -2232933 -2506576 -2259878 -809034
34814 -809034 1407880 2408491 1202169 -170759 717799 2678626 2364301 -328467 -1632280
34805 -1632280 396612 2861520 2580891 791005 684788 2431570 3712171 3868868 4327579
34796 4327579 5372530 5467839 4046286 2597704 2393323 2877071 2884182 2142788 1169098
34787 1169098 751743 1744358 4313609 7132193 8140063 6352594 2584688 -1245222
34779 -1245222 -3107527 -2050613 642825 2265299 1678681 615123 907580 1767709 1582155
34770 1582155 1061347 1979584 3486487 2712578 -746472 -3745866 -3717963 -1539324 485386
34761 485386 1254044 641166 -1043057 -2243608 -1036874 1869543 3208317 1694997 101817
34752 101817 811637 1821183 138089 -2831141 -3114177 -527291 875512 -946526 -3092076
34743 -3092076 -2365041 294321 2008149 2195239 2236143 2480267 2064336 999807 310194
34734 310194 323064 483418 655595 1101611 1375954 815595 76723 545782 2008048 2526167
34724 2526167 1171020 -587341 -959522 -46828 865518 1071821 545323 -649329 -1901921
34715 -1901921 -1944525 -481740 849922 568471 -327034 144344 1606422 1700598 38631
34706 38631 -560456 1960430 5451188 6010920 3120072 312528 588593 2907537 4204878
34697 4204878 3688403 3357019 4301289 4524045 1943766 -1657225 -2194459 1043527 3874784
34688 3874784 2730733 -512895 -1430856 820440 3162688 3671368 3767328 4955414 6274664
34679 6274664 6164460 4712188 2799176 758007 -956227 -1379442 -540776 94340 -150071
34670 -150071 78058 1907965 4086352 4455457 2576566 -246313 -2513403 -3166819 -1996239
34661 -1996239 -457976 -717019 -2821900 -4353511 -3884234 -2807119 -2420853 -1656861 214127
34652 214127 1143972 -446050 -2096031 -647095 2314044 2480352 -362003 -1922153 -137024
34643 -137024 1904156 1068920 -1356115 -2202323 -722532 1597664 3533711 4643163 4722110
34634 4722110 4109537 3475837 2683775 1219884 -42897 458120 2125225 2469388 976893
34625 976893 56546 943525 1472933 -188368 -2176842 -1801396 192535 988577 37400
34616 37400 -674186 10351 1193867 1800205 1757590 1442526 1323778 1831079 2567609 2416870
34606 2416870 1364379 927294 1567055 1380657 -815063 -2866980 -2265880 -307414 -251909
34597 -251909 -2234497 -3336732 -2414312 -1348557 -1130156 -237011 1891110 2970933 1438106
34588 1438106 -548521 17041 2682595 4311493 3197082 486087 -1895066 -3052305
34580 -3052305 -3158710 -2989451 -3240256 -3456427 -2205100 713121 2995587 2247687 -688109
34571 -688109 -2384219 -925437 2047356 3783951 3595886 2737027 2111575 1437669 520272
34562 520272 86347 735455 1700917 1499258 -235006 -2224165 -3010722 -2349264 -847820
34553 -847820 1059632 3008081 4003878 2979811 333332 -1892531 -1946220 -210779 1208268
34544 1208268 557396 -1989648 -4465932 -4663748 -2000578 1793471 4090984 3785526 2155929
34535 2155929 1180905 1380677 1723738 1304139 356310 -449252 -950169 -1252403 -1077537
34526 -1077537 -117464 1116634 1649429 1416479 1435671 2147855 2456332 1307042 -452650
34517 -452650 -1061811 -397788 -85370 -945057 -1863520 -1754174 -1172791 -1022311 -934558 -260094
34507 -260094 320897 -197480 -1042172 -267339 2477879 5202912 5947642 4868332 3580952
34498 3580952 3208619 3471506 3256629 1884924 2183 -1022395 -814664 -443216 -621611
34489 -621611 -481607 737428 1818049 1195834 -166266 216617 2482670 3917421 2881607
34480 2881607 975693 220711 163542 -640325 -1916685 -2328203 -1788774 -1349050 -1452678
34471 -1452678 -1832041 -2498076 -3328478 -3253466 -1446895 1030688 2290557 2055835 1589893
34462 1589893 1435008 821216 -611009 -1963665 -2244495 -1322362 288683 1561076 1173366
34453 1173366 -958587 -2562507 -1203097 2202361 3877473 1741079 -2218730 -4816249
34445 -4816249 -5184524 -4392894 -3202544 -1758243 -497667 130532 311303 191083 -730428
34436 -730428 -2534541 -4032251 -4147915 -3448598 -3119027 -3115525 -2607218 -1582693 -621271
34427 -621271 345081 1538946 2157359 1410460 377966 909526 2747208 3777264 3375205
34418 3375205 3319500 4645846 5721573 4784172 2692446 1480730 1371459 1023056 55682
34409 55682 -435610 292887 1704209 2848587 3027015 1711232 -941090 -3360626 -3596570
34400 -3596570 -1613414 300888 69285 -1768568 -2850870 -1940322 -374583 -388669 -2476380
34391 -2476380 -4952557 -6008749 -5448960 -4082959 -2324440 -393354 762483 342694
34383 342694 -578279 25539 2032681 2849107 1156477 -842882 -508878 1455665 2345559
34374 2345559 1391327 -40988 -1372888 -3087758 -4233688 -2774471 753979 2769457
34366 2769457 1333812 -973534 -696529 1878011 3843103 3899881 3059307 2104968 949529
34357 949529 227441 1083790 3098740 4423087 4373328 4093796 4225400 3831198 2430604
34348 2430604 1286751 1445282 1937898 1359944 117997 -456252 -439557 -1072453 -2523429
34339 -2523429 -3509321 -3206177 -2199486 -1326709 -733752 -364561 -335305 -459639 -353470
34330 -353470 -388037 -1555625 -3861860 -5802725 -6144502 -5383320 -4644312 -4007132 -3036894
34321 -3036894 -2242257 -2459480 -2987554 -2008104 699314 2897637 2658216 968041 381815
34312 381815 1611813 2815155 2355349 1030109 814235 2074805 3070305 2231945 74519
34303 74519 -1622668 -1956193 -1513410 -1168517 -1181304 -1537656 -2226162 -2805689 -2567287 -1664109
34293 -1664109 -1231034 -1697629 -1912114 -901317 478075 1002736 1277623 2592222 4184460
34284 4184460 4005367 2200833 1228630 1873246 1856741 -175214 -1864490 -614965 2101630
34275 2101630 2755706 989738 -112892 1282505 3497226 4054557 2433109 -324272
34267 -324272 -2782903 -3414347 -1603049 1014629 1928779 1088589 1094017 3324376 5803953
34258 5803953 6121317 4685992 3419712 2612357 1124387 -993264 -2130026 -1403113 210631
34249 210631 1359963 1916959 2679999 4000904 5016406 4281241 1431440 -1857315 -3292925
34240 -3292925 -2477010 -1065145 -228362 675139 2259796 3544477 3516133 2895503 2691363
34231 2691363 2172710 314532 -1636390 -1467647 523349 1908210 1944837 2230481 3071197
34222 3071197 2288464 -878408 -3446716 -2565683 309871 1728479 1232624 1100079 1941325
34213 1941325 1789447 -245958 -2310391 -2624510 -1664209 -525449 841365 2518882 3492033
34204 3492033 3092185 2277968 2155908 2419812 2536043 3163783 4783927 6019052 5145090
34195 5145090 2530847 -113790 -2111384 -3599726 -3842184 -2141438 -11143 123772
34187 123772 -1581326 -2672537 -2269765 -1868167 -1824474 -290404 2962852 4782538 2991138
34178 2991138 2684 -687830 265276 -514223 -3570247 -5717491 -4520887 -1003245 2257681
34169 2257681 3531238 2296832 -739808 -3639113 -4796769 -4603268 -4248272 -3502398 -1628799
34160 -1628799 169329 -101305 -1691181 -1626233 721428 2482368 1734020 228211 43929
34151 43929 191203 -1059377 -2510013 -1649850 1064202 2423728 880645 -1641117 -2727267
34142 -2727267 -2277378 -1516851 -769132 414461 1552382 1138459 -1331794 -4117304 -4944899
34133 -4944899 -3710279 -2356597 -1952695 -1419188 -435 692905 -1056566 -3985374 -5405864
34124 -5405864 -5179681 -5442097 -6580899 -6562263 -4769372 -3390545 -3777832 -4305093 -3493387
34115 -3493387 -2565234 -2810434 -2904147 -1434919 -39444 -1042027 -3417735 -4182182 -2926994
34106 -2926994 -2009606 -2691355 -3864236 -4414938 -4225728 -2852453 203468 3628743 5066801
34097 5066801 4177882 2837878 2015600 763557 -1163408 -2161804 -1382472 -379928 -708166
34088 -708166 -1497579 -981366 764937 2139358 2254711 1510005 529052 -218605 -155772
34079 -155772 846182 1803391 1537132 285500 -452798 147612 1193807 1353132 643817
34070 643817 276549 820155 1330338 777931 -240293 -115157 1583751 3468204 4032100
34061 4032100 3161234 1803888 1072837 1833574 3996151 5846579 5427008 3185019 1794467
34052 1794467 2517343 3398496 2336266 247025 -656068 -328924 -427348 -1325023 -1914075
34043 -1914075 -1813270 -1524432 -777365 1001071 2772887 2772712 1329189 504059 755430
34034 755430 385840 -1190119 -2102825 -1009962 631805 604574 -1242708 -3370710 -4551055
34025 -4551055 -4486557 -3473749 -2371328 -2156054 -2904550 -3803506 -4227725 -3941790 -2536228
34016 -2536228 -80356 1912869 1982292 1091500 1410742 2696133 2480111 399670 -629552
34007 -629552 1034744 2802307 1592881 -1633229 -3592675 -3360342 -2677803 -2567464 -2361680
33998 -2361680 -1862185 -2015556 -3013485 -3514262 -2450982 -529867 688309 658431 383642
33989 383642 1132769 2702359 3345783 1960304 -206433 -1217738 -1323400 -2275829 -3890585
33980 -3890585 -3867483 -1761193 -329401 -1275768 -2229370 -402536 2788631 3753003 2103438
33971 2103438 828292 1524406 2455838 1679369 -298839 -1651402 -1381069 96892 1370304
33962 1370304 1073872 -400681 -748759 1364175 4056931 4612516 3226292 2106465 1540425
33953 1540425 -258412 -3400595 -5431738 -4885398 -3078604 -1476364 164190 1861080
33945 1861080 2183221 645138 -801361 -503139 510902 768327 1137881 3032071 5274037
33936 5274037 5476207 3797150 2660217 2967831 3159081 2292398 1683321 2634673 4363293
33927 4363293 5256357 4948142 4151456 3276631 2122811 558613 -964641 -1417775 30901
33918 30901 2583222 3661166 1556147 -1915440 -3072614 -926228 1720309 2267060 1384285
33909 1384285 1001736 1333150 1710122 2577347 4261706 5055662 3287253 506951 -398450
33900 -398450 85010 -1324495 -5046961 -7226000 -5456099 -2626961 -2681584 -5079193 -6233471
33891 -6233471 -4595824 -1448524 1934329 4883214 6012033 4391968 1720624 552489
33883 552489 588925 -512020 -2772872 -3422699 -1231193 1605089 2757443 2326374 1204441
33874 1204441 -439743 -1797184 -1172486 1184258 2305237 558019 -1497316 -538142
33866 -538142 2757861 4708736 3360695 46950 -3054435 -4829568 -5041592 -4062458 -2830380
33857 -2830380 -1943752 -1031415 197404 1043223 961280 743063 1385736 2585952 3459052
33848 3459052 3822875 3661868 2519209 795294 313284 1829465 3248474 2434081 688498
33839 688498 916039 3044273 4078791 2610299 534522 -125680 319808 622326 326277
33830 326277 -667242 -2337167 -3479368 -2240537 1182599 3930130 3797634 1957236 1162948
33821 1162948 2248606 3692175 3979869 3077314 1711593 260892 -1302659 -2796098
33813 -2796098 -3595884 -3281771 -2389816 -1909367 -1829744 -1060940 650237 1837715 1421333
33804 1421333 564905 801134 1252477 -48753 -2485755 -3098187 -879330 1603341 1831485
33795 1831485 479278 -349956 -230020 -107537 -171627 173171 830843 1050585 708059
33786 708059 404681 430492 536303 646347 1035723 1743403 2273709 1968744 614227 -1121438
33776 -1121438 -1923517 -1044779 624558 1304177 349590 -1010686 -1155741 230159 2076829
33767 2076829 2982039 2219719 315787 -1147039 -781532 1319898 3752945 5084626 4715373
33758 4715373 3037261 1373745 1121894 2082661 2383889 1147360 191340 1375285 3330867
33749 3330867 3407052 2247783 3060013 5957982 6804736 3399192 -610717 -855985 1299239
33740 1299239 1081553 -2324083 -4700464 -3050305 643699 2839424 2707134 1453067
33732 1453067 -324862 -2448360 -3641973 -2560352 -115594 1151480 381805 -504629
33724 -504629 208895 1385645 888368 -726631 -493511 2692570 6113165 6693011 4831936
33715 4831936 3102515 2349243 1321758 -331930 -1190036 -530143 393453 274739 -645301
33706 -645301 -1560124 -2173133 -2148285 -1031892 471957 609759 -1118229 -3055148 -3605026
33697 -3605026 -2997582 -2059035 -852868 332028 273741 -1398464 -3037694 -3115417 -2278641
33688 -2278641 -1716035 -860588 1223711 3241565 2911904 457834 -1435230 -1246778 -199792
33679 -199792 150574 95730 748055 2076711 2886853 2255199 497507 -1102535 -1522964
33670 -1522964 -1146850 -1335510 -2582954 -3715767 -3418663 -1827292 33369 1562366 2508373
33661 2508373 2468158 1557164 900121 1355937 2333949 2845190 2968108 3162721 2964034 1714004
33651 1714004 -47771 -1231565 -1596904 -1273687 191240 2674491 4163174 2585156
33643 2585156 -1326389 -4687848 -5692221 -4638832 -2351575 414292 2289439 2193690
33635 2193690 1085648 965814 2002482 2411944 1262245 -465016 -1754234 -2576626 -2740909
33626 -2740909 -1637469 339818 1747388 1936060 1559754 1162705 829127 1090752 2212749
33617 2212749 2699357 909874 -1701260 -1707873 1319116 3817761 3279653 1457454 1005191
33608 1005191 1653123 1825672 1725832 2287142 2746448 1802273 59768 -923699 -1076804
33599 -1076804 -1238034 -1106190 30748 1188550 554501 -1676469 -3158681 -2185267 620850
33590 620850 3281302 4149821 2964916 1055534 65469 24887 -350293 -1115499 -631926
33581 -631926 1483128 3104423 2861407 2444979 3476482 4225772 2385600 -586016 -1373481
33572 -1373481 12702 706453 191112 1024433 3871138 5609822 3796995 31316 -2716847
33563 -2716847 -3666120 -3500189 -2269640 68667 2460493 3754103 3955560 3466301 2195463
33554 2195463 361115 -974824 -1090476 -364447 685559 1904153 2592706 1692074 -348639
33545 -348639 -1407911 -317416 1729598 3236789 4378188 5932776 7702939 9071005
33537 9071005 9801985 9372990 7080439 3885179 2354191 3280345 4088497 2448411 -98344
33528 -98344 -382110 1656966 2987673 1810523 -421502 -1359679 -341273 1552434 2645941
33519 2645941 1829029 -301101 -1573269 -496891 1963305 3804452 4494438 4814792 4903891
33510 4903891 4061888 2200233 65439 -1748824 -2850625 -2670074 -1372295 -483208 -1055810
33501 -1055810 -1914801 -1475816 -477897 -639712 -1247853 42569 2960858 4218092 2181963
33492 2181963 -806766 -2107889 -2284384 -3136791 -4330501 -4309508 -3300690 -3026508 -3915995
33483 -3915995 -4671565 -4606793 -4640057 -5476368 -6116824 -5118449 -2833125 -1432499 -2399277
33474 -2399277 -4556153 -5385835 -4184202 -2719014 -2358836 -2076131 -533087 1288320 1540363
33465 1540363 616491 393498 906313 488482 -870247 -1266250 -366870 -37767 -607906
33456 -607906 197991 3002471 4670446 2817873 -338566 -1416730 -760231 -741830 -1230058
33447 -1230058 -410800 1263577 1831378 1747015 3072068 4970662 4146871 337695 -2622851
33438 -2622851 -2483919 -1610970 -2471897 -3516704 -2266953 125537 644877 -815044 -1580606
33429 -1580606 -372621 1422815 2379506 2457863 1826436 603379 63130 1791596 4832882
33420 4832882 5739754 2786082 -1435138 -3165780 -2045533 -727029 -748122 -1030599 -534642
33411 -534642 -159066 -1010231 -2414501 -3020727 -2836912 -2821017 -3233332 -3735728 -4400026 -5142501
33401 -5142501 -4885815 -3109598 -1672563 -2855472 -5756446 -7130599 -6077223 -5154846
33393 -5154846 -6006315 -6732499 -5186543 -2298168 -66815 1498608 3072687 3662665 2284876
33384 2284876 386738 -223748 -449189 -1918660 -3319443 -2232931 321768 1111576 105326
33375 105326 482900 2855992 3760465 1240786 -1911397 -2442563 -925083 402588 1250030
33366 1250030 2304083 2956392 2508010 1909007 2106320 2265716 1636460 1436844 2691413
33357 2691413 3876445 3172693 1639428 1542605 2638224 2793004 1524413 285633 -277567
33348 -277567 -793820 -1148331 -457922 927361 1588452 1223842 646437 -194007 -1813054
33339 -1813054 -2879024 -1164978 2475678 3917599 1106407 -2694934 -3096774 -415662
33331 -415662 1133705 -670683 -3540758 -4342301 -3076448 -1983309 -2062153 -2253835 -1752322
33322 -1752322 -1357917 -1933798 -2848680 -3043015 -2739898 -2761093 -2773923 -1835939 -393470 60004
33312 60004 -644885 -1200833 -1245633 -1771326 -2540645 -1562668 1578600 4231554 4333399 3439335
33302 3439335 3869718 4783689 3937389 1928740 1395058 2584077 3011117 1633679 355519
33293 355519 765886 2003752 2778753 3298801 4105762 4777864 4841607 4532226 3806489 2036130
33283 2036130 -392768 -1479147 262326 3809586 6576708 6902700 5300642 3765911
33275 3765911 3883327 5082647 5144301 3159223 1085657 979955 1753115 965002 -821042
33266 -821042 -478167 2645576 5210826 4509667 1927479 273162 1348 -25952 60094
33257 60094 796307 1688064 1825650 1424514 1247369 1281696 1238708 1397322 1707643 1137753
33247 1137753 -739441 -2590392 -3137245 -2972621 -3044909 -2623583 -730329 1456537 1899286
33238 1899286 772542 -81274 -406836 -1693189 -3836322 -4226005 -1362478 2413407 3391356
33229 3391356 885783 -2151936 -2690778 -784988 1117339 1457909 1266007 2152158 3507772
33220 3507772 3244975 1206866 -211641 352975 1103705 125026 -1297299 -707938 1477447
33211 1477447 2694500 2295930 1998480 2447184 2376791 1622841 1877796 3281277 3113181
33202 3113181 -206505 -4043091 -4766486 -2529264 -484221 -245176 -593840 -357112 -147471
33193 -147471 -730588 -1470866 -1380478 -728492 -649931 -1483396 -2189902 -1573590 195844 1689978
33183 1689978 2006109 1859995 2190803 2278245 712047 -1849364 -2790777 -1081113 1137446
33174 1137446 1671753 1227321 1575649 2408312 2294322 1579356 1626383 1818576 313692
33165 313692 -2223770 -2745827 -370601 2076309 2212163 1091191 570408 344299 -367464
33156 -367464 -600799 350222 765561 -761922 -2155093 -782743 1740881 1581436 -1065863
33147 -1065863 -2021824 190740 2032081 761115 -1407280 -1300056 384701 1172240 1115042
33138 1115042 1679622 2163270 707203 -2090522 -3766706 -3658397 -3115033 -2565504 -1373561
33129 -1373561 -346057 -1120597 -2731892 -2052909 1354874 3804998 2419430 -964403
33121 -964403 -2574034 -1337655 1138109 3420459 4870624 4687360 2700636 591326
33113 591326 334121 1662549 2683083 2634406 2288127 1835603 437431 -1673109 -2521551
33104 -2521551 -949769 1392379 1968164 644789 -316719 529028 1976563 2107284 1000366
33095 1000366 364469 939660 1718866 1959488 2448608 3811898 4778732 3670674 1036231
33086 1036231 -831476 -879715 -251610 -165628 -446671 -635150 -1045088 -1839936 -2171471 -1255230
33076 -1255230 309666 1035690 1075 -2422979 -4688146 -4903736 -2572074 369728
33068 369728 1432399 692809 578932 2206991 3794582 3618359 2613696 2455232 2636305
33059 2636305 1522759 -606164 -1680775 -743040 946393 1657426 838085 -784697 -1773253
33050 -1773253 -1136547 107404 -637513 -4229677 -7803858 -7847197 -4630381 -1686125 -1363828
33041 -1363828 -3007416 -5221191 -7376596 -8488882 -7171560 -3911276 -1460840 -1562550
33033 -1562550 -2698247 -2460477 -949009 -223388 -1076692 -1966768 -1194573 906706 2326201
33024 2326201 1627028 -336276 -1230208 -76818 1296635 624915 -1450182 -2067104 -267492
33015 -267492 1607577 1567539 1053045 2528899 5267942 5924264 3189071 -217694 -883839
33006 -883839 1332956 3554916 3299384 792996 -1733437 -2265660 -521652 2108130 3718323
32997 3718323 3203716 992343 -1220165 -1764034 -485717 1111846 1565602 1109574 1115193
32988 1115193 2072104 2977607 2860782 1998598 1180651 585046 49138 -195781 113052
32979 113052 569018 549831 106565 -327277 -800748 -1515225 -1837059 -813726 1104315
32970 1104315 2024050 959289 -690233 -941126 163326 966618 896230 1187631 2524060
32961 2524060 3459665 2363839 -7592 -1398320 -1142860 -756559 -1294200 -1780780 -1074121
32952 -1074121 44227 -107249 -1742176 -3462983 -4011256 -3048895 -670658 2455717 4574468
32943 4574468 4005822 1301020 -953934 -1164738 -615865 -1501716 -3842540 -5565088 -5469913
32934 -5469913 -4818967 -5320561 -6355611 -5507167 -2030992 1496418 2154922 564788 3775
32925 3775 1627220 2781839 1187930 -1310243 -1401049 655561 1562417 195937 -881116
32916 -881116 174145 1554080 987999 -513267 -493889 906004 1449664 667314 521213
32907 521213 2077921 3885371 4329506 3645636 2675384 1400452 -9486 -245878 1261786
32898 1261786 2564112 1406102 -1177750 -1748340 769274 3432369 3377238 1549259 687959
32889 687959 1212052 1393681 680175 195104 105437 -818111 -2526455 -3143333 -2072140
32880 -2072140 -1231705 -1816103 -2209986 -1035525 21695 -974289 -2486613 -1812518 163327
32871 163327 143549 -2199005 -3828663 -3513238 -3466931 -4843696 -5434806 -3782537 -2207749
32862 -2207749 -3064213 -4625717 -3798749 -1037223 739716 947019 1644065 3387668 4003468
32853 4003468 2054415 -966333 -2787833 -2881249 -2031401 -943360 -186123 -336398 -1200926
32844 -1200926 -1606565 -738397 741909 1439069 774434 -567528 -1515778 -1654777 -1440038
32835 -1440038 -1502368 -1914371 -2372759 -2890175 -3691175 -4452886 -4473432 -3769840 -3126619 -2828027
32825 -2828027 -2386018 -1810749 -1804570 -2145702 -1470763 348827 1256224 -117471 -2118498
32816 -2118498 -2409359 -1357779 -988589 -1599085 -1847647 -1581050 -1952878 -2824881 -2578583
32807 -2578583 -838705 851551 1508666 1775966 2043614 1612492 405646 -510859 -908903
32798 -908903 -1883221 -3379320 -3304442 -575012 2614443 3242893 1050494 -1771230 -3465628
32789 -3465628 -3850150 -3375711 -2494421 -1616484 -766754 297948 1109364 532961 -1498076
32780 -1498076 -3348780 -3728584 -3391324 -3761306 -4822013 -5548284 -5602807 -5340486 -4790614
32771 -4790614 -3884101 -3164984 -3090372 -3066460 -2295343 -1179603 -808693 -1367552 -2020761 -2078654
32761 -2078654 -1451806 -353650 617159 537299 -836665 -2453054 -3013235 -2234018 -663891
32752 -663891 964878 1712712 853134 -942172 -1966221 -1765171 -1658387 -2140324 -1742442
32743 -1742442 -10127 563497 -1946482 -5174635 -5310799 -2574597 -606522 -1048030 -2176890
32734 -2176890 -2740989 -3446559 -4142118 -3212101 -971326 -304583 -2280992 -4112569 -3339655
32725 -3339655 -1254380 -22726 892496 2733564 4149796 3111133 712929 -82481
32717 -82481 1234850 2461754 2245034 1259089 87253 -1498706 -3050397 -3523657 -3094212
32708 -3094212 -2904924 -2892803 -1968100 -574293 -737876 -2818246 -4348995 -3305338 -806039
32699 -806039 813880 1243611 1900268 3224703 3934425 2900237 636678 -1282560 -1735077
32690 -1735077 -910450 9427 27161 -715034 -1299135 -1257156 -958105 -740137 -356049 308026
32680 308026 516104 -604214 -2689964 -4028494 -3086887 -40556 3365312 5413309 5685452
32671 5685452 4798863 3403633 1907284 809390 476788 565789 400934 -38321 -299355
32662 -299355 -569308 -1488539 -2731147 -3124233 -2525595 -2026983 -1744023 -345841 2135998
32653 2135998 3216209 1582094 -137193 1187903 4459926 6108565 5550117 5354104
32645 5354104 6254428 5900851 3391761 1395915 2026699 3562212 3418541 2055448 1563192
32636 1563192 2091239 2097490 1062785 -173779 -1060258 -1571288 -1481141 -878932 -640275 -1029033
32626 -1029033 -813768 728963 2050668 1399312 -350419 -1056789 -713071 -1032700 -1992267
32617 -1992267 -1544380 762496 2426828 1432192 -893910 -1943641 -1363505 -824297 -1028457
32608 -1028457 -790012 768502 2552214 2839298 1607284 561417 927588 2118447 2911718
32599 2911718 3048207 2870989 2175492 715694 -599897 -619102 49002 -282905 -1539626
32590 -1539626 -1794993 -587440 18145 -1107268 -2002566 -851123 749333 357701 -1032373
32581 -1032373 -372677 2513436 4498273 3682643 1641351 723423 1410898 2866986 4059594
32572 4059594 3830398 1784201 -350100 -118391 2289505 3845979 2500901 -520677
32564 -520677 -2857598 -3646162 -3213081 -1938583 -559119 -165678 -772719 -1010508 -91595
32555 -91595 1054623 1294579 687533 -221100 -1062143 -1020221 666761 2699186 2180653
32546 2180653 -1481405 -4874399 -4507635 -1053880 2075830 3097802 2850625 2515349 2551081
32537 2551081 3359005 4954886 6146477 5685743 4041633 2603773 1560612 150074
32529 150074 -1434458 -2220332 -2339225 -2872926 -3783444 -3825406 -2775555 -2016590 -2474940
32520 -2474940 -3562836 -4618974 -5752667 -6589616 -5833626 -3152865 -220446 1270693
32512 1270693 1616391 2059532 2793501 3341799 4055344 5527604 6854581 6271627 3826665
32503 3826665 1877617 2157167 3501700 3585765 2164260 1199983 1868126 2835858 2151114
32494 2151114 -109365 -2073747 -2520859 -1993632 -1439044 -835469 222501 1294587 1396138
32485 1396138 436872 -432995 -218388 670459 1054259 647812 411844 1044990 1809750
32476 1809750 1546747 418893 -395898 -662763 -1439228 -3071895 -4196262 -3621416 -2041298
32467 -2041298 -740297 278270 1450383 2070918 1463407 839240 1669605 2773377 1768104
32458 1768104 -682984 -1236512 857166 2150976 275546 -2210279 -1716410 953946
32450 953946 2069245 468723 -1397015 -1334121 285413 1904334 2338188 1086097 -1060682
32441 -1060682 -1937743 -305657 2064649 2400831 647008 -833806 -959379 -952452 -1508217
32432 -1508217 -1433736 -7491 1312655 794356 -1245072 -3055973 -3464509 -2500087 -818010
32423 -818010 867899 2289672 3746954 5184668 5495818 3851266 1436043 377736
32415 377736 958967 1465284 920085 218910 135262 3622 -799028 -1590292 -1552346 -948432
32405 -948432 -358890 131346 244703 -742279 -2682977 -4086311 -3799193 -2190638 -90723
32396 -90723 2138569 3766771 3543448 1631963 338249 1431760 3774317 5035631 4738370
32387 4738370 3988034 3108198 1541031 -272782 -897178 12841 1166195 1523381 1469805
32378 1469805 1662054 1779069 1138969 -8745 -536251 161487 1138238 712450 -1381515
32369 -1381515 -3128944 -2416665 164369 2044293 2277161 2593789 4120587 5094542 3536293
32360 3536293 581584 -1128710 -1368373 -2060411 -3488069 -3549308 -1289926 1256158 1864386
32351 1864386 920104 154242 58495 67960 305735 1422696 2951333 3293887 1738996
32342 1738996 -348088 -928230 346781 1649384 1075741 -1063930 -2681492 -2654016 -2101501
32333 -2101501 -2284257 -2381747 -874758 1516974 2325063 933725 -332767 410133 1860282
32324 1860282 1551992 -571869 -2260326 -2033717 -562098 917571 2117478 3289575
32316 3289575 4346931 4977023 5105989 4797264 3967282 2564603 957033 -149075 -380265
32307 -380265 -233240 -549988 -1211073 -901402 1084433 3262500 3446808 1761519 578811
32298 578811 979163 1055775 -1051477 -4034116 -5183767 -4200580 -3053294 -2597861 -1689610
32289 -1689610 339814 2607712 4426966 5913573 6332998 4301750 697547 -1152430
32281 -1152430 80064 1421162 94533 -1763096 -120406 4478043 7264314 6002941
32273 6002941 3653039 3336621 4085964 3542688 2172644 2112763 3393071 4004038 3066405
32264 3066405 1608246 386423 -977871 -2443001 -2905352 -1825792 -339868 60209
32256 60209 -650436 -1195797 -790071 -246358 -1015781 -3182132 -4977737 -4888123 -3743974
32247 -3743974 -3512311 -4181741 -3647237 -1265856 454889 -785977 -3561148 -4544972 -2957214
32238 -2957214 -1073608 -721681 -1340762 -1550618 -824697 615147 2017649 2071133 178262
32229 178262 -2124947 -2625826 -1462001 -944903 -2058851 -3075298 -2359650 -678240 389040
32220 389040 729014 1055052 1250479 815726 181882 276314 1184577 2093534 2151335 923947
32210 923947 -1259276 -2989045 -2802380 -1077518 173602 -12705 -341203 516089 1862230
32201 1862230 2171801 1062402 -1014871 -3691451 -6016491 -6299729 -4207364 -1776012
32193 -1776012 -719341 -102878 1379200 2361827 766106 -2203992 -3175117 -1503525 4362
32184 4362 -466523 -1594939 -1956253 -2244186 -3089738 -3219422 -1623517 376586 1103191
32175 1103191 1020086 1412071 1894580 1208423 -453539 -1831522 -2630841 -3347971 -3602527
32166 -3602527 -2534153 -663007 426877 329263 178144 639769 1076199 1026147 1033620 1404354
32156 1404354 1418998 590318 -301140 -329174 168572 257923 -20133 219676 1135833 1684879
32146 1684879 1017251 -247351 -615589 573035 2387380 3288174 2621846 984440 -656818
32137 -656818 -1774538 -2213689 -1868670 -800910 635364 2154476 3746404 5150594 5529230
32128 5529230 4337401 2326097 929293 643170 704449 433181 117844 282350 728999
32119 728999 748011 -46830 -1267246 -1840481 -756593 1557460 2849024 1271915 -1852502
32110 -1852502 -3052997 -1161577 854957 -242459 -3703692 -6124136 -5944248 -4510296
32102 -4510296 -3301604 -2461956 -2000731 -2131368 -2118177 -1011241 -8896 -1694360 -5933802
32093 -5933802 -8850224 -7432083 -3327975 -422401 -263412 -1624622 -3051209 -3786299
32085 -3786299 -3320589 -2060283 -1568521 -2357885 -2532557 -585344 1690558 1508656 -705620
32076 -705620 -2165978 -2088937 -2195341 -3092973 -3271814 -2007665 -430112 728629 1735930
32067 1735930 1882956 -53693 -2727089 -2822549 126683 2677241 2645735 2103418 3277507
32058 3277507 4642331 3737934 1296016 -317127 -742233 -1010386 -1204103 -1397410 -2911878
32049 -2911878 -5699858 -6534777 -3281833 816830 1092548 -1640805 -2512835 -217442 1577803
32040 1577803 701743 -436212 407903 1705295 1389597 289044 -37764 -147190 -944050
32031 -944050 -1308811 -22908 1615006 1555378 181618 -529729 -133564 158214 -72223
32022 -72223 78430 955324 1562311 923804 -786103 -2650871 -3889696 -4258665 -3964322
32013 -3964322 -3225314 -2026659 -674805 -210151 -1220687 -2351743 -1399579 1777095 4807174
32004 4807174 5786378 5315201 4842755 4418682 3237315 1353410 -355176 -1260975 -1141921
31995 -1141921 -23008 1324706 1588214 521471 -462323 -205682 556899 507368 -158780
31986 -158780 -217638 519452 872281 -130971 -2185465 -4024590 -4271914 -2487860 45735
31977 45735 1211089 351281 -1022890 -1401197 -1109485 -1069037 -904895 208912 1596066
31968 1596066 1699772 396079 -873215 -1228547 -1139005 -948649 -103726 1556343 2839452
31959 2839452 2406005 520080 -1008282 -646591 1191239 2365625 1227896 -1331774
31951 -1331774 -2758990 -2110966 -1435740 -2892946 -5407059 -5832589 -3203981 -49073 934623
$$ [...]
##END NTUPLES=NMR SPECTRUM
##END=
