##TITLE=31Pdec_LR-753-R1-C1
 CDCl3, 24 sc
 26.7.2022
##JCAMPDX= 6.0         $$ Bruker NMR JCAMP-DX V2.0
##DATA TYPE= NMR SPECTRUM
##DATA CLASS= NTUPLES
##ORIGIN= UXNMR, Bruker Analytische Messtechnik GmbH
##OWNER= root
$$ XWIN-NMR		Version 3.5
$$ Tue Jul 26 15:53:25 2022 Russian Standard Time (UT+4h)  she@DPX200
##.OBSERVE FREQUENCY= 81.013821
##.OBSERVE NUCLEUS= ^31P
##.ACQUISITION MODE= SIMULTANEOUS
##.ACQUISITION SCHEME= undefined
##.AVERAGES= 24
##.DIGITISER RES= 16
##SPECTROMETER/DATA SYSTEM= spect
##.PULSE SEQUENCE= zgpg30
##.SOLVENT NAME= CDCl3
##.SHIFT REFERENCE= (INTERNAL, CDCl3, 0, 248.564)
##AUDIT TRAIL= $$ (NUMBER, WHEN, WHO, WHERE, WHAT)
$$ ##TITLE= Audit trail, XWIN-NMR		Version 3.5
$$ ##JCAMPDX= 5.01
$$ ##ORIGIN= Bruker BioSpin GmbH
$$ ##OWNER= she
$$ F:/spectra/data/she/nmr/P31/1/pdata/1/auditp.txt
$$ ##AUDIT TRAIL=  $$ (NUMBER, WHEN, WHO, WHERE, WHAT)
(   1,<2022-07-26 15:52:20.10 +0400>,<she>,<DPX200>,
      <created by zg, POWCHK disabled, PULCHK disabled
       configuration hash MD5:
       00 E9 B6 7A A2 85 ED C7 34 08 36 98 17 FE 4E 26
       data hash MD5: 32K
       87 63 56 26 EF 92 B5 9C 45 65 2E 21 72 93 C1 28>)
(   2,<2022-07-26 15:52:22.67 +0400>,<she>,<DPX200>,
      <Start of raw data processing
       efp BC_mod = 2 LB = 1 FT_mod = 6 PKNL = 1 PHC0 = -10334.27 PHC1 = 21.45686 SI = 64K 
       data hash MD5: 64K
       E7 A0 4D CA 43 94 5F E7 10 2D 1C CF 3C C9 7B 6A>)
(   3,<2022-07-26 15:52:43.70 +0400>,<she>,<DPX200>,
      <pk PHC0 = 116.0443 PHC1 = -44.40002 
       data hash MD5: 64K
       6C B2 C0 85 AD 9B 01 21 C1 4A C1 40 00 10 10 CE>)
(   4,<2022-07-26 15:52:46.92 +0400>,<she>,<DPX200>,
      <abs ABSG = 5 
       data hash MD5: 64K
       3E 80 23 E1 6F 64 E1 0E 32 55 7F 22 5E 6D B9 B4>)
$$ ##END=
$$ 
$$ hash MD5
$$ FC A2 FD 05 24 B5 17 AE A0 66 02 05 04 4D CC 66
##$RELAX= 
##$RELAX= 
##$RELAX= 
##$RELAX= 
##$RELAX= 
##$RELAX= 
##$RELAX= 
##$RELAX= 
$$ Bruker specific parameters
$$ --------------------------
##$DU= <F:/spectra>
##$EXPNO= 1
##$NAME= <P31>
##$PROCNO= 1
##$TYPE= <nmr>
##$USER= <she>
##$AMP= (0..31)
100 100 100 100 100 100 100 100 100 100 100 100 100 100 100 100 100 100 
100 100 100 100 100 100 100 100 100 100 100 100 100 100 
##$AQSEQ= 0
##$AQ_mod= 1
##$AUNM= <au_zg>
##$AUTOPOS= <>
##$BF1= 81.014009
##$BF2= 200.13
##$BF3= 200.13
##$BF4= 200.13
##$BF5= 200.13
##$BF6= 200.13
##$BF7= 200.13
##$BF8= 200.13
##$BYTORDA= 1
##$CFDGTYP= 0
##$CFRGTYP= 5
##$CHEMSTR= <none>
##$CNST= (0..31)
1 1 145 1 1 1 1 1 1 1 1 1 1 1 1 1 1 1 1 1 1 1 1 1 1 1 1 1 1 1 1 1 
##$CPDPRG= <waltz16>
##$CPDPRG1= <>
##$CPDPRG2= <waltz16>
##$CPDPRG3= <>
##$CPDPRG4= <mlev>
##$CPDPRG5= <mlev>
##$CPDPRG6= <mlev>
##$CPDPRG7= <mlev>
##$CPDPRG8= <mlev>
##$CPDPRGB= <>
##$CPDPRGT= <>
##$D= (0..31)
0 1 0 0 0 0 0 0 0 0 0 0.03 2e-05 3e-06 0 0 0 0 0 0 0 0 0 0 0 0 0 0 0 0 
0 0 
##$DATE= 1658836339
##$DBL= (0..7)
120 120 120 11 120 120 24 19 
##$DBP= (0..7)
150 150 150 150 150 150 150 150 
##$DBP07= 0
##$DBPNAM0= <>
##$DBPNAM1= <>
$$ [...]
##$SUBNAM3= <"">
##$SUBNAM4= <"">
##$SUBNAM5= <"">
##$SUBNAM6= <"">
##$SUBNAM7= <"">
##$SUBNAM8= <"">
##$SUBNAM9= <"">
##$SW= 501.771253377433
##$SWIBOX= (0..15)
0 1 3 0 0 0 0 0 0 0 0 0 0 0 0 0 
##$SW_h= 40650.406504065
##$TD= 32768
##$TD0= 1
##$TE= 0
##$TE2= 300
##$TE3= 300
##$TEG= 300
##$TL= (0..7)
0 120 53 12 22 120 120 120 
##$TP= (0..7)
150 150 150 150 150 150 150 150 
##$TP07= 0
##$TPNAME0= <>
##$TPNAME1= <>
##$TPNAME2= <>
##$TPNAME3= <>
##$TPNAME4= <>
##$TPNAME5= <>
##$TPNAME6= <>
##$TPNAME7= <>
##$TPOAL= (0..7)
0.5 0.5 0.5 0.5 0.5 0.5 0.5 0.5 
##$TPOFFS= (0..7)
0 0 0 0 0 0 0 0 
##$TUNHIN= 0
##$TUNHOUT= 0
##$TUNXOUT= 0
##$USERA1= <user>
##$USERA2= <user>
##$USERA3= <user>
##$USERA4= <user>
##$USERA5= <user>
##$V9= 5
##$VALIST= <valist>
##$VCLIST= <CCCCCCCCCCCCCCC>
##$VD= 0
##$VDLIST= <DDDDDDDDDDDDDDD>
##$VPLIST= <PPPPPPPPPPPPPPP>
##$VTLIST= <TTTTTTTTTTTTTTT>
##$WBST= 1024
##$WBSW= 4
##$XGAIN= (0..3)
0 0 0 0 
##$XL= 0
##$YL= 0
##$YMAX_a= 9637
##$YMIN_a= -11323
##$ZGOPTNS= <>
##$ZL1= 120
##$ZL2= 120
##$ZL3= 120
##$ZL4= 120
##$ABSF1= 248.5645
##$ABSF2= -253.2056
##$ABSG= 5
##$ABSL= 3
##$ALPHA= 0
##$AQORDER= 0
##$ASSFAC= 0
##$ASSFACI= 0
##$ASSFACX= 0
##$ASSWID= 0
##$AUNMP= <proc_1d>
##$AZFE= 0.1
##$AZFW= 0.5
##$BCFW= 0
##$BC_mod= 2
##$BYTORDP= 0
##$COROFFS= 0
##$CY= -3
##$DATMOD= 1
##$DC= 0
##$DFILT= <>
##$DTYPP= 0
##$F1P= 0
##$F2P= 0
##$FCOR= 1
##$FTSIZE= 65536
##$FT_mod= 6
##$GAMMA= 0
##$GB= 0
##$INTBC= 1
##$INTSCL= 5.30512e-09
##$ISEN= 30
##$LB= 1
##$LEV0= 0
##$LPBIN= 0
##$MAXI= 10000
##$MC2= 0
##$MEAN= 0
##$ME_mod= 0
##$MI= 50
##$NCOEF= 0
##$NC_proc= -6
##$NLEV= 6
##$NOISF1= 182.463
##$NOISF2= 159.3651
##$NSP= 0
##$NTH_PI= 0
##$NZP= 0
##$OFFSET= 248.5645
##$PC= 4
##$PHC0= -10218.23
##$PHC1= -22.94316
##$PH_mod= 1
##$PKNL= yes
##$PPARMOD= 0
##$PSCAL= 0
##$PSIGN= 0
##$REVERSE= no
##$SF= 81.014009
##$SI= 65536
##$SIGF1= 159.3651
##$SIGF2= -187.1042
##$SINO= 113.3802
##$SIOLD= 16384
##$SREGLST= <1H.CDCl3>
##$SSB= 0
##$STSI= 65536
##$STSR= 0
##$SW_p= 40650.406504065
##$SYMM= 0
##$S_DEV= 0
##$TDeff= 32768
##$TDoff= 0
##$TI= <>
##$TILT= no
##$TM1= 0
##$TM2= 0
##$TOPLEV= 0
##$USERP1= <user>
##$USERP2= <user>
##$USERP3= <user>
##$USERP4= <user>
##$USERP5= <user>
##$WDW= 1
##$XDIM= 65536
##$YMAX_p= 532654927
##$YMIN_p= -5073875
$$ End of Bruker specific parameters
$$ ---------------------------------
##NTUPLES= NMR SPECTRUM
##VAR_NAME=  FREQUENCY,     SPECTRUM/REAL,   SPECTRUM/IMAG
##SYMBOL=    X,             R,               I
##VAR_TYPE=  INDEPENDENT,   DEPENDENT,       DEPENDENT
##VAR_FORM=  AFFN,          ASDF,            ASDF
##VAR_DIM=   65536,         65536,           65536
##UNITS=     HZ,            ARBITRARY UNITS, ARBITRARY UNITS
##FACTOR=    0.620285442955139, 1,           1
##FIRST=     20137.2065510759, 0,            0
##LAST=      -20513.1999529892, 0,           0
##MIN=       -20513.1999529892, -5073875,    0
##MAX=       20137.2065510759, 532654927,    0
$$ Real data points
##PAGE= N=1
##DATA TABLE= (X++(R..R)), XYDATA
$$ [...]
40518a258915L71541J500378J668654Q01481n06346j280054j079760m27686L4079
40509a76628L22785N79612M43528k34668o49282o0622Q17151O18204o13507j371631
40499c25058q33520J01758L27647O0640J89333Q22081J268547J092947M93080
40490C197455k00907q14853j141430r70343m56635j18971k35929m30854j47213
40481a319680N11415P80725K46927m84573n33374N4232M09361J27685j87240J02776
40471b91746P01913P79436J9572j035830j486712q25819M65023J076935K08127
40462c89101j217568j453846k40983P79563M14511m39642l68159L87646N94613
40453a932966J42449K640L94504N04922Q4658o4907M69993R43170N93244l00071
$$ plain form
40518 -1258915 -887374 613004 2281658 3083139 2576793 1296739 216979 -210707 -176628
40509 -176628 146157 725769 1169297 934629 285347 224725 1041876 1660080 1046573 -325058
40499 -325058 -1158578 -1056820 -729173 -668533 -479200 342881 1611428 2704375 3197455
40490 3197455 2996548 2181695 1040265 69922 -386713 -505684 -741613 -1172467 -1319680
40481 -1319680 -808265 -27540 219387 -265186 -798560 -744328 -334967 -207282 -394522 -291746
40471 -291746 410167 1189603 1209175 173345 -1313367 -2139186 -1674163 -597228 -389101
40462 -389101 -1606669 -3060515 -3301498 -2521935 -2107424 -2547066 -2915225 -2527579 -1932966
40453 -1932966 -1790517 -1787877 -1393373 -888451 -803793 -868700 -398707 544463 1137707 837636
40443H37636r41407r37304l92903K89594N17346M0131n20860l70083K20777K49425
40433a007648l70307n95845k313M38804k8393o26865k81732O28465Q56365J66362
40423h23107m62891l79288l0843o8547m15914n42906k46149J66222L32061K48350
40413b223012J43391L9275k46206n28619j88528P91220J208611N7910j629262
40404b575220j655381L52999K152632J773809m462j088623r17300m76441k04076
40395b642063L89829J143058R97266k11634j088387n58260N87637Q99834L01655
40386a81065r1800J88151L80762j47913q50896p90911j402N61177L31563j70502
40376g72836j72892K66189M76543K64426J54445M39273O11790J67413m67793m38080
$$ plain form
40443 837636 -103771 -1041075 -1433978 -1144384 -627038 -586907 -1107767 -1477850 -1257073 -1007648
40433 -1007648 -1377955 -1973800 -1976113 -1537309 -1565702 -2192567 -2474299 -1845834 -989469 -823107
40423 -823107 -1285998 -1665286 -1696129 -1764676 -2180590 -2723496 -2969645 -2803423 -2471362 -2223012
40413 -2223012 -2079621 -2040346 -2286552 -2815171 -3003699 -2212479 -1003868 -945958 -2575220
40404 -2575220 -4230601 -3877602 -1724970 48839 44377 -1044246 -1961546 -2437987 -2642063
40395 -2642063 -2252234 -1109176 -111910 -323544 -1411931 -1970191 -1382554 -482720 -181065
40386 -181065 -272865 -84714 296048 148135 -702761 -1493672 -1495074 -933897 -602334 -772836
40376 -772836 -945728 -679539 -202996 61430 215875 655148 1266938 1434351 966558 528478
40366E28478K60755O63386J51435o53864p02409R2339P87793P26738M03404P01806
40356B959861J596756K150703J774969R19376K93206m9377m10119o97417o22641
40347G915317l93074n02541q91555r73475n32031M68K20023J68448O1973J37454
40337E211007O86654J604556K041551J310772J0544p30682r72756j621688k384386
40328E155572j807327J20351J252031K73652j243348j262181l08125k13028r49644
40319A017953r18974J65815R03506O20615J39196j8215l20743q15946p65699j31565
40309a24057J66244q5998l5074M92630N48099n9479j92595M93107O40256m79872
40299A363261j426060q07261M40689O52464N9041l0012L01368m9294r14181r85460
$$ plain form
40366 528478 789233 1452619 1604054 950190 247781 340120 1127913 1854651 2258055 2959861
40356 2959861 4556617 6707320 8482289 9401665 9694871 9645494 9235375 8537958 7915317
40347 7915317 7522243 7019702 6128147 5154672 4622641 4623109 4843132 5011580 5073553 5211007
40337 5211007 5897661 7502217 9543768 10854540 10865084 10134402 9161646 7539958 5155572
40328 5155572 3348245 3468596 4720627 4994279 3750931 2488750 2180625 1967597 1017953
40319 1017953 98979 264794 1168300 1788915 1928111 1909896 1589153 773207 7508 -124057
40309 -124057 42187 -43811 -78885 413745 961844 902365 709770 1202877 1843133 1363261
40299 1363261 -62799 -870060 -429371 223093 282134 252122 553490 504196 -409985 -1395445
40289a395445j05418M32577K6930m12902j12262M92231P32528O11443L23510j47526
40279D45666n98203o14699k71211n5829R291L35819P94458P18414L1456n49402
40269B45760n95516l49926L7989O21255R21573L21017n88138m25228P63599J199489
40259B151874L6386j172834q31100K31049J91494q40188j151793k11212P06098
40250h90226O86728L40079M19434O25773L82948j59800m89007m07763O0566P96690
40240A365422J257749P36567n81365j471458j157206l98862m18432j134545j271050
40231c073180j42357J397196J993262J315241K32408l22630l29013m05845p41843
40222g6761p04566J85578J202161J037351l96827j534301j035868M61923J228358
$$ plain form
40289 -1395445 -1500863 -1068286 -1041356 -1454258 -1566520 -1074289 -341761 269682 593192 445666
40279 445666 -152537 -767236 -1038447 -1094276 -1084985 -749166 45292 763706 795162 245760
40269 245760 -349756 -699682 -661693 -40438 881135 1202152 614014 188786 952385 2151874
40259 2151874 2188260 1015426 184326 415375 606869 -233319 -1385112 -1596324 -890226
40250 -890226 -203498 136581 556015 1181788 1564736 1404936 915929 508166 568732 1365422
40240 1365422 2623171 3359738 2778373 1306915 149709 -249153 -667585 -1802130 -3073180
40231 -3073180 -3215537 -1818341 174921 1490162 1722570 1399940 1070927 665082 -76761
40222 -76761 -781327 -595749 606412 1643763 1246936 -287365 -1323233 -861310 367048
40213C67048P11288k0355n3505K06892J7253m86024p18280o30743m76960r5842
40203a179228O62345J125909M79550p96708j244438l78441P04691J012341Q72235
40194A258256Q55101N71906m07856j236712p30450O90562J323705M93807o31807
40185B186512q04314k30663J29413k4931k63318k56672q6402M3280M807k08674
40175D89038m42197n16201m31522k39804J55384O98198Q78214L12352m87433o30653
40165b14624r8508L08512K88865L57897O58599N17279l19390r63023n99226L17044
40155B53425P91589N92798J40753l18811p15157q16337n51249k31873M7506O21883
40145a85473J350191J338181L27835n27064k95778J69702l90196j418025j298997
$$ plain form
40213 367048 1078336 1057981 1004476 1211368 1228621 742597 24317 -606426 -1083386 -1179228
40203 -1179228 -516883 609026 1088576 291868 -952570 -1331011 -626320 386021 1258256
40194 1258256 2113357 2685263 2277407 1040695 310245 1000807 2324512 2818319 2186512
40185 2186512 1382198 1151535 1280948 1256017 992699 736027 649625 692905 697712 489038
40175 489038 46841 -469360 -900882 -1140686 -985302 -287104 591110 903462 416029 -214624
40165 -214624 -313132 -4620 284245 642142 1300741 1818020 1498630 535607 -63619 253425
40155 253425 1045014 1637812 1778565 1459754 744597 -71740 -622989 -854862 -807356 -185473
40145 -185473 1164718 2502899 2830734 2303670 2007892 2177594 1787398 369373 -929624
40136i29624K656Q04479K99254l50309R718Q22961Q55968k603p51385n93714K60391
40125D27792Q49397L88573p81838j370553o97881L49402O38879M74213Q14709
40116A092693J326645P86614p01308j596766j238893o00099l47980R1289Q81449
40107c06356R81923L9442n52279K05446J111669O00212p73896j306617p09458
40098g09914k2205L64989Q53716J196992O71636l69989p08977j68358Q6627n65481
40088F29036j246979r33909J86305J129572J215137N01661l36360n06974M2258
40079F79747M40933J17767k31572K47357R78256O96759m81949j152969p94426
40070D99903l86790n99851q25002n31058j99767j91341L2349O56792P09613l33626
$$ plain form
40136 -929624 -926968 -122489 176765 -173544 -163826 659135 1515103 1512500 761115 167401 427792
40125 427792 1277189 1665762 883924 -486629 -1184510 -835108 -196229 277984 1092693
40116 1092693 2419338 3205952 2504644 907878 -331015 -931114 -1279094 -1187805 -306356
40107 -306356 675567 715009 162730 368176 1479845 2080057 1306161 -456 -709914
40098 -709914 -732119 -367130 486586 1683578 2355214 1985225 1276248 1107890 1194517 629036
40088 629036 -617943 -1551852 -1365547 -235975 979162 1480823 1144463 637489 679747
40079 679747 1120680 1238447 1006875 1254232 2232488 2929247 2447298 1294329 499903
40070 499903 113113 -486738 -1311740 -1842798 -2042565 -2233906 -2201557 -1544765 -835152 -1168778
40060a168778j174145l54534J377931J929530Q01256l79870l62669J84439J45196
40051I98356l08810l79117j72415m00758r05140p07498K91532P77996j41605j367203
40041b314662j116091N25447J594746R65332j75216k19246N74930P94633J30044
40032G59917m56738n02351n26000o76398l16019O30747J173384P21968k9650l93681
40022C85179p85282j582811j874241o52368J304596K136236J321784J47230k85198
40013A15125k95832n48566q16154m94088L09820Q88525Q38077L55135j75888n08056
40003c31902n49465l39293J1784M38801Q49795R23466L09256p58926j349571p50676
39993a546731N52940J232123O20291m22940n09152N11935J275282O27460q17990
$$ plain form
40060 -1168778 -2342923 -2697457 -1319526 610004 1411260 1031390 668721 853160 998356
40051 998356 689546 310429 138014 -262744 -1167884 -1875382 -1583850 -805854 -947459 -2314662
40041 -2314662 -3430753 -2905306 -1310560 -345228 -520444 -739690 -164760 629873 759917
40032 759917 303179 -199172 -725172 -1401570 -1717589 -1086842 86542 808510 778860 385179
40022 385179 -400103 -1982914 -3857155 -4509523 -3204927 -1068691 253093 400323 115125
40013 115125 -180707 -729273 -1545427 -2039515 -1729695 -841170 -3093 352042 176154 -331902
40003 -331902 -881367 -1220660 -1208876 -770075 79720 1003186 1312442 553516 -796055 -1546731
39993 -1546731 -993791 238332 858623 435683 -73469 438466 1713748 2341208 1523218
39984A523218j433568o89654K74113L46246j19656j22142L88051N83178J31551
39975H81337m14875n98488n93290n92174l88526J22922O09714P84406P28827M90613
39965A030466n6480o37283n54098K38011P05697J15886p35847n99998L43249P84111
39955F33714K96417j73270K0690K74046o7118o13617p32073n83785n76047m81312
39945b002355J9382M75219K92419j85259j79710K42761L75967J27291K5005J06473
39935g02807p8642l56755l1146P13678P57709j78986r12412n71187J44296K88900
39925i27352J75466M90199Q26230M01588l76156m45910J47498M08289J60743K33973
39915A094568P34767N72054p31447j918091j528712J48142J445611J245861m0833
$$ plain form
39984 1523218 89650 -600004 -325891 20355 -99301 -221443 166608 749786 881337
39975 881337 466462 -132026 -725316 -1317490 -1706016 -1583094 -973380 -188974 539853 1030466
39965 1030466 973986 336703 -217395 20616 726313 842199 106352 -493646 -150397 633714
39955 633714 930131 756861 777551 1051597 984479 370862 -361211 -944996 -1521043 -2002355
39945 -2002355 -1982973 -1507754 -1215335 -1400594 -1580304 -1337543 -961576 -834285 -809280 -702807
39935 -702807 -781449 -1138204 -1169350 -455672 302037 123051 -789361 -1360548 -1216252 -927352
39925 -927352 -751886 -261687 564543 966131 589975 144065 291563 699852 860595 1094568
39915 1094568 1829335 2401389 1669942 -248149 -1776861 -1628719 -183108 1062753 1021920
39906A021920j121504r96603K38856J413651J356539J97451p57158o58337q5469
39897F09346J7161k32097n0676N23075N16347m67330j445398j250493n2323Q83624
39887i48764P58919J650n39971n92579l77989j0242M97415Q27033N67591j08234
39877G4829n02684k92634J01230K47361K83717M23627L97968p2898o03047n29414
39867d71945J99946J006090J358090J038576M4009j180458j673525q87446L78163
39858a88500P07636k03209j201655j149415j28736R18501J162282M06377p44831
39849d21550j150414k26584J115486J364837L83921m10098j35575L51609L1045
39840I02677n33274j72939P98890R00181k19808j166581q48769K8319K26732j75749
$$ plain form
39906 1021920 -99584 -1096187 -857331 556320 1912859 2110310 1353152 694815 609346
39897 609346 626507 394410 343734 866809 1383156 915826 -529572 -1780065 -1832388 -948764
39887 -948764 -189845 -188195 -728166 -1320745 -1698734 -1708976 -1211561 -384528 183063 74829
39877 74829 -427855 -720489 -619259 -371898 -88181 335446 733414 660516 57469 -471945
39867 -471945 -271999 734091 2092181 3130757 3174766 1994308 320783 -566663 -188500
39858 -188500 519136 315927 -885728 -2035143 -2163879 -1245378 -83096 323281 -421550
39849 -421550 -1571964 -1798548 -683062 681775 1065696 655598 520023 871632 902677
39840 902677 369403 196464 995354 1895535 1675727 509146 -339623 -311304 -84572 -260321
39830b60321k28221J29945J5558o75241p76364L25156J415662J030556l51058
39821F25672r60605l08499L57762K88163L05248R41107J047244l83661k089280
39812a76849j925367R2169J751169J528555N9371j264887j706639j049324M45657
39803b246145J558492J007061o20254j179211J03573J397699R08991n64355j022042
39794f56191j80399N54428M35989J07204J41801K73260K10610Q9282q4584m75504
39784D15896p30172k02058Q64115J296641N66564m36551p28020n39262n68088
39775f0935o04255K4603R47617R47656j35675q85461l31995N10029J69828r50054
39765c68642j187369k47359M56195K80590L59938J316606J714505K94852j566695
$$ plain form
39830 -260321 -488542 -358597 -343039 -1018280 -1794644 -1469488 -53826 976730 625672
39821 625672 -334933 -643432 -285670 2493 307741 1248848 2296092 1912431 -176849
39812 -176849 -2102216 -2010047 -258878 1269677 1329048 64161 -1642478 -2691802 -2246145
39803 -2246145 -687653 319408 -300846 -1480057 -1376484 21215 930206 365851 -656191
39794 -656191 -836590 -282162 153827 261031 402832 676092 886702 975984 891400 415896
39784 415896 -314276 -516334 347781 1644422 2210986 1774435 1046415 507153 -60935
39775 -60935 -665190 -640587 307030 1254686 1119011 233550 -98445 411584 581412 -368642
39765 -368642 -1556011 -1803370 -1347175 -1066585 -706647 609959 2324464 2619316 1052621
39756A052621j569122J03100J134694N56176k22241j9723M68602K53423l78604
39747A378926p00480o75098n00476j11168K49411J9982n77010n34988L16900Q91427
39737b42574O10327L01027O19755R00833M64389j69225l47769m07465p12861p07296
39727C09141r63O54907N65281K26067K12906O9965n54058q67466l27331J35835
39717D24284k94314p32618j80386N42251K86709j90166L80686J165052M44884
39708A846382j201746j536442k41449O99371L03044k10154O2781L12097j24776
39699i0892n15406k23370J93762J80946Q0127J89599K23209J65811L65845M97804
39689A067435j03943q75307n08587O89760Q79641l27995j059807k36756O73045
$$ plain form
39756 1052621 -516501 -413401 721293 1277469 1055228 1035505 1504107 1757530 1378926
39747 1378926 678446 3348 -497128 -608296 -358885 -338903 -915913 -1450901 -1134001 -242574
39737 -242574 367753 668780 1288535 2189368 2653757 2484532 2136763 1729298 1016437 309141
39727 309141 308178 963085 1528366 1754433 1967339 2037304 1483246 615780 288449 424284
39717 424284 129970 -602648 -783034 -240783 45926 -144240 236446 1401498 1846382
39708 1846382 644636 -891806 -1133255 -433884 -130840 -340994 -278213 33884 -90892
39699 -90892 -606298 -829668 -635906 -454960 -374833 -185234 37975 203786 569631 1067435
39689 1067435 963492 88185 -420402 269358 1148999 821004 -238803 -475559 197486
39680A97486K34679n97389l56531L75226K05530n25511m70089K70082L83855l53790
39670f36452p95202l33621L60166N69456L50004M9844r7377R4092N33254P04002
39660G98166L54324J5393J80120L89061o5320q96371j187219p77938l95054m49834
39650b034672n12183r1464O49661J116842Q89679Q3507o91250q45014m30606l2840
39640a898340M0034P0295L22961O28008P82336Q59016Q75811O69105L23288J75341
39630B847855J85500q3327o61484j043318j055175j035646r24426j80350R74118
39621i76253J330924M13003n90917m57607L90595P70515M84946J17245k30855
39612A251596p84871j118115n62461N34586J027116M80521l69896p11013m88044
$$ plain form
39680 197486 432165 -165224 -521755 -146529 59001 -466510 -936599 -666517 -282662 -636452
39670 -636452 -1431654 -1765275 -1405109 -835653 -485649 -435805 -533182 -439090 94164 798166
39660 798166 1152490 1167883 1348003 1737064 1671744 775373 -411846 -1189784 -1584838 -2034672
39650 -2034672 -2546855 -2638319 -1988658 -871816 17863 101370 -589880 -1434894 -1865500 -1898340
39640 -1898340 -1858306 -1788011 -1465050 -837042 -54706 804310 1680121 2349226 2672514 2847855
39630 2847855 3033355 2950028 2288544 1245226 190051 -845595 -1770021 -1950371 -976253
39621 -976253 354671 767674 176757 -280850 109745 880260 1365206 1482451 1251596
39612 1251596 466725 -651390 -1213851 -679265 347851 828372 458476 -252537 -740581
39603g40581q0639K38516L62553K71357M6850j83464l16113k75594j16608n1470
39593h45193q0362K03089R18677J302370O44544l89892m97451K71993O04263J28278
39583B260316m1603N78019Q58733L0499r43129j036018p51953q21850p10573J41264
39573d36295Q60836N29550q9510J07999N44201J17457n53723j17525R53245R84868
39563B901103p8376o72695l18711j46130n71116n84430J92844O93083K89664k13229
39553A492007j84160j75790n51704n93795Q1885N31921k6075q00670o18576K86539
39543e58418P79852N31665J48040m4511l10049o55716n67367J31172P21886L80380
39533E56934o23296j030857j76627R57901R24094j55820o85931J30798J218180
$$ plain form
39603 -740581 -821220 -582704 -220151 51206 98056 -85408 -401521 -677115 -793723 -845193
39593 -845193 -925555 -722466 196211 1498581 2143125 1753233 1255782 1527775 2132038 2260316
39583 2260316 2218713 2796732 3655465 3685964 2742835 1706817 954864 133014 -577559 -436295
39573 -436295 424541 954091 864581 972580 1516781 1634238 1080515 962990 1916235 2901103
39563 2901103 2822727 2150032 1831321 1685191 1114075 529645 722489 1415572 1705236 1492007
39553 1492007 1307847 1132057 580353 -13442 68443 600364 574289 -226381 -844957 -558418
39543 -558418 221434 753099 901139 856628 546579 -109137 -676504 -545332 176554 556934
39533 556934 -66362 -1097219 -1273846 -315945 608149 452329 -233602 -102804 1115376
39524A115376J299643N29122k82111r51856j453476j220461j48500O30806K97621
39515a83836k21629K01149Q59440M46834n10902m85953L59404M97266k35189m76138
39505B50446J17985M17163R6887J57260P84464Q57212J27408k01115K82088M22409
39495C312207k91560p81854m61832k15139l94263O626J070244J086256n76385
39486B754300j869602j108480L46624M54549k61149j37586M87749J87544n60590
39477B93359n8895J424413J830208O51151l62546j83652N1507o73862j415240
39468A556443q20545P19742J604859J053332k55338j232004j439040j154325p49669
39459g16545k61618L00460N14154J7957o46220n32586K23649M71949o7428k47560
$$ plain form
39524 1115376 2415019 2944141 2662030 1710174 256698 -963763 -1112263 -481457 -183836
39515 -183836 -405465 -204316 655124 1101958 591056 105103 464507 961773 726584 250446
39505 250446 368431 785594 882481 1039741 1824205 2681417 2808825 2607710 2889798 3312207
39495 3312207 3020647 2238793 1776961 1561822 1167559 1174185 2244429 3330685 2754300
39486 2754300 884698 -223782 122842 577391 316242 178656 666405 853949 293359
39477 293359 234464 1658877 3489085 4140236 3777690 3594038 3645545 2971683 1556443
39468 1556443 735898 1455640 3060499 4113831 3858493 2626489 1187449 33124 -716545
39459 -716545 -978163 -677703 -163549 -145592 -791812 -1324398 -1100749 -628800 -696228 -943788
39449i43788N19508J094878M90129l78153k14308M68601L52425l13588j95232
39440H80472P14382J023899K21209o30197o18537m1329M14991M07245j77177j018576
39430A176382j202282l21469O03095N12985P9684N19894J221879O34204p54444
39421B469928q24753N27084Q72720o93813j708968k42411J757469J421939n10056
39412C069139j008647L60962R83229l72200j621270q16442Q48381J049064k41352
39403B250864j133652p80883j70723j46600k08535L25330J073041J177782N56017
39394B942641p7275j86019P6784K64552J60133j67374n83344r74758j136155p70965
39384d51780J26621R06554P36714k65762q69614k95035N24665K21488p90562q08257
$$ plain form
39449 -943788 -424280 670598 1160727 782574 568266 1036867 1389292 1075704 880472
39440 880472 1594854 2618753 2839962 2209765 1591228 1549899 1964890 2372135 2194958 1176382
39430 1176382 -25900 -347369 255726 768711 848395 1368289 2590168 3224372 2469928
39421 2469928 1645175 2172259 3044979 2351166 642198 399787 2157256 3579195 3069139
39412 3069139 2060492 2421454 3404683 3032483 1411213 594771 1443152 2492216 2250864
39403 2250864 1117212 336329 165606 19006 -189529 135801 1208842 2386624 2942641
39394 2942641 2865366 2679347 2756131 3020683 3180816 3013442 2430098 1455340 319185 -451780
39384 -451780 -325159 581395 1318109 1052347 182733 -112302 412363 633851 -156711 -964968
39374i64968L58677Q58140j88183j004700J9393J470805J020156p55772j257845
39365d44297l8719P31550O2256m87539O2646M20120k78525o54492K73875R25730
39355E72605j94351j580394r81431Q20495J213755j09156r91032m74405N6573
39346a667341l67606p97566k88770N65553Q35101N63389J86682j89000l75608
39337a535166j4701O31355P58253K69091K194L54077O27280K01314m87980o59668
39327A46049k57300J48164J10783l17572o75363m79383K33201Q87854J116548
39318I12981J106034R00421Q3297j229077j909136j269182k40203j0794k36734
39309a892393R7916P46845O91379O3029r6527K94769L92532J27490J84755M19426
$$ plain form
39374 -964968 -606291 251849 63666 -941034 -921641 549164 1569320 813548 -444297
39365 -444297 -483016 248534 310790 -176749 -114103 306017 27492 -627000 -353125 572605
39355 572605 378254 -1202140 -2183571 -1363076 -149321 -258477 -1249509 -1723914 -1667341
39346 -1667341 -2034947 -2832513 -3121283 -2555730 -1720629 -1157240 -970558 -1159558 -1535166
39337 -1535166 -1549867 -918512 -160259 108832 111026 465103 1092383 1293697 805717 146049
39327 146049 -111251 36913 147696 -169876 -845239 -1324622 -1091421 -203567 912981
39318 912981 2019015 2919436 3002733 1773656 -135480 -1404662 -1644865 -1655659 -1892393
39309 -1892393 -1794477 -1047632 -356253 -293224 -389751 -94982 297550 425040 609795 1029221
39299A029221N2783n95541m15095L80231L69185n94826r87179j69969N77975K80604
39289g2611k58368l0844O58883J046197R16061J75844j145818k001791j087006
39280a799453R19868J651403L27501j094390r35558n4193Q2424k51886q7788L72200
39270h69872M54005L49818M08523K40270k90261l98743J86844M73342l3010l39036
39260A81880Q4085J16011q00024j132651K06781J591112J124643k05685k71605
39251H94547O23385N90512l90696o71733m4531J09973l86040j68317J064607J895554
39241C517261J422745K35798r49916j830960j779763m94389P21397L37329q55419
39232C24083p23163P64203J463594N90630k40738l1857J07186o18193j154858
$$ plain form
39299 1029221 1082004 486463 71368 451599 820784 225958 -761221 -931190 -353215 -72611
39289 -72611 -330979 -361823 297060 1343257 2259318 2435162 1289344 -712447 -1799453
39280 -1799453 -879585 771818 1099319 4929 -930629 -984822 -902398 -1154284 -1242072 -869872
39270 -869872 -415867 -66049 342474 582744 292483 -106260 80584 553926 520916 181880
39260 181880 265965 381976 -418048 -1550699 -1343918 247194 1371837 1166152 894547
39251 894547 1517932 2108444 1717748 1046015 1001484 1111457 725417 557100 1621707 3517261
39241 3517261 4940006 5175804 4225888 2394928 615165 120776 842173 1179502 324083
39232 324083 -399080 365123 1828717 2419347 2178609 2146752 2253938 1635745 480887
39223D80887o87029j45934l24830l84066L71123R53404M15807m22919m67200j41690
39213c52447j78020P778J000867J662323O72074j031187j340099o1181R65447
39204A345555O50578k12666o95412r48510j222580j054377j80721O53225O06544
39195a058364k6590k01369M44264J114116R03463n8541q21590q23116m36485j98894
39185a163106l3929L10860N25939J71418m12531m67747j9335J50221k04589m02173
39175a544972K8549O18985P28137M14438J83563L12689O54648P76640K96978n34443
39165A935212q20050j42847O41519N21410j81824m75203m03633p18859j132183
39156g76458o05642N58465P62251l33561j104014m88828N09279P33704N85696
$$ plain form
39223 480887 -206142 -352076 -676906 -1060972 -689849 263555 679362 256443 -210757 -352447
39213 -352447 -530467 -522689 478178 2140501 2812575 1781388 441289 380108 1345555
39204 1345555 1996133 1783467 1088055 139545 -1083035 -2137412 -2318133 -1664908 -1058364
39195 -1058364 -1084954 -1286323 -842059 272057 1175520 1116979 295389 -527727 -964212 -1163106
39185 -1163106 -1197035 -886175 -360236 -188818 -601349 -1069096 -1088431 -938210 -1142799 -1544972
39175 -1544972 -1516423 -897438 -169301 245137 428700 741389 1396037 2172677 2469655 1935212
39165 1935212 1115162 972315 1613834 2135244 1953420 1478217 1074584 355725 -776458
39156 -776458 -1382100 -823635 -61384 -394945 -1498959 -1987787 -1478508 -744804 -159108
39147a59108P21083O49663j4612l50562L01626Q39202J21011r12477o56160N03764
39137A043430Q86182K53823j58132m0027l66975j254714j405025k38332R90054
39128b89716R60083K5222n76367m15640m3077L5492o5426P4864N54938Q53934
39118A114307L41925p74281j433627r97623n1769N29432O89253O97010K88690
39109D03317o63984j210489l78086J064408J292874k2706j166727p54720M81700
39100i54413R14951J91079n73588l49206O72117J408140J057613p3903r46759
39091A346031j022569p91755p86656n90459M24211J658099J622085m1227j696868
39082A20892j462173N56346K324135K138995M14024j002058r99558j75714M01085
$$ plain form
39147 -159108 561975 1211638 1197026 846464 1148090 1987292 2108303 1195826 539666 1043430
39137 1043430 1929612 2183435 2025303 1985276 1618301 363587 -1041438 -1279770 -289716
39128 -289716 670367 695589 119222 -296418 -339495 -304003 -369429 -294565 260373 1114307
39118 1114307 1456232 681951 -751676 -1749299 -1801068 -1271636 -582383 114627 403317
39109 403317 -260667 -1471156 -1849242 -784834 508040 485334 -681393 -1436113 -954413
39100 -954413 -39462 151617 -421971 -771177 -99060 1309080 2366693 2292790 1346031
39091 1346031 323462 -468293 -1254949 -1845408 -1421197 236902 1858987 1817760 120892
39082 120892 -1341281 -784935 1539200 3678195 4092219 3090161 2090603 1914889 2315974
39073B315974N87181P17288N28506l01762r81570m64939O00614M90223p98627
39064B692888j274186j29484Q48215K06627q35700o37898J05790m3771m67688
39055D64793K37508J318573R30196n31477r60856j05312K43408l66088m04924
39046H25821M49392M49569r13996j525545o5094J580481J195281l89639q73733
39037G32537m5048M10464j35850n46395k638P95155P49490k30395j164239j000816
39027d37735K31664J259092R90848l2234m49443j48365k32788q97380r65523m695
39017f86559P56515M13141k51295l28710k45433n67826p55997l55984j31625o36838
39007b790611q69861J23665J354803J252889J27303l93182J63379P54478N87808
$$ plain form
39073 2315974 2903155 3620443 4148949 3847187 2865617 2400678 3001292 3491515 2692888
39064 2692888 1418702 1289218 2137433 2344060 1508360 870462 976252 932481 464793
39055 464793 702301 2020874 2951070 2419593 1458737 1353425 1596833 1230745 825821
39046 825821 1275213 1724782 810786 -714759 -779853 800628 1995909 1606270 732537
39037 732537 687489 1097953 962103 415708 413070 1208225 1957715 1727320 563081 -437735
39027 -437735 -206071 1053021 2043869 2011635 1562192 1413827 1181039 283659 -681864 -686559
39017 -686559 69956 483097 231802 -96908 -342341 -910167 -1666164 -2022148 -2153773 -2790611
39007 -2790611 -3660472 -3536807 -2182004 -929115 -801812 -1194994 -1031615 -277137 310671
38998C10671j19003q59602j174482o26585N33414J150178N72863l31338n06758
38989a050642k15608j43770o204O15518J041381O36325K16965O16098Q52872k40150
38979B322785j483439q70486R47930J362257j34442j294374q15241k2925j50134
38970a38069m35756k0569M33258K69591J30723M70213M61838l37223q29998k30713
38960b26705M22251L2462o75933n86319j91193m48175p63570l1093J135396J203930
38950a28949K79203j10010M12020O19756o6386o92637n77621m19119q66259j238638
38940b788640n88174P62490J605645J343639M67926j92644k67355m8015j10066
38931A84806n82019q52190l71212L99207N00457p0098k92951K34872N90991J00496
$$ plain form
38998 310671 191668 -667934 -1842416 -2469001 -1935587 -785409 -212546 -543884 -1050642
38989 -1050642 -1266250 -1410020 -1416224 -800706 240675 877000 1093965 1710063 2562935 2322785
38979 2322785 839346 -31140 916790 2279047 2144605 850231 34990 12065 -138069
38970 -138069 -573825 -594394 -161136 108455 239178 709391 1171229 834006 4008 -226705
38960 -226705 195546 228008 -447925 -1034244 -1225437 -1673612 -2437182 -2468275 -1332879 -128949
38950 -128949 150254 40244 452264 1072020 1005634 312997 -264624 -683743 -1550002 -2788640
38940 -2788640 -3376814 -2614324 -1008679 334960 802886 610242 342887 294872 184806
38931 184806 -397213 -1249403 -1620615 -1221408 -720951 -791049 -1084000 -849128 -258137 -157641
38921a57641l34202M03288J566028J302725n58773j999429j542063j35121N26689
38912i28499L50235K87072L84944J77n44089k69088N55311N62160m19662r62350
38902i83789m11632J28919m2269M1329R18021J187923j71926j572465j037605
38893a943494N48614Q42964j41882k99338Q37949J430817O29348j51293O3474
38884A817159K78649k99426p61807l60516P8982j15337j37588N32149P95254r9576
38874A727943r12652m54617K68180j16456p70970j32878J122765J069016j95127
38865A605204p75990k10629O8065m11819l53289O89841J206054K42952r17450
38856A142939q38853q6828P3351j79895N4404M73308N9035r47024j184065k94100
$$ plain form
38921 -157641 -491843 -88555 1477473 2780198 2221425 221996 -1320067 -1455188 -928499
38912 -928499 -578264 -291192 93752 93929 -450160 -719248 -163937 398223 -21439 -983789
38902 -983789 -1395421 -1266502 -1308771 -1267442 -349421 838502 666576 -905889 -1943494
38893 -1943494 -1394880 -551916 -693798 -993136 -155187 1275630 1904978 1753685 1817159
38884 1817159 2095808 1796382 1034575 674059 753041 637704 500116 1032265 1827519 1727943
38874 1727943 815291 360674 628854 512398 -258572 -391450 731315 1800331 1605204
38865 1605204 829214 618585 686650 274831 -78458 611383 1817437 2060389 1142939
38856 1142939 304086 217258 290609 110714 165118 638426 697461 -249563 -1433628 -1727728
38846a727728N05684L00189k64046k13647J94103P6935m35375k96946P01061J348818
38836A89048P12725m02517n52548K56227O40264p1830r13967p52514K20566R56021
38826B81475Q44360Q4760o84415p66652j4072O72297K09633r99575j262402K9685
38816a604906J355204J214936K06247j69792K39169N30326M43805K54910l24647
38807B145252j463414j994104p69446J087920J344900L3999n32395N33015J291129
38798A676856K07191j343748j267010J78746J162217R84080L47892k51378p81565
38789I13281q31110m8136Q26730P12520j66229o05917k91650r8223m64121o89440
38779g42295j90517N55070P92356M72018n038m29513p19002o75013k59564J77099
$$ plain form
38846 -1727728 -1222044 -921855 -1185901 -1399548 -1205445 -1128510 -1563885 -1860831 -1159770 189048
38836 189048 901773 499256 -53292 202935 843199 771369 -142598 -895112 -674546 281475
38826 281475 1125835 1210595 526180 -240472 -254544 417753 627386 -372189 -1634591 -1604906
38816 -1604906 -249702 965234 1171481 1001689 1240858 1771184 2214989 2469899 2145252
38807 2145252 681838 -1312266 -2081712 -993792 351108 385107 -147288 385727 1676856
38798 1676856 1884047 540299 -726711 -547965 614252 1598332 1946224 1694846 913281
38789 913281 82171 34035 860765 1573285 1407056 801139 509489 411266 -52855 -742295
38779 -742295 -932812 -377742 414614 886632 881594 452081 -266921 -941934 -1201498 -1024399
38769a024399L08555K59307L27598M65780L46972j02087m80731l21152L31643
38760A11486Q41697O18556j50869o24596l05859L12381L77825k29478q08476p55350
38750f12683j56328N47480J038489J112926O18133k59348q75431o70752J95521
38741I38007R76134J079366N47003j07525l51149k5079M79274N19156p0865o58825
38731C325497n74751p5310o945m89922o67725p3641N30166L25627k06043l9817
38721B047136O90803Q58891J11461o56209p35321m41205k25663R660K86177K26076
38711B171806j25036j21077K73719J58544o92269j058971j72273P40550K30200
38702A405193r43561q86355M28098J112472K92134p34325o44865J61511O25182
$$ plain form
38769 -1024399 -715844 -456537 -128939 336841 683813 581726 100995 -220157 111486
38760 111486 953183 1571739 1420870 796274 490415 802796 1180621 951143 142667 -612683
38750 -612683 -769011 -221531 816958 1929884 2548017 2288669 1413238 742486 938007
38741 938007 1914141 2993507 3540510 3432985 3081836 3056757 3536031 4055187 3984322 3325497
38731 3325497 2750746 2675436 2668491 2178569 1510844 1437203 1967369 2292996 2086953 2047136
38721 2047136 2737939 3596830 3708291 3052082 2316761 1875556 1649893 1659553 1945730 2171806
38711 2171806 2046770 1925693 2199412 2357956 1665687 606716 434443 1174993 1405193
38702 1405193 461632 -424723 3375 1115847 1407981 673656 28791 190302 815484
38693H15484N88822N18538N39729M76614K95857L6807k50260l00214P0424L89383
38683C181184k7787r52560j347169p60062J36593N39849K92963l78350j049868
38674c65207r92365J33195J389118J420408L14777n15509m05782q3317m7442J72551
38664A020427O69250O20706j67853o35723k18393J81545j12330l53316L6287J69381
38654A209981o38148j289116o08550N58623P07866J23566P9347M21481K2366q57703
38644b70287p95043L20971J000009M80445l62440o32117l93568J26991Q35785
38635C10746J095032K38289j017247j139856k7252P83039M48702j53172j57429
38626C80852R7526K32175O57403J384290J360549M9836j393808j604606q34006
$$ plain form
38693 815484 1404306 1922844 2462573 2939187 3235044 3271851 3021591 2721377 2791801 3181184
38683 3181184 3153397 2200837 853668 93606 230199 770048 1063011 684661 -365207
38674 -365207 -1357572 -1224377 164741 1585149 1899926 1384417 978635 895318 847876 1020427
38664 1020427 1689677 2310383 2142530 1506807 1288414 1469959 1357629 1004313 1040600 1209981
38654 1209981 571833 -717283 -1325833 -767210 -59344 64222 143569 565050 587416 -270287
38644 -270287 -1065330 -744359 255650 736095 373655 -258462 -652030 -525039 310746
38635 310746 1405778 1644067 626820 -513036 -540288 242751 691453 538281 380852
38626 380852 478378 710553 1367956 2752246 4112795 4162631 2768823 1164217 330211
38617C30211k94070l46763l51189R9714O47926P11571R0316p59261r19206L1339
38607g59412J205052J286897L01164m30454k44740Q5614j19556l79257j35436
38598H09872K29605K11852J9023j30535n10945r66424o39368N06865J106602L94556
38588A031103m36489j45639N20979K60057m52247l14526L91678M07754j10687
38579A151983j4960M08841j61154j299515j041516O66775J352654j09576j470144
38570e16612n62793J288647J408411j89645j228671p72767n7469K6172R9690O52871
38560A47834J009006N78613r0672j83100K70253O24251M02004l82575j177921
38551A197693j181854k73061N23647K93038l25516n8537Q34870Q12533l65736
$$ plain form
38617 330211 36141 -310622 -661811 -562097 85829 797400 887716 128455 -790751 -759412
38607 -759412 445640 1732537 2033701 1603247 1358507 1444121 1324565 945308 809872
38598 809872 1039477 1251329 1270352 1139817 628872 -337552 -976920 -470055 636547 1031103
38588 1031103 594614 448975 969954 1230011 777764 463238 854916 1262670 1151983
38579 1151983 1137023 1545864 1384710 85195 -956321 -289546 1063108 953532 -516612
38570 -516612 -1079405 209242 1617653 1428008 199337 -573430 -630899 -604727 -505037 147834
38560 147834 1156840 1735453 1644781 1461681 1731934 2356185 2758189 2375614 1197693
38551 1197693 15839 -257222 266425 559463 233947 175410 1010280 1822813 1457077
38542A457077j006793j23422R40034O67326k79742m04858M9887k53736j168104
38533a22331j140892J70936J219222Q61068j84183o85952m45941N0856M41449
38524A64232M29737j05438n57827j66624N66955K96654r27674j359197k53917
38515a913099P57061K22954p21803k22234J193034J433217J54934q57038n10539
38506d63513L14995N30480K15480j47051m09192l49336K21498O51515M0187j054613
38496d49550r22662P59484K096187J461800l75644j503659j231860k97723M41258
38487b2369N82626Q4589n70808o02779Q1600O64626O16006L76406L82958L08902
38477A901757j11572m13736k69208j28443k69740j82715K86723K78381n61164
$$ plain form
38542 1457077 450284 326862 1266896 1934222 1654480 1249622 1299509 1045773 -122331
38533 -122331 -1263223 -1092287 126935 988003 803820 117868 -328073 -277217 164232
38524 164232 593969 488531 -69296 -235920 331035 627689 -299985 -1659182 -1913099
38515 -1913099 -1156038 -933084 -1654887 -1877121 -684087 749130 904064 47026 -463513
38506 -463513 -148518 381962 597442 450391 41199 -308137 -86639 564876 605063 -449550
38496 -449550 -1372212 -612728 1483459 2945259 2569615 1065956 -165904 -463627 -22369
38487 -22369 560257 644846 74038 -528741 -447141 217485 833491 1209897 1592855 1901757
38477 1901757 1790185 1376449 1107241 978798 709058 526343 813066 1091447 530283
38468E30283j035838j94552Q78073O45043l73521m77604M20666Q30891K58357
38459A481798k09295K7402K33060j24063n62069o77197o63538m92804N2694M03886
38449e30126j90680r69679l97929J111622J344254j68146j064545J23245J449827
38440G07843O74641j041362j051783M80235J021108j50077j014683k59735Q56683
38431B22870Q10498m2583n97486o85055n77826p7043Q09466J229625N88626l95547
38421A285545o62259k58215M1558M1130J37646L66288L24071n8034l66987l02261
38411E48482O6487M97368O02925l4802j203368j787776r07243P60771J575706
38402A18550R50207L233q2658L96653L64175l12789o47905o2993O82049M96188
$$ plain form
38468 530283 -505555 -700107 177966 823009 449488 -28116 392550 1223441 1481798
38459 1481798 1272503 1299905 1532965 1408902 846833 169636 -493902 -986706 -934012 -530126
38449 -530126 -720806 -1690485 -2088414 -976792 367462 199316 -865229 -741984 707843
38440 707843 1382484 341122 -710661 -230426 790682 640605 -374078 -633813 222870
38431 222870 1033368 990785 393299 -291756 -869582 -946625 -137159 1092466 1681092 1285545
38421 1285545 623286 365071 406629 447759 585405 951693 1275764 1217730 850743 548482
38411 548482 614969 1112337 1715262 1680460 477092 -1310684 -2217927 -1457156 118550
38402 118550 1068757 1071990 989332 1385985 1750160 1437371 789466 726473 1408522 1904710
38392A904710n25805j173613o70758L85751Q83608N79101J52873R6373J59066
38383A791306j6257k82265l06968j01020R1504J14540j36981o74459j041260n19208
38373a081068P72862J524636P50381p33765j276471n77897J81851L07938L60435
38364B28902O82009N64378l51191j046033n84963L05414L62847j93176j84564
38355b16377M00134L82154n03618j030889m11289N36846P91915N77660N88390
38346A114926O62018K10076n74092q93411n01444O2198K67796Q1843j99018j69313
38336F1579M12506J166315J197054J33480j207468j688844j137172k72059L34532
38327a000077O14289N80175K95716J81421O09562J148701R23918j14698r49912
$$ plain form
38392 1904710 1378905 205292 -465466 -79715 803893 1382994 1535867 1632240 1791306
38383 1791306 1775049 1492784 1185816 1084796 1176300 1290840 1153859 479400 -561860 -1081068
38373 -1081068 -308206 1216430 1966811 1233046 -43425 -621322 -439471 -131533 228902
38364 228902 910911 1475289 1124098 78065 -506898 -201484 161363 -31813 -216377
38355 -216377 183757 565911 62293 -968596 -1379885 -843039 -51124 526536 1114926
38346 1114926 1776944 1987020 1412928 519517 18073 80271 348067 429910 230892 61579
38336 61579 474085 1640400 2837454 2970934 1763466 74622 -1062550 -1334609 -1000077
38327 -1000077 -385788 194387 490103 671524 1281086 2429787 3353705 3239007 2289095
38318B289095p87127l325N25078N11570K28414j81698p45359j154915q44921K27752
38308F4564J238927J269222L65147m50251l51505L12788M99781j70950r72456
38299A805267j084566n73809m0258K74052M85071M67592l7096p33676q89229l54994
38289f81646J01802j45292o23160l61154P25314J564782J162490j95463j208904
38280C38769r83499J9305N85427K05704l46215l2452J075856J778394J129757
38271C771046m22478j477239j173514k9202P80936P51349L29198j6915l95123
38262B118058q56161q05796J80796J301670J266926J01081p64354m20110M35919
38253B558029P10930K94246k97748p81410r64648n42753K50289N23079k3767n05601
$$ plain form
38318 2289095 1501968 1498643 2023721 2535291 2763705 2582007 1836648 681733 -163188 64564
38308 64564 1303491 2572713 2937860 2487609 2136104 2448892 2948673 2777723 1805267
38299 1805267 720701 146892 106634 380686 865757 1333349 1296253 562577 -326652 -681646
38289 -681646 -579844 -725136 -1348296 -1709450 -984136 580646 1743136 1547673 338769
38280 338769 -644730 -625425 -39998 165706 -180509 -212961 862895 2641289 3771046
38271 3771046 3348568 1871329 697815 668613 1449549 2200898 2530096 2513181 2118058
38262 2118058 1261897 456101 636897 1938567 3205493 3306574 2542220 2122110 2558029
38253 2558029 3268959 3563205 3265457 2484047 1519399 976646 1226935 1750014 1726247 1220646
38243A220646k58348Q2043j64965m04832O4141N36933Q9182n48641r3274R32940
38233A455825R38492j1425l49127K20620L63564k79568m81728N7208l8943j169197
38223G05721j649578n00777P71656O70863M5301K39176O92032L31467j84138K30597
38213A352320P88584J12341j109540j062323K09810J001399P25893L26764J78381
38204B523629k46053o92075k68532O08840N06623n26202p96972K45663J067733
38195B422654N69296l18084m42576j84701l41070o12095l22775L30207O96771
38186A797627N96926J96353l00053m52279M1009N48814J67425o72297o13832L79511
38176A689204Q15834J51947l53244n746O8123q21148j363704n08641N03646K72005
$$ plain form
38243 1220646 962298 1044341 879376 474544 538685 1075618 1164800 616159 522885 1455825
38233 1455825 2394317 2382892 2033765 2254385 2617949 2338381 1856653 1913861 1874918 705721
38223 705721 -943857 -1444634 -672978 -2115 43186 282362 974394 1305861 1121723 1352320
38213 1352320 2140904 2253245 1143705 81382 291192 1292591 2018484 2345248 2523629
38204 2523629 2277576 1585501 1316969 1925809 2432432 1906230 1109258 1354921 2422654
38195 2422654 2991950 2673866 2231290 2046589 1705519 1093424 770649 1100856 1797627
38186 1797627 2394553 2590906 2290853 1838574 1879583 2428397 2595822 1923525 1309693 1689204
38176 1689204 2505038 2656985 2303741 2297995 2366118 1544970 181266 -327375 176271 448276
38166D48276k11176N75662J591803P47056j248331j547829L19501J544583L61163
38157B580708j379093j309181p6783J04551r51412j363034k63367R45046P10019
38148a002546n54187j123234j64153J340102J819435Q99370k82695m74000L07062
38139G65154R77619P32462j59228p99260o01229J77200O50370J63684r01869j388593
38129c83690o31600P48724J512318J008330l84095j602847j574292j71033J246284
38120b31901J036290n37921j291062k9506J578700J284764m76671j309769m13842
38111c90918N44263K86716k87155L1256O96901M65375m99156r19665l56393L12822
38101a15954K77670k39848n18882k17564M54241J029937J077361M70954m09856
$$ plain form
38166 448276 237100 812762 2404565 3151621 1903290 355461 674962 2219545 2580708
38157 2580708 1201615 -107566 -184349 -79798 -1031210 -2394244 -2657611 -1712565 -1002546
38148 -1002546 -1556733 -2679967 -2844120 -1504018 315417 1214787 932092 458092 765154
38139 765154 1742773 2475235 2316007 1516747 915518 1092718 1743088 1906772 1004903 -383690
38129 -383690 -1015290 -266566 1245752 2254082 1869987 267140 -1307152 -1478185 -231901
38120 -231901 804389 266468 -1024594 -1054100 524600 1809364 1332693 22924 -390918
38111 -390918 153345 440061 152906 184162 881063 1346438 847282 -72383 -428776 -115954
38101 -115954 161716 -78132 -597014 -814578 -360337 669600 1746961 2217915 1808059
38092A808059q79927n96347m3589q4749p93636j073733l1736J475057J621333
38083A400732J08424j247129r91674N1177L24131q8575p0580L18095J8844r10401
38073a086956j143725j95775Q83924J203288R94293O08650q765m78380r1044P55729
38063A441239O92262m64216j175430n25942M20583N09203K13841L36617M35722
38054A883879o5631m54196N5483P12468M27531k87732k12795M73829O63048L23618
38044C519502L13203N72553K55065n30630q01105m76896m49695q09115o19545
38035I73337K93439Q60345M71659j68290l11331r4239J76379N19625P11001L46565
38025C778490k11051j25819L84724J60993q32528j074751Q2668J041378K51180
$$ plain form
38092 1808059 928132 331785 288196 203447 -590189 -1663922 -1695658 -220601 1400732
38083 1400732 1509156 262027 -729647 -678470 -354339 -442914 -513494 -195399 -176555 -1086956
38073 -1086956 -2230681 -2426456 -1542532 -339244 655049 1263699 1254934 776554 685510 1441239
38063 1441239 2133501 1669285 493855 -32087 388496 897699 1111540 1448157 1883879
38054 1883879 1818248 1364052 1419535 2132003 2559534 2271802 2059007 2532836 3195884 3519502
38044 3519502 3832705 4405258 4660323 4129693 3328588 2851692 2401997 1592882 973337
38035 973337 1266776 2127121 2598780 2430490 2119159 2024920 2201299 2720924 3431925 3778490
38025 3778490 3567439 3441620 3826344 3987337 3154809 2080058 2162726 3204104 3455284
38016C455284j293808j416516M0888J039866L35311q35201o24734Q05299J495476
38007C001865L68292j204460j148627M31420J284499K08768j141291p38092O96681
37998A759055Q72422l99452r90212k356Q49510K19694o94997l63941M73554J96688
37988A919965r44681j348625n84296L42676P69841Q39561N39939j87750o05871
37979G40759Q5031J255929J456120M65286n65188r43406r87224p32685K79540
37970A054162J546653J544861n8568j451005r91655M83367Q55850l75842j626169
37961I81654j485341l38460N36525O76736O46024Q56876Q90176K81213m70664
37952B574739l93952M46109P81991n1465r45498n25663P37390J112559J17271
$$ plain form
38016 3455284 2161476 744960 785848 1825714 2161025 1325824 701090 1506389 3001865
38007 3001865 3370157 2165697 1017070 1448490 2732989 2941757 1800466 1062374 1759055
37998 1759055 2631477 2232025 1241813 1239457 2088967 2308661 1613664 1249723 1723277 1919965
37988 1919965 975284 -373341 -957637 -614961 154880 994441 1534380 1346630 740759
37979 740759 825790 2081719 3537839 4003125 3437937 2494531 1507307 774622 1054162
37970 1054162 2600815 4145676 4087108 2636103 1644448 2127815 2983665 2607823 981654
37961 981654 -503687 -842147 -305622 371114 1017138 1874014 2764190 3045403 2574739
37952 2574739 2180787 2626896 3408887 3357422 2411924 1886261 2623651 3736210 3853481
37943C853481q59129o67037J02413L28202N8339J02352N53413P04103K34188l51393
37933D058932n33176m11134l32417l06183r0015L25029O27105O08024M25637K85952
37923D657754J05563j74717j63975M80048J173291Q70109l26555r47029j49411
37914E525078R45939Q04662l83349j206990j081040n45158K7065O17995P43508
37905E447710m7829r39359o65636M08008O91232j0842j91530N98828P86499m70516
37895E606565j570909r53326M05271O75123k2870l35574q8370n6235j79018P3695
37885C554352K50830k45506n32646M63108J642779J007921r58630j707698n28670
37876B945840N73889L91790J84138Q23211R43739l86134j444914m67758J273929
$$ plain form
37943 3853481 2994352 2327315 2429728 2757930 2816269 2918621 3472034 4176137 4410325 4058932
37933 4058932 3525756 3114622 2782205 2476022 2386007 2711036 3338141 3946165 4371802 4657754
37923 4657754 4763317 4588600 4424625 4904673 6077964 6948073 6621518 5674489 5525078
37914 5525078 6471017 7275679 6892330 5685340 4604300 4059142 4086207 4704202 5447710
37905 5447710 5399881 4460522 3794886 4202894 4894126 4883284 4691754 5290582 6077081 5606565
37895 5606565 4035656 3082330 3487601 4162724 4139854 3804280 3715910 3659675 3480657 3554352
37885 3554352 3805182 3559676 3027030 3490138 5132917 6140838 5182208 3474510 2945840
37876 2945840 3519729 3911519 4095657 4918868 5862607 5476473 4031559 3563801 4837730
37867D837730J399246J84822j44087Q10049J170517O9214j044914q94850j72433
37858F215294j2895k34811j07125K41781K02826k16300n12501m70753k34688K9251
37848D900079J24122r9918l31624J3833Q28799J153678N09550k40373j32157L16449
37838G042438j44204j317719j438447K97881K211284K175566M95144o17745k64849
37829H439349O3513q20132j661490p49104J058757J325823k20826j140013J0307
37820F306184J465782J001847p24618j297746l4837J449765J738668J027638J79286
37811A1111969k12869J60960R84996J069970k69937j722778j345997N70755J688130
37802A2035199R33568j59040o3407N79572N08386L781P0337N56735N85861J48880
$$ plain form
37867 4837730 6236976 6421798 6277711 7087760 8258277 8327491 7282577 6387727 6215294
37858 6215294 6202399 5967588 5860463 6102244 6305070 6088770 5576269 5105516 4870828 4900079
37848 4900079 5024201 4924283 4592659 4606492 5435291 6588969 7098519 6858146 6725989 7042438
37838 7042438 6898234 5580515 4142068 4439949 6651233 8826799 9321943 8704198 8439349
37829 8439349 8502862 7682730 6021240 5272136 6330893 7656716 7435890 6295877 6306184
37820 6306184 7771966 8773813 8049195 6751449 6716612 8166377 9905045 10932683 11111969
37811 11111969 10899100 11060060 12045056 13115026 12845089 11122311 9776314 10347069 12035199
37802 12035199 12968767 12809727 12746320 13325892 13834278 13838059 13908396 14465131 15050992 15199872
37792A5199872o8400Q0055K91401N88766R14941N99045n54782j287258l93685
37783A5369955J287813J903259J223511O31143O93916N78929J2891n2959P13246
37774B2361704J213245P82968L89578R24812J557217J060442r5982l42301P36734
37765B8588417J932656K082403J309785N91253P01559J605250K519389K664039
37757D1994751K156322J899731K426440L271024L697942L549809L144435K901424
37749F5041878L299669M505423N763638O012833N501217N771230P420895R039139
37741A12355922R344747R227026J0240828J2019496J3027404J3398796J4944686
37734A94558905J8185967K1350000K2997249K4002109K5903547K8529632L0461752
$$ plain form
37792 15199872 15131472 15211527 15502928 16091694 17006635 17605680 17050898 15763640 15369955
37783 15369955 16657768 18561027 19784538 20415681 21109597 21688526 21701417 21648458 22361704
37774 22361704 23574949 24357917 24747495 25672307 27229524 28289966 28193984 27851683 28588417
37765 28588417 30521073 32603476 33913261 34504514 35206073 36811323 39330712 41994751
37757 41994751 44151073 46050804 48477244 51748268 55446210 58996019 62140454 65041878
37749 65041878 68341547 72846970 78610608 84623441 90124658 95895888 103316783 112355922
37741 112355922 121700669 130927695 141168523 153188019 166215423 179614219 194558905
37734 194558905 212744872 234094872 257092121 281094230 306997777 335527409 365989161
37727C65989161L1042557L0672168K9478789K6835235K2272938J6122339R020130
37720E31433317J221610p262772j5891418k3258442k8001009l0185399l1236315
37713C96819572l2060396l1916483k9953395k7114584k5086467k3744427k1465576
37706B05478244j8090045j5530459j4719816j3984376j1790920r336266q556932
37699A13469430q925810q437266o928915o026655o098870n705545m314051l271577
37691F3760741l399075l658718l184655k812051l329177l774363k996710j721426
37683C8884566j426479k005631k196853j761837j565125j765846j579870q72649
37675B5710276m86751p44968r59440p68614p18142j061775j172126p50664n24892
$$ plain form
37727 365989161 397031718 427703886 457182675 484017910 506290848 522413187 531433317
37720 531433317 532654927 525392155 509500737 486242295 458241286 428055887 396819572
37713 396819572 364759176 332842693 302889298 275774714 250688247 226943820 205478244
37706 205478244 187388199 171857740 157137924 143153548 131362628 122026362 113469430
37699 113469430 104543620 96106354 89177439 83150784 77051914 71346369 67032318 63760741
37691 63760741 60361666 56702948 53518293 50706242 47377065 43602702 40605992 38884566
37683 38884566 37458087 35452456 33255603 31493766 29928641 28162795 26582925 25710276
37675 25710276 25223525 24478557 23519117 22750503 22032361 20970586 19798460 19047796 18522904
37666A8522904r68278j303519p32426J28974J45371n31855p18267l3263O21647
37657A5131288M52356l06286j010511j323479j087392k54139O85391Q37366n1914
37648A3072680j102420j270769n14782L40548N83818J11584p47685j449790j448013
37639G575171o63143K46574M30250k44160r96877r14943J27088J287164J505001
37630H352125N86954m84711o23726q529J50827o03119j156781m23791Q51673R42898
37620G583820l92792j472351r85640L10544P96478Q5689q53400j129677o68071
37611C274600J51102Q03476P61113M3775n14938k42454L25782J88454n09404o62556
37601C618950m4162K75954k47066o43458n2716P66843O69192m805j47207J18809
$$ plain form
37666 18522904 17554626 16251107 15518681 15647655 15793026 15261171 14542904 14509641 15131288
37657 15131288 15583644 15277358 14266847 12943368 11855976 11601837 12287228 13124594 13072680
37648 13072680 11970260 10699491 10184709 10525257 11109075 11220659 10472974 9023184 7575171
37639 7575171 6912028 7158602 7588852 7344692 6347815 5432872 5559960 6847124 8352125
37630 8352125 8939079 8454368 7830642 7822113 7972940 7369821 6213040 5789249 6640922 7583820
37620 7583820 7191028 5718677 4733037 5043581 5840059 5925748 5072348 3942671 3274600
37611 3274600 3425702 4229178 4990291 5034066 4519128 4276674 4602456 4790910 4281506 3618950
37601 3618950 3574788 3850742 3603676 2960218 2907502 3674345 4343537 4338732 4191525 4310334
37591D310334k43182j081932j013304K43958J139130N99060l57540l05634M55377
37582C746267O54791N9911n51633q03654q23824m39118L84317P15079k11682j288874
37572A441580p08246J106017J671587Q8455j463644r49971N93990R71033K20540
37563B971341M4827O90684P03053l36100r86110l09275P23024Q85525L20254k67594
37553D439629p72221j177381r87604j41844M09878K3598n43973l58115J46383
37544A038350j8339o71248q26848l50405L3889J02095K12763K37526k26867o64502
37534a133586j32842R44432J040716n6809p00090P9437J045779P75696k02927
37525A659806n70526l34920k97921l26360J85039P48238M21916l21768j42838
$$ plain form
37591 4310334 4067152 2985220 1971916 2215874 3355004 3954064 3596524 3290890 3746267
37582 3746267 4401058 4460969 3909336 3105682 2281858 1842740 2227057 2942136 2730454 1441580
37572 1441580 733334 1839351 3510938 3599393 2135749 1185778 1779768 2750801 2971341
37563 2971341 3016168 3706852 4409905 4073805 3087695 2778420 3501444 4386969 4707223 4439629
37553 4439629 3667408 2490027 1502423 1360579 1770457 1794055 1250082 891967 1038350
37544 1038350 1020011 348763 -478085 -828490 -794601 -692506 -479743 -242217 -469084 -1133586
37534 -1133586 -1266428 -321996 718720 661911 -38179 41258 1087037 1862733 1659806
37525 1659806 1089280 754360 456439 130079 315118 1063356 1485272 1163504 1020666
37516A020666Q28801R92841j63541j246352j183284o21666l64388K0143R58566
37507B41786J575403R72050j30901l95695J25119L06234j60236n14250l82748
37498A636762k35246l20959k32814K12323M96466J56737n04287p36274j14800
37489C57908J015863J688557J146051k06122j084015r10846n13542o78145p94651
37480B1058M7459J237551J289072J03698q04891m84144L26042N64930K34683o6919
37470B468539r8112M5909K33124K12940j96319o69045p20366m83846m12362l55750
37460B4712R1862N23748K70534j21447M35061J378419R57782o94012j205624L04478
37450A965513J461866K74161j572227j345338M48143J134349J77537n19544j85223
$$ plain form
37516 1020666 1849467 2842308 2678767 1432415 249131 -372535 -736923 -716780 241786
37507 241786 1817189 2789239 2658338 2262643 2387762 2693996 2533760 2019510 1636762
37498 1636762 1401516 1080557 847743 1060066 1556532 1713269 1208982 472708 357908
37489 357908 1373771 3062328 4208379 4002257 2918242 2007396 1493854 815709 21058
37480 21058 68517 1306068 2595140 2698838 1893947 1409803 1735845 2300775 2535458 2468539
37470 2468539 2370427 2416336 2649460 2862400 2666081 1997036 1276670 792824 380462 24712
37460 24712 116574 640322 910856 789409 1224470 2602889 3560671 2866659 1661035 1965513
37450 1965513 3427379 3701540 2129313 783975 1232118 2366467 2544004 2024460 1839237
37441A839237o8611n68994l18936J072977J832780P67454p85561j090898m86438
37432B193010l05378o08457n02915R6725M16344J25836l25166m23895j4400O67803
37422A319507J014916O18056L1401J86546Q46074P20180m88399j416897j084465
37413A746919l12775j81178l16439O3174M88244P6857p48554q67569k52308K34234
37403f9395L62220M79159L74126l15064q82258l30034P66611Q12162l20783j013472
37393a36728m15350M08233M11925Q3748J53777J79322m14597r30802l66662Q34315
37383a92819J274164N60939l44958o64711o52781p39537o85538p5760P89659J055085
37373C23743L81789m77781m86888L19428P18872j36548j439447j652127n29062
$$ plain form
37441 1839237 1770626 1201632 882696 1955673 3788453 4555907 3770346 2679448 2193010
37432 2193010 1887632 1279175 776260 872985 1289329 1415165 1089999 666104 651704 1319507
37422 1319507 2334423 2952479 2983880 3170426 4016500 4736680 4248281 2831384 1746919
37413 1746919 1434144 1252966 936527 999701 1487945 1564802 816248 -51321 -303629 -69395
37403 -69395 292825 771984 1146110 831046 -51212 -381246 385365 1197527 876744 -136728
37393 -136728 -552078 -143845 268080 351828 505605 684927 270330 -660472 -1027134 -192819
37383 -192819 1081345 1642284 1297326 632615 -20166 -759703 -1445241 -1521001 -731342 323743
37373 323743 705532 227751 -259137 60291 779163 642615 -796832 -2448959 -2978021
37364b978021O10346P17832K48380J78403N66335P10222K46595n05471r85985
37355a191364p48233K57386J339907J449444L99435p10821q11224j36938L94928
37346B42520N29331N68839M20029j54963n70780N5641J322089J706900O87419
37337D807025m38187m45844J16173k5458r10202j458481j100832l12638K58434
37328D89990L46155q6716p29530p82602J95330J349742J374916L57526k55476
37319B259335K04821O41636l3951j149513j274742l11043N50844O42628M54511
37310A984526M80803M94459K35282m1456r1249p6622n1853K99354R27769J039323
37300E200336J40822r71036j094463l07715J27940l53425p62286p5927J099296
$$ plain form
37364 -2978021 -2367675 -1649843 -1401463 -1223060 -656725 53497 300092 -205379 -1191364
37355 -1191364 -1939597 -1682211 -342304 1107140 1506575 795754 -15470 -152408 242520
37346 242520 771851 1340690 1760719 1605756 1034976 1090617 2412706 4119606 4807025
37337 4807025 4368838 3922994 4039167 4013709 3103507 1645026 544194 231556 489990
37328 489990 836145 749429 19899 -762703 -567373 782369 2157285 2514811 2259335
37319 2259335 2464156 3105792 3071841 1922328 647586 336543 887387 1530015 1984526
37310 1984526 2465329 2959788 3195070 3153614 3062365 2985743 2933890 3233244 4161013 5200336
37300 5200336 5341158 4370122 3275659 2967944 3095884 2742459 1980173 1904246 3003542
37291C003542J256122J02457j014383r67826k66145p4394m88374o08750r320P83786
37281A716715J239126J354506J122034L84507m57026n30851J87917N61935j2023
37272E566840n40973m5174O92269L49393o51735p70829O6897L92889j99758l39666
37262D520153O51562J451400R32844L0213M9136M73547R8405o65734m78001N05525
37252G569050P94490N8192l25562M80039J496393J490644O39437m8349j06232
37243A2048102K67995Q38960J433859J782272J764523J647456J802815K334364
37235B3920346L062598L671639L890443L793780L842151M314352M845506M893100
37227E6233915M448130L811182K888428J311506q54224l073881m886740n988182
$$ plain form
37291 3003542 4259664 4362121 3347738 2379912 2113767 2039373 1550999 942249 932929 1716715
37281 1716715 2955841 4310347 5432381 5816888 5359862 4829011 5016928 5578863 5566840
37272 5566840 5025867 4980693 5672962 6022355 5370620 4599791 4666688 5059577 4859819 4520153
37262 4520153 5171715 6623115 7555959 7586172 7635308 8108855 8207260 7541526 7063525 7569050
37252 7569050 8363540 8421732 8096170 8576209 10072602 11563246 12202683 12154334 12048102
37243 12048102 12316097 13155057 14588916 16371188 18135711 19783167 21585982 23920346
37235 23920346 26982944 30654583 34545026 38338806 42180957 46495309 51340815 56233915
37227 56233915 60682045 64493227 67381655 68693161 67838937 64765056 59878316 53890134
37219E3890134o075491n297777m553822m509445m590039l899431k835357k542226
37211A9586546k879654k456293r69734M3187m98708j539990j508319n47920K6749
37202I255864k36586o45580p08410o64573p73534q86391p50966k88317L23665
37193D625172O04827J84478n11008n63169J28748N76619K03157k33451R1403P01690
37183E808466O35329n6543o27097q85006j087228j080622o45942k59944l73041
37174A428372l71720M37848J216182N57938j044530j494451j83536R63253L21945
37165A831301j091797j301090k44232M63608N7880n10582k19289O15262R23124
37156E24185L06704n00073n12000K97315Q60859L48446o02737o35716L75176J030332
$$ plain form
37219 53890134 47814643 42516866 37963044 33453599 28863560 24964129 22128772 19586546
37211 19586546 16706892 14250599 13280865 13324052 12825344 11285354 9777035 9229115 9255864
37202 9255864 9019278 8373698 7665288 7000715 6227181 5340790 4589824 4301507 4625172
37193 4625172 5229999 5414477 4903469 4340300 4469048 5045667 5248824 5015373 5106776 5808466
37183 5808466 6443795 6387252 5760155 4875149 3787921 2707299 2061357 1801413 1428372
37174 1428372 1056652 1494500 2710682 3268620 2224090 729639 546103 1509356 1831301
37165 1831301 739504 -561586 -805818 -342210 -284330 -794912 -1014201 -398939 524185
37156 524185 830889 330816 -181184 116131 976990 1325436 722699 86983 462159 1492491
37146A492491M08430n79695n80776K24720N89510K06301M136M07785N20716m02169
37136B291449j549603j504639k22663Q63461P71721J62399J45349N64319L68923
37127A890716n29267r23761k07903M88968k2063r86227p22344P04260J396484
37118A088863M19204q62126r22487j89970P0451j13905J33649O24202L02907p14035
37108a63247r11308L51553J628103J263539l64071j415204r60123J33161N97782
37099A60185K55290j56501j21335J65815L18831L14620L24271K63041r9639o06949
37089H17629p09627j79667M79523N89933O0769o12375q90802n42803K64807R59408
37079B36795R23561J71178n75611p34224m49542q1979L53179P65302O26823j89373
$$ plain form
37146 1492491 1900921 1321226 740450 965170 1554680 1760981 1765117 2172902 2693618 2291449
37136 2291449 741846 -762793 -985456 -121995 649726 812125 957474 1521793 1890716
37127 1890716 1361449 437688 229785 718753 696690 -289537 -1011881 -307621 1088863
37118 1088863 1508067 645941 -276546 -466516 -396065 -509970 -376321 247881 550788 -163247
37108 -163247 -1074555 -723002 905101 2168640 1804569 389365 -570758 -437597 160185
37099 160185 415475 258974 137639 303454 622285 936905 1261176 1524217 1424578 817629
37089 817629 108002 -71665 407858 997791 1058560 446185 -444617 -987420 -722613 236795
37079 236795 1160356 1331534 755923 21699 -427843 -509822 -156643 608659 1235482 1046109
37069A046109p21153q2732J000318J006710j18919q32931l34584L11634k4519
37060A249933q36079r68886l87295P8516J25781J05330J46050O7529p5151j04371
37050e98643j16079j22108K87666J164702J552317O12909q96707j378375n26716
37041b1034L77495L44200k50883o54714p18628n21232R834O04209O21865N1340
37031a57548k29020K64094Q22197O54596N9735k66519m15392q14039j088944m90377
37021a661217O99561J238747N57567m95693p86214j46482P35694J145727P96016
37012B083706r8442q90244r48789l05223L34803L59076j63366p06874q06604k80963
37002a422920O68754J361538J025369l02403j467399j270926J42497J381041J390240
$$ plain form
37069 1046109 324956 242224 1242542 2249252 2130333 1297402 962818 1274452 1249933
37060 1249933 413854 -555032 -942327 -863811 -738030 -632700 -486650 -419121 -494272 -598643
37050 -598643 -714722 -836830 -549164 615538 2167855 2780764 1884057 505682 -21034
37041 -21034 356461 700661 449778 -204936 -923564 -1444796 -1434962 -830753 -208888 -157548
37031 -157548 -386568 -122474 699723 1354319 1414054 1147535 732143 -81896 -1170840 -1661217
37021 -1661217 -961656 277091 834658 338965 -447249 -593731 141963 1287690 2083706
37012 2083706 1985264 1095020 146231 -158992 175811 534887 371521 -335353 -1141957 -1422920
37002 -1422920 -754166 607372 1632741 1330338 -137061 -1407987 -1265490 115551 1505791
36993A505791N35504j32149k57110k86524m25361k72419K89764N67323j5862r28668
36983E80289j168495o26157p4108P0086J27419K73129K05686j3738K55720J024322
36973F54153J111972k64524j910316j826684J21274J817065J485560k02539j201412
36964b15451o78065K71651L49983l23703o88514l00829K73206N11715O06630P98441
36954F05064P52245J96385l59155l27060o1602k48705n98756k96383L94384L47147
36944D03564m69829p55025m2230M54654m7313n11127K6166O30114J05195p49782
36934i55613m06954P03799Q43262j19273n56094J51704P38448L33340k08467M7867
36924E72019N96360M31966n07240j471151j712496q95384N05450J199788M80533
$$ plain form
36993 1505791 2041295 1909146 1652036 1365512 940151 667732 957496 1524819 1508957 580289
36983 580289 -588206 -1214363 -1288471 -1218385 -1090966 -817837 -612151 -625889 -370169 654153
36973 654153 1766125 1501601 -408715 -2235399 -2114125 -297060 1188500 985961 -215451
36964 -215451 -893516 -621865 -271882 -595585 -1284099 -1584928 -1311722 -800007 -193377 605064
36954 605064 1357309 1553694 1194539 867479 805877 557172 -41584 -337967 56417 403564
36944 403564 -66265 -821290 -863520 -408866 -456179 -967306 -941140 -311026 -205831 -955613
36934 -955613 -1362567 -658768 184494 65221 -490873 -339169 399279 732619 524152 572019
36924 572019 1168379 1600345 1093105 -378046 -2090542 -2985926 -2480476 -1280688 -800155
36915h00155n05257j74362R81401J009834l28917j057713j64706Q30603M67709
36906B58437m76266o90967m33545m21228k35799M75167O58738l83399j158130
36897b406992l9289J788066J751891k60634j785937j389043k05481L31204L07010
36888a909205L39224M25086M75845P56128J167954J081765L65952k75018l77292
36879B050439l46904o56213j068926r95189k11695Q64683J365283P17802m55036
36870A264244p74319N0050O73839J81039m37141q0511M12380k05408j076443n36570
36860e28840P85510Q01617l87246n70016O35516R98635l37236j154068L6299J284672
36850A564843M16230j345345j464128j10842N52207K301l41159J21219N11841
$$ plain form
36915 -800155 -1305412 -1479774 -498373 511461 182544 -875169 -1039875 -209272 258437
36906 258437 -217829 -908796 -1342341 -1763569 -1999368 -1524201 -865463 -1248862 -2406992
36897 -2406992 -2446281 -658215 1093676 833042 -952895 -2341938 -2547419 -2216215 -1909205
36888 -1909205 -1569981 -1144895 -669050 87078 1255032 2336797 2702749 2427731 2050439
36879 2050439 1703535 1047322 -21604 -1016793 -1228488 -363805 1001478 1719280 1264244
36870 1264244 489925 539975 1213814 1394853 957712 877201 1289581 1084173 7730 -528840
36860 -528840 256670 1058287 671041 101025 736541 1735176 1397940 243872 280171 1564843
36850 1564843 1981073 635728 -828400 -939242 -387035 -384734 -725893 -604674 -92833
36841i2833M27656M66529P26039N30258j67598n57718l05621Q4014K59903L05837
36831A676466J48351k70081m67342j43466l5577q08216j531515p98889Q84660
36822a345609J532515N56602m67807k63338M88592N59819m2499m57823k46236
36813C14216L22908O45643J89463q60929j409342p15078L50876M15086k68963
36804a016120k53260O06207Q52148l3651o42931K5519R36240Q05787P6849j54668
36794A202120k802k38424p73305r75868p95973m67253J80104J045199J228854
36785D02652L80270k58238M50425J500956J001508r54525k313555j856883m70634
36776b118024M58839N72702K52550n1066M9260N37659P34655J93420l59156r271
$$ plain form
36841 -92833 334823 801352 1527391 2057649 1890051 1332333 1026712 1110726 1370629 1676466
36831 1676466 1824817 1554736 1087394 943928 908351 100135 -1431380 -2230269 -1345609
36822 -1345609 186906 743508 275701 12363 500955 1060774 1018275 560452 314216
36813 314216 637124 1282767 1472230 611301 -798041 -1513119 -1162243 -747157 -1016120
36804 -1016120 -1269380 -663173 188975 155324 -487607 -462088 474152 1279939 1356788 1202120
36794 1202120 1199318 960894 187589 -788279 -1584252 -2051505 -1871401 -826202 402652
36785 402652 782922 524684 975109 2476065 3477573 2523048 209493 -1647390 -2118024
36776 -2118024 -1659185 -1086483 -833933 -884999 -835739 -298080 436575 629995 270839 261568
36766B61568P07883M92370n39276r01294j13996N57103J72044n65520o86986l03860
36756i19964J41160P08058J255129J087282J65688m38052j62826R4386m12219
36747A518642r14980n22087J81957K70199J54553O01841J008025M14186m82921
36738B229415k83152O12480N29828n89930r91501k5178Q62068O41713K03854M44781
36728C634378O87695J94198l30137j04284J97317k36017o68022j08639O59439
36719C925928K23178q97169q66729M17599R63169k20283j517732j131346L06732
36710A203347P87490k36115j343921j222412j87581N20104L03291k62006k46429
36701f84232N28313J305519J312036O46206Q952k53788l87628n71432o08494m51095
$$ plain form
36766 261568 969451 1461821 922545 21251 -92745 464358 636402 70882 -616104 -919964
36756 -919964 -778804 -70746 1184383 2271665 2437353 1999301 1836475 1930861 1518642
36747 1518642 603662 81575 263532 533731 688284 1290125 2298150 2712336 2229415
36738 2229415 1946263 2558743 3088571 2498641 1507140 1481962 2344030 2985743 3189597 3634378
36728 3634378 4322073 4516271 4186134 4081850 4279167 4043150 3375128 3266489 3925928
36719 3925928 4149106 3251937 2385208 2802807 3765976 3545693 2027961 896615 1203347
36710 1203347 1990837 1754722 410801 -811611 -999192 -479088 -175797 -437803 -684232
36701 -684232 -155919 1149600 2461636 3107842 3116794 2863006 2475378 1903946 1295452 844357
36691H44357m81379q82500j115070n17406P07426J529759J173679m5712j002332
36682B10822q23961K35822R66935M50704p97274j268057k71531J077477J185188
36673I66125N0155p41710k08613O68746L90701q42365j356366l77020R01044J052701
36663E03398L07562j35202l4373k04479q85297j234745o96188J74969O94325R17579
36653e92451R56475L91779p45603j231376r9581J611215J861949K61931j503005
36644I11333j964061j369103o07521J02157P79513R76487M48969j12725N4187
36635g80764O09321O41433N4224m39687n01729m43183l65569M3239O69203P92671
36625B79159J54740m96623m53909p8516j33856n13322m48120J65634N21848J58171
$$ plain form
36691 844357 362978 -519522 -1634592 -2151998 -1444572 85187 1258866 1213154 210822
36682 210822 -613139 -377317 589618 1040322 243048 -1025009 -1296540 -219063 966125
36673 966125 1016280 274570 65957 734703 1125404 283039 -1073327 -1450347 -549303 503398
36663 503398 810960 675758 641385 436906 -448391 -1683136 -2379324 -2204355 -1510030 -592451
36653 -592451 364024 755803 10200 -1221176 -1320757 290458 2152407 2414338 911333
36644 911333 -1052728 -2421831 -3029352 -2927195 -2147682 -1171195 -722226 -834951 -780764
36635 -780764 -171443 469990 524214 84527 -417202 -860385 -1225954 -1182715 -513512 279159
36625 279159 433899 -62724 -516633 -595149 -729005 -1242327 -1690447 -1524813 -1002965 -844794
36615h44794l24446k12683K77768N04797M65819N96017P78279M72606j56150k19307
36605A337906M49456P52695j03200j243951j264645k74239K99895j48462o18758
36596h13303j84582N53602M25507n16317j050564m82532M91291P99265L35593
36587d42040j00611M0742M29993M53409O3415k82083l30620k39621r7111K25947
36577b78580N72209M20532k83727p31338k85454M62198M19718m18374r45417n21968
36567a590201K44419N26458L51981K53310L91849N00638L75771M9120l25459n31407
36557B46479m43081k43787k27278l19516j53432L09679O61678O64067N23084M04750
36547A422643J78330j53423k86246j36372k8427r7596m6053K11333K82711P4253
$$ plain form
36615 -844794 -1169240 -1381923 -1104155 -599358 -133539 462478 1240757 1713363 1557213 1337906
36605 1337906 1787362 2540057 2436857 1192906 -71739 -345978 -46083 -194545 -813303
36596 -813303 -997885 -444283 -18776 -535093 -1585657 -2068189 -1576898 -777633 -442040
36587 -442040 -542651 -501909 -71916 381493 444908 162825 -167795 -407416 -504527 -278580
36577 -278580 293629 714161 430434 -300904 -586358 -124160 295558 -122816 -1068233 -1590201
36567 -1590201 -1345782 -819324 -467343 -214033 177816 678454 1054225 1103345 777886 246479
36557 246479 -196602 -440389 -667667 -987183 -1140615 -830936 -169258 494809 1017893 1422643
36547 1422643 1600973 1447550 1161304 1024932 996505 898909 852856 1064189 1346900 1421153
36537A421153J35309O50215P79901j46436j292641j193479K11783J393715J130786
36528C090306k09865j396464j608855q32055L26621R35907M42236n89816q98232
36519g40217j1580J086782J139685J28400q08526p75685l2512M71745J82578n23287
36509A17383p95927k86357L87130L23904m93049j038868m91340O50759J151363
36500d75002O45906O4413K32162O63472L63743n41461q73890j37248P32692P45421
36490A420208J82290q8508L2381K0852k43876m93527p63679j130539j065056j28517
36480b257971R16841R34574K39010J67071P86939P38151k50794n95649M60672
36471A138844J265831L41964j051227q73829L63821M98888o90447j193850p3302
$$ plain form
36537 1421153 1556462 2206677 2986578 2840142 1547501 354022 565805 1959520 3090306
36528 3090306 2880441 1483977 -124878 -956933 -630312 305595 747831 158015 -740217
36519 -740217 -751797 334985 1474670 1603070 794544 18859 -13653 458092 640670 117383
36509 117383 -678544 -964901 -577771 -253867 -746916 -1785784 -2277124 -1626365 -475002
36500 -475002 170904 235317 467479 1130951 1494694 953233 79343 -57905 674787 1420208
36490 1420208 1602498 1513990 1546371 1567223 1323347 829820 66141 -1064398 -2129454 -2257971
36480 -2257971 -1341130 -406556 -167546 -475 786464 1524615 1273821 678172 1138844
36471 1138844 2404675 2746639 1695412 821583 1185404 1684292 993845 -200005 -273307
36462b73307J168738J022651o2690q37319q74802l42052N25532J005244J90656
36453A522651j479362k122532p54499J214928J762609P36718l89180n89499j12732
36444b10898L57873M53927J85294j25085r3213K12084L11012O3469j60329k60485
36434G33649n82424r63759n65866O95558J495093P96395n57210r94630l49938
36425b93132K73974K87504L6767k64296p43624j048471n31471N46392J049796
36416f86561N25864j46345m0685N96005Q39341L16615m40317o39779p7562N62176
36406H08752M42454k34269l17898N55842J105564K10331j160416j219645r5708
36397I5007M44579q6463k37575P00019J371201O88217l29724m03929j23299n66234
$$ plain form
36462 -273307 895431 1918082 1855392 1018073 143271 -198781 326751 1331995 1522651
36453 1522651 43289 -2079243 -2833742 -1618814 143795 880513 491333 -98166 -210898
36444 -210898 146975 600902 786196 661111 567898 779982 1090994 1154463 994134 733649
36434 733649 151225 -812534 -1378400 -682842 812251 1608646 1051436 56806 -293132
36425 -293132 -19158 268346 305113 40817 -702807 -1751278 -2282749 -1736357 -686561
36416 -686561 -160697 -307042 -347727 248278 1087619 1404234 963917 324138 246576 808752
36406 808752 1251206 1016937 699039 1254881 2360445 2570776 1410360 190715 95007
36397 95007 539586 453123 215548 915567 2286768 2974985 2645261 2241332 2118033 1551799
36387A551799j084705m20199Q56386J116028L78684J24212O00191N08991m56352
36378C175035r44644l44416K14856N5775J40348R56331J165599r5351j279284
36369C044249p09791N76673M75937p06578r13984M8985K57542q60251j456266
36360b43484m16784Q14690P74576K55112M87333Q21941J35041p92397m51638O79640
36350B064030Q12027j84662p09667k95693k88207j213547j628984n69446P05291
36341a308858P36556J52370L44430R77742O45472n89841j169331m71084L85201
36332b97343M03671n2382l20108m58777n92745l17259M64324R61208N81321p1475
36322C00435j18577K49886K56508r7673j62697J14868J20201k81729n09299l06863
$$ plain form
36387 1551799 467094 46895 903281 2019309 2397993 2522205 3122396 3631387 3175035
36378 3175035 2230391 1885975 2100831 2156606 2296954 3253285 4418884 4323533 3044249
36369 3044249 2334458 2911131 3387068 2680490 1766506 1815491 2073033 1212782 -243484
36360 -243484 -660268 154422 928998 1184110 1671443 2493384 2628425 1836028 1384390 2064030
36350 2064030 2876057 2691395 1981728 1686035 1397828 184281 -1444703 -2014149 -1308858
36341 -1308858 -572302 -419932 -75502 902240 1547712 957871 -211460 -682544 -297343
36332 -297343 106328 53946 -266162 -724939 -1317684 -1634943 -1170619 -209411 371910 300435
36322 300435 181858 431744 688252 590579 427882 542750 662951 381222 -128077 -434940
36312d34940j13928j50778o906M77435P25596L48485j29718r8612J43617n1014
36302G09237n13146m46564L28717J017390Q33534q6210q62004p65529L8680N92028
36292H46133K18122n08687m26497M56246P45074k66881j282447p92409N88756
36283d22590J003732J61745l95714J09969N70492L2960p06885n53096Q9621K08420
36273I8654j9405K77385Q84185O94379l71048r98301m08078M17002J23488j023128
36263c24867j397296k11449J268917J204349l92500j494801o51070J035935J419181
36254D56399K90229n17458L15O66194K73693m60357l18382K53785J9758p53621
36244h9445o69268L78941R27040K75174m86025k86355M19941O44578K86477j89920
$$ plain form
36312 -434940 -548868 -699646 -706552 -229117 496479 844964 715246 616634 760251 709237
36302 709237 196091 -250473 78244 1095634 1929168 1842958 980954 215425 254105 846133
36292 846133 1064255 555568 129071 585317 1330391 1063510 -218937 -1011346 -422590
36283 -422590 581142 742887 347173 457142 1027634 1060594 353709 -199387 -109766 98654
36273 98654 79249 356634 1240819 1935198 1564150 565849 157771 574773 698261 -324867
36263 -324867 -1722163 -1933612 -664695 539654 147154 -1347647 -1998717 -962782 456399
36254 456399 746628 229170 229485 895679 1169372 709015 390633 644418 664176 -89445
36244 -89445 -758713 -379772 547268 822442 336417 50062 470003 1114581 1401058 1211138
36234A211138o27960r46761p46367K7422N50714Q7532q50341j090471l53233N03072
36224b235255P19498M41441J96554J48993J39903R8315P8188M0831j02565k46644
36214g20741j52559J53138K94566R3307l9677L19107P88773N72864k83235p71976
36204B53567l54233K69732L33183J52149L23135N05470Q3462m77845k30814N26233
36194A384039M96261n52639j315980r13633j02271N9645k66061k42996L20212
36185a133423Q95026R52499K67342r34345j726617j081651P46809K089726J721739
36176A797105K99416o40278n53034r1865Q2807m7622j73136o4257J96306J55740
36166I61182m78874j141498r16525L0924M54305r2533m47436L00917J226559R92903
$$ plain form
36234 1211138 583178 -363583 -1109950 -1082528 -531814 -444282 -1294623 -2385094 -2738327 -2235255
36224 -2235255 -1515757 -1074316 -877762 -728769 -588866 -490551 -412363 -371532 -474097 -720741
36214 -720741 -873300 -720162 -425596 -332289 -371966 -52859 735914 1308778 1025543 253567
36204 253567 -100666 169066 502249 654398 977533 1483003 1566465 1088620 857806 1384039
36194 1384039 1880300 1327661 11681 -901952 -1004223 -944578 -1210639 -1453635 -1133423
36185 -1133423 -238397 714102 981444 47099 -1679518 -2761169 -2014360 75366 1797105
36176 1797105 2096521 1456243 903209 811344 894151 846529 673393 609136 805442 961182
36166 961182 482308 -659190 -1575715 -1544791 -1090486 -1183019 -1630455 -1329538 -102979 889924
36156H89924k8388m75937j97903j61852n25376m67498Q7917K33243j95292k29784
36146a070946M15653O52408j19171q07976k88374Q21819J145389M91313k86467
36137I53648p10083q23313m59337M10550R44912L25046p60970q14088K55641R40715
36127B62721M48230j86988N2317N17292J62228n56319m47455L24370M39325m19084
36117E96637j078518p71495j60078J0276L5295L13090M01898k2342k00336N50529
36107c25044J398356J021296l36671j156794q07889j16852J94790L24535M56324
36098F52051K69348k53805o00465o47739p83931q72766l00582O28164P50618L7731
36088a121376k4147J102520J786881P57735o81318o86499J53957p250j012956
$$ plain form
36156 889924 861536 385599 187696 25844 -499532 -967030 -879113 -645870 -841162 -1070946
36146 -1070946 -655293 -2885 -122056 -930032 -1218406 -396587 748802 1240115 953648
36137 953648 243565 -579748 -1039085 -628535 316377 641423 -119547 -933635 -677994 262721
36127 262721 710951 523963 576280 1093572 1255800 699481 252026 576396 1015721 596637
36117 596637 -481881 -1253376 -1413454 -1403178 -1367883 -1054793 -652895 -675237 -875573 -325044
36107 -325044 1073312 2094608 1757937 601143 -206746 -323598 -128808 195727 652051
36098 652051 921399 667594 67129 -580610 -1364541 -2237307 -2537889 -1909725 -1159107 -1121376
36088 -1121376 -1145523 -43003 1743878 2501613 1820295 1133796 1287753 1280503 267547
36079B67547j034351J32859O09227l95062j244111n51469P20797R70819K86368
36070b37376j72049m1879J85460K46556K27309J24480K7787K08991M98911K92322
36060A360512l14922l22000N61638J125076M29416n97128n36456L39245O35818
36051B681199L4947n19314n22140l61969j81492L25266R07697Q43342K01320j66611
36041C242245o1406j41438m93905l58163L15096M21192n07308j355811j129324
36032f8822m22332j98793k16398J41230M51216Q8469k87658L33571J364324J254945
36022B439752p5136j050233p73604l5591K73090L00340L36616J34218k60429j86057
36012A102966M37935O72502L0532o31425m55410J60526M56005M84594M95899J21667
$$ plain form
36079 267547 -766804 -633945 -24718 -419780 -1663891 -2215360 -1494563 -523744 -237376
36070 -237376 -409425 -451304 -265844 -19288 208021 332501 360288 569279 1068190 1360512
36060 1360512 1045590 723590 1285228 2410304 2839720 2242592 1706136 2045381 2681199
36051 2681199 2716146 2196832 1674692 1312723 1131231 1456497 2364194 3207536 3408856 3242245
36041 3242245 3180839 3039401 2545496 2187333 2502429 2923621 2416313 1060502 -68822
36032 -68822 -491154 -689947 -906345 -765115 -313899 -225430 -513088 -179517 1184807 2439752
36022 2439752 2364616 1314383 540779 505188 778278 1078618 1415234 1549452 1289023 1102966
36012 1102966 1540901 2213403 2243935 1612510 1157100 1317626 1773631 2258225 2754124 2875791
36002B875791p54436j212515n76906L11824L66282J3110K50714O80466K07013
35993B161343p81384q70116j17163p1542j055639j441939k95467J097267J314453
35984f0187Q37213P94652R48624L40105q67553j537255j141523j81045O45254
35975b21715Q94571L97639m37155p05489m4663P84757Q89511L19290l71098r72737
35965E32911j342555r59445L18250J538368J637715P98671k9503n73593j199620
35956G21199j688821j212647K89188J614576J603495M59699n61905n73005O2390
35947G14169K97089j89720n06314J14756R25830N98071o02206r58577N1632Q01551
35937A246281L6291j118454r51780K21828P87773L07085l29725o09284o93173
$$ plain form
36002 2875791 2121355 908840 331934 643758 1010040 1023150 1273864 1954330 2161343
35993 2161343 1379959 509843 392680 321138 -734501 -2176440 -2471907 -1374640 -60187
35984 -60187 777026 1571678 2520302 2860407 1992854 455599 -685924 -866969 -221715
35975 -221715 672856 1070495 633340 -72149 -116812 667945 1557456 1876746 1505648 532911
35965 532911 -809644 -1769089 -1450839 87529 1725244 2523915 2494412 1920819 721199
35956 721199 -967622 -2180269 -1891081 -276505 1326990 1786689 1224784 651779 714169
35947 714169 1011258 821538 315224 429980 1355810 1953881 1351675 393098 444730 1246281
35937 1246281 1282572 164118 -787662 -565834 221939 529024 199299 -409985 -1103158
35928a103158m82317J16871M29166l1505l80861K90546J052232N01704o22975
35919b30297m80101O19758O52245m26659m04053J177472J841478L17233j120898
35910A946178m35067P05650j53171j946299j795378K63639J459331O71781l79891
35901C36773l77387n9708j41473j7829O00058P75847N4861o00878n46095n47106
35891e22937j065169r63880O34619K374543K230643M16741q99734n87876K34336
35882A851286J55402o33673r65335m15163K94146L27577l06339q50928o84999
35873a228026l1679L16948n558m88699m71867j9235K90656K25778Q2837R6367
35863a232478J55786J59408K13984L54615M24629L74648L61958M09100K73788
$$ plain form
35928 -1103158 -1585475 -1468604 -1039438 -1070943 -1451804 -1161258 -109026 392678 -230297
35919 -230297 -710398 -90640 561605 134946 -269107 908365 2749843 3067076 1946178
35910 1946178 1511111 2216761 2063590 117291 -1678087 -1414448 44883 716664 336773
35901 336773 -40614 -100322 -241795 -259624 340434 1116281 1171142 570264 24169 -522937
35891 -522937 -1588106 -2551986 -1917367 457176 2687819 3104560 2204826 1616950 1851286
35882 1851286 2006688 1373015 407680 -7483 286663 614240 307901 -543027 -1228026
35873 -1228026 -1259705 -942757 -948315 -1437014 -1908881 -1928116 -1637460 -1411682 -1328845 -1232478
35863 -1232478 -1076692 -917284 -703300 -348685 75944 450592 812550 1221650 1495438
35854A495438j66914o67669r04558p67902k79952M33532R62437Q31962J46360
35845A082734l87074l35977q271K17765M24650N93215K40577o44925r94062k2966
35835A65666J287354J312647J00581p97588o95847m29714m93659k37093N00388
35826G12735O33129l09828j052497n31203L15661J46809n43343m58951J48624
35817i38864P3873m94816k74449O64272Q26576j25698p04361p2401N95710J13016
35807c37142q40550r26346j51032M37088L23752j57480n76515o96186l92345J49254
35797c167502M98648N60600O03704N47233l288p34158o15451N42103J481884J189454
35787I03227K95482q8239o9946l71284p10202k22770P62519Q62351k38565j107055
$$ plain form
35854 1495438 1328524 660855 -243703 -1011605 -1291557 -858025 104412 936374 1082734
35845 1082734 695660 359683 351412 569177 993827 1587042 1827619 1182694 188632 165666
35835 165666 1453020 2765667 2866248 2068660 1372813 943099 449440 212347 712735
35826 712735 1345864 1036036 -16461 -547664 -232003 -85194 -628537 -1087488 -938864
35817 -938864 -864991 -1359807 -1634256 -969984 -143408 -269106 -973467 -1045868 -450158 -337142
35807 -337142 -1177692 -2104038 -2255070 -1817982 -1494230 -1651710 -2228225 -2924411 -3316756 -3167502
35797 -3167502 -2668854 -2108254 -1504550 -957317 -960605 -1694763 -2310214 -1768111 -286227 903227
35787 903227 1198709 1110470 1040524 669240 -40962 -263732 498787 1361138 1122573 15518
35777A5518n67156O36331R88755L18055k49144j48180p1726n54861q60897q1564
35767e74869J200241J424262K11607j031363j015081j46150L85874K72379j073
35758G25827k71504p36238j222714j307050r07395q5606J207898K396498K119789
35749A919505R2093j653763j093640P38545J061983n05201j466889m12893J027717
35740b92543J108467N01013M89139O52355J38240l67698P9445O44524j8969j315389
35730A618584j536205o04240l7143l98380o06123J21899J142375J452482P94993
35721A948242l87542j234693q84910M90317J399033P69123m41309n29264M62186
35712A591183Q99532J1912j206972j592040j053605j03797P58554J039936N79341
$$ plain form
35777 15518 -551638 84693 1073448 1391503 1142359 994179 922453 367592 -493305 -574869
35767 -574869 625372 2049634 2261241 1229878 214797 68647 454521 726900 725827
35758 725827 454323 -281915 -1504629 -2811679 -3719074 -3804680 -2596782 -200284 1919505
35749 1919505 2011598 357835 -735805 2740 1064723 559522 -907367 -1320260 -292543
35740 -292543 815924 1316937 1806076 2458431 2596671 2228973 2308418 2952942 2933973 1618584
35730 1618584 82379 -521861 -559004 -957384 -1563507 -1441608 -299233 1153249 1948242
35721 1948242 1560700 326007 -558903 -68586 1330447 2099570 1658261 1128997 1591183
35712 1591183 2490715 2502627 1295655 -296385 -1349990 -1453787 -695233 344703 924044
35703I24044k3978r7446J29291O0299j14851J38782M92975K46946k87917k88004
35693A180141l8535m73987j226147r08545M83309J261453N85073l86295m98593
35684b2126j61091j24655j73493O3308K60327K18370L63758O53954K53283q49823
35674D81812j254477k33310Q96365P34820p6891j54693K50645j17586j168199
35665f41514j488814n31577P02915J175543Q40258J68114l83086m53762j30196
35656g42119m4187m49290o26706k2379O13523L16948l87879k05245Q25674J356366
35646F34706P77564j22569n83836o38377l66607K64457O64324J19285p34735m50179
35636d35967Q34607J216162l0502j073231k97970J100096R69445n01479j288853
$$ plain form
35703 924044 900066 802620 931911 992210 877359 1016141 1509116 1756062 1468145 1180141
35693 1180141 1141606 667619 -558528 -1467073 -983764 277689 862762 476467 -22126
35684 -22126 -183217 -307872 -481365 -418057 -157730 60640 424398 1078352 1331635 481812
35674 481812 -772665 -1005975 -109610 625210 548319 393626 644271 526685 -641514
35665 -641514 -2130328 -2661905 -1958990 -783447 56811 224925 -158161 -611923 -742119
35656 -742119 -786306 -1235596 -1862302 -1884681 -1271158 -954210 -1342089 -1547334 -721660 634706
35646 634706 1412270 1289701 705865 67488 -299119 -34662 629662 748947 14212 -435967
35636 -435967 398640 1614802 1584300 511069 213099 1313195 2282640 1781161 492308
35627D92308p05261m5788j76119l96375o4148L07663K43829K67925Q33331J295155
35617B052520Q36728k82527j199320j578789j521876r12212K38965J159087J001087
35608b06337R3716l60009P2038N01226R4049p01215q46696k12616L18516K16474
35598a030854P7443O10864J298925Q81779p30950j909540j299898K69354Q67302
35589i65575J20378m63451Q6020Q43261O45053j42832n09302m71074o30898p45167
35579b233587j14046R26003J244612N88685j63123l88934k41698J62955Q34099
35570F14966J144592L44458r42178j137741k7510P81069K95087m73634m30752
35561A68357k06045p39893j329972p43246N33571R05405J52004l69527M5582N57258
$$ plain form
35627 492308 -212953 -258741 -434860 -831235 -895383 -587720 -343891 -75966 757365 2052520
35617 2052520 2889248 2606721 1407401 -171388 -1693264 -2605476 -2366511 -1207424 -206337
35608 -206337 -112621 -472630 -400592 100634 194683 -506532 -1353228 -1565844 -1247328 -1030854
35598 -1030854 -953411 -342547 956378 1838157 1107207 -802333 -2102231 -1832877 -965575
35589 -965575 -845197 -1308648 -1222628 -379367 265686 122854 -386448 -857522 -1488420 -2233587
35579 -2233587 -2347633 -1421630 -177018 411667 248544 -140390 -382088 -219133 614966
35570 614966 1759558 2104016 1161838 24097 -3413 777656 1072743 599109 168357
35561 168357 -37688 -777581 -2107553 -2850799 -2317228 -1411823 -1259819 -1629346 -1583764 -1026506
35551a026506L61687j49994k67503R269L06985M95751N46285L63820J00146J16148
35541H56088L68907L36856j83295o78961o19009j59578J56684J16237n3567j10976
35531B9386o4658n4449j52852l47084o29255r26492q96249j18774J170445J868503
35521a21479J180065j44703n86506R9632O15219J40095n20386m05097R4693J11610
35511D63143k28476k90962j64300k65041k93673K24432Q04501O10356j41078n41814
35501A77088m34431l17278j61723L66317P79143K98150o06549o83351Q4581M32967
35491f5086r5222n65319m05677j50854l0613N19157J303885J018270n98892j803571
35481h73922j237427O6487M15977j8455o969L90725J46332n77110n09624M84271
$$ plain form
35551 -1026506 -664819 -814813 -1082316 -1073047 -766062 -270311 275974 639794 739940 856088
35541 856088 1224995 1561851 1378556 699595 80586 -78992 77692 193929 140362 29386
35531 29386 -35272 -89721 -242573 -589657 -1218912 -2145404 -3041653 -3160427 -1989982 -121479
35521 -121479 1058586 913883 327377 427009 1042228 1182323 661937 256840 351533 463143
35511 463143 234667 -56295 -220595 -485636 -779309 -554877 249624 859980 718902 177088
35501 177088 -257343 -574621 -736344 -370027 409116 707266 100717 -582634 -498053 -65086
35491 -65086 -160308 -725627 -1131304 -1282158 -1312771 -793614 510271 1528541 929649 -873922
35481 -873922 -2111349 -2044862 -1628885 -1647340 -1654309 -1263584 -1117252 -1694362 -2203986 -1719715
35471a719715R92768K55464o95872o93046j5940M35844N68408P53751P62059J19473
35461G63194p62775q79303j20653M36051L8533o94193p48413j44732L06501L00901
35451a504889K70837M41462M86499K29211m4427j58517k76936l93556k73585m5239
35441a269140o3156m8106O27895J533960J305330k40493j414527r72792J27539
35432d13490L99686K7808N529J86221j49456o41443m99917j03605k17018l36824
35422a742509L00262Q20092K3434j043736l93296J362911J606520n9179j138399
35413b63900l43653O11981L14083j59495K23479M08274m42635r73867o297J143441
35403E11411Q25174k51568o21045o52399j231781j430144q0331J544204J361652
$$ plain form
35471 -1719715 -726947 -471483 -1167355 -1860401 -1876341 -1440497 -872089 -118338 643721 763194
35461 763194 419 -878884 -999537 -563486 -524953 -1219146 -1967559 -2112291 -1805790 -1504889
35451 -1504889 -1234052 -792590 -306091 -76880 -121307 -279824 -556760 -950316 -1223901 -1269140
35441 -1269140 -1332296 -1380402 -752507 781453 2086783 1846290 431763 -541029 -413490
35432 -413490 -13804 14004 19533 205754 56298 -585145 -1085062 -1188667 -1405685 -1742509
35422 -1742509 -1442247 -622155 -598721 -1642457 -2035753 -672842 933678 874499 -263900
35413 -263900 -607553 4428 318511 159016 382495 790769 348134 -625733 -632030 511411
35403 511411 1336585 1085017 463972 -188427 -1420208 -2850352 -2930683 -1386479 -24827
35394b4827m8939l54699O74541R87509j76969j202218q99142o3634L10563L72269
35384d25546L61690k1315n63481m03651M25581P19491l0763p87481o12203K4318
35374a313360K62376J60670K53841N73720P65959O63824L21486j06719l41109
35365A240688k68573k36369n18910o67448j22382O99934Q18163J24403m86828
35356E82678m36957m5182K30223K90823J22487j71812j19828M96641R11174K65819
35346B126066q83228j132875l45260J09600m68224r90311l12349R44867J214778
35337B63064Q8199j189991j187892J65050J488347J387262O2104q30430k42299
35328C414Q76049R57542O6026l57051K09257O27110n6918j137552j239386j42958
$$ plain form
35394 -24827 -73766 -428465 246076 1233585 1056616 -145602 -1044744 -1108378 -797815 -425546
35384 -425546 -63856 -85171 -648652 -1052303 -626722 92769 62006 -725475 -1337678 -1313360
35374 -1313360 -1050984 -890314 -636473 -62753 703206 1367030 1688516 1581797 1240688
35365 1240688 972115 735746 216836 -450612 -572994 126940 945103 1069506 582678
35356 582678 145721 100539 330762 621585 744072 572260 452432 949073 1860247 2126066
35346 2126066 1242838 109963 -235297 -125697 -593921 -1584232 -1896581 -951714 263064
35337 263064 351263 -838728 -2026620 -1861570 -373223 1014039 1076143 245713 3414
35328 3414 879463 1837005 1903031 1545980 1755237 2382347 2325429 1187877 -51509 -194467
35318a94467R68673Q92438k33444r90380l01327J040029J173028k20329j199969
35309I34252k96922J197317J098819m06706j216482n63601K07954J17774k00163
35300H72242j16889p9298m14696n77446k79475p3876k07562j45757K06651J18032
35290f98074n17143o60673J93938J072125J048107N59668L55875K41042k19559
35281A375306p13097p90240o24204m20927M8651O70182P38922J81471n6164M08522
35271H18422O05175r6991p40104l57095L30520J18427o99896r48254m55532J8138
35261a407190J88032L16551L34853M8682j76023N8297M05552M06422L01858L64285
35251H41319J97235l52791n25904N474K10807n18305q76916K71498J473317O46786
$$ plain form
35318 -194467 774206 1666644 1433200 442820 141493 1181522 2354550 2134221 934252
35309 934252 637330 1834647 2933466 2526760 1310278 746677 954631 1072405 872242
35300 872242 755353 676055 261359 -316087 -595562 -669438 -877000 -1022757 -816106 -698074
35290 -698074 -1215217 -1875890 -1681952 -609827 438280 997948 1353823 1594865 1375306
35281 1375306 662209 -128031 -752235 -1173162 -1124511 -454329 284593 466064 409900 818422
35271 818422 1423597 1326606 586502 229407 559927 678354 -21542 -969796 -1425328 -1407190
35261 -1407190 -1219158 -902607 -567754 -519072 -695095 -636798 -231246 175176 477034 841319
35251 841319 1038554 685763 159859 165333 376140 -142165 -1019081 -747583 725734 1372520
35241A372520j339388j725052j85592P89882R9021l88576O03396J449185N54302
35232A229698p43549l82334R75113J073733l30923j333618r53073k20238j27328
35223h12519l23418k66780j93410l17894k04033L53527O57537R1980p59421p61760
35213b536191K21089J107197R66701Q4524n74168n88448l36771j44677K19062
35204a581682Q69585J134406L11726r88083j160394L20039J856903J527438m27606
35195A862332j806635j198378L28052P63740k19681j033242m65721O97005Q78977
35186a93551k6620n34998K61366J331598J111696l04777j263649p33131M73487
35177A21421R29735L68110l10928l99375q6669J46213K24899K96284K28696k32264
$$ plain form
35241 1372520 33132 -1691920 -1877512 -1087630 -988609 -1377185 -773789 675396 1229698
35232 1229698 486149 103815 1078928 2152661 1821738 488120 -464953 -685191 -812519
35223 -812519 -1135937 -1402717 -1596127 -1914021 -2118054 -1764527 -1106990 -1015010 -1774431 -2536191
35213 -2536191 -2315102 -1207905 -241204 -156680 -730848 -1319296 -1656067 -1800744 -1581682
35204 -1581682 -712097 422309 734035 -254048 -1414442 -1094403 762500 2289938 1862332
35195 1862332 55697 -1142681 -814629 -50889 -270570 -1303812 -1769533 -1072528 -193551
35186 -193551 -220171 -755169 -493803 837795 1949491 1644714 381065 -352066 121421
35177 121421 1051156 1419266 1108338 708963 622294 768507 993406 1289690 1518386 1286122
35167A286122q75017j073639o33832j77506k55756l93479K79582J500911J871807
35158A529193P44053p14355j028150l44668N1360k98092o49643m84049j27455
35149a321806J68071N99049R33605M29701p76332j307314m28586O73955N65041
35140d64616l22104n40220L7990L06805M4457J85458Q20771P09677n49238j448944
35130a219964p29735O60680J024408L47396j37168r0563j88507m80324k88484
35121a102261K44067J02664p66342j036439l7101J054569R00668j24418p03085
35112a467678m51012m219K49420M88192P35799P17700M05120O5055j72994l11632
35102B53751k17864J50968M55109L80046R7738j21097l80772o98634n47601L43723
$$ plain form
35167 1286122 411105 -662534 -1296366 -1473872 -1729628 -2123107 -1843525 -342614 1529193
35158 1529193 2273246 1558891 530741 186073 237433 -60659 -710302 -1194351 -1321806
35149 -1321806 -1153735 -554686 378919 808620 32288 -1275026 -1703612 -1029657 -464616
35140 -464616 -786720 -1326940 -1288950 -982145 -937688 -752230 68541 778218 228980 -1219964
35130 -1219964 -1949699 -1289019 -264611 82785 -54383 -144946 -333453 -813777 -1102261
35121 -1102261 -858194 -755530 -1521872 -2558311 -2595412 -1540843 -640175 -764593 -1467678
35112 -1467678 -1918690 -1922909 -1673489 -1185297 -449498 268202 673322 738377 565383 253751
35102 253751 35887 186855 641964 1022010 1119748 998651 617879 -80755 -628356 -284633
35092b84633J125818P58964l80555q94711l56842K07294L0511l34024j29126M28277
35082A70973P38348P69096O81405K08694p30791j350116r03125L7281K27748m24142
35072e74629p44565j47585M79968K64886k48582j03404L23292j38694j290232
35063b179545j384166L16453K024073J627101l21232j279495k29396J038678O12567
35054B25038r05209j416569j76828J442487J735170M12034j284433j723668l99867
35045b091845J349935J603133J68406j092041p88432J42681J10557n75132l88324
35036a561062O93822R97699k00578j503834j405576j69153R34476J195681O32068
35027c86457m55573j371157j249982j38178P54119N37192j69555k02938M68615
$$ plain form
35092 -284633 841185 1600149 1219594 324883 -31959 175335 205846 -128178 -257304 170973
35082 170973 909321 1678417 2359822 2568516 1837725 487609 -415516 -378235 -150487 -574629
35072 -574629 -1319194 -1466779 -986811 -721925 -970507 -1073911 -750619 -889313 -2179545
35063 -2179545 -3563711 -3247258 -1223185 403916 82684 -1196811 -1426207 -387529 225038
35054 225038 -680171 -2096740 -2273568 -831081 904089 1316123 31690 -1691978 -2091845
35045 -2091845 -741910 861223 1029629 -62412 -850844 -708163 -597606 -1172738 -1561062
35036 -1561062 -867240 130459 -70119 -1573953 -2979529 -3148682 -2214206 -1018525 -386457
35027 -386457 -842030 -2213187 -3463169 -3601347 -2847228 -2310036 -2479591 -2682529 -2213914
35018b213914Q08280K46736n38642m92377N10420J407673J067803l21430j279813
35009h05264p55454N31874J032224L54216m67097n47614r8329K80831L87331K62216
34999A74934m9393l47997m18122l71818l51036q5361N52638Q73168K37545o67792
34989d53234o25486K06893N39869L4588l84038l62285n48358q98749m12280Q52105
34979b050975J366266N87041l7966M18109P40058j29421r83890l70949P73396
34970C11669N79948p15882j266261m54349O49263J144720R07533j04265j465818
34961d13442j815594n28480P66630K60509j056950p31389J196249K100390Q34127
34952F12050o34736m06812P27536R84372J74185o74661j010936q73752k28805
$$ plain form
35018 -2213914 -1405634 -1158898 -1697540 -2189917 -1679497 -271824 795979 474549 -805264
35009 -805264 -1560718 -1028844 3380 357596 -109501 -657115 -755444 -474613 -87282 174934
34999 174934 125541 -222456 -640578 -1012396 -1363432 -1448793 -896155 -22987 214558 -453234
34989 -453234 -1078720 -871827 -331958 -297370 -681408 -1043693 -1592051 -2490800 -2903080 -2050975
34979 -2050975 -684709 -97668 -135634 282475 1022533 893112 -90778 -461727 311669
34970 311669 891617 175735 -1090526 -1544875 -895612 249108 1156641 1052376 -413442
34961 -413442 -2229036 -2757516 -1990886 -1730377 -2787327 -3518716 -2322467 -222077 612050
34952 612050 -22686 -429498 298038 1282410 1456595 781934 -229002 -1102754 -1331559
34943a331559P41802J305643R53241P3112o13302q00724n35137l6839K09001j39528
34933a74290o57985o42163j90531L9745J7929K05997L82039o8544p02739m00555
34923b191097O22510Q53304p2696p24547k98597J65242q4653o2086R31896J590967
34913G30243O45049q06213r35514m6948K54686j13811O5403P75754P35700j75046
$$ plain form
34943 -1331559 -589757 715886 1669127 1742239 1128937 328213 -206924 -243763 -34762 -174290
34933 -174290 -832275 -1474438 -1664969 -1625224 -1607295 -1401298 -1019259 -1087803 -1790542 -2191097
34923 -2191097 -1568587 -715283 -787979 -1512526 -1811123 -1645881 -1730534 -1792620 -860724 730243
34913 730243 1375292 569079 -366435 -413383 -158697 -272508 -207105 568649 1304349 1129303
$$ [...]
##END NTUPLES=NMR SPECTRUM
##END=
