##TITLE=31Pdec_LR-748-R2-M1
 CDCl3, 24 sc
 8.4.2022
##JCAMPDX= 6.0         $$ Bruker NMR JCAMP-DX V2.0
##DATA TYPE= NMR SPECTRUM
##DATA CLASS= NTUPLES
##ORIGIN= UXNMR, Bruker Analytische Messtechnik GmbH
##OWNER= root
$$ XWIN-NMR		Version 3.5
$$ Fri Apr  8 15:48:31 2022 Russian Standard Time (UT+4h)  she@DPX200
##.OBSERVE FREQUENCY= 81.013821
##.OBSERVE NUCLEUS= ^31P
##.ACQUISITION MODE= SIMULTANEOUS
##.ACQUISITION SCHEME= undefined
##.AVERAGES= 24
##.DIGITISER RES= 16
##SPECTROMETER/DATA SYSTEM= spect
##.PULSE SEQUENCE= zgpg30
##.SOLVENT NAME= CDCl3
##.SHIFT REFERENCE= (INTERNAL, CDCl3, 0, 248.564)
##AUDIT TRAIL= $$ (NUMBER, WHEN, WHO, WHERE, WHAT)
$$ ##TITLE= Audit trail, XWIN-NMR		Version 3.5
$$ ##JCAMPDX= 5.01
$$ ##ORIGIN= Bruker BioSpin GmbH
$$ ##OWNER= she
$$ F:/spectra/data/she/nmr/P31/1/pdata/1/auditp.txt
$$ ##AUDIT TRAIL=  $$ (NUMBER, WHEN, WHO, WHERE, WHAT)
(   1,<2022-04-08 15:47:32.75 +0400>,<she>,<DPX200>,
      <created by zg, POWCHK disabled, PULCHK disabled
       configuration hash MD5:
       00 E9 B6 7A A2 85 ED C7 34 08 36 98 17 FE 4E 26
       data hash MD5: 32K
       0D 5F DC BF D5 50 49 C7 BA 7C C5 98 4B 0E 53 1D>)
(   2,<2022-04-08 15:47:34.95 +0400>,<she>,<DPX200>,
      <Start of raw data processing
       efp BC_mod = 2 LB = 1 FT_mod = 6 PKNL = 1 PHC0 = -9707.965 PHC1 = 473.8757 SI = 64K 
       data hash MD5: 64K
       C1 4C 16 37 AB 17 7B 7C AF 94 A2 A4 B2 11 33 1C>)
(   3,<2022-04-08 15:47:57.39 +0400>,<she>,<DPX200>,
      <pk PHC0 = -73.19109 PHC1 = 170.6 
       data hash MD5: 64K
       28 F1 B9 C3 83 3A F6 80 6D D5 92 70 12 18 1F 39>)
$$ ##END=
$$ 
$$ hash MD5
$$ C6 5F 5A 3D 06 EE E0 BA DC AA BD 70 5E 6E 1C 05
##$RELAX= 
##$RELAX= 
##$RELAX= 
##$RELAX= 
##$RELAX= 
##$RELAX= 
##$RELAX= 
##$RELAX= 
$$ Bruker specific parameters
$$ --------------------------
##$DU= <F:/spectra>
##$EXPNO= 1
##$NAME= <P31>
##$PROCNO= 1
##$TYPE= <nmr>
##$USER= <she>
##$AMP= (0..31)
100 100 100 100 100 100 100 100 100 100 100 100 100 100 100 100 100 100 
100 100 100 100 100 100 100 100 100 100 100 100 100 100 
##$AQSEQ= 0
##$AQ_mod= 1
##$AUNM= <au_zg>
##$AUTOPOS= <>
##$BF1= 81.014009
##$BF2= 200.13
##$BF3= 200.13
##$BF4= 200.13
##$BF5= 200.13
##$BF6= 200.13
##$BF7= 200.13
##$BF8= 200.13
##$BYTORDA= 1
##$CFDGTYP= 0
##$CFRGTYP= 5
##$CHEMSTR= <none>
##$CNST= (0..31)
1 1 145 1 1 1 1 1 1 1 1 1 1 1 1 1 1 1 1 1 1 1 1 1 1 1 1 1 1 1 1 1 
##$CPDPRG= <waltz16>
##$CPDPRG1= <>
##$CPDPRG2= <waltz16>
##$CPDPRG3= <>
##$CPDPRG4= <mlev>
##$CPDPRG5= <mlev>
##$CPDPRG6= <mlev>
##$CPDPRG7= <mlev>
##$CPDPRG8= <mlev>
##$CPDPRGB= <>
##$CPDPRGT= <>
##$D= (0..31)
0 1 0 0 0 0 0 0 0 0 0 0.03 2e-05 3e-06 0 0 0 0 0 0 0 0 0 0 0 0 0 0 0 0 
0 0 
##$DATE= 1649418452
##$DBL= (0..7)
120 120 120 11 120 120 24 19 
##$DBP= (0..7)
150 150 150 150 150 150 150 150 
##$DBP07= 0
##$DBPNAM0= <>
##$DBPNAM1= <>
##$DBPNAM2= <>
##$DBPNAM3= <>
##$DBPNAM4= <>
##$DBPNAM5= <>
##$DBPNAM6= <>
##$DBPNAM7= <>
##$DBPOAL= (0..7)
0.5 0.5 0.5 0.5 0.5 0.5 0.5 0.5 
##$DBPOFFS= (0..7)
$$ [...]
##$SUBNAM2= <"">
##$SUBNAM3= <"">
##$SUBNAM4= <"">
##$SUBNAM5= <"">
##$SUBNAM6= <"">
##$SUBNAM7= <"">
##$SUBNAM8= <"">
##$SUBNAM9= <"">
##$SW= 501.771253377433
##$SWIBOX= (0..15)
0 1 3 0 0 0 0 0 0 0 0 0 0 0 0 0 
##$SW_h= 40650.406504065
##$TD= 32768
##$TD0= 1
##$TE= 0
##$TE2= 300
##$TE3= 300
##$TEG= 300
##$TL= (0..7)
0 120 53 12 22 120 120 120 
##$TP= (0..7)
150 150 150 150 150 150 150 150 
##$TP07= 0
##$TPNAME0= <>
##$TPNAME1= <>
##$TPNAME2= <>
##$TPNAME3= <>
##$TPNAME4= <>
##$TPNAME5= <>
##$TPNAME6= <>
##$TPNAME7= <>
##$TPOAL= (0..7)
0.5 0.5 0.5 0.5 0.5 0.5 0.5 0.5 
##$TPOFFS= (0..7)
0 0 0 0 0 0 0 0 
##$TUNHIN= 0
##$TUNHOUT= 0
##$TUNXOUT= 0
##$USERA1= <user>
##$USERA2= <user>
##$USERA3= <user>
##$USERA4= <user>
##$USERA5= <user>
##$V9= 5
##$VALIST= <valist>
##$VCLIST= <CCCCCCCCCCCCCCC>
##$VD= 0
##$VDLIST= <DDDDDDDDDDDDDDD>
##$VPLIST= <PPPPPPPPPPPPPPP>
##$VTLIST= <TTTTTTTTTTTTTTT>
##$WBST= 1024
##$WBSW= 4
##$XGAIN= (0..3)
0 0 0 0 
##$XL= 0
##$YL= 0
##$YMAX_a= 2679
##$YMIN_a= -3042
##$ZGOPTNS= <>
##$ZL1= 120
##$ZL2= 120
##$ZL3= 120
##$ZL4= 120
##$ABSF1= 0
##$ABSF2= 0
##$ABSG= 0
##$ABSL= 0
##$ALPHA= 0
##$AQORDER= 0
##$ASSFAC= 0
##$ASSFACI= 0
##$ASSFACX= 0
##$ASSWID= 0
##$AUNMP= <proc_1d>
##$AZFE= 0.1
##$AZFW= 0.5
##$BCFW= 0
##$BC_mod= 2
##$BYTORDP= 0
##$COROFFS= 0
##$CY= -3
##$DATMOD= 1
##$DC= 0
##$DFILT= <>
##$DTYPP= 0
##$F1P= 0
##$F2P= 0
##$FCOR= 1
##$FTSIZE= 65536
##$FT_mod= 6
##$GAMMA= 0
##$GB= 0
##$INTBC= 1
##$INTSCL= 5.30512e-09
##$ISEN= 30
##$LB= 1
##$LEV0= 0
##$LPBIN= 0
##$MAXI= 10000
##$MC2= 0
##$MEAN= 0
##$ME_mod= 0
##$MI= 50
##$NCOEF= 0
##$NC_proc= -7
##$NLEV= 6
##$NOISF1= 182.463
##$NOISF2= 159.3651
##$NSP= 0
##$NTH_PI= 0
##$NZP= 0
##$OFFSET= 248.5645
##$PC= 4
##$PHC0= -9781.156
##$PHC1= 644.4757
##$PH_mod= 1
##$PKNL= yes
##$PPARMOD= 0
##$PSCAL= 0
##$PSIGN= 0
##$REVERSE= no
##$SF= 81.014009
##$SI= 65536
##$SIGF1= 159.3651
##$SIGF2= -187.1042
##$SINO= 113.3802
##$SIOLD= 16384
##$SREGLST= <1H.CDCl3>
##$SSB= 0
##$STSI= 65536
##$STSR= 0
##$SW_p= 40650.406504065
##$SYMM= 0
##$S_DEV= 0
##$TDeff= 32768
##$TDoff= 0
##$TI= <>
##$TILT= no
##$TM1= 0
##$TM2= 0
##$TOPLEV= 0
##$USERP1= <user>
##$USERP2= <user>
##$USERP3= <user>
##$USERP4= <user>
##$USERP5= <user>
##$WDW= 1
##$XDIM= 65536
##$YMAX_p= 364912030
##$YMIN_p= -84952770
$$ End of Bruker specific parameters
$$ ---------------------------------
##NTUPLES= NMR SPECTRUM
##VAR_NAME=  FREQUENCY,     SPECTRUM/REAL,   SPECTRUM/IMAG
##SYMBOL=    X,             R,               I
##VAR_TYPE=  INDEPENDENT,   DEPENDENT,       DEPENDENT
##VAR_FORM=  AFFN,          ASDF,            ASDF
##VAR_DIM=   65536,         65536,           65536
##UNITS=     HZ,            ARBITRARY UNITS, ARBITRARY UNITS
##FACTOR=    0.620285442955139, 1,           1
##FIRST=     20137.2065510759, 0,            0
##LAST=      -20513.1999529892, 0,           0
##MIN=       -20513.1999529892, -84952770,   0
##MAX=       20137.2065510759, 364912030,    0
$$ Real data points
##PAGE= N=1
##DATA TABLE= (X++(R..R)), XYDATA
$$ [...]
39351a934243J198272R89885R16971J562483J468547j61986j779919j848403j148779
39342g37172j156165j448586n83994J139728J692482J92518j630871j511996M73830
39333c570226J944663J281347p4778N08645K817151L500477Q49296k182048j988124
39324C086403L05085P47840j093981j830359l74206K58324j332426k056968J47317
39315b142971K143005O75748j850136j216102J561625K095287P347q40092R17741
39306A351452K268658J230497l68378o24070k33983j67388K7289L96894N9307
39297C940278n72388p8854P45466n53363l373376l821236p87404J758073Q58286
39288a884518q98445J2481K324929K549400O34306q13572j024890j012560n85511
$$ y = [-1934243, -735971, 253914, 1170885, 2733368, 4201915, 4039929, 2260010, 411607, -737172, -1893337, -3341923, -3925917, -2786189, -1093707, -901189, -2532060, -4044056, -3570226, -1625563, -344216, -418994, 89651, 2906802, 6407279, 7256575, 5074527, 3086403, 3391488, 4139328, 3045347, 1214988, 840782, 1099106, -233320, -2290288, -2142971, 34, 675782, -1174354, -2390456, -828831, 1266456, 1273803, 433711, 1351452, 3620110, 4850607, 4482229, 3858159, 3624176, 3456788, 3484077, 3880971, 3940278, 3367890, 3289036, 4034502, 3481139, 107763, -3713473, -4500877, -2742804, -1884518, -2782963, -2770482, -445553, 2103847, 2738153, 1924581, 899691, -112869, -698380]
39279f98380Q43977J746931N26265j010911j46260J701225Q06341k342975l185960
39270a759747l70867J970281R15081q46398m7785J625120P64232j772740k323288
39261a846111m01406R22331J95682o86133k96525K26905n6293l5917R55439J336352
39251C14324L4792j005544L32407K388407J676867j645750l451706j412875J756359
39242a012719K314199M51274q97413o08853j16977k26489P9707J173053J402263
39233B558045m69714k800654k713023Q4571K527734J795274j107753k445999m86920
39224c058439K170361K110439r9647q29955J009576K162118J18580k698765k428469
39215a544201M31265J996794Q90538l62198R6904R15811N06012l96604o17856
$$ y = [-698380, 145597, 1892528, 2418793, 1407882, 1261622, 2962847, 3769188, 1426213, -1759747, -2130614, -160333, 754748, -91650, -139435, 1485685, 2249917, 477177, -1846111, -2247517, -1325186, -1129504, -1815637, -2112162, -1885257, -1941550, -1977467, -1022028, 314324, 349116, -656428, -324021, 2064386, 3741253, 2095503, -1356203, -2769078, -1012719, 1301480, 1752754, 855341, 246488, 129511, -96978, -17271, 1155782, 2558045, 2088331, -712323, -3425346, -3340775, -813041, 982233, -125520, -2571519, -3058439, -888078, 1222361, 1122714, 292759, 1302335, 3464453, 3583033, 884268, -1544201, -1112936, 883858, 1774396, 1412198, 1509102, 2424913, 2930925, 2534321, 1916465]
39206A916465n86200q12021l63487J248615K305025J070651j360779k417697j515394
39197e14822k86123J85326M49990J004740J232366O02965k03081j72146N32235
39188B831450O68470m09724j686543j628360k72619O88298K49799n33976l82840
39179d76045J22346k39977r31628m78366P66379R65333p1304m63460N70733J444035
39169A208046R30280p056k26035k54499p93851j123348m69201M66624P29797N80452
39159A041209M83137m5267j265290k141519j774356p87584q3814N96411J643045
39150b334028K310348J801472N93073m48743j199526j586437j108393k9274M60688
39141a540820K75860Q27425K232093K310298N3957k125601j823557l09978j96197
$$ y = [1916465, 1330265, 518244, 154757, 1403372, 3708397, 4779048, 3418269, 1000572, -514822, -800945, -615619, -165629, 839111, 2071477, 2674442, 2471361, 2299215, 2831450, 3499920, 3090196, 1403653, -224707, -497326, 190972, 440771, -93205, -476045, -353699, -593676, -1525304, -2003670, -1237291, -271958, -343262, -806722, -235989, 1208046, 2138326, 2131270, 1905235, 1650736, 856885, -266463, -735664, -269040, 460757, 1041209, 1524346, 1479079, 213789, -1927730, -3702086, -4489670, -4573484, -3977073, -2334028, -23680, 1777792, 2370865, 1922122, 722596, -863841, -1972234, -2001508, -1540820, -1264960, -437535, 1794558, 4104856, 4158813, 2033212, 209655, -100323, -296520]
39132b96520j158145r09639P61002J863474J394855R1958j315496k286130j811005
39123c665646P0442J194134J94181q72849K74704J903176R37829j393017j111305
39114b468351J732835K721441J03155k583253k324984o57639J46710Q39253K451313
39105c9520L213932J360671j481169k651949k219392j717205j050838N53560K114353
39096a917557K201235J446202J223421J075346m850j034809o13168J15986q08070
39087A683736k322225j704675N42750R31390j394014k940795j129160J920042
39079d412951K796075J427998O8580l25703k66177K14843J149758J280240l62596
39070A570067k158413j718967L26596J071564o0243m26807J217189K189124l3792
$$ y = [-296520, -1454665, -2364304, -1603302, 260172, 1655027, 1746985, 431489, -1854641, -3665646, -3595204, -2401070, -2206889, -3079738, -2805034, -901858, 35971, -1357046, -2468351, -735516, 1985925, 2089080, -494173, -2819157, -3476796, -3330086, -2490833, -39520, 3174412, 4535083, 3053914, 401965, -1817427, -3534632, -4585470, -4031910, -1917557, 283678, 1729880, 2953301, 4028647, 4023797, 2988988, 2375820, 2491806, 1683736, -638489, -2343164, -1800414, -869024, -2263038, -5203833, -6332993, -4412951, -1616876, -188878, -120298, -446001, -712178, -497335, 652423, 1932663, 1570067, -588346, -2307313, -1980717, -909153, -969396, -1396203, -179014, 2010110, 1976318]
39061A976318l413134l734015l43877L079628L276651P77172j630477k025507
39053b037241n43118J215365J521188J64169j136400p52492P25330J428398Q13266
39044A398465o3564m46224l81182L45366J786083K476551P84547k132740l109551
39035F57751j305986O41254O44678j79924j31760L36064K56067K58283R42780
39026B119207J055054m50933k109665j972673n67783L69450P29498J249453J280101
39017A701709o29j252967o96700O67244N21829o80321l20933J794840K770381
39008D504453J110252j142227j784352j315009j060156p32117L69313J349383
39000A299540Q48855o17814j121586M8066J410422J211506l66866j473447r70703
$$ y = [1976318, -1436816, -5170831, -5514708, -2435080, 841571, 1618743, -11734, -2037241, -2580359, -1364994, 156194, 320363, -816037, -1568529, -843199, 585199, 1398465, 1334901, 888677, 507495, 852861, 2638944, 5115495, 5900042, 3767302, 657751, -648235, -6981, 637697, 457773, 326013, 662077, 918144, 1176427, 2119207, 3174261, 2723328, 613663, -1359010, -1926793, -1557343, -827845, 421608, 1701709, 1701080, 448113, -248587, 418657, 940486, 260165, -60768, 1734072, 4504453, 5614705, 4472478, 2688126, 1373117, 312961, -419156, -49843, 1299540, 2148395, 1530581, 408995, 457061, 1867483, 3078989, 2712123, 1238676, 267973]
38991B67973J88489N48860L26233N95274Q66562k45120j811277r57739K411622
38982B190877M260290J886893j944341l053985j634545p20171r06035m73730N18410
38973A23663L76028n47413k07484J214305J411601M8287p65942l06982j03109
38964A242954o37198n71158K64555L83506l71290n67162k55084q89617j849264
38955c249758q44860J566028J966911k91685j606398R1516K082672J535029k30389
38946A019066n99586L76954J295936J817095J579209m17691l186123l469668l77639
38937a962447K597618K461418N87374o07039j462868k698670k607969j20102K218607
38928a594078J907365N21151N34765Q57815m98773j909553p79597J394517J288482
$$ y = [267973, 456462, 1005322, 1331555, 1926829, 2793391, 2548271, 736994, -220745, 2190877, 6451167, 8338060, 6393719, 3339734, 1705189, 985018, 78983, -394747, 123663, 499691, -47722, -255206, 959099, 2370700, 2418987, 1653045, 1346063, 1242954, 605756, 34598, 299153, 682659, 311369, -255793, -510877, -1400494, -3249758, -4094618, -2528590, -561679, -853364, -2459762, -2368246, -285574, 1249455, 1019066, 419480, 796434, 2092370, 3909465, 5488674, 5070983, 1884860, -1584808, -1962447, 635171, 3096589, 3683963, 3076924, 1614056, -1084614, -3692583, -3812685, -1594078, 313287, 834438, 1369203, 2227018, 1728245, -181308, -960905, 433612, 1722094]
38919A722094n66987j069396j11390l092m82380N31646J944062P37853j931114
38910G71296j660822J535773K413323r85157l740814j843835J541734J485975
38902d82527j084473j770511J3373J024208K11308Q5987J896162L301217K086488
38893E281232n06306j797351j343952q45016j154950j170395P4444J578266J664044
38884A780016M68803j79993O06067J615755J480139M86598l57360q61849j174313
38875C863863q85012M9873M64063m21582j385619q69588M17292M38964r70456
38866G01798j773500o45207J421484K595871J948632k82621k782873l526285j527361
38857c870062J558489K850737J496123n59359j140935r7422J162555J390940N05498
$$ y = [1722094, 1155107, 85711, -25679, -28771, -511151, 20495, 1964557, 2702410, 771296, -889526, 646247, 3059570, 2074413, -1666401, -3510236, -1968502, -482527, -1567000, -3337511, -3324138, -2299930, -2088622, -2002635, -106473, 3194744, 5281232, 4774926, 2977575, 1633623, 788607, -366343, -1536738, -1462294, 115972, 1780016, 2248819, 2068826, 2674893, 4290648, 5770787, 6257385, 5900025, 5038176, 3863863, 2978851, 3028724, 3492787, 3071205, 1685586, 815998, 1233290, 1672254, 701798, -1071702, -1716909, -295425, 2300446, 4249078, 3966457, 1183584, -2342701, -3870062, -2311573, 539164, 2035287, 1475928, 334993, 237571, 1400126, 2791066, 3296564]
38848C296564m92164n69372L3906M6966q71876j396751n81780N02777M40564k95790
38838A13044l25020L39603O68964N45827N52007M73275k03316q84849p39604l65707
38828A74224p99871j546401j489308r71980q69016n01159J029019K282915J249804
38819a441773q55835q80881J240985K263907Q77079m51077M9776O84851k17832
38810A269200j223798n58762N76431J48697j045091o28450J436004K690685J655748
38801D320664m52388j531056q77705M33293Q22961q3136r51023m80962N71082
38792A771730L13505j358502k345415j245542Q51054K009128J475274l52661k404102
38783a285531k975653j104036J547662K112701M33415o71051J90081J023051K88271
$$ y = [3296564, 2804400, 2235028, 2268934, 2315900, 1444024, 47273, -534507, -31730, 408834, 113044, -211976, 127627, 796591, 1342418, 1894425, 2367700, 2164384, 1279535, 539931, 174224, -625647, -2172048, -3661356, -4633336, -5502352, -6003511, -4974492, -2691577, -1441773, -2297608, -3178489, -1937504, 326403, 1203482, 752405, 802181, 1487032, 1269200, 45402, -513360, 63071, 211768, -833323, -1461773, -25769, 2664916, 4320664, 3868276, 2337220, 1459515, 1892808, 2715769, 2632633, 1681610, 1200648, 1771730, 2085235, 726733, -1618682, -2864224, -2013170, -4042, 1471232, 1118571, -1285531, -4261184, -5365220, -3817558, -1704857, -1271442, -1942493, -1752412, -729361, -441090]
38774d41090k63052J073802K428919J298851r62615j203251K22088J42428j795404
38765E00676k246679L35672K965537K497539j10858j866586j844123j081419j33608
38756i83849Q80789R85882l87537j511962l18405J954094J827580j207375l383733
38747b144516j919698J012919J802662P22314O33895J720295J343157r34214k141096
38738I5718p92980O54526J47746n25117O29613J688170P248k553408j981569J218085
38728a411968K280764n35965l208815j984682J340437K456437M98445j495206
38720b060553r46082J399743K680286J048354k213101l703422j734905J328212
38712d201468J965018J85791q02033N57908K259368K163265P59470m81618j180671
$$ y = [-441090, -704142, 369660, 2798579, 4097430, 3134815, 1931564, 2153652, 2296080, 500676, -1746003, -1410331, 1555206, 4052745, 3941887, 2075301, 231178, -850241, -983849, -103060, 882822, 495285, -1016677, -1335082, 619012, 2446592, 1239217, -2144516, -4064214, -3051295, -1248633, -526319, 107576, 1827871, 3171028, 2236814, 95718, -697262, -42736, 105010, -420107, 209506, 1897676, 1904924, -648484, -2630053, -1411968, 868796, 332831, -2875984, -4860666, -3520229, -1063792, -565347, -2060553, -3006635, -1606892, 1073394, 2121748, -91353, -3794775, -5529680, -4201468, -2236450, -2050659, -2852692, -2294784, -35416, 2127849, 2887319, 2405701, 1225030]
38703A225030j270812k96047J170784J373108q907r97960m57430l0114j214754
38694e07102k483228j527232J033368K450749J533235l34771j251708m73950J273866
38685b86773K137372Q07672j335298j372304Q79328J983615n5449k381544j574117
38676a197498R22964J242468n49584p90197J420084K572278M64646k230244k093536
38667b38619J33279J169115m5074j614351j854723j061026k44665K83610P31928
38658b740526J175844J511368J643382J453326P65256m30284j688311k230013
38650e39958j617112k88526Q57144J354511J267642O40083l16414n86399P76279
38641A547250K702009K506735o38612l820299l571081l35859K000550J034016
$$ y = [1225030, -45782, -341829, 828955, 2202063, 2193156, 1195196, 737766, 707652, -507102, -2990330, -4517562, -3484194, -1033445, 499790, 165019, -1086689, -1560639, -286773, 1850599, 2658271, 1322973, -49331, 829997, 2813612, 2758163, 376619, -1197498, -274534, 967934, 418350, -371847, 1048237, 3620515, 4085161, 1854917, -238619, -105340, 1063775, 1018701, -595650, -2450373, -3511399, -3756064, -3472454, -2740526, -1564682, -53314, 1590068, 3043394, 3808650, 3378366, 1690055, -539958, -2157070, -2445596, -1588452, -233941, 1033701, 1673784, 1357370, 770971, 1547250, 4249259, 6755994, 6117382, 2297083, -1273998, -1609857, 390693, 1424709]
38633A424709j355803j733062N36885K730389K276385j28111j473282k50245J635511
38624C663376J422358p82466k230968j371899K14748L25883r06427j662722j019910
38615b348027L10144J219294J165522L00249o12543p72008k88232m938j32942
38606a163481J6390O36757J007528R56802J269076J876277J299053r37434k919040
38597B041928k818306j306432J2592R74021J817849J486404n67056k201986j079893
38588a640879J525358K364608J046492j363r2355j047707k901380k815475P1651
38579c491050K271591R29469j672042j643222O30073J673496P28958M71378J952725
38570A851376K581095M26236k337438k342953L06815K368254J662584p82115k495539
$$ y = [1424709, 68906, -1664156, -1127271, 1603118, 3879503, 3751392, 2278110, 2027865, 3663376, 5085734, 4303268, 2072300, 700401, 915149, 1241032, 334605, -1328117, -2348027, -2037883, -818589, 346933, 647182, 34639, -737369, -1025601, -1030539, -1163481, -1147091, -510334, 497194, 1453996, 2723072, 4599349, 5898402, 4960968, 2041928, -776378, -2082810, -2070218, -1096197, 721652, 2208056, 1641000, -560986, -1640879, -115521, 2249087, 3295579, 3294216, 3201861, 2154154, -747226, -3562701, -3491050, -1219459, -289990, -1962032, -3605254, -2975181, -1301685, -572727, -101349, 1851376, 4432471, 4858707, 2521269, 178316, 485131, 2853385, 4515969, 3733854, 1238315]
38561A238315k100438j29586J671640J830730N77426m42398l57840j87800q68581
38552A231468j299692j00747J565707J372070l17435q79735O0202j0056j574922
38543D6860j431152J708925L774221J232161k717142k667570M69269J134202j675864
38534a26090l090535p66963J544542P50740q30456l62180O56350o3849j181834
38525c470275o13844M83282L78544M14119K106989L387126J887765m51843m42769
38516C679094Q38890K13539j746588j970761o58192o10523j612912q59529J227591
38507a499391J143821j196739j589698J470963M049823L010677M04593p48076
38499E045973q90677j428110j502810l04447M92882l53061r74858L67269J835870
$$ y = [1238315, -862123, -991709, 679931, 2510661, 3088087, 2645689, 2287849, 2100049, 1231468, -68224, -168971, 1396736, 2768806, 2451371, 1571636, 1631838, 1621782, 46860, -1384292, 324633, 4098854, 5331015, 2613873, -53697, 415572, 1549774, -126090, -3216625, -3983588, -2439046, -1688306, -2518762, -2880942, -2224592, -2288441, -3470275, -4084119, -3600837, -3222293, -2808174, -701185, 2685941, 4573706, 4121863, 3679094, 4517984, 4731523, 2984935, 1014174, 355982, -254541, -1867453, -2726982, -1499391, -355570, -1552309, -3142007, -1671044, 2378779, 5389456, 5794049, 5045973, 4155296, 2727186, 1224376, 919929, 1412811, 1059750, 84892, 452161, 2288031]
38490B288031R68728j045994j384939k25307L6216r10514j078781K27384J514034
38481C88858J616078P69506n72426j900346k034440m17355J403568J588610P23306
38472A565359N71113Q28741j81292j927578j878389L04007J799499R04323m65101
38463A520682q7007J121533R97787l32337j087963q31533n87278o63178m81999
38454d31293k00667m86879q89245m18377L64303J2728r65385m55891J474977J909521
38444h6208m05054k539143j579045R38847J625521M76939R9450Q21567M55700
38435a91426j242926j787423k79592J078617R00618O54004J340239J461309K14865
38426B148285m36602P35460J540380l9600k078650j607323P45810K124841J743892
$$ y = [2288031, 3256759, 2210765, 825826, 600519, 636735, -273779, -1352560, -1125176, 388858, 2004936, 2774442, 2202016, 301670, -1732770, -2150125, -746557, 842053, 1565359, 2136472, 2965213, 2783921, 856343, -1022046, -718039, 1081460, 1985783, 1520682, 1433675, 2555208, 3552995, 3220658, 2132695, 1301162, 713884, 50706, -431293, -631960, -1118839, -2008084, -2426461, -2062158, -2049430, -3014815, -3470706, -1995729, -86208, -491262, -3030405, -4609450, -3670603, -2045082, -1568143, -1468693, -647126, -191426, -1434352, -3221775, -3501367, -2422750, -1522132, -868128, 472111, 1933420, 2148285, 1711683, 2447143, 3987523, 3947923, 1869273, 261950, 1007760, 3132601, 4876493]
38417D876493P63199m93301k037354k454874r06824N39313j20995j153661q4573
38408a072577J392788N7395k661970k479898L38851J184294q92979j493325J253247
38399d374174L190927J365926q14233L56439K367356R98901k127782k074380J261594
38390A50574L046334J105118j344391j225091K63540N36660m41654j056068q83057
38381A51965o58345m48153L31717J291384R74038j044812k876347k219258O26712
38372c871099K835380K462769N12942j061267j830972k018127q50856J893136
38364a928094L840488K355444j448354l735677k893018q24673N62770J237177
38356b833937J249769J98454r35054l81733J340397J893563J109898J091670J747532
$$ y = [4876493, 5639692, 5146391, 3109037, 654163, -252661, 286652, 165657, -988004, -1072577, 320211, 377606, -2284364, -4764262, -4425411, -3241117, -4134096, -5627421, -4374174, -1183247, 182679, -631554, -275115, 2092241, 3091142, 963360, -1111020, 150574, 3196908, 4302026, 2957635, 1732544, 1996084, 2532744, 2091090, 1035022, 151965, -506380, -954533, -622816, 668568, 1642606, 597794, -2278553, -4497811, -3871099, -1035719, 1427050, 1939992, 878725, -952247, -2970374, -3821230, -1928094, 1912394, 4267838, 2819484, -916193, -3809211, -4633884, -4071114, -2833937, -1584168, -1385714, -2320768, -2702501, -1362104, 531459, 1641357, 2733027, 4480559]
38347D480559L64933l019333m267209j467287J613691J409684p8124N37996K087639
38338A662549J502418m07791o65409L56532N128j345272r13952J179509J924629
38329C298341O64654j44453K39596l20799k199680k400475N62552L592707L149893
38320F442336N7677k104515j776519m81180n6922o25881j115280p24439K71256
38311a13467R44451R07801O75419N57234P0963p90296q37598M27010J286460N1840
38301C179817j923238j712918R08939K936964K171770k44465j940695k183069
38293A193105j700124j012271j32960O86040R04182M15291q1220K66795J231433
38284A770271J278841n91122k937837l170086r97450J025730J019905K5582k56599
$$ y = [4480559, 4845492, 1826159, -2441050, -3908337, -2294646, -884962, -963086, -425090, 1662549, 3164967, 2757176, 2091767, 2448299, 2453427, 1108155, 194203, 1373712, 3298341, 3962995, 3818542, 4058138, 3737339, 1537659, -862816, -300264, 3292443, 6442336, 6500013, 4395498, 2618979, 2137799, 2080877, 1454996, 339716, -384723, -113467, 830984, 1738785, 2414204, 2971438, 3042401, 2252105, 1414507, 1841517, 3127977, 3179817, 1256579, -456339, 452600, 3389564, 5561334, 5316869, 3376174, 1193105, -507019, -1519290, -1652250, -966210, -62028, 353263, 272043, 538838, 1770271, 3049112, 2457990, -479847, -3649933, -4647383, -3621653, -2601748, -2576166, -2832765]
38275b832765K6823J38428N65228J612642J914041N90408o59498j16495P71493
38266B010305l39771k381880k162781N12280K362698J457221n09107j316300r39381
38257a306716l78213J1495J62505l2486j54620K02468L13021n96106j403805m00129
38247c582586J539946J597590p55162k641014j781380N56551J783961J411458
38239a870636R15987J313361K014844J667487k32224k240661k019011O11876K609635
38230B770658J367511j431572j938045L31886J864856L76621k056296k204674
38222i19055M5764K053714J837630j0522j300827o95596O15454K59827j794168
38213I2221k544153k21156K564750K447079M49126P0866J315292Q90119j683603
$$ y = [-2832765, -2805942, -2667514, -2102286, -489644, 1424397, 2014805, 1355307, 1238812, 2010305, 1670534, -711346, -2874127, -2361847, 851, 1458072, 948965, -367335, -1306716, -1684929, -1673434, -1510929, -1543415, -1698035, -1495567, -1182546, -1778652, -3182457, -3582586, -2042640, -445050, -1200212, -3841226, -5622606, -5066055, -3282094, -1870636, -954649, 358712, 2373556, 4041043, 3808819, 1568158, -450853, 161023, 2770658, 4138169, 2706597, 768552, 1100438, 2965294, 3341915, 1285619, -919055, -873291, 1180423, 3018053, 3007531, 1706704, 1011108, 1626562, 1886389, 92221, -2451932, -2673088, -108338, 2338741, 2787867, 2858733, 4174025, 5064144, 3380541]
38204C380541k780447o85441J360134L02437k031032k103736N5780J632552J393579
38195E24367N94385L84305M49648O057j089581k100125k004954q51454j13832
38186d201184n69938o62036J075913K934928K244328l7469n81826O77700M71222
38177A351638j728199k326086J52034K210359J209324m48715m0638Q16750k5648
38168A170819o86973J037528K730837J153496j605575j249126J222747R35779
38160D709532k625677m610582k466025P19979J804336J749551K245845K282411
38152C809370P01791r28817q17992j45427r96132k524567j938687J119503L540645
38143A819687K617990n12160k304484j179976P17713O70010p57730o73155J556459
$$ y = [3380541, 600094, -85347, 1274787, 1577224, -453808, -2557544, -2501764, -869212, 524367, 1118752, 1503057, 1952705, 1958762, 869181, -1230944, -3235898, -4087352, -4201184, -4771122, -5433158, -4357245, -1422317, 822011, 784542, 202716, 880416, 1351638, -376561, -2702647, -2550613, -340254, 869070, 420355, 379717, 1196467, 1170819, 483846, 1521374, 4252211, 5405707, 3800132, 2551006, 3773753, 4709532, 2083855, -2526727, -4992752, -4272773, -2468437, -718886, 1526959, 3809370, 4511161, 3582344, 2764352, 2618925, 1622793, -901774, -2840461, -1720958, 1819687, 4437677, 3925517, 1621033, 441057, 1158770, 1828780, 1071050, 397895, 1954354]
38134A954354L004575J408108j525214k782279k169647j496390j081491J42590
38126b545394J745406J865253K27149j251238j172654j01556Q75589J289054Q80674
38117A812283k50520r81383k28922J247486J604701M28511j003993j758438j863782
38108i94057j144650O03136K235971K053443K82130j008017p86856j41602j43453
38099I56045m00554k58005J62737P02595J511015K117950J507574l22571k031902
38090C944884k593230k244276j593618r05152m03537j53289L92784J572816K428233
38081D45615J799447K71761n29276l46610k54711m59641j67566M04885R2286r63324
38071B92866j325384p86134n53833o13064M48314K308640K465698J62806j925130
$$ y = [1954354, 4958929, 6367037, 4841823, 2059544, -110103, -1606493, -2687984, -2545394, -799988, 1065265, 1292414, 41176, -1131478, -1233034, -357445, 931609, 1812283, 1561763, 580380, 351458, 1598944, 3203645, 3632156, 2628163, 869725, -994057, -2138707, -1535571, 700400, 2753843, 3035973, 2027956, 1241100, 1099498, 956045, 555491, 297486, 460223, 1162818, 2673833, 4791783, 6299357, 5976786, 3944884, 1351654, -892622, -2486240, -3391392, -3794929, -3948218, -3555434, -1982618, 445615, 2245062, 2516823, 1987547, 1640937, 1386226, 926585, 759019, 1163904, 1256190, 292866, -1032518, -1818652, -2372485, -2985549, -2537235, -228595, 2237103, 2399909, 474779]
38062D74779j568014j14233J39254n03268m06293L87580P19864N37698M48707
38053A16074K10190m45887o44587J81171R14600N79613R2780L21754J44335j218750
38043B51293j809025P8421K127460R94438j938417k130228R20718K686455Q08235
38034A989350j287637j89920K066435J654292q29887j629119K31241J926624J274685
38025E206064q58572k602453l051277k030718J2045J665268J803565J155946J041855
38016B341723J038023l464j175723n99251Q01512K2446k786587l535991m26427
38007d323739K659425J823752r66841j399940L22765P09880n29237l83603J463036
37998f24502J855531J32137l25314J739417K656979m4329l069833k455001L68057
$$ y = [474779, -1093235, -1207468, -1068214, -1571482, -1977775, -1590195, -870331, -332633, 116074, 326264, -119623, -764210, -583039, 331561, 911174, 1003954, 1325708, 1470043, 251293, -1557732, -1479311, 648149, 1642587, -295830, -2426058, -1505340, 1181115, 1989350, 701713, 511793, 2578228, 4232520, 3402633, 1773514, 2004755, 3931379, 5206064, 4347492, 1745039, -1306238, -3336956, -3324911, -1659643, 143922, 1299868, 2341723, 3379746, 3376282, 2200559, 1601308, 2402820, 2425266, -361321, -3897312, -4323739, -1664314, 159438, -807403, -2207343, -1884578, -1174698, -1703935, -2087538, -624502, 1231029, 1363166, 1037852, 2777269, 5434248, 5389919, 2320086, -134915, 233142]
37989B33142J571642J010742R49990J111818k52188j941152j300976P49694Q85549
37980C018261r34625j621388n76325k74229j010065k29752J959412J858110j456659
37971G32740l775221k164739Q09386J959136K089457K553589J671752j347425
37963B528675k929903l63684K857858K145371o19884n05288J738809J148958k191939
37954C808973k693227J084937L375151L87003l573626l053621K87005J118281
37946G40876j075226k058449L6682K322293J969871j22627j339204p19741O72982
37937D27457J454896J152160K26433o75402j332665j605041r70129N79238J555890
37928H12837N58676j198441j066573R08367J590029l70889k013952n60312J995550
$$ y = [233142, 1804784, 2815526, 3765516, 4877334, 4625146, 2683994, 1383018, 2132712, 3018261, 2083636, 462248, -114077, -388306, -1398371, -1628123, 331289, 2189399, 732740, -3042481, -5207220, -4397834, -2438698, -349241, 2204348, 3876100, 2528675, -401228, -764912, 2092946, 4238317, 3618433, 3113145, 4851954, 6000912, 3808973, 1115746, 2200683, 5575834, 5962837, 2389211, -664410, -377405, 740876, -334350, -2392799, -2356117, -33824, 1936047, 1813420, 474216, -245525, 427457, 1882353, 3034513, 3260946, 2585544, 1252879, -352162, -1322291, -743053, 812837, 1371513, 173072, -893501, 14866, 1604895, 1234006, -779946, -1340258, 655292]
37919F55292J828097p92395k061198n28709J188915R70616J07402L86787J016694
37910B771501L93153r33540j192938k53571M22396J97286j27035k6308m194l07461
37900I39289k16661O94631J533243J203113n967q66030r25108p58867o20510o5449
37890I11684P66922P68364m69480j682244j623526p35712J7488Q39523J986845
37881G79864K108632M7614k379127k200177K11477J465533L28237p14773N387
37872c47333P74004J95346k2854J480432K646076J469647k85877l67985k99941
37863E241515k168187l644849j414031K148086J699969k232246l497596m0761
37855c908100L013566J862530n10801l84709P30193J29786p65722L00621J585429
$$ y = [655292, 2483389, 1690994, -370204, -898913, 290002, 1260618, 1368020, 1754807, 2771501, 3164654, 2231114, 1038176, 784605, 1207001, 1404287, 1277252, 1250944, 1246750, 939289, 722628, 1417259, 2950502, 4153615, 4147648, 3281618, 2356510, 1597643, 977133, 911684, 1678606, 2446970, 1977490, 295246, -1328280, -2063992, -2046504, -1206981, 779864, 2888496, 2936110, 556983, -1643194, -1431717, 33816, 362053, -352720, -347333, 426671, 622017, 599163, 2079595, 4725671, 6195318, 5909441, 5541456, 5241515, 3073328, -571521, -1985552, 162534, 1862503, -369743, -3867339, -3908100, -894534, 967996, 457195, 72486, 802679, 932465, 166743, 467364, 2052793]
37846B052793N63856j093492n89450O48929k26459j664517k86385K397312J894126
37837C696713j354747k209753O37723K495670N15940j956441j364864N72308N29373
37828A561922j075449j792266j373005j032256n62848Q28814K274930K310987
37820A140829J075012l27766j351904j563636m58277R22617L92475j779347k233381
37811d183378M44427K833339J630292j156600j542011J06363L53049j078793j104428
37802c697740R63414K082521O47718j084696j030151k07253n4245O5964Q20797
37793a493671J045111n2869j037383n81691K82332J68960k75906p619K18377m50895
37783b185254p24787P81652K600980K355977O71767P7473N78800k51710k598244
$$ y = [2052793, 2616649, 1523157, 933707, 1582636, 1356177, -308340, -594725, 1802587, 3696713, 2341966, 132213, 769936, 3265606, 3781546, 1825105, 460241, 1032549, 1561922, 486473, -1305793, -2678798, -3711054, -4273902, -3445088, -1170158, 1140829, 2215841, 1888075, 536171, -1027465, -1485742, -563125, -170650, -1949997, -4183378, -3738951, -905612, 724680, -431920, -1973931, -1867568, -1514519, -2593312, -3697740, -2734326, -651805, -4087, -1088783, -2118934, -2326187, -2380432, -2314468, -1493671, -448560, -501429, -1538812, -2120503, -1838171, -1669211, -1945117, -1952736, -1734359, -2185254, -2910041, -2128389, 472591, 2828568, 3500335, 3577808, 4156608, 3904898, 1306654]
37774A306654l357641r50554J876143J932088m9962j091346l42018N23548L10888
37765A57800m57527r31908q34932j29227Q83052J311986O48663k62033j91169
37756A94705Q58386J838493J941920R52219q32777k154294j511578M39304P74218
37747B500596j574027l334316j289717K359128K734362l64081k211228n50453
37739a729736J415422Q60136l61334K22763J302589P63764j84314M14331J173945
37730C877566j42383k097743j746045K01694O93000k75270j06707J116670N63881
37721B084663j896230k822220p82472J393742J368074M65244L95579L98800k53320
37712C51860j44272J436843K253087L90931k349943k951765j402065M7050M77780
$$ y = [1306654, -2050987, -3001541, -1125398, 806690, 756728, -334618, -676636, -153088, 157800, -299727, -1231635, -2066567, -2195794, -1312742, -756, 647907, 385874, 194705, 1053091, 2891584, 4833504, 5785723, 4952946, 2798652, 1287074, 1726378, 2500596, 926569, -2407747, -3697464, -1338336, 1396026, 1031945, -1179283, -1729736, -314314, 545822, 184488, 407251, 1709840, 2473604, 2289290, 2703621, 3877566, 3735183, 1637440, -108605, 93089, 786089, 510819, 404112, 1520782, 2084663, 188433, -2633787, -3416259, -2022517, -654443, -189199, 206380, 605180, 351860, 207588, 1644431, 3897518, 4288449, 1938506, -1013259, -2415324, -2368274, -1890494]
37703a890494P16433J072173R63720L99930L1570p7013m18616r76204j114743
37694a293244l81291R95221K042407J571208l76893j886886j296262L74122Q60851
37685F09233J30932O2619Q26995N26523j124745j880014p03683N70414N84235
37676c97491M78638J068440J006011l65106j166072p2434J378554J620512J541802
37667E092854K066948K125959J356727J750329L774627L941186k60344n583675
37659A4264611o950088m135419r41861M19784M88883j61918j096312q83568Q18003
37650A822115J589125j67982k042305j491283l85144j436758k692111p99277K355338
37641c248282K256311l58313o45565J828107K413511k89896k049962m54045J380162
$$ y = [-1890494, -1174061, -101888, 861832, 1261762, 1293332, 1216319, 797703, -178501, -1293244, -1674535, -679314, 1363093, 2934301, 2557408, 670522, -625740, -251618, 609233, 740165, 802784, 1629779, 2156302, 1031557, -848457, -1552140, -981726, -397491, 81147, 1149587, 2155598, 1790492, 624420, 551986, 1930540, 3551052, 5092854, 7159802, 9285761, 10642488, 12392817, 16167444, 20108630, 19848286, 14264611, 7314523, 3179104, 2237243, 2657027, 3145910, 2983992, 1887680, 1004112, 1822115, 3411240, 3243258, 1200953, -290330, -675474, -2112232, -4804343, -5603620, -3248282, -991971, -1350284, -1995849, -167742, 2245769, 1955873, -94089, -548134, 832028]
37632H32028P56296m24455p9713K80527r29823k151510j699685n14168L37865
37623c592638J470734K618584J959012j72813q41849L46154O2723k508152l119607
37614c777852N45865L977308K260971k328662l919277j468330J137981J493732
37606b078264O79715j2662m73957n09963j14438k07922r10450o07957J121719
37597c114179J865599K57394j017692O36540K986339K240029q76926k511091j733528
37588a267515q76601p23492K19289J849081K026538L90392r33503r10933p42858
37579i69602j019841p43026K70743P53822L39462R3900K64154j07218r12673p33172
37569b763451N83744J341953O50861l15244l35711L08246P88289O92763j93440
$$ y = [832028, 1588324, 1163869, 1084156, 1364683, 434860, -1716650, -3416335, -3930503, -3592638, -2121904, 496680, 2455692, 2282879, 1441030, 1787184, 1849907, -658245, -3777852, -3231987, 745321, 3006292, 677630, -3241647, -4709977, -3571996, -2078264, -1398549, -1411211, -1885168, -2395131, -2509569, -2717491, -3627941, -4235898, -3114179, -1248580, -991186, -2008878, -1372338, 1614001, 3854030, 2977104, 466013, -1267515, -2144116, -2867608, -2648319, -799238, 1227300, 1617692, 684189, -226744, -969602, -1989443, -2732469, -2461726, -1707904, -1368442, -1274542, -1010388, -1117606, -2030279, -2763451, -2179707, -837754, -186893, -502137, -837848, -529602, 258687, 951450, 758010]
37560G58010j548146j961291m17774J729086K097216N53325p84109q11976n69834
37551i55493q44760q54457j4736Q40882Q57291L46945r3559m32083o52561m63147
37541b265678M3807L55701L28987K38586K52886O53689J868567L137311K258850
37532F872706j426602m760684m009187J4715K771903J949638k44384j160458j025064
37523a017417r40265l43513J466305L131236K805560R40442m31526o70410j048056
37514C892356k289452l035447j487239J899426M192670K999209n37364k740789
37506B893370j735882M15555P71095o21801j486209r25931j55860Q954K10245
37497f26464Q53589J206287P20689j00881n96790o69015m67978k48904l41043
$$ y = [758010, -790136, -2751427, -3169201, -1440115, 657101, 1210426, 426317, -385659, -955493, -1800253, -2654710, -2669446, -1828564, -971273, -624328, -717887, -1149970, -1802531, -2265678, -2221871, -1866170, -1537183, -1298597, -1045711, -392022, 1476545, 4613856, 6872706, 5446104, 685420, -3323767, -3309052, -537149, 1412489, 1168105, 7647, -1017417, -1957682, -2301195, -834890, 2296346, 5101906, 6042348, 5610822, 4940412, 3892356, 1602904, -1432543, -2919782, -1020356, 3172314, 6171523, 5634159, 2893370, 1157488, 1573043, 2344138, 1722337, 236128, -689803, -845663, -836709, -626464, 227125, 1433412, 2154101, 2053220, 1456430, 787415, 319437, 70533, -270510]
37488b70510l84888O71850K565399K845983O4651l176893l113923k42235J327955
37479B87389J0017j287068k42372J329068R05009o85357j122079m00503j20344
37470a326240l74607K7176R71990J066558O2054o83328l00075N01427P19747M03274
37460A067976K99742O67339P93196j54265j716816k168251o97504J040181Q97741
37451B9339o69756j292225k90704O47861O20853O96989J153631M42817j473524
37442a34719j664704J349512M189226K936904q72476k401165p14482M02815j004687
37433B086224k077673l08094K045933J474734j336479k734324j470290K30679
37425b089290N98088M78713J085151J837614J530387K63797q41655j086182o49947
$$ y = [-270510, -655398, 16452, 2581851, 5427834, 5492485, 2315592, -798331, -1040566, 287389, 297406, -989662, -1232034, 97034, 1002043, 316686, -805393, -1205896, -1326240, -1700847, -1673671, -701681, 364877, 426931, -256397, -556472, -55045, 664702, 1067976, 1367718, 2035057, 2828253, 2673988, 957172, -1211079, -1908583, -868402, 29339, -640417, -1932642, -2223346, -1575485, -954632, -257643, 895988, 1338805, -134719, -1799423, -449911, 3739315, 6676219, 5803743, 3402578, 2688096, 3090911, 2086224, 8551, -299543, 1746390, 3221124, 1884645, -849679, -2319969, -2089290, -1491202, -1012489, 72662, 1910276, 3440663, 3704460, 2862805, 1776623, 1126676]
37416A126676k02132m17856j220775j412098r2399J478244J060493j028679j651235
37407b359761N70218K639111J506078r25456n75378K067231K283089j360418m245989
37398d01275k435339J541248K614853K26863j981626j829596m15267Q97215J922315
37389A39391K112106N13474k154376l529478k347597K72098K425663L018045J977862
37380B427188K90710m89386r1174k13543j829687k918181j190249J849058K552318
37371C87054N39260q28357K06177J318953K59247j474674j156195J012007K454493
37362B717965J785338m7403j549344k116108j893920j230055m07520L33118N83459
37353a824470K7051p37100m80309P35768J062002l67182j488055j93208K034351
$$ y = [1126676, 924544, 506688, -714087, -2126185, -2218584, -740340, 320153, -708526, -2359761, -1789543, 849568, 2355646, 1430190, 854812, 2922043, 5205132, 3844714, -401275, -2836614, -1295366, 1319487, 1546350, -435276, -2264872, -2680139, -1782924, 139391, 2251497, 2764971, 610595, -2918883, -5266480, -4994382, -2568719, 449326, 2427188, 2717898, 2228512, 2137338, 1923795, 94108, -2824073, -4014322, -2165264, 387054, 926314, 97957, 304134, 1623087, 1882334, 407660, -748535, 263472, 2717965, 4503303, 4455900, 2906556, 790448, -1103472, -2333527, -2741047, -2407929, -1824470, -1797419, -2534519, -3014828, -2279060, -1217058, -1584240, -3072295, -3265503, -1231152]
37344a231152K121829K72142m21514R21788J746854N14632r93372r61128j15846
37335A854233L58048P53031J205108O74724q64126j577759o78962J15500m12093
37326A427704q89493j3447J010542O53390l81051p56672p45464r59558p29923
37317a383972L41191J035768N48145j7978J32457n2018r94797j003054N65519
37308h28739J345038j70115j537048l53616J316853L91449j634746j035959J771778
37299g35105L000221J784345Q35702J000920R5337k218358l074648j286205N28619
37290f9172M07654k7208R14974J852552J078589k46929k09303N83576L21345q83069
37280C723009j476541j043778l91511J98883J003219J578961J001210o97820k317276
$$ y = [-1231152, 890677, 1162819, 741305, 1663093, 3409947, 3924579, 2931207, 1970079, 1854233, 2212281, 2965312, 4170420, 4845144, 3981018, 2403259, 1724297, 1839797, 1427704, 538211, 524764, 1535306, 2188696, 1807645, 1050973, 305509, -654049, -1383972, -1042781, -7013, 541132, 523154, 655611, 603593, -391204, -1394258, -828739, 516299, 346184, -1190864, -1544480, -227627, 163822, -1470924, -2506883, -735105, 2265116, 4049461, 4885163, 5886083, 5981420, 3763062, 688414, -597791, -69172, 338482, 311274, 1226248, 3078800, 4157389, 3910460, 3701157, 4284733, 4606078, 3723009, 2246468, 1202690, 811179, 1010062, 2013281, 3592242, 4593452, 3895632, 1578356]
37271A578356k671515j511864L75167J619808J318450r147r41827p70359o5043
37262a077974L37616K27790o0831K3224P83470J500233P90312j233981k128616
37253h38757j58636K641497K772310K39111j528166q76836K2663p05545j572709
37244e068p16282N88689P9912j460180j261491R63517K363232J051490j296941
37235C06878j836249j62845J558518J504202J96874n66489j00160O31522P42016
37226B274267N55102M58416j19299j340680j730642k23852J423900P66664j213431
37217H50445j161039J237096K358043L48413j823933j235777L49810q8141j418901
37208e83984m65193K097109K482771M2874j680770p34562N60525R4142o36390
$$ y = [1578356, -1093159, -2605023, -2229856, -610048, 708402, 699255, -242572, -1012931, -1077974, -740358, -512568, -573399, -550175, 233295, 1733528, 2523840, 1289859, -838757, -997393, 1644104, 4416414, 4655525, 3127359, 2250523, 2273186, 1567641, -5068, -721350, -132661, -52749, -1512929, -2774420, -1810903, 552329, 1603819, 306878, -1529371, -1692216, -133698, 1370504, 1567378, 1000889, 900729, 1532251, 2274267, 2829369, 3287785, 3168486, 1827806, 97164, -126688, 1297212, 2063876, 850445, -310594, 926502, 3284545, 3632958, 1809025, 573248, 923058, 834917, -583984, -1049177, 1047932, 3530703, 3573577, 1892807, 1158245, 1718770, 1812912, 1176522]
37199A176522J90022J172689K34455j562136j766466n94068k14119r16321r76207
37190c255629L6364O89549N12665O78277J411066J304750N9046n66496K30487
37181A100079O42837o78343j984567j106425Q45153J153690r3253k53261J390926
37172A016836K420622J232560m81116n57595M38591N49996n52047j668496k137419
37163B61932k049793j197518L89220J375412M95463j160148j163226O96513J791440
37154e60705L72762j797194j880979J32177J664389J246120K28056M53726J609532
37145A467884J854549M37245j354914j830673p40411P18374J237545M51701r75918
37136A265382j930732j671848m41984P20106R34360K47899n39023o23274K28756
$$ y = [1176522, 1366544, 2539233, 2773688, 1211552, -554914, -1148982, -1363101, -2279422, -3255629, -3219265, -2529716, -2017051, -1338774, 72292, 1377042, 1436088, 869592, 1100079, 1742916, 1064573, -919994, -2026419, -1181266, -27576, -120829, -374090, 1016836, 3437458, 4670018, 4188902, 3631307, 4069898, 4619894, 4067847, 2399351, 261932, -1787861, -2985379, -2596159, -1220747, -725284, -1885432, -3048658, -2352145, -560705, -187943, -1985137, -3866116, -3733939, -2069550, -823430, -595374, -141648, 1467884, 3322433, 3759678, 2404764, 574091, -166320, 552054, 1789599, 2241300, 1265382, -665350, -2337198, -2779182, -2059076, -1124716, -876817, -1415840, -2039114, -1810358]
37127a810358J505043K205797J650464K45410q71581j074071p01934k44765J70893
37118A074898K71941l84355j389037j459833k01972J111705J357418R66863M95924
37109A843552o32182k285246k226381Q26903L954754L109285j007322l620903
37101c7540k564311n33060J01287O19464K174301K614307K70206k079756q96577
37092c31679K351719L124127N63351j644974j106024L05713J06719j272058k037045
37083E9849j814336j272239n22821N32875J227899R05711J85865K59367J023494
37074E85664R50503p77394k671063k393067J52112K293702J940677L96947L05324
37065G83405J567408J643616j40781j389654o35184K27347p07563j925563q78259
$$ y = [-1810358, -305315, 1900482, 3550946, 3796356, 2924775, 1850704, 1148770, 904005, 1074898, 1346839, 962484, -426553, -1886386, -2088358, -976653, 380765, 1347628, 1843552, 1211370, -1073876, -3300257, -2473354, 1481400, 4590685, 3583363, -37540, -2601851, -3134911, -3033624, -2414160, -239859, 2374448, 2644654, 564898, -331679, 2020040, 5144167, 5707518, 4062544, 2956520, 3262233, 3368952, 2096894, 59849, -1754487, -3026726, -3549547, -3016672, -1788773, -883062, -697197, -437830, 585664, 1536167, 758773, -1912290, -4305357, -4153245, -1859543, 81134, 478081, 783405, 2350813, 3994429, 3853648, 2463994, 1828810, 2056157, 1348594, -576969, -1455228]
37056a455228J803677L135642J960713q4274j322000j665040j684074j694605
37048a005189j651721r53914R57435K965269K688217j44487k439300j691084N43651
37039g31123J332172P21858O49965J117455P44700j7141K24501M86974j254642
37030C274719l775483l575213l56612K290355K265073J298766J065536P26644
37022C213785k53533m16524O75473Q64846j026265k742413j951850K46926J381916
37013g639J124083N60552j64446j174529j390821o9058J363915J150690q5298
37004A307449m44153K94454P64344M34688R1722K11989L97185L10522N2700k42883
36994C178017m37950l65067k75071o50658j155456p70051M62412J049730K44330
$$ y = [-1455228, 348449, 3484091, 5444804, 5360530, 4038530, 2373490, 689416, -1005189, -2656910, -3610824, -2653389, 311880, 3000097, 2855610, 416310, -1274774, -731123, 601049, 1322907, 1972872, 3090327, 3835027, 3817886, 4042387, 4529361, 3274719, -500764, -4075977, -4432589, -2142234, 122839, 1421605, 2487141, 3213785, 2960252, 2543728, 3219201, 4084047, 3057782, 315369, -1636481, -1389555, -7639, 1116444, 1676996, 1512550, 338021, -1052800, -1121858, 242057, 1392747, 1307449, 863296, 1157750, 1922094, 2356782, 2448504, 2660493, 3057678, 3368200, 3420900, 3178017, 2740067, 2375000, 2099929, 1449271, 293815, -476236, -13824, 1035906, 1280236]
36985A280236o33490j91980Q41653Q20574k46446q54063l87541R6825l51581j093433
36975g19246p80642P00205J882643J618727P29168P37996J233932L05574j924087
36966C784270k575354l64876J763991R10696j141991j051481K37526o55155k916678
36957b009052k195956J845219M223220K351274k36970j94762O48796k61986j398343
36948B771440o70429K07372q11057j677462M7362K005446O45473k314872k480127
36939b276854j89010M44599r15059l30512K946306M475066J826274j395917j363974
36930C220919L64392K89017j181183j049295R05826J744968k2094k305777k452563
36921d85790n60374J135306J272132O65965N66442O04438m44424k181981k559836
$$ y = [1280236, 646746, 454766, 1296419, 2116993, 1870547, 1016484, 628943, 725768, 374187, -719246, -1499888, -799683, 1082960, 2701687, 3430855, 4168851, 5402783, 5708357, 3784270, 1208916, 844040, 2608031, 3518727, 2376736, 1325255, 1562781, 907626, -2009052, -4205008, -2359789, 1863431, 4214705, 3977735, 3782973, 4431769, 4169783, 2771440, 2101011, 2308383, 1497326, -180136, -132774, 1872672, 2518145, 203273, -2276854, -2465864, -2021265, -2936324, -3266836, -320530, 4154536, 5980810, 4584893, 3220919, 3585311, 3874328, 2693145, 1643850, 2549676, 4294644, 4272550, 1966773, -485790, -1046164, 89142, 1361274, 2027239, 2593681, 3198119, 2753695, 571714, -1988122]
36912a988122q92746Q36788R18479N15148J461777K808718K059795o79154k355753
36903B684930j060405J563861K603078J144326j271025k480352j637395O3747
36895A610765O00942n52977j799413j515583Q5107J711660K417544J662574m14115
36886C806504j956765p54009K089581K416432j080825m077256k619506R45454
36878a230390J945849P26338R75055K467247J529968j570133k112358R68063K564130
36869F263769m24969l796932k589968J409240L017861J404548l1048L93357J130809
36860F776667R96392N93692L20759k18189q26922q86816p08996r52018j169677
36851C924892o34727Q076l59875j380940j824478j487088q90131Q2610J451697
$$ y = [-1988122, -2880868, -2044080, -1125601, -610453, 851324, 3660042, 5719837, 5040683, 2684930, 1624525, 3188386, 5791464, 6935790, 5664765, 3184413, 1547018, 1610765, 2211707, 1658730, -140683, -1656266, -1571159, 140501, 2558045, 4220619, 3806504, 1849739, 1095730, 3185311, 5601743, 4520918, 443662, -2175844, -1230390, 715459, 1441797, 2416852, 4884099, 6414067, 4843934, 2731576, 3699639, 6263769, 5838800, 2041868, -548100, 861140, 3879001, 5283549, 5252501, 5645858, 6776667, 7773059, 8366751, 8687510, 8469321, 7642399, 6755583, 6046587, 5094569, 3924892, 3290165, 3298241, 2938366, 1557426, -267052, -1754140, -2644271, -2561661, -1109964]
36842a109964J938528O17226r16161l82112J539063J900597j27289k093257k011288
36833f44657q78570m35371n06028o3908N95215M87291j12639j4325R00807J441342
36823G69157R38143J85594J28358L83247j92771j655753k468898j308883R93686
36814b228120K142425J183660k18701N390J494713J944009K65459j974241k645989
36805c1395j538212l9919Q42993J155361J105553O38695n0655m80840n60724n72809
36795D68048l59926N50540J721772J828742N89911m37417n2989O63876J50211
36786E122768q18391k13230J679018K235462M69087j378052j244118q0623J99768
36777E971689k93868l80420k40942p71636j507124j299257m13964R730M6245N87616
$$ y = [-1109964, 828564, 1445790, 529629, 147517, 1686580, 3587177, 3459888, 1366631, -644657, -1523227, -1958598, -2464626, -2528534, -1933319, -1446028, -1558667, -1572992, -672185, 769157, 1707300, 1892894, 2021252, 2404499, 2211728, 555975, -1912923, -3221806, -2228120, -85695, 1097965, 879264, 884654, 2379367, 4323376, 4588835, 2614594, -31395, -1569607, -1609526, -766533, 388828, 1494381, 2133076, 2082421, 1601581, 1040857, 468048, 108122, 658662, 2380434, 4209176, 4799087, 4361670, 4308681, 4972557, 5122768, 4304377, 4091147, 5770165, 8005627, 8474714, 7096662, 5852544, 5771921, 5971689, 5677821, 5297401, 5056459, 4284823, 2777699, 1478442, 1064478, 1074208, 1120453, 1708069]
36767A708069J321993J121031J91490j27843L98392P39861N45224L56585M5166
36758F299968q92475j551609m56803J590141J930631n9317j814129j211150P77356
36749D612613K095243K225482J606957L58544j019898j346353n22106k1164l73207
36740G616111l2102J652057K368743R6709l151215l658957j266120O10160P9825
36731D315211r42416k17444J511701K065936J074593O9519O0515M20725J51256
36722H509596o89057j184015q30438j84731j08277o09497q47329l06162M95750
36713D245840O81845M6011q00637j021453k07839J181589K005824J560110N34543
36704H225833K52214R26084J435539R61516r013n54735l43239M88829J578707
$$ y = [1708069, 3030062, 4151093, 4342583, 4214740, 4613132, 5352993, 5898217, 6254802, 6299968, 5407493, 3855884, 3399081, 4989222, 6919853, 6860536, 5046407, 3835257, 4612613, 6707856, 8933338, 10540295, 10898839, 9878941, 8532588, 8010482, 7989318, 7616111, 7584009, 9236066, 11604809, 11701518, 8550303, 4891346, 3625226, 4235386, 4315211, 3372795, 3155351, 4667052, 6732988, 7807581, 7877100, 7937615, 8358340, 8509596, 7820539, 6636524, 5806086, 5621355, 5513078, 4903581, 4056252, 3750090, 4245840, 4927685, 4973696, 4173059, 3151606, 2943767, 4125356, 6131180, 7691290, 8225833, 8478047, 9404131, 10839670, 11801186, 11792173, 11237438, 10894199, 11383028, 12961735]
36695A2961735K165826J655101O62986M02579P52341M17608m70675J35049K836376
36686B1518926M909767L926584J754772K118038M868810O016665L960161K420989
36678E1494712N291545J0918567J4268790J3784843J3202067J6250770K2061223
36671A47272517K7281597L1079416L5508394M0650457M1486126L1578712J0054811
36664C64912030j5994471l6520221m5736327m4707607l8200538l0387782k3483623
36657A29881461j8669182j6341938j5283493j3214233r410724o009697n330398
36650D5621796o394636n995409l352987j420480k406636m174583l337146n05507
36642A8034412M94640j666472l913361l307052q98842M36955M7128n88469p88773
$$ y = [12961735, 15127561, 16782662, 17445648, 17848227, 18600568, 19018176, 18547501, 18682550, 21518926, 26428693, 30355277, 32110049, 34228087, 39096897, 45113562, 49073723, 51494712, 56786257, 67704824, 81973614, 95758457, 108960524, 125211294, 147272517, 174554114, 205633530, 241141924, 281792381, 323278507, 354857219, 364912030, 348917559, 312397338, 266661011, 221953404, 183752866, 153365084, 129881461, 111212279, 94870341, 79586848, 66372615, 56961891, 50952194, 45621796, 39227160, 33231751, 29878764, 28458284, 26051648, 21877065, 18539919, 18034412, 18529052, 16862580, 12949219, 9642167, 8743325, 9180280, 9227408, 8638939, 7850166]
36633G850166j331166k410802k791933j526106N49881J701622J236300L0956p55623
36624B553295r74372j115023r69507L50368K618476L738586K011441j276669k938314
36615C998281j632072P10862J482859K99211j177037j428032n13486K70988o8163
36606A943411q64745m60409J248493J981893J85356k067262j585280J002882J763652
36597C147991o70178k875542j710586J229271K444883J539988O12750K28033q07081
36588C139529k246781k127362n7867J737055J506746K15606k75770J91844M28011
36579B511011r3368p12763p34883k45558K74687O74118J146693J549583J168096
36570E537616k51025j496340j010706P84784J593957L60864j091905p49487N66223
$$ y = [7850166, 6519000, 4108198, 1316265, -209841, 340040, 2041662, 3277962, 3308918, 2553295, 1578923, 463900, -505607, -155239, 2463237, 6201823, 8213264, 6936595, 3998281, 2366209, 3077071, 4559930, 4859141, 3682104, 2254072, 1740586, 2011574, 1943411, 1078666, 618257, 1866750, 3848643, 4033999, 1966737, 381457, 1384339, 3147991, 2477813, -397729, -2108315, -879044, 1565839, 3105827, 3718577, 3946610, 3139529, 892748, -1234614, -1292481, 444574, 1951320, 2166926, 1891156, 2083000, 2511011, 2417643, 1704880, 969997, 724439, 999126, 1673244, 2819937, 4369520, 5537616, 5286591, 3790251, 2779545, 3564329, 5158286, 5519150, 4427245, 3677758, 4243981]
36561D243981O69765m09973o79713K18937K78633j326663k399009r43257J589613
36552A242314K274627P81979o91626r73441j057655j592492j540991k45332J042778
36543g59839J024937L67958L90449Q45148O32738j38021n51716o50794r29109
36534B31751p30932O33292J720603O05423j515268j531497N12480J216220l97740
36525G44332j068528P66278J608000j172121m033309k510256J341877K183291
36517b140436l5154p39118J050310J543278n04325j557839J85897J750643R51735
36508E04991j49121J67895J40370j141193j021782J574471K765632k52397l685248
36499a096382k588403J217573K068617p33198k591158j218533P60499J040362
$$ y = [4243981, 4913746, 4503773, 3824060, 4042997, 4321630, 2994967, 595958, -347299, 1242314, 3516941, 4298920, 3607294, 2633853, 1576198, -16294, -1557285, -1802617, -759839, 265098, 633056, 1023505, 1868653, 2501391, 2363370, 1811654, 1160860, 231751, -499181, 134111, 1854714, 2460137, 944869, -586628, -74148, 1142072, 744332, -324196, 442082, 2050082, 877961, -3155348, -5665604, -4323727, -2140436, -2175590, -2914708, -1864398, -321120, -825445, -2383284, -2197387, -446744, 504991, 355870, 523765, 664135, -477058, -1498840, 75631, 2841263, 2588866, -1096382, -3684785, -2467212, -398595, -1131793, -3722951, -4941484, -4180985, -3140623]
36491c140623P68951J345195J771403P78648q48965j443923n18902J017398J771487
36482A500669J038469j79273q8230J141586J064719j258761l155117k121826K32749
36473a825015P84079k47368k72211J011114J437074L17420p48240q46217n50647
36464i40011J02652J530889K561956J396361j207116k400896j186899N16081R26854
36455A299871K86490m04925n21735J81915R54297J96977j886135k306942M25435
36446a774752K931513J486551j871508k358112j92873K60848j413807r23581K480231
36437a375490L685229K30232l005861j479780J825212J593197j456104k583793
36429b567158p20677R89021Q23526O8605l10018p11984r70843m89921J23524J56443
$$ y = [-3140623, -2371672, -1026477, 744926, 1523574, 674609, -769314, -1288216, -270818, 1500669, 2539138, 2359865, 2271635, 3413221, 4477940, 3219179, 64062, -2057764, -1825015, -1040936, -1288304, -1560515, -549401, 887673, 1205093, 456853, -389364, -940011, -837359, 693530, 3255486, 4651847, 3444731, 1043835, -143064, 373017, 1299871, 1586361, 1181436, 659701, 841616, 1795913, 1992890, 106755, -2200187, -1774752, 1156761, 2643312, 771804, -1586308, -1779181, -1518333, -2932140, -3855721, -1375490, 2309739, 2539971, -465890, -1945670, -120458, 1472739, 16635, -2567158, -3287835, -2298814, -1475288, -1406683, -1716701, -2428685, -3399528, -3889449, -3765925, -3609482]
36419c609482O45409K450850L594428J686845j756217k822135p88820J119136
36411E20014P57038l94485m61170j7357l50357j103014j209131p54769n38932
36402c552163o34224m19477L87777J305302J511269P33263l7812O43846K458815
36393B396596K877983L50743k871059l131937l34855J832539J039914p37701o51850
36384G70373P67851R08759o27037j540984m99217J054817J416809J009708R58770
36375D219849P61123p08782k581816k585113m01563J608337J738434J080683J183697
36366D314849J422699N49666n73622j93957J105864R41498j160147k949398k723369
36357G34083j271156K7162R83873J583237J064563o83545k195403k188461j249527
$$ y = [-3609482, -2964073, -513223, 3081205, 4768050, 3011833, 189698, -599122, 520014, 1277052, 882567, 421397, 404040, 53683, -1049331, -2258462, -3013231, -3552163, -4186387, -4605864, -4218087, -2912785, -1401516, -668253, -706065, -62219, 2396596, 5274579, 5625322, 2754263, -377674, -712529, 1120010, 2159924, 1422223, 770373, 1538224, 2446983, 1819946, 278962, -220255, 834562, 2251371, 3261079, 4219849, 4980972, 4272190, 1690374, -894739, -1296302, 312035, 2050469, 3131152, 4314849, 5737548, 6287214, 5713592, 5519635, 6625499, 7566997, 6406850, 3457452, 734083, -537073, -509911, 473962, 2057199, 3121762, 2438217, 242814, -1945647, -3195174]
36348c195174o55672m19228L33452J645370K480306K012803N52342p32929q79506
36339A141764j49505K36636j73661k50378Q63794J915562J188053n98053j129547
36330C044665q4189M60869n18797j523493j212098k98217K13808O10165J149245
36321A841958J067731J27591n43897k83728J07990J76603P05116J678423J464958
36312F342745m75473k056990j445627L23599J300139J337170J014127k08802k466195
36303C664693l778307k426573J55462J317076R73455R62023J509788J088455m88930
36294B977142j375955m05813J322387J904752N64551j758276k958902j589530
36286a319644J093053K098352O60180n23698N58397J993666J162464q23460j041231
$$ y = [-3195174, -3850846, -4270074, -3936622, -2291252, 189054, 2201857, 2754199, 2021270, 1141764, 992259, 1228895, 1055234, 804856, 1668650, 3584212, 4772265, 4174212, 3044665, 2960476, 3421345, 2902548, 1379055, 166957, -131260, 82548, 692713, 1841958, 2909689, 3037280, 2493383, 2209655, 2317645, 2494248, 3199364, 4877787, 6342745, 5867272, 3810282, 2364655, 2688254, 3988393, 5325563, 6339690, 6130888, 3664693, -113614, -2540187, -2384725, -1067649, -94194, 867829, 2377617, 3466072, 2977142, 1601187, 1195374, 2517761, 4422513, 4987064, 3228788, 269886, -1319644, -226591, 1871761, 2531941, 2008243, 2566640, 4560306, 5722770, 4899310, 3858079]
36277C858079K80529L34888j301406j987896n97174O19583k34574j802998j698516
36268b529485J85727J856207J695852L7159j221762o35111P74899N24633j555483
36259h67364k410288l07483J926358J053881j204623q59389J629895K054094m00403
36250F14678j807287k31842J184040p2289j583912m21001J764503J649150l31390
36241G64650j161385k24126M05015k07600q27645n93231p0959K33876N06752P71554
36231d03099Q71047J095211J600409J647409O55591n21940o84714j56643k39168
36222C864103j141429j703495j006159O95284K380608K882046J621980n16531
36214G076407j724767j423043r92013j486642j826289o58734J076238J350960
$$ y = [3858079, 4138608, 4473496, 3172090, 1184194, 587020, 1206603, 972029, -830969, -2529485, -2343758, -487551, 1208301, 1245460, 23698, -611413, 163486, 688119, -867364, -3277652, -3585135, -1658777, -604896, -1809519, -2668908, -1039013, 1015081, 614678, -1192609, -1424451, -240411, -312700, -1896612, -2317613, -553110, 1096040, 764650, -396735, -620861, -215846, -423446, -1251091, -1844322, -1915281, -1681405, -1174653, -403099, 467948, 1563159, 3163568, 4810977, 5466568, 4944628, 4259914, 4103271, 3864103, 2722674, 1019179, 13020, 708304, 3088912, 5970958, 7592938, 7076407, 5351640, 3928597, 2936584, 1449942, -376347, -1035081, 41157, 1392117]
36206A392117J88773m86613k169J97798p30604j431022n54048Q67681P45434j007509
36196h20162k218827j312103P68591K022881J908825J416635J086461L69965p80011
36187B442255j216623m60101J21055n22327j025998J90137J628385N61541k059792
36178c41468k071510J577857M440768K612658j696829l450889j569824P36872
36170B37635J119648K83693m74242q74480o53536N27595J786455J613515M9336
36161C615619j355571j693634j204206l9796J534364K179022R70161n73445m65435
36152B967079K51720q70259k835795j972816J776200L683281J200680k032053
36144B168037j920888P8089L06147q97863p49131M72184L09094p25677J44280
$$ y = [1392117, 1580890, 1094277, 1092108, 1289906, 559302, -871720, -1425768, -558087, 187347, -820162, -3038989, -4351092, -3582501, -1559620, 349205, 1765840, 2852301, 3222266, 2442255, 1225632, 765531, 886586, 364259, -661739, -471602, 1156783, 1718324, -341468, -2412978, -835121, 3605647, 6218305, 4521476, 1070587, -499237, 237635, 1357283, 1640976, 1166734, 292254, -361282, 166313, 1952768, 3566283, 3615619, 2260048, 566414, -637792, -677588, 856776, 3035798, 4005959, 3432514, 2967079, 3218799, 2348540, -487255, -2460071, -683871, 2999410, 4200090, 2168037, 247149, 325238, 631385, -266478, -1015609, -543425, -234331, -960008, -815728]
36135h15728K477061K756681M36633r52127J15442O18530j456348l282416j797836
36126a900108J285273K378471J304409K90288k58732j390696k379714j455772
36118b126581Q33261K112538J708616R43907L61932m27294m58016J712125M489099
36109I149587L988301m61705m400186l621834N77234L431163K505056m16884k305327
36100H445405j955277l88445M79466m67167k460769l499048k422157j10313J568972
36091h09333J606356N03532m40984l28193N23037R91633O40410K93495N77888
36082C557841O96532k30720j356119j232009k69039j42011q69008o71602Q48077
36073C31942J625889K82203j517274j336065O49498K095101J641381K41336m76102
$$ y = [-815728, 1661333, 4418014, 4854647, 3902520, 4017962, 4636492, 3180144, -102272, -1900108, -614835, 1763636, 3068045, 3358333, 3099601, 1708905, -670809, -2126581, -1293320, 819218, 2527834, 3471741, 3833673, 3406379, 2948363, 4660488, 9149587, 13137888, 12676183, 8275997, 4654163, 5231397, 8662560, 11167616, 10750732, 8445405, 6490128, 6101683, 6581149, 6113982, 3653213, 154165, -2267992, -2378305, -809333, 797023, 1300555, 859571, 531378, 1054415, 2046048, 2686458, 2979953, 3557841, 4254373, 4023653, 2667534, 1435525, 1166486, 1024475, 155467, -516135, 331942, 1957831, 2240034, 722760, -613305, 36193, 2131294, 3772675, 4014011, 3537909]
36064C537909j28322L61413J58177m39848n73271j59412J55323L75501J152137
36055D439607K038033J616632K83219N49462K898311M021344J849695l77680J260292
36046A8578915N155473P117276P304023Q729832J0715990J0443143R888480J3616913
36038I1550045K0048382K3588417K5592897L2106760L8071288K7144466m674057
36031B53428198l6608900m5722346l3885772k0137382j3466014q306309k818845
36024I2482630l724749j0999754j3746651p129553p24403k989790q181577o987723
36016C7998430j390865M86784j854113k278318Q54601L213365K413456L17761
36008C9761101j603389l442101m231243l029619j703532k422694l680720k822915
$$ y = [3537909, 3409587, 3771000, 3929177, 3489329, 2916058, 2756646, 2911969, 3287470, 4439607, 6477640, 8094272, 8377491, 8926953, 11825264, 15846608, 17696303, 17318623, 18578915, 23734388, 30851664, 38155687, 46885519, 57601509, 68044652, 77933132, 91550045, 111598427, 135186844, 160779741, 192886501, 230957789, 258102255, 253428198, 216819298, 171096952, 137211180, 117073798, 103607784, 95301475, 92482630, 88757881, 77758127, 64011476, 56881923, 56157520, 53167730, 44986153, 37998430, 36607565, 37094349, 35240236, 32961918, 33816519, 37029884, 39443340, 39761101, 38157712, 34715611, 30484368, 27454749, 25751217, 23328523, 19647803, 16824888]
36000A6824888q98539p48885j868536j647220l66685l74807j367914j126056j15317
35991H310929o62336k101761j543962P15130J401385M8545l53362Q82719Q13217
35982G510504j345791k133855J42820J898559l8994l003768k636841K54194J256580
35973A903408o58101j976861m38419J721424J498122m83848j163925N43043K366162
35964C311005J781736p13618k263495j264284O91327R68795p43335k222871j677261
35955b132001J84434J395620J182073M05929n6299m06552j060761j452902o96250
35946b636709P25788J210821L84128k21604K73116N05823n33236j086732N37959
35937h40646K176387N57395k796041k910816Q99330L494467J783800p67035l80401
$$ y = [16824888, 15926349, 15177464, 13308928, 11661708, 11295023, 10920216, 9552302, 8426246, 8310929, 7648593, 5546832, 4002870, 4718000, 6119385, 6167930, 5814568, 6697287, 7510504, 6164713, 4030858, 4173678, 6072237, 6033243, 3029475, 392634, 646828, 1903408, 1245307, -731554, -1169973, 551451, 2049573, 1565725, 401800, 944843, 3311005, 5092741, 4379123, 2115628, 851344, 1542671, 2511466, 1768131, -454740, -2132001, -1947567, -551947, 630126, 1036055, 979756, 573204, -487557, -1940459, -2636709, -1910921, -700100, -315972, -537576, -264460, 241363, -291873, -1378605, -840646, 1335741, 1893136, -902905, -3813721, -2914391, 580076, 2363876, 1596841, 1216440]
35928A216440R90994L7803j525861k58777K215877J635217j320989j946519N16949
35919A561134J804058o231j743972j117216j94014q37465j275771J44435J658975
35910f067J434591J027832K469186M348202L764717N36865k870859m245118k846934
35901C612415M85954L009045J975400j556761l156582r48397J603658R99653j175907
35892D848478j472036k11547k9461p10542J04358J958214J790066p71893k412660
35883C092977j296367L11203j6925j252891j073937M82450J450237P94617o60287
35874A831077j451298p38311R97741K099783J419646n956j69929Q99780J023634
35865E906167o89961k147885j271416Q03950J287041l12137j670146j069579L27485
$$ y = [1216440, 2207434, 2245237, 719376, 460599, 2676476, 4311693, 2990704, 1044185, 1561134, 3365192, 3358961, 1614989, 497773, 303759, -533706, -1809477, -1665042, -6067, 1428524, 2456356, 4925542, 9273744, 13038461, 13575326, 10704467, 6459349, 3612415, 4098369, 7107414, 9082814, 7526053, 4369471, 3421074, 5024732, 6024385, 4848478, 3376442, 3164895, 3135434, 2424892, 2529250, 4487464, 6277530, 5505637, 3092977, 1796610, 2107813, 2090888, 837997, -235940, 246510, 1696747, 2491364, 1831077, 379779, -358532, 639209, 2738992, 4158638, 4152682, 3982753, 4882533, 5906167, 5216206, 3068321, 1796905, 2600855, 3887896, 3575759, 1905613, 836034, 1163519]
35856A163519L52112j035626j699475m03796J232019Q81109r20935j112634J427087
35847a16620L636227K230757j445090l086137j447653K66845m90153k133059k050492
35838d635375n82653L46139O18210J276015J759361O89401j137760j389673J58881
35829b897454J279028R06040M53030P95444O52748o57838j347306m8791J414562
35820E49463O50334j285431j325419P41425J806665K24782j607134p43334K078132
35811A089483L439720J685733j215314k280523r53018N92309L03048j226657j667114
35802b32333k03594J282493R43711k98272k62510R19802Q58680j199991k657577
35793h49591j032764K248674L320952P58575k590369l041762l48818K244985J928618
$$ y = [1163519, 1515631, 480005, -1219470, -1623266, -391247, 489862, -431073, -1543707, -116620, 3519607, 5750364, 4305274, 1219137, -228516, 38329, -451824, -2584883, -4635375, -5218028, -4871889, -4253679, -2977664, -1218303, -528902, -1666662, -3056335, -2897454, -1618426, -712386, -259356, 536088, 1188836, 530998, -816308, -865099, 549463, 1199797, -85634, -1411053, -669628, 1137037, 1361819, -245315, -988649, 1089483, 4529203, 6214936, 4999622, 2719099, 1766081, 2358390, 2661438, 1434781, -232333, -435927, 846566, 1790277, 1492005, 1229495, 2149297, 3007977, 1807986, -849591, -1882355, 366319, 3687271, 4445846, 1855477, -1186285, -1535103, 709882, 2638500]
35784B638500n68752k248778j619415n5008O81879P69047J177614J489315O19468
35775B883870r03765j358070m70966K41752L347k61080m430j60082j200707j816045
35765c046176q39924Q07695J456030R60951L71464J35312j33527o55343j223491
35756b167009j484385r49761M75414J624860J051686n63473p29131J125116K253629
35747F36946O32389j571810j050116J570813K686803J076061q03638r36565k04165
35738B036718k603k474M63086P51276Q7697r52708j403036j333730j262149j018626
35728b636549k49476O04147Q02689L80609l0227j25857o6014L1236J66060J92513
35718i30869m2705l23663j86235M59459J010466P49820j75931p17040k41958M91621
$$ y = [2638500, 2069748, -179030, -1798445, -1853453, -1171574, -402527, 775087, 2264402, 2883870, 1980105, 622035, 151069, 392821, 396168, 135088, 130658, -29424, -1230131, -3046176, -3886100, -3078405, -1622375, -661424, -289960, -154648, -288175, -943518, -2167009, -3651394, -4601155, -4125741, -2500881, -1449195, -2012668, -2741799, -1616683, 636946, 1269335, -302475, -1352591, 218222, 2905025, 3981086, 3177448, 2240883, 2036718, 2034115, 2031641, 2494727, 3246003, 3333700, 2380992, 977956, -355774, -1617923, -2636549, -2886025, -2281878, -1479189, -1098580, -1128807, -1254664, -1320678, -1289442, -1123382, -930869, -973574, -1297237, -1483472, -1024013, -13547, 736273, 560342, -156698, -398656, 92965]
35708I2965M28890o4845K27274J166210J178003k51421j678303j987777j755479
35699b644483j297805N06042L617447N042989K326539k324280m275126k337333
35691a386010L30255J031420M45564L02454O93193P31762J61658o29704j106197
35682E74395p49301K66461P58036J27870l27142N80161J416129Q8214k182864
35673E51959j955399J110484L241107J857625j036525k202638j285570J23116
35665D04159J213389J745835R98307r35151k128990j061245J142809K372910K471261
35656F223284K795722L508459L025640L04073l180382m129121o11036M881565
35648A2818204O692477K177806m231611n868260k271742P47399l20385k453820
$$ y = [92965, 521855, 457010, 684284, 1850494, 3028497, 2777076, 1098773, -889004, -2644483, -3942288, -3436246, 181201, 5224190, 7550729, 5226449, 951323, -1386010, -1055755, -24335, 421229, 723683, 1416876, 2148638, 2310296, 1680592, 574395, -174906, 91555, 849591, 977461, 650319, 1230480, 2646609, 2734823, 551959, -1403440, -292956, 2948151, 4805776, 3769251, 1566613, 281043, 404159, 1617548, 3363383, 4361690, 3426539, 1297549, 236304, 1379113, 3752023, 6223284, 9019006, 12527465, 15553105, 15857178, 12676796, 8547675, 7936639, 12818204, 19510681, 21688487, 17456876, 11588616, 9316874, 10064273, 9743888, 7290068]
35640G290068k001992k90208k62850j252361r93924j02176l88943p75896Q10190
35631B031908K908441K289539n63448k067054j300507q30971j569752j196477
35623b98321J153703K599025Q98419j851514k201810j07466J429864M73857j702658
35614C93099k331807l17045K350990K733257P17829o86830K42792J290056J04364
35605D496705j538180o39766J488873R40505k146951l378115r85003J678975J748825
35596A665868N99096K05702j33437j114444j173187L91657J284006k5409j407600
35587B92252p79963L09018p9843m57826J023311K432765J153969j162298j240624
35578A490761O2847m88496k324511j912919P09243J662329j48766j392378l52878
$$ y = [7290068, 5288076, 4997868, 4735018, 3482657, 2488733, 2386557, 1997614, 1221718, 2031908, 4940349, 7229888, 6666440, 4599386, 3298879, 2467908, 898156, -298321, 855382, 3454407, 4352826, 2501312, 299502, 192036, 1621900, 2095757, 393099, -1938708, -2255753, 95237, 2828494, 3546323, 2859493, 3102285, 4392341, 4496705, 2958525, 2318759, 3807632, 4748137, 2601186, -776929, -1761932, -82957, 1665868, 2264964, 2470666, 2337229, 1222785, 49598, 441255, 1725261, 1699852, 292252, -487711, -178693, -258536, -716362, 306949, 2739714, 3893683, 2731385, 1490761, 1553608, 1065112, -1259399, -3172318, -2463075, -800746, -949512, -2341890, -2694768]
35569b694768M81973l59170l94283J939635L787267K468926J2357m13686L88201
35560E216452j12371j239055n82777J150704J016205j081734k139826r61777K68292
35551A534113n6424n90159K09313J444268J386932N0389j214733j605927j279517
35542a21745o28746J5376L92094M88749M51766K88351l486k47136m57496r13392
35532g35665j332153p92532O64390J384893L60483q93853m69426Q44109Q18337
35523a51417m77960q44387K63637R88624N61870N68784J644798J807329j40013
35514D221265k076321j734227l47032m43402j529619j056126J030954J923667
35506a0841M18053j085783j56915K151710K891751J157752j110394j903283j413638
$$ y = [-2694768, -2212795, -2571965, -2966248, -1026613, 2760654, 5229580, 5241937, 4828251, 5216452, 5104081, 3865026, 3282249, 4432953, 5449158, 4367424, 2227598, 1265821, 1534113, 1477689, 887530, 1096843, 2541111, 3928043, 3978432, 2763699, 1157772, -121745, -750491, -735115, -343021, 145728, 597494, 885845, 882359, 635223, 177727, -735665, -2067818, -2860350, -2195960, -811067, -450584, -1344437, -1813863, -969754, -151417, -629377, -1473764, -1210127, -221503, 340367, 909151, 2553949, 4361278, 4221265, 2144944, 410717, 63685, -379717, -1909336, -2965462, -1934508, -10841, 407212, -678571, -835486, 1316224, 4207975, 5365727, 4255333, 2352050, 938412]
35497I38412j162433j626948j678429n13016Q46421R72970L47393O42394J744571
35488E11335J530884o09615k120943q04784J646444J898079k20424j690907q41463
35479g01394O43889P69686M2670M0789P28428P44974l01125j201977q54044K57681
35469A69577O74900j91573j289615j262712k28031M92228L62052K88012Q60416
35460a24746J109996L1942j494404j621581l9022J617055J834920P92556k69925
35451A836791o12368o53699j112065j556141m98957K222101L991745K281596j305473
35442D593530k487801k68602J621202N41780j177883o13996P35758p2780j923298
35433I47910j490198Q70294J676776J60427r70570n76234m59839j232525j124035
$$ y = [938412, -224021, -1850969, -3529398, -4042414, -3195993, -2223023, -1875630, -1233236, 511335, 2042219, 1432604, -688339, -1493123, 153321, 2051400, 1830976, 140069, -701394, -57505, 712181, 754851, 795640, 1524068, 2269042, 1967917, 765940, -88104, 169577, 844477, 652904, -636711, -1899423, -2127454, -1635226, -1273174, -985162, -124746, 985250, 1017192, -477212, -2098793, -2137815, -520760, 1314160, 2106716, 1836791, 1224423, 570724, -541341, -2097482, -2596439, -374338, 3617407, 5899003, 4593530, 2105729, 1837127, 3458329, 4000109, 2822226, 2208230, 2943988, 2871208, 947910, -542288, 328006, 2004782, 2165209, 1194639, 618405, 158566, -1073959, -2197994]
35424b197994J81802O62492R240L98005J879765J462299j250877k141505Q04943
35415a91830L367088J462655k113528k066018J062524K227802N8911j682482o46522
35406A478600J017811J002269J45219j26160l72287j267758j644955n13680O70868
35397C89927n9300j898455k062846J55692K028794J030131j385042j406437J806390
35388a401146M494640L189887n29296k374136j295284j41074o43948j141944j66792
35379i093Q61631K54924j111339j535551j103326p07780k17734N62260P53186
35370b252822Q575l30822N70379J329865O19341n09476m43570M77877J137125
35361F06472J601046J981518J223248q17227k028631j135961r9364q07821j582524
$$ y = [-2197994, -2016192, -1353700, -1344460, -946455, 933310, 2395609, 1144732, -996773, -191830, 3175258, 4637913, 2524385, 458367, 1520891, 3748693, 3807604, 2125122, 1478600, 2496411, 3498680, 3643899, 3517739, 3145452, 1877694, 232739, -280941, 389927, 330627, -1567828, -3630674, -3474982, -1446188, -416057, -1801099, -3207536, -1401146, 3093494, 6283381, 5754085, 3379949, 2084665, 1943591, 1299643, 157699, -9093, 852538, 1107462, -3877, -1539428, -2642754, -3350534, -3568268, -3006008, -2252822, -2244247, -2575069, -2004690, -674825, -55484, -564960, -1008530, -530653, 606472, 2207518, 4189036, 5412284, 4595057, 2566426, 1430465, 1331101, 523280, -1059244]
35352a059244j81570J780933J284066p56586q40661J221289K060405L21543j537318
35343B292857j480287m02975K82902N44741N32281Q9238j06365P09580J468381
35334C930353O26220p52049j63678K111800L054128J457487n10576p44968M87012
35325I495729J934377K461649Q37210k712029m984235l120755P68607J956580
35317F637133r0995j499256p05414l92751j667840j658634P97213K092439k34145
35308C277750k814904j611380J668214K549279O41188q08802n25321j83797n88208
35299A604019n91278K33553P22773J38492r04648j484576r92330P31490K660736
35290B118231K888178R33726j255238j784499j092787n99798n30136m51437n47775
$$ y = [-1059244, -1240814, 540119, 1824185, 1067599, 226938, 1448227, 3508632, 3830175, 2292857, 812570, 409595, 692497, 1237238, 1769519, 1858757, 1752392, 2461972, 3930353, 4556573, 3804524, 3640846, 5752646, 8806774, 10264261, 9753685, 9008717, 9495729, 11430106, 13891755, 14728965, 12016936, 7032701, 3911946, 4680553, 6637133, 6546138, 5046882, 4341468, 3948717, 2280877, 622243, 1419456, 3511895, 3277750, 462846, -1148534, 519680, 3068959, 3710147, 2901345, 2376024, 2192227, 1604019, 1012741, 1246294, 1969067, 2107559, 1202911, -281665, -1273995, -542505, 2118231, 5006409, 5940135, 4684897, 2900398, 1807611, 1207813, 677677, 226240, -321535]
35281c21535q88385p20253J87426Q05751N62183K60809L00967j24323r85138q37024
35271a759522L99412O36785p28238j138403R62580L079466K492240N31980j07015
35262D369285M1090j086762k693176k338763l33497Q36428O42654N65954P26142
35253G29355n0049j255184j148908Q2924O89959N15045P68349J142878L67585
35244A841954p76454l60051J028482R69021n48996j117422k01562K25009l73425
35235F86556k91189O91659O22629o60578p50225Q45162J291040p27140k470902
35226g62988j718691l87130q07821j479151R7938K665365K955787Q54652o63026
35217G54935k08891M98083r5506j109497r21000M84008J638588J411331K81105
$$ y = [-321535, -1209920, -1930173, -1742747, -936996, -374813, -114004, 186963, 62640, -922498, -1759522, -1360110, -723325, -1451563, -2589966, -1627386, 1452080, 3944320, 4476300, 4369285, 4410375, 3323613, 630437, -1708326, -2041823, -1205395, -562741, 3213, 729355, 679306, -575878, -1724786, -1641862, -951903, -436858, 331491, 1474369, 1841954, 1065500, 705449, 1733931, 2702952, 2153956, 1036534, 834972, 1059981, 686556, 395367, 1087026, 1709655, 1049077, 298852, 1144014, 2435054, 1707914, -762988, -2481679, -2868809, -3676630, -5155781, -5057843, -2392478, 563309, 1417961, 754935, 546044, 1044127, 948621, -160876, -1081876, -597868, 1040720, 2452051, 2733156]
35208B733156k16204M74111Q48644o38997k823874k947548p50281Q15970j12326
35199b617349j594490j060099Q33666J643631R17428J45763r4767n12799j020284
35190c359300n67210Q16161J660245J096678j09262q30358p27163N7078J237990
35181g25141K112640J850575M76675r73893j504037r95173l1339O69281O65575
35172A545163M8562o52674r90524r45724p34239n62977n82825o49369j84039J060181
35162b648465K118642J649433j39964j449578j195178k69677J19119J99006P18446
35153h98216J278572R41863j5861l62014J46581L04135p06246j874296j444646
35144b630128P35012K537458J740329j153990l097239k072227L54577J222435
$$ y = [2733156, 2516952, 2991063, 3839707, 3200710, 376836, -2570712, -3320993, -2505023, -2617349, -4211839, -5271938, -4438272, -2794641, -1877213, -1731450, -1826217, -2339016, -3359300, -3926510, -3110349, -1450104, -353426, -462688, -1293046, -2020209, -1963131, -725141, 1387499, 3238074, 3714749, 2740856, 1236819, 241646, 210307, 879588, 1545163, 1593725, 941051, -49473, -995197, -1729436, -2292413, -2875238, -3524607, -3708646, -2648465, -529823, 1119610, 979646, -469932, -1665110, -1934787, -1815668, -1616662, -898216, 380356, 1322219, 1306358, 944344, 1090925, 1395060, 688814, -1185482, -2630128, -1895116, 642342, 2382671, 1228681, -1868558, -3940785, -3586208, -2363773]
35136b363773J99887m02250N86505J674825J510136R16248R19979P79243l07285
35127C513515j200538o04603L91351j52433j723005j985473m46028Q86655P39000
35118e81559K76448Q44316J826308J845390Q24431l02961j087668j631721j655033
35109C57951o75812Q27016J395563K84332j334829j652273n98362J10462l13706
35100a599658l41785J260129K711342J451537j455880k161052K93236K340133
35092B498002J298732p75506r17066L4506k94914j264736p97243K54822l56301
35083c19704j485935j31948K585906K193331j665830l807378j393431J771966
35075b253023J630814n0996K60193J663219J242932k54639j64277O53478p16861
$$ y = [-2363773, -2163886, -2566136, -1979631, -304806, 1205330, 2121578, 3041557, 3820800, 3513515, 2312977, 1708374, 2099725, 1947292, 224287, -1761186, -2207214, -1320559, -581559, -305111, 539205, 2365513, 4210903, 5035334, 4732373, 3644705, 2012984, 357951, -317861, 509155, 1904718, 2189050, 854221, -798052, -1396414, -1285952, -1599658, -1941443, -681314, 2030028, 3481565, 2025685, -135367, 157869, 2498002, 3796734, 3021228, 2104162, 2138668, 1843754, 579018, -218225, 36597, -319704, -1805639, -1937587, 648319, 2841650, 1175820, -2631558, -4024989, -2253023, -622209, -673205, -413012, 1250207, 2493139, 2238500, 2074223, 2727701, 2010840]
35066B010840l383797l435160m24620J847466J506955Q62004J483135J606299
35058B073122J75940p14301K63422R84572k48568j411798l53813J172647M84007
35049B425230j325245j340584J47996L86779j041503j859027j125161j76974L71231
35040c537258J272203K123697J442835k39504m85988J042584J694585L6332j922679
35031A426807k110341j274563p96436j99757J086718J754641P63047m13044j01964
35022A35108O63463J10146r57666o63655L87909K39888o02735P1430J953298K339069
35012C676255P15325l96245P6803J10620j186061j390617Q76658K695484J074607
35003F252829k070522k746203r43569j4028r48409j331887M413J177619R17906
$$ y = [2010840, -1372957, -4808117, -5232737, -3385271, -1878316, -1016312, 466823, 2073122, 2249062, 1534761, 1798183, 2782755, 2534187, 1122389, 768576, 1941223, 2425230, 1099985, -240599, -92603, 294176, -747327, -2606354, -3731515, -3908489, -3537258, -2265055, -141358, 1301477, 1061973, 575985, 1618569, 3313154, 3349486, 1426807, -683534, -1958097, -2754533, -2954290, -1867572, -112931, 650116, 237072, 135108, 798571, 908717, -48949, -712604, -324695, -84807, -687542, -616112, 1337186, 3676255, 4391580, 3995335, 4072138, 4182758, 2996697, 1606080, 2482738, 5178222, 6252829, 4182307, 1436104, 492535, 478507, -469902, -1801789, -1797376, -619757, 298149]
34994B98149N96645J226867J424556J30766j150675q58693l0906k92294r51181
34985C93234m45047P21282R65468N21576P91149J491477J070984l36751r81229
34976D192143n55733o30842j643583j929660n50348J102187J516146R89835L59048
34967B849193m21293j341023j608428r59596k46165J34653P29065J183597J07048
34958D27051k023766k309434L32314K791100K129627J03655J62819J750508J461260
34949D825134j047224k446527j128205O62304Q51155K60453J49582R1486k60115
34940A958043L8507J103862J281627q7786j187004o62763J22417l60405j088975
34931A117523n24302M33231M0816j037031p27996R14906J717159P46444n19734
$$ y = [298149, 894794, 2121661, 3546217, 3676983, 2526308, 1667615, 1636709, 1344415, 393234, -51813, 669469, 1634937, 2156513, 2947662, 4439139, 5510123, 5173372, 4192143, 3636410, 3005568, 1361985, -567675, -1118023, -15836, 1500310, 2490145, 2849193, 2427900, 1086877, -521551, -1481147, -1727312, -1592659, -863594, 320003, 427051, -1596715, -3906149, -3573835, -782735, 1346892, 1450547, 1613366, 3363874, 4825134, 3777910, 1331383, 203178, 865482, 1716637, 1977090, 2126672, 2218158, 1958043, 1996550, 3100412, 4382039, 4294253, 3107249, 2444486, 2566903, 2206498, 1117523, 593221, 1026452, 1067268, 30237, -697759, 217147, 1934306, 2680750, 2161016]
34922B161016n81730K60231Q27812N62550k31547q80190r92157j007592j662018
34913a543625k535123k087225R1919K152558K255320J035961M53494R50261J280896
34904B054436P09500j29775m67798l24332j82183m60576j106080j300320k58925
34895a466053J252256J350016k85854j580710j025157J11418J43448m3285J296323
34886b47598L138842K595877o58191l413801k969478k77126J687014J379273j93260
34877A041552j057799m85327K93819j48591j118810n74785J444685K241048N45486
34868B181278j111796k75492J366978Q06316j145395j278580M70344J094860n1919
34859B056594l11211J078166J222009j239982l136514j576768J376804J954819
$$ y = [2161016, 1579286, 1839517, 2667329, 3229879, 2998332, 2118142, 1125985, 118393, -1543625, -4078748, -6165973, -6074054, -3921496, -1666176, -630215, -176721, 773540, 2054436, 2763936, 2634161, 2166363, 1842031, 1659848, 1199272, 93192, -1207128, -1466053, -213797, 1136219, 850365, -730345, -1755502, -1644084, -1500636, -1543921, -247598, 2891244, 5487121, 4828930, 1415129, -1554349, -1831475, -144461, 1234812, 1041552, -16247, -501574, -207755, -356346, -1475156, -2049941, -605256, 1635792, 2181278, 1069482, 793990, 2160968, 2967284, 1821889, 543309, 1013653, 2108513, 2056594, 1745383, 2823549, 4045558, 2805576, -330938, -1907706, -530902, 1423917]
34851A423917L23024l90684O40765J088523l50173j881383j457893L04299J186334
34842H86729L71022o94817l61456J013139J533217L88113r46724p90175L78565
34833A777613Q44992K58012k76405l23547n76069j199285j411826q99528j79608
34824a985651M90599J121314J109119N7819p95250q198J429098J249107l92839
34815B275118j121735m45155m79885j782332j854340N03218K452124J180007j646199
34806i19179k230657N2493K306887K251631N43382p43536m94599M88205L79118
34797A633745j312378k507160j180016J115124R05135j775119k843328k13344
34789f177341K947820K985962P38818p65045q98836q15861m58773O87420J526474
$$ y = [1423917, 1746941, 1356257, 1997022, 3085545, 2735372, 853989, -603904, -299605, 886729, 1257751, 562934, 201478, 1214617, 2747834, 3135947, 2189223, 1399048, 1777613, 2622605, 2880617, 2604212, 2280665, 1704596, 505311, -906515, -1806043, -1985651, -1495052, -373738, 735381, 793200, -2050, -10248, 1418850, 2667957, 2275118, 1153383, 708228, 228343, -1553989, -3408329, -2905111, -452987, 727020, -919179, -3149836, -3097343, -790456, 1461175, 2004557, 1261021, 766422, 1254627, 1633745, 321367, -2185793, -3365809, -2250685, -1345550, -3120669, -5963997, -6177341, -3229521, -243559, 495259, -269786, -1168622, -1984483, -2443256, -1755836, -229362]
34780b29362R93949L37580J003833J750140P18628j080909j390185m89214k45073
34771A369387n75067j30600N05730k58066j622697j373558J94002P29497n1292
34762a212664q4547J212490K077196J537487M48604o38652j743266j803610M9450
34753a57512J806371P21848j931779k197036K33922J388265l84408j765489k23425
34744b509243J918828J736857K71275j24348J90062q2971j36248R18185J396693
34735C579090j32332j502620j75529J949298J138147j843191k548528N5141J860300
34726B379776Q7561k597341k575079o41843M3007p39397m21998J611446K762516
34717i1352J342739o64895n69601J002923J226539m44178j331837L78538K660239
$$ y = [-229362, 764587, 1102167, 2106000, 3856140, 4574768, 3493859, 2103674, 1614460, 1369387, 794320, 663720, 1169450, 911384, -711313, -2084871, -1890869, -1161372, -1212664, -1297211, -84721, 1992475, 3529962, 3978566, 3339914, 1596648, -206962, -157512, 1648859, 2370707, 438928, -1758108, -1524186, -135921, -520329, -2285818, -2509243, -590415, 1146442, 1417717, 1293369, 1483431, 1400460, 1264212, 2182397, 3579090, 3446758, 1944138, 1768609, 3717907, 4856054, 3012863, 464335, 519476, 2379776, 2467337, -130004, -2705083, -3346926, -3303919, -4043316, -4465314, -2853868, -91352, 1251387, 586492, 16891, 1019814, 2246353, 1802175, 470338, 848876, 3509115]
34708C509115K235160j010034l877393l696999q84212K159329L396453K390704
34700D222123L40626r26505p27071j60436l33982o16958J28918J251207J044271
34691D222193l90084r90121J99510J604352J449085K692j314245j808853j660752
34682A313777j220150r50085j218604j523132q07101Q23629J651919N10298j294817
34673b714266j322482Q24664K618218J531730j477666k613940j59104K549514
34665g63332J283467k572630l246155Q73038M217245K324429j108596k45192L108511
34656C870785K318204k863814n327378j716014K612877K340880l99320j129457
34648b93237j67089n3294j46900J164250K095972L51411k119702k066864m57864
$$ y = [3509115, 5744275, 4734241, 856848, -2840151, -3724363, -1565034, 1831419, 4222123, 4562749, 3636244, 2909173, 2748737, 2414755, 1797797, 1926715, 3177922, 4222193, 3832109, 2841988, 3041498, 4645850, 6094935, 6097627, 4783382, 2974529, 1313777, 93627, -856458, -2075062, -3598194, -4405295, -3581666, -1929747, -1419449, -2714266, -4036748, -3212084, -593866, 937864, -539802, -3153742, -3312846, -763332, 520135, -2052495, -5298650, -4425612, -208367, 2116062, 1007466, 762274, 3870785, 6188989, 3325175, -2002203, -3718217, -1105340, 1235540, 836220, -293237, -460326, -513620, -660520, 503730, 2599702, 2951113, 831411, -1235453, -1693317]
34639a693317k48082p35643O25542K499260J488087j333089j690133L94375N88723
34630a04277j784625k235581Q12622K754931M93727k285464j350299J407042K008140
34621b83784J090507J534032K435450R16165j933844k390248n00704R0181j409414
34612d51659j806612P7887J266923J01302p29930Q55164K332233Q52033j641555
34603H55786j536877L79092L61971j864251k699211q17067O91767l45871j585652
34594f560313k17439K387528L001034J473923K56271K52589K78177J6299M09828
34585A297897J128714O00017r80448j417803j03223P75636k31948j551912j373588
34576a856658m89645m39514p59175l23554J55719n00977j245284k34868J678699
$$ y = [-1693317, -1941399, -2677042, -2051500, 447760, 1935847, 602758, -1087375, -693000, -104277, -1888902, -4124483, -3311861, -556930, -63203, -2348667, -3698966, -2291924, -283784, 806723, 2340755, 4776205, 5692370, 3758526, 1368278, 867574, 957755, -451659, -2258271, -2180384, -913461, -812159, -1542089, -686925, 1645308, 2497341, 855786, -681091, -301999, 59972, -1804279, -4503490, -5320557, -4628790, -4974661, -6560313, -6777752, -4390224, -1389190, 84733, 341004, 593593, 871770, 888069, 1297897, 2426611, 3026628, 2046180, 628377, 525154, 1300790, 1068842, -483070, -1856658, -2346303, -2785817, -3544992, -3868546, -3712827, -4213804, -5459088, -5693956, -4015257]
34567d015257J786010j63818j292735J23703K190038K364833R10401j26999Q499
34558A784675L58289J61779k87258n25838o04010p71303j048494j185794q22314
34549b940268J48598J165816J239403j8367j686527k203964r18626J093672J977887
34540b142376J054021l59635m75611P38758J533651O74608j025206j850985j149543
34531c002318L31958J394494J174793k78498j643943j346211M09960J533213P47571
34522f78981o79396r55208k92029Q3424K91846J131380J842108R89545o48159
34513A084530o87347J004544J666595j40892k059887j306566J283921K534250
34505C379148J128048j327551k759853k440725p55656J203864J924358P90730
$$ y = [-4015257, -2229247, -2393065, -3685800, -3562097, -1372059, 992774, 1903175, 1776176, 1784675, 2142964, 2304743, 2017485, 1491647, 887637, 116334, -932160, -2117954, -2940268, -2791670, -1625854, -386451, -404818, -2091345, -4295309, -5213935, -4120263, -2142376, -1088355, -1447990, -1923601, -1184843, 348808, 1023416, -1790, -1852775, -3002318, -2670360, -1275866, -101073, -379571, -2023514, -3369725, -2959765, -1426552, -678981, -1358377, -2313585, -2605614, -2522190, -2230344, -1098964, 743144, 1732689, 1084530, 397183, 1401727, 3068322, 2927430, 867543, -439023, 844898, 3379148, 4507196, 3179645, 419792, -2020933, -2776589, -1572725, 351633, 1142363]
34497A142363p88220q05254O82493J551772N49604j031657j247252o072J226749
34488A274526J471368Q89602j45836j369543k001986j073811J101268K693961
34480B839549K289764M20325j400095k364725k323266j057596R56705J780839
34472A141500k4430k730058k831825L43146L402047L243809Q34351p55124m98017
34463B125399J89983J16349n13688j036305r03174K01593J573546J592252o5410
34454C280545j367429p20912M13479j03837j309398o97887J127299R86757j399675
34445B08942k267639M21770L431243K795877o13605k799540k178170n79855K70651
34436a310326M54757K95462m09688j223438j033534K17264J125548P41592j46513
$$ y = [1142363, 354143, -451111, 231382, 1783154, 2332758, 1301101, 53849, 47777, 1274526, 2745894, 3635496, 3489660, 2120117, 118131, -955680, 145588, 2839549, 5129313, 5549638, 4149543, 1784818, -538448, -1596044, -639339, 1141500, 1117070, -1612988, -4444813, -4101667, -699620, 2544189, 3378540, 2623416, 2125399, 2315382, 2431731, 1918043, 881738, -21436, 180157, 1753703, 3345955, 3280545, 1913116, 1192204, 1605683, 1501846, 192448, -505439, 621860, 1608617, 208942, -2058697, -1636927, 1794316, 4590193, 3976588, 1177048, -1001122, -1580977, -1310326, -855569, -560107, -969795, -2193233, -3226767, -3009503, -1883955, -1142363, -1288876]
34427a288876k59664L86841O55574l9182q61233o10346N82800J226071M81560
34418B73545m68667n8625J109727Q97408j064995k459052j451333P73807J837259
34409f10926J232324J53105o65524j227457j080528K88336J988859K306538R55246
34400C339973n35752q99566m41351k8252J01375P5627j51827n36493p36170n76651
34390c89087k70061N0671M92387Q88271P18318q8369p48647n03078L42092O94138
34380A186635l5145j232135j778833j266346k88449M51388R41264J441416J593403
34371A013198O82731j080793k236663j528595N86630K255987J987662K7165j847942
34362a40620j981515n55052N79967J89293p27351m65898P69427J247519N57148
$$ y = [-1288876, -1548540, -1161699, -506125, -545307, -1406540, -2016886, -1434086, -208015, 273545, -195122, -253747, 855980, 1753388, 688393, -1770659, -3221992, -2448185, -610926, 621398, 774503, 108979, -1118478, -2199006, -1910670, 78189, 2384727, 3339973, 2804221, 1904655, 1463304, 1435052, 1536427, 1612054, 1460227, 923734, 187564, -389087, -659148, -608477, -116090, 772181, 1490499, 1402130, 653483, 150405, 492497, 1186635, 1151490, -80645, -1859478, -3125824, -3414273, -2962885, -2021621, -580205, 1013198, 1695929, 615136, -1621527, -3150122, -2563492, -307505, 1680157, 1707322, -140620, -2122135, -2677187, -2097220, -1907927, -2635278, -3101176, -2331749, -1084230, -527082]
34353e27082K14772R66314J398023L01202j246107j584251r04358m03247j59572
34344a944306M13995R19022N92433j16657l56939n50726j352987j679756j08710
34335d184631K169819K426729M99301q53705k14967N85470j14708j075390n35813
34326a297895P36663Q42392j88218p39364j54935P83433J285128J030643r2579
34317B205268j397009j327004N49917K234621J607127n58195j640907q15659K50533
34308A108692K16940l89770p49352j006485j251553p87227N90993J651392J114257
34299D97887n65057j580140o99669J524112L179671K587221l0476k474574k739216
34290c00241j128806M67204J044619J092156R79549L26217p44737j274987r88621
$$ y = [-527082, -312310, 654004, 2052027, 2353229, 1107122, -477129, -1381487, -1784734, -1944306, -1530311, -611289, -18856, -135513, -492452, -1043178, -2396165, -4075921, -4184631, -2014812, 411917, 911218, 57513, -157454, 428016, 313308, -762082, -1297895, -561232, 281160, 92942, -646422, -801357, -17924, 1267204, 2297847, 2205268, 808259, -518745, 31172, 2265793, 3872920, 3314725, 1673818, 858159, 1108692, 1325632, 935862, 186510, -819975, -2071528, -2858755, -2267762, -616370, 497887, -67170, -1647310, -2346979, -822867, 2356804, 4944025, 4913549, 2438975, -300241, -1429047, -961843, 82776, 1174932, 2154481, 2480698, 1735961, 460974, -527647]
34281e27647p54044q89593m76199Q12962J743291J475382R23188P87043o6189
34272C028194k264788l508169j270487K786888M171253J522163j639634j937013
34264H88407k81664M49659l09285r20152n94123j55990j72064j11723M45539R49488
34254A88092O28356m36693j275813j040577p9704K78987n51720j378064q06942
34245d474078O06880J218595R93467J385811K398945K162236K48161j093753m78875
34236B967389K64649o64461j757616q83685O93606L76823j031934n46054J629243
34227A047960K128097J66283r89020M17620J620400J33471j917953j354528P48831
34218B001161R01844j126057k108331m74181J577274J543981k09456j583175j454048
$$ y = [-527647, -1281691, -2171284, -2647483, -1834521, -91230, 1384152, 2307340, 3094383, 3028194, 763406, -2744763, -4015250, -1228362, 2942891, 4465054, 2825420, 888407, 606743, 1056402, 747117, -173035, -767158, -923148, -1095212, -1206935, -761396, 188092, 816448, 379755, -896058, -1936635, -2016339, -1737352, -2289072, -3667136, -4474078, -3867198, -2648603, -1655136, -269325, 2129620, 4291856, 4540017, 3446264, 2967389, 3232038, 2567577, 809961, -73724, 619882, 996705, -35229, -581283, 1047960, 3176057, 3342340, 2353320, 2770940, 4391340, 4524811, 2606858, 1252330, 2001161, 2903005, 1776948, -331383, -805564, 771710, 2315691, 2106235, 523060, -930988]
34209i30988m51902J07700l62266r96847m29883J151534J826548O78271n11468
34200H0699J70476J635787J376554n07473j410353l02911R10446O79492o4170
34191B568547j89803m93376j812665k743609j377451J533565L106913J825289
34183B417410q88752k476307j612081R32581K844259K093566p68746k595037j101080
34174a154187K084900L264770J308088j271249k010657j332431q68341p54827
34166g33934j72319N46890K51548q93374j300599k06550J292340J832099J309972
34157A926073L43782p56504j738705j961284j165440k34293k09162p42829m92152
34148e030514Q74361J978132J479650r6291r37502j48232J226699J516661L41713
$$ y = [-930988, -1382890, -1275190, -1637456, -2634303, -3064186, -1912652, -86104, 592167, 80699, 251175, 1886962, 3263516, 2756043, 1345690, 1042779, 1953225, 2632717, 2568547, 2378744, 1885368, 72703, -2670906, -4048357, -2514792, 592121, 2417410, 1528658, -947649, -2559730, -1627149, 1217110, 3310676, 2541930, -53107, -1154187, 930713, 4195483, 5503571, 4232322, 2221665, 889234, 20893, -733934, -906253, -359363, -107815, -1001189, -2301788, -2508338, -1215998, 616101, 1926073, 2269855, 1513351, -225354, -2186638, -3352078, -3586371, -3795533, -4538362, -5030514, -4156153, -2178021, -698371, -794662, -1732164, -1880396, -653697, 862964, 1204677]
34139A204677j131194j630331r78105J65524J122705J402798P15113n00533r95187
34130f24533j09825J006514P23476o07795r48116L69696J456166N83453j320070
34121E28966k113351j286626L933R01513J417852J626289J590357J582823J322310
34112E574066r6054k255038k739728l89348K023619J079008k085972l075520o53963
34103b618930J649459J109566n06939m36866R66042J837678K055763K357123K081780
34094H494676M32697j321274j400251l43127l8816p47077j224745j071722q29809
34085A950552m19282L98114O41567n69944j871910j226859O98940J277630j2263
34076H66545r42514l45472J54461p63550j709616q66970J060818J964491J326351
$$ y = [1204677, 73483, -1556848, -2534953, -2369429, -1246724, 156074, 871187, 370654, -624533, -734358, 272156, 995632, 387837, -560279, -190583, 1265583, 1849036, 528966, -1584385, -2871011, -2867078, -1965565, -547713, 1078576, 2668933, 4251756, 5574066, 5478012, 3222974, 483246, 93898, 2117517, 3196525, 1110553, -1964967, -2618930, -969471, 140095, -366844, -803710, 162332, 2000010, 4055773, 6412896, 8494676, 8927373, 7606099, 6205848, 5862721, 5823905, 5076828, 3852083, 2780361, 1950552, 1531270, 1929384, 2570951, 2001007, 129097, -1097762, -398822, 878808, 866545, -75969, -421441, -266980, -1030530, -2740146, -3607116, -2546298, -581807, 744544]
34067G44544M26424R3353k06628r62805j454718o44998J084583J830407L42552
34058A252714k014165k504173m51404J762118J775448O6849j334999j647400j323440
34049d418452l73417J353710K852745K860514J733212P71256K11497l67459m28127
34040D195479N46310J167459j45121k018005j669194M78371J030384j037727k704166
34031a56210j733717R3956L64692k70337p329Q46389R12584K67578k61993p83765
34021g28152j345630q74970Q40328J751785L99576j372650j062662M85198N52727
34012a354450r27805j410972k8922J132132M62095r14844j081685K36778J875348
34003b012325K614564J975975O10534p8958M18159Q57295P3212j071301j077841
$$ y = [744544, 1170968, 1264321, 1057693, 94888, -1359830, -2004828, -920245, 910162, 1252714, -761451, -3265624, -3717028, -1954910, -179462, -112613, -1447612, -3095012, -4418452, -4791869, -3438159, -585414, 2275100, 4008312, 4779568, 4991065, 4623606, 4195479, 4741789, 5909248, 5764127, 3746122, 2076928, 2555299, 3585683, 2547956, -156210, -1889927, -1795971, -1431279, -1701616, -1708945, -862556, 50028, 317606, 55613, -728152, -2073782, -2948752, -2108424, -356639, 42937, -1329713, -2392375, -1907177, -1354450, -2282255, -3693227, -3722149, -2590017, -2127922, -3042766, -4124451, -3887673, -2012325, 602239, 2578214, 3188748, 3109790, 3527949, 4385244, 4458456, 3387155, 2309314]
33994B309314l79412n30339j323692j019668N71757J569725R75445l1968l89641
33985A751521o65156j355326j567359o19215N61452Q92941P26174P56984N59743
$$ y = [2309314, 1929902, 1399563, 75871, -943797, -372040, 1197685, 2173130, 2141162, 1751521, 1086365, -268961, -1836320, -2455535, -1894083, -1001142, -274968, 482016, 1041759]
$$ [...]
##END NTUPLES=NMR SPECTRUM
##END=
