##TITLE=31Pdec_LR-748-CR3-15K
 CDCl3, 124 sc
 4.5.2022
##JCAMPDX= 6.0         $$ Bruker NMR JCAMP-DX V2.0
##DATA TYPE= NMR SPECTRUM
##DATA CLASS= NTUPLES
##ORIGIN= UXNMR, Bruker Analytische Messtechnik GmbH
##OWNER= root
$$ XWIN-NMR		Version 3.5
$$ Wed May  4 10:50:18 2022 Russian Standard Time (UT+4h)  she@DPX200
##.OBSERVE FREQUENCY= 81.013821
##.OBSERVE NUCLEUS= ^31P
##.ACQUISITION MODE= SIMULTANEOUS
##.ACQUISITION SCHEME= undefined
##.AVERAGES= 124
##.DIGITISER RES= 16
##SPECTROMETER/DATA SYSTEM= spect
##.PULSE SEQUENCE= zgpg30
##.SOLVENT NAME= CDCl3
##.SHIFT REFERENCE= (INTERNAL, CDCl3, 0, 248.564)
##AUDIT TRAIL= $$ (NUMBER, WHEN, WHO, WHERE, WHAT)
$$ ##TITLE= Audit trail, XWIN-NMR		Version 3.5
$$ ##JCAMPDX= 5.01
$$ ##ORIGIN= Bruker BioSpin GmbH
$$ ##OWNER= she
$$ F:/spectra/data/she/nmr/P31/1/pdata/1/auditp.txt
$$ ##AUDIT TRAIL=  $$ (NUMBER, WHEN, WHO, WHERE, WHAT)
(   1,<2022-05-04 10:45:17.84 +0400>,<she>,<DPX200>,
      <continue with go, POWCHK disabled, PULCHK disabled
       configuration hash MD5:
       00 E9 B6 7A A2 85 ED C7 34 08 36 98 17 FE 4E 26
       data hash MD5: 32K
       83 10 A9 E6 10 41 7F 1F 67 26 BB 82 FD 0C DB 45>)
(   2,<2022-05-04 10:46:53.95 +0400>,<she>,<DPX200>,
      <Start of raw data processing
       efp BC_mod = 2 LB = 1 FT_mod = 6 PKNL = 1 PHC0 = -9466.903 PHC1 = -144.9246 SI = 64K 
       data hash MD5: 64K
       12 B0 5E C7 78 55 6E F3 D8 DA F5 66 39 F8 BB D8>)
(   3,<2022-05-04 10:48:03.87 +0400>,<she>,<DPX200>,
      <pk PHC0 = -2213.199 PHC1 = 4572.573 
       data hash MD5: 64K
       12 73 F4 A2 B5 5E 6A C8 6C DE D8 81 60 91 7F 25>)
(   4,<2022-05-04 10:48:13.76 +0400>,<she>,<DPX200>,
      <abs ABSG = 5 
       data hash MD5: 64K
       D7 FA EA E4 82 A9 2C 48 3A FB 26 05 4B F6 62 2F>)
$$ ##END=
$$ 
$$ hash MD5
$$ B0 03 D5 CA D5 2C B6 63 F0 3B 5D ED 02 1E 7E C9
##$RELAX= 
##$RELAX= 
##$RELAX= 
##$RELAX= 
##$RELAX= 
##$RELAX= 
##$RELAX= 
##$RELAX= 
$$ Bruker specific parameters
$$ --------------------------
##$DU= <F:/spectra>
##$EXPNO= 1
##$NAME= <P31>
##$PROCNO= 1
##$TYPE= <nmr>
##$USER= <she>
##$AMP= (0..31)
100 100 100 100 100 100 100 100 100 100 100 100 100 100 100 100 100 100 
100 100 100 100 100 100 100 100 100 100 100 100 100 100 
##$AQSEQ= 0
##$AQ_mod= 1
##$AUNM= <au_zg>
##$AUTOPOS= <>
##$BF1= 81.014009
##$BF2= 200.13
##$BF3= 200.13
##$BF4= 200.13
##$BF5= 200.13
##$BF6= 200.13
##$BF7= 200.13
##$BF8= 200.13
##$BYTORDA= 1
##$CFDGTYP= 0
##$CFRGTYP= 5
##$CHEMSTR= <none>
##$CNST= (0..31)
1 1 145 1 1 1 1 1 1 1 1 1 1 1 1 1 1 1 1 1 1 1 1 1 1 1 1 1 1 1 1 1 
##$CPDPRG= <waltz16>
##$CPDPRG1= <>
##$CPDPRG2= <waltz16>
##$CPDPRG3= <>
##$CPDPRG4= <mlev>
##$CPDPRG5= <mlev>
##$CPDPRG6= <mlev>
##$CPDPRG7= <mlev>
##$CPDPRG8= <mlev>
##$CPDPRGB= <>
##$CPDPRGT= <>
##$D= (0..31)
0 1 0 0 0 0 0 0 0 0 0 0.03 2e-05 3e-06 0 0 0 0 0 0 0 0 0 0 0 0 0 0 0 0 
0 0 
##$DATE= 1651646529
##$DBL= (0..7)
120 120 120 11 120 120 24 19 
##$DBP= (0..7)
150 150 150 150 150 150 150 150 
##$DBP07= 0
##$DBPNAM0= <>
##$DBPNAM1= <>
$$ [...]
##$SUBNAM3= <"">
##$SUBNAM4= <"">
##$SUBNAM5= <"">
##$SUBNAM6= <"">
##$SUBNAM7= <"">
##$SUBNAM8= <"">
##$SUBNAM9= <"">
##$SW= 501.771253377433
##$SWIBOX= (0..15)
0 1 3 0 0 0 0 0 0 0 0 0 0 0 0 0 
##$SW_h= 40650.406504065
##$TD= 32768
##$TD0= 1
##$TE= 0
##$TE2= 300
##$TE3= 300
##$TEG= 300
##$TL= (0..7)
0 120 53 12 22 120 120 120 
##$TP= (0..7)
150 150 150 150 150 150 150 150 
##$TP07= 0
##$TPNAME0= <>
##$TPNAME1= <>
##$TPNAME2= <>
##$TPNAME3= <>
##$TPNAME4= <>
##$TPNAME5= <>
##$TPNAME6= <>
##$TPNAME7= <>
##$TPOAL= (0..7)
0.5 0.5 0.5 0.5 0.5 0.5 0.5 0.5 
##$TPOFFS= (0..7)
0 0 0 0 0 0 0 0 
##$TUNHIN= 0
##$TUNHOUT= 0
##$TUNXOUT= 0
##$USERA1= <user>
##$USERA2= <user>
##$USERA3= <user>
##$USERA4= <user>
##$USERA5= <user>
##$V9= 5
##$VALIST= <valist>
##$VCLIST= <CCCCCCCCCCCCCCC>
##$VD= 0
##$VDLIST= <DDDDDDDDDDDDDDD>
##$VPLIST= <PPPPPPPPPPPPPPP>
##$VTLIST= <TTTTTTTTTTTTTTT>
##$WBST= 1024
##$WBSW= 4
##$XGAIN= (0..3)
0 0 0 0 
##$XL= 0
##$YL= 0
##$YMAX_a= 2461
##$YMIN_a= -12442
##$ZGOPTNS= <>
##$ZL1= 120
##$ZL2= 120
##$ZL3= 120
##$ZL4= 120
##$ABSF1= 248.5645
##$ABSF2= -253.2056
##$ABSG= 5
##$ABSL= 3
##$ALPHA= 0
##$AQORDER= 0
##$ASSFAC= 0
##$ASSFACI= 0
##$ASSFACX= 0
##$ASSWID= 0
##$AUNMP= <proc_1d>
##$AZFE= 0.1
##$AZFW= 0.5
##$BCFW= 0
##$BC_mod= 2
##$BYTORDP= 0
##$COROFFS= 0
##$CY= -3
##$DATMOD= 1
##$DC= 0
##$DFILT= <>
##$DTYPP= 0
##$F1P= 0
##$F2P= 0
##$FCOR= 1
##$FTSIZE= 65536
##$FT_mod= 6
##$GAMMA= 0
##$GB= 0
##$INTBC= 1
##$INTSCL= 5.30512e-09
##$ISEN= 30
##$LB= 1
##$LEV0= 0
##$LPBIN= 0
##$MAXI= 10000
##$MC2= 0
##$MEAN= 0
##$ME_mod= 0
##$MI= 50
##$NCOEF= 0
##$NC_proc= -8
##$NLEV= 6
##$NOISF1= 182.463
##$NOISF2= 159.3651
##$NSP= 0
##$NTH_PI= 0
##$NZP= 0
##$OFFSET= 248.5645
##$PC= 4
##$PHC0= -11680.1
##$PHC1= 4427.648
##$PH_mod= 1
##$PKNL= yes
##$PPARMOD= 0
##$PSCAL= 0
##$PSIGN= 0
##$REVERSE= no
##$SF= 81.014009
##$SI= 65536
##$SIGF1= 159.3651
##$SIGF2= -187.1042
##$SINO= 113.3802
##$SIOLD= 16384
##$SREGLST= <1H.CDCl3>
##$SSB= 0
##$STSI= 65536
##$STSR= 0
##$SW_p= 40650.406504065
##$SYMM= 0
##$S_DEV= 0
##$TDeff= 32768
##$TDoff= 0
##$TI= <>
##$TILT= no
##$TM1= 0
##$TM2= 0
##$TOPLEV= 0
##$USERP1= <user>
##$USERP2= <user>
##$USERP3= <user>
##$USERP4= <user>
##$USERP5= <user>
##$WDW= 1
##$XDIM= 65536
##$YMAX_p= 331864598
##$YMIN_p= -81520327
$$ End of Bruker specific parameters
$$ ---------------------------------
##NTUPLES= NMR SPECTRUM
##VAR_NAME=  FREQUENCY,     SPECTRUM/REAL,   SPECTRUM/IMAG
##SYMBOL=    X,             R,               I
##VAR_TYPE=  INDEPENDENT,   DEPENDENT,       DEPENDENT
##VAR_FORM=  AFFN,          ASDF,            ASDF
##VAR_DIM=   65536,         65536,           65536
##UNITS=     HZ,            ARBITRARY UNITS, ARBITRARY UNITS
##FACTOR=    0.620285442955139, 1,           1
##FIRST=     20137.2065510759, 0,            0
##LAST=      -20513.1999529892, 0,           0
##MIN=       -20513.1999529892, -81520327,   0
##MAX=       20137.2065510759, 331864598,    0
$$ Real data points
##PAGE= N=1
##DATA TABLE= (X++(R..R)), XYDATA
$$ [...]
##PAGE= N=2
##DATA TABLE= (X++(I..I)), XYDATA
12920b0399083j757748M364293N493222J102610k947525j742156L327192P002644
12912e556551N938751J101540l838447n088850j191301M969682P266093K078061
12904E678978o334993q703452j168047Q885992J0871490M251509j113470Q76389
12896A3244396M205582J125163m889403m720045J211483L617433j75866k528428
12888A1090315K80615J365114l837336q198741m249906L284704M942210J98409
12880D875384m513626n787436l627491J981165P227312M495010n127983q038439
12872h516104K218159J0988563K975821j1802064j1327176M191984J2732666M629496
12864F091345n412116m362800J734451L914300N151719Q657602P139436l946655
$$ plain form
12920 -20399083 -22156831 -17792538 -12299316 -11196706 -14144231 -15886387 -12559195 -5556551
12912 -5556551 382200 1483740 -2354707 -7443557 -8634858 -3665176 3600917 5678978
12904 5678978 -656015 -9359467 -10527514 -1641522 9229968 13481477 12368007 13244396
12896 13244396 17449978 18575141 13685738 8965693 10177176 13794609 13618743 11090315
12888 11090315 11370930 12736044 8898708 699967 -3549939 -265235 4676975 4875384
12880 4875384 361758 -5425678 -9053169 -7072004 155308 4650318 -477665 -8516104
12872 -8516104 -6297945 4690618 7666439 -4135625 -15462801 -11270817 1461849 6091345
12864 6091345 679229 -3683571 -1949120 1965180 7116899 15774501 22913937 18967282
12856A8967282j4630854j4063834o313847j522448l387L727503Q304460P971930
12848B436805K810218k516331n980796p292590n083781j095619p30337l461056
12840b0913487o27339J0117783J7046718J0340209k255434o602510k304877K16573
12832E017636k199781k997095O85386L875272L030349L2104l226054o255161o249204
12823h286548o51016O416182P387482J633288l460621k642805J163947K129111
12815C689020j164289n008415m976250l66849N117573P608872P229891N893630
12807A8023183K886032k652633o677250m709103m39467j257663n455282m477113
12799d759296J131011R24772o677344q900531J081689J1727243J0591711K338486
$$ plain form
12856 18967282 4336428 -9727406 -16041253 -17563701 -17567088 -13839585 -5535125 2436805
12848 2436805 5247023 2730692 -3250104 -10542694 -15626475 -16722094 -17452431 -20913487
12840 -20913487 -21540826 -11423043 5623675 15963884 13708450 7105940 4801063 5017636
12832 5017636 2817855 -179240 506146 4381418 7411767 7443871 4217817 -2037344 -8286548
12823 -8286548 -8937564 -2521382 4866100 6499388 3038767 395962 1559909 3689020
12815 3689020 2524731 -2483684 -7459934 -7826783 -2709210 4899662 12129553 18023183
12807 18023183 20909215 18256582 11579332 6870229 6430762 5173099 -282183 -4759296
12799 -4759296 -3628285 -2703513 -9380857 -18281388 -17199699 -5472456 5119255 7457741
12791G457741j659200j074764j971984l668268k738467k144038m361630l579908
12783a3740518L027465N451891l525500j2069746n630524Q054903R717111l81151
12775i096069l174481P845604J6564975R545221n802791j4219170j0505379N15320
12767h326770J0687517J1472675N60513j1778561j2562485l254129L183067J746609
12759h271564o93854p37440k777158n893838k079341P786710J1264640M197710
12751B795865j108608M030762R791649M011123p520591r780475r74920O146317
12743G391122K953813n107926p619677j923013M753477L887557l907172q441831
12735h013650k686980O730437P724430n72321p369466n798771P2964M405725O333654
$$ plain form
12791 7457741 5798541 4723777 2751793 -916475 -3654942 -5798980 -10160610 -13740518
12783 -13740518 -10713053 -5261162 -8786662 -20856408 -26486932 -18432029 -8714918 -9096069
12775 -9096069 -12270550 -4424946 12140029 21685250 15882459 1663289 -8842090 -8326770
12767 -8326770 2360747 13833422 14393935 2615374 -9947111 -13201240 -10018173 -8271564
12759 -8271564 -8965418 -9702858 -12480016 -18373854 -20453195 -12666485 -1401845 2795865
12751 2795865 1687257 5718019 15509668 19520791 12000200 2219725 1244805 7391122
12743 7391122 10344935 5237009 -2382668 -4305681 447796 4335353 428181 -8013650
12735 -8013650 -10700630 -3970193 3754237 3181916 -4187550 -9986321 -9913357 -5507632 826022
12726H26022N742581J578996k858604j495102M782408P978896M831966L28598
12718B1715761k473219o253357j0182287p740953J103643N654729p69018j0096195
12710i040896j0731838k958774L986312N278888M185258M997474P179819O043794
12702H940037j476876j0496318j0803703k07563R759564R153526M521350O804903
12694A6194920J0530573K156674j3652377j6772102k952449Q661603N628841q85137
12686H910546Q49229L157745l839784j1912352q356250K407820P132039M078895
12678B427888L16449k584946n943728n098932K878586R647087O746062o53880
12670G734586l107785j829242j941440k77215N936047P892869r21406q557953
$$ plain form
12726 826022 6568603 8147599 5288995 3793893 8576301 16555197 21387163 21715761
12718 21715761 19242542 12989185 2806898 -4934055 -3830412 1824317 1055299 -9040896
12710 -9040896 -19772734 -22731508 -18745196 -13466308 -9281050 -4283576 2896243 8940037
12702 8940037 7463161 -3033157 -13836860 -14044423 -4284859 4868667 9390017 16194920
12694 16194920 26725493 28882167 15229790 -1542312 -4494761 4166842 9795683 8910546
12686 8910546 9759775 12917520 9077736 -2834616 -11190866 -8783046 -1651007 2427888
12678 2427888 2744337 159391 -5784337 -10883269 -8004683 1642404 8388466 7734586
12670 7734586 4626801 2797559 856119 578904 6514951 14407820 13486414 4928461
12662D928461q78776J3025828J2040764m461395j5988697j1433538k52193P139761
12654D120215J0397494Q449854k736976j6446297j7026088k631395R004845N281392
12646a586956m353889m868588K756763O556526K031305m204201m898270O65989
12638g901321P427333Q730794K434272n570883p205642j706754M549917O571148
12630G328864M379562O9821l347244k601690Q80985N62424m708006n983003J663278
12621a755009P934313K096562q192970p773663J970614P093558M943198M546375
12613A0862978N223507l049143j6046050j5270063J867246J3658810N901549p585756
12605d436922q445754q7535L766026J840126J161070J935073J391949K903203
$$ plain form
12662 4928461 4049685 17075513 29116277 24654882 8666185 -2767353 -3019546 4120215
12654 4120215 14517709 22967563 20230587 3784290 -13241798 -15873193 -6868348 -1586956
12646 -1586956 -5940845 -10809433 -8052670 -1496144 535161 -3669040 -8567310 -7901321
12638 -7901321 -473988 8256806 10691078 5120195 -2085447 -3792201 757716 7328864
12630 7328864 11708426 11778247 8431003 5829313 6710298 7272722 2564716 -3418287 -1755009
12621 -1755009 6179304 8275866 82896 -7690767 -5720153 1373405 6316603 10862978
12613 10862978 16086485 13037342 -3008708 -18278771 -16411525 -2752715 3148834 -4436922
12605 -4436922 -12882676 -12970211 -9204185 -7364059 -6202989 -4267916 -2875967 27236
12597B7236P677981P049535l262830j0881538l824995Q576520Q145545m796224
12589H711230j3072312q149871J687285P216957Q008171O031305J767430k212459
12581I987736l173104l426754n609776n508038J018068P376997L953669n548056
12573i29258p720247O27389P963355N092619l770860r479800q497860k391639
12565a9106301N338458R429760O597921R16526o19898J495759K49024n770606
12557a469357q990265m032649M398979Q045013M626105j803886o133240n611388
12549a0970688r18827M415859O933490N591590J011197m724273o578803k34160
12541e474615R685509J1368152Q43130j1048675j2826352o740616j711506L69317
$$ plain form
12597 27236 7705217 14754752 11491922 610384 -3214611 5361909 13507454 8711230
12589 8711230 -4361082 -12510953 -10823668 -3606711 4401460 10432765 12200195 9987736
12581 9987736 6814632 3387878 -2221898 -7729936 -6711868 665129 4618798 -929258
12573 -929258 -8649505 -8022116 -58761 5033858 1262998 -8216802 -16714662 -19106301
12565 -19106301 -13767843 -4338083 2259838 3176364 2556466 4052225 4301249 -1469357
12557 -1469357 -10459622 -14492271 -10093292 -2048279 2577826 773940 -5359300 -10970688
12549 -10970688 -11889515 -7473656 -540166 5051424 6062621 1338348 -5240455 -5474615
12541 -5474615 4210894 15579046 16422176 5373501 -7452851 -14193467 -15904973 -15535656
12533a5535656J733536p4978o080649p779888J089260J0726485Q574502O73234
12525f674154J613328P935805L627258r202981j0384129L553469J0778360j260
12517A245696j0234756l002609R013745O727078l238687l004533M246359K118034
12509C870327p608535p776616L192735Q277375J160429m317719R47080O951152
12501D696228L067504n173597p070738k556020J675530K930438K271022N81623
12493D21990J03878L425213P453955N458327k178451p115359n562212k949492
12485i42151l090404k222552J746967L510172k57309m010450k124207K476967
12477d912967M357966L607909K345160r4844l064398k618680R44908R88226m279581
$$ plain form
12533 -15535656 -13802120 -13877098 -19957747 -27737635 -26648375 -15921890 -7347388 -6674154
12525 -6674154 -5060826 2874979 6502237 -2700744 -13084873 -9531404 1246956 1245696
12517 1245696 -8989060 -11991669 -2977924 3749154 510467 -2494066 1752293 3870327
12509 3870327 -3738208 -11514824 -8322089 -44714 1115715 -3202004 -2254924 4696228
12501 4696228 7763732 2590135 -4480603 -7036623 -5361093 -2430655 -159633 421990
12493 421990 525868 3951081 11405036 16863363 14684912 7569553 2007341 -942151
12485 -942151 -4032555 -6255107 -4508140 -997968 -1255277 -5265727 -7389934 -4912967
12477 -4912967 -555001 3052908 5398068 5303224 2238826 -379854 565054 1553280 -2726301
12468b726301o760252j421557M493277L563749N71002K507237M779664P3153o034592
12459i54620k987470N782673P339854M94229l284752j15449J299755k679529l960205
12450I34486J133922L802221j650007o999322l746000L306110N538991M057806
12442F378207L800837K705132k341239n979715k503408K300429l36718o369617
12434b346092m852315L111129N457477q60529n128221r41569M079040K078190
12426E97110k667212k329027K178880N079487N229402M446668J970962k217603
12418A2288667l465784R01917N354600L858840o11949k319005l792873j0213482
12410B000931j6037373j0076201N777449J5872494J2137977L966731J519935J236389
$$ plain form
12468 -2726301 -9486553 -10908110 -6414833 -2851084 -2280082 227155 5006819 5079972 -954620
12459 -954620 -3942090 1840583 9180437 9674666 6389914 6274465 7574220 4894691 934486
12450 934486 2068408 5870629 4220622 -2778700 -6524700 -3218590 2320401 6378207
12442 6378207 10179044 12884176 10542937 4563222 2059814 4360243 4023525 -2346092
12434 -2346092 -7198407 -4087278 1370199 509670 -4618551 -5560120 -1481080 597110
12426 597110 -2070102 -4399129 -2220249 2859238 8088640 12535308 14506270 12288667
12418 12288667 8822883 9724800 15079400 18938240 18326291 16007286 12214413 2000931
12410 2000931 -14036442 -24112643 -18335194 -2462700 9675277 13642008 15161943 16398332
12402A6398332l587582q505770n886562K85293M79516l945302l468029K591654
12394e638450N018740Q35471k311350j10064K042564L66195p17099J694653K845581
12385D026241k11537k306029K47428K486721K61317j615097J407744M198233O14208
12376I109229n497538p232963n949874o062261n209392k27817L576930R64698
12368a6528988j680924L283114Q727443K977479q147013p885955L911606R420450
12360e922788J672009n005893L1927O902192L664665m129728n108184j030960
12352h926760n53652l105173k221355J457199K636808K054998L880186O256197
12344A478448M222802r99901m107731m028437k821034j03066M229374O003288
$$ plain form
12402 16398332 12810750 4304980 -1581582 -1296289 -816773 -4762075 -8230104 -5638450
12394 -5638450 -619710 215761 -2095589 -2205653 -163089 203106 -513993 1180660 4026241
12385 4026241 3814704 1508675 1756103 4242824 4504141 2889044 4296788 8495021 9109229
12376 9109229 3611691 -3621272 -9571146 -15633407 -20842799 -21070616 -17493686 -16528988
12368 -16528988 -18209912 -14926798 -6199355 -3221876 -11368889 -19254844 -15343238 -5922788
12360 -5922788 -4250779 -9256672 -9224745 -2322553 1342112 -2787616 -7895800 -8926760
12352 -8926760 -9480412 -12585585 -14806940 -13349741 -10712933 -8657935 -4777749 1478448
12344 1478448 5701250 4701349 593618 -3434819 -6255853 -6358919 -2129545 3873743
12336C873743K796404n94526R166L62857l765331o312461K86235J0485208J1718808
12327A8860103K967967m446708m133926j318417j044469n58508K797246M643309
12319A7766597j77196r202400j4481057j0952134q44629Q578819J0973677N853126
12311G514803k193379q595117j0970796p580898J019313Q694825Q956861M617919
12303A463531M263926P618406M900731n658339j1985548o732987N28788q18609
12295f420101n823250m783373l58665n51101l048477m21089N765127Q922466Q932214
12286B213751P900018K878566m865084m237760P120455J1323913l611520j8886089
12278a63750j0377613J1495824J5958611m53893j1731819o215203J14528k510461
$$ plain form
12336 3873743 6670147 6075621 6084787 6447644 2682313 -3630148 -3343913 7141295 18860103
12327 18860103 21828070 17381362 13247436 11929019 10884550 10326042 13123288 17766597
12319 17766597 17589401 8387001 -6094056 -17046190 -17890819 -9312000 1661677 7514803
12311 7514803 5321424 -3273693 -14244489 -21825387 -20806074 -12111249 -3154388 1463531
12303 1463531 5727457 13345863 18246594 12588255 602707 -6130280 -5601492 -6420101
12295 -6420101 -12243351 -17026724 -17385389 -17936490 -20984967 -21406056 -15640929 -6718463 2213751
12286 2213751 10113769 12992335 8127251 3889491 11009946 22333859 18722339 -163750
12278 -163750 -10541363 954461 16913072 16459179 4727360 -1487843 -1373315 -3883776
12270c883776l025926L209650L319726n698966p294616L750185Q491365k756997
12262c889355j1057109j129477J1994828R301205j495383l489995R45845J522895
12254B703454J781649P059859P825012k280587q721275j49586P221312m030734
12246A1409104j8556434j1355635Q717956J2553801j024492o338379L511262Q089484
12238G006667j127843p235094j018020L141101m408173j0606138l266673Q529354
12230h984819J0776303M584958j283298l881375l259938J166448N025359J928773
12222F072411m356453m115891M55144j839037q873079n780924P908696J3321642
12214B792509K154631r661076q534236k963286l910426m906804K338178R138899
$$ plain form
12270 -3883776 -6909702 -3700052 -380326 -6079292 -13373908 -9623723 -1132358 -3889355
12262 -3889355 -14946464 -16075941 -4081113 5220092 3724709 234714 1180559 2703454
12254 2703454 4485103 11544962 19369974 17089387 8368112 8218526 15439838 11409104
12246 11409104 -7147330 -18502965 -9785009 2768792 1744300 -4594079 -1082817 7006667
12238 7006667 5878824 -1356270 -2374290 766811 -3641362 -14247500 -17514173 -8984819
12230 -8984819 1791484 6376442 5093144 1211769 -2048169 -881721 4143638 6072411
12222 6072411 1715958 -2399933 -1944789 -3783826 -12656905 -18437829 -10529133 2792509
12214 2792509 4947140 -4713936 -13248172 -16211458 -20121884 -25028688 -22690510 -13551611
12206a3551611M446314m722488n136029O57963J280897k742029j798946N012263
12198a6553666R887286R990713Q408902N446184K71204k917770p11411J892696
12190A5714138r46497n836995o666480n262723o087959o408537j792952M105573
12182a3182432M970441J795714j123122l687350n097892N4483J0734933J3874649
12174H339424K159164j1544973j1386368j476027L756995L311953N255473O135329
12166D550970l203237j4923074j1082394O001496J3832712M571589l388376K994992
12158f45322J0421238L115624j0762802j3324283m606757J177259j129748m023106
12150a9777897k173587K743861Q900786J4253400J2398885j08850j3759329j4272270
$$ plain form
12206 -13551611 -9105297 -13827785 -18963814 -18305851 -17024954 -19766983 -21565929 -16553666
12198 -16553666 -6666380 3324333 11733235 17179419 17450623 14532853 13821442 15714138
12190 15714138 14767641 8930646 2264166 -2998557 -9086516 -15495053 -17288005 -13182432
12182 -13182432 -8211991 -6416277 -7539399 -11226749 -16324641 -16270158 -5535225 8339424
12174 8339424 10498588 -1046385 -12432753 -13908780 -10151785 -6839832 -1584359 4550970
12166 4550970 1347733 -13575341 -24657735 -18656239 -4823527 -251938 -3640314 -645322
12158 -645322 9775916 12891540 2128738 -11195545 -15802302 -14625043 -15754791 -19777897
12150 -19777897 -21951484 -19207623 -10306837 3946563 16345448 16236598 2477269 -11795001
12142a1795001j242983J0487808R371224m93620p229407n060901K164396P054470
12134C255986N764507P28175k806093k964370k103494j472579L77952K189871
12126B969955o71761p257919q139450J455184J1263722Q128968m963591j2468286
12118i683178p652837O03989L460277L296188M847892M875935j701410j0873271
12110a2826415j2509177k918007J0382155J6331279J0777732m4715o032812m113111
12102i53071p85539j491815k082071K561856O322321J914j0237557p974113O970722
12093g667353J3896784J492841j3197757r479397O503397J2969422M731677m704253
12085D545361p401329p534677o307760l06540N031853J10923q855975n072341
$$ plain form
12142 -11795001 -13037984 -2550176 6821048 6327428 -901979 -5962880 -3798484 3255986
12134 3255986 9020493 9748668 6942575 3978205 1874711 402132 780084 2969955
12126 2969955 2298194 -4959725 -13099175 -11643991 -380269 7748699 2785108 -9683178
12118 -9683178 -17336015 -16732026 -13271749 -9975561 -5127669 -251734 -1953144 -12826415
12110 -12826415 -25335592 -28253599 -17871444 -1540165 9237567 9192852 3160040 -953071
12102 -953071 -1738610 -3230425 -5312496 -2750640 3571681 3573595 -6663962 -14638075 -7667353
12093 -7667353 6229431 7722272 -5475485 -14954882 -8451485 4517937 9249614 4545361
12085 4545361 -2855968 -10390645 -16698405 -17004945 -11973092 -11862169 -20718144 -25790485
12077b5790485R677094J3069104k548657j5200550o641871R405538R899177k752330
12069a0882980q784170k666709M148108N243594M542825L348034o04576l408801
12061i064675M62725O097615M586297j491679l004508r45207k943039o513233
12053a2815704k493911O688771R371484M601745K351594L695301q63086j1414473
12045h78279j5681139r723246l438688r99544N191773J4940500J4754078J366531
12037E531986q415376l543635L455413r55762p539673j057528J2330361J4690779
12029A4496565M937714k324445k064149l510382j0183970j2811408n478093M523079
12021a2415089P556184L108976l190888o990643o745378l000902J582028M339968
$$ plain form
12077 -25790485 -16113391 -3044287 -5592944 -20793494 -27435365 -18029827 -8130650 -10882980
12069 -10882980 -19667150 -22333859 -18185751 -12942157 -8399332 -5051298 -5655874 -9064675
12061 -9064675 -8601950 -2504335 2081962 590283 -2414225 -3359432 -6302471 -12815704
12053 -12815704 -15309615 -8620844 750640 5352385 7703979 11399280 10536194 -878279
12045 -878279 -16559418 -26282664 -29721352 -30720896 -25529123 -10588623 4165455 5531986
12037 5531986 -2883390 -6427025 -2971612 -3927374 -11467047 -12524575 -194214 14496565
12029 14496565 19434279 17109834 15045685 11535303 1351333 -11460075 -16938168 -12415089
12021 -12415089 -4858905 -1749929 -4940817 -11931460 -18676838 -21677740 -20095712 -15755744
12013a5755744N034674M402292K220007j020296l354279m331492n167744m550618
12005b2523200L12387O882307Q691409N892912N571416Q032682L782096r349284
11997G292725j7796262j1227118K99011J177915n517860l858517Q880293J7675202
11989c074611J1960315q37018p550829n492404j708388j734437l711900k660183
11981a4809455J328566J835255l719553o305826L209855J6357518J4784798j590293
11973A1090865j0815307j166242J0381232N342128p163860p445492J694584K109041
11965D026949p105553q927744J445779R268587N743742J74161J400024M756040
11957A0781985L982158J402643j79141l323037q111805r273105n472358j702633
$$ plain form
12013 -15755744 -10721070 -6318778 -4098771 -5119067 -8473346 -12804838 -17972582 -22523200
12005 -22523200 -22210813 -15328506 -6637097 -744185 4827231 12859913 16642009 7292725
11997 7292725 -10503537 -21730655 -21431644 -20253729 -25771589 -29630106 -20749813 -3074611
11989 -3074611 8885704 8048686 497857 -4994547 -6702935 -8437372 -12149272 -14809455
11981 -14809455 -13480889 -11645634 -15365187 -21671013 -18461158 -2103640 12681158 11090865
11973 11090865 275558 -890684 9490548 14832676 7668816 223324 1917908 4026949
11965 4026949 -3078604 -12006348 -10560569 -1291982 4451760 4625921 6025945 10781985
11957 10781985 14764143 16166786 15987645 12664608 4552803 -4720302 -10192660 -11895293
11949a1895293J37931L033288O085003M947316J435193Q04606J07740o671151
11941b015367j2772131n371919J0551567J4574007J652599r287574n078487L164542
11933d582763J799815l798908k941223J523437K870186M473532Q567838M942638
11925A2854552j1362250k3205057j2520744J0055398J7768142N142963p820629
11918i087625o972472Q11664N464080P697850R518876O396797k947499r831832
11910A049839o650377K351046P256823M311882k437690o847198n215916Q37508
11902e344083M340182k34997r318545j3598045r230218r94135N592524R409542
11894a9377775J0162450O148737j386609o425974m483466J752968N759545M416559
$$ plain form
11949 -11895293 -11757362 -8724074 -2639071 2308245 3743438 4548044 4655784 -2015367
11941 -2015367 -14787498 -20159417 -9607850 4966157 6618756 -2668818 -7747305 -4582763
11933 -4582763 -2782948 -6581856 -9523079 -7999642 -5129456 -655924 7911914 12854552
11925 12854552 1492302 -21712755 -34233499 -24178101 -6409959 -1266996 -9087625
11918 -9087625 -16060097 -15248433 -9784353 -2086503 7432373 13829170 10881671 1049839
11910 1049839 -5600538 -3249492 4007331 8319213 5881523 -965675 -6181591 -5344083
11902 -5344083 -1003901 -1238898 -10557443 -24155488 -33385706 -34379841 -28787317 -19377775
11894 -19377775 -9215325 -3066588 -4453197 -10879171 -15362637 -13609669 -7850124 -3433565
11886c433565l7745l797797n118409m335046j803680K619569P365103Q240042
11878c01528K840944m508087o308327j371355L460440K759183j027488l260721
11870g716939m089187n217412m130537K312211J0858605J4401415J0695786L765659
11862B0879601k435167o948680r022556p524370l801392r38782P61071L827418
11854e202857P971074Q274696J898667n822035o138139J804576Q113796L773558
11846A4673336o903642j0786362l532213M026757J464122n706292m448948N677108
11838e536134J1757087O891923r38538k834861j549553l865532q490431r397903
11830a3963942n986122k309445L39311L185671M928420L543307J435367K418745
$$ plain form
11886 -3433565 -3471310 -7269107 -12387516 -16722562 -18526242 -15906673 -8541570 -301528
11878 -301528 2539416 -1968671 -8276998 -9648353 -6187913 -3428730 -4456218 -7716939
11870 -7716939 -11806126 -17023538 -21154075 -18841864 -7983259 6418156 17113942 20879601
11862 20879601 18444434 11495754 2473198 -5051172 -8852564 -9791346 -9030275 -5202857
11854 -5202857 2768217 11042913 12941580 7119545 981406 2785982 10899778 14673336
11846 14673336 7769694 -3016668 -6548881 -2522124 -1058002 -6764294 -11213242 -5536134
11838 -5536134 6220953 13112876 12174338 9339477 7789924 3924392 -4566039 -13963942
11830 -13963942 -19950064 -22259509 -21920198 -18734527 -13806107 -10262800 -8827433 -6408688
11822f408688M262037O65880q074431j2013225l241722J1729321J6753718N584524
11814I257414p761622n099311J0710175J7443137M556204j0267793o957139O010181
11806A7891246M997633j0857669j8323484p372699M653792L498380r99700K569243
11798c943258N151306l796406j2862130o534400O213645N556784n154728m898394
11790b0267581Q594050J4454085L654732o611762k071375O656463M198083m238272
11782D368423l772006M574798O211129l205883j1316083p571729L000437Q702641
11774I91727O471198K326143J50249k663714p316403q226723j124345P677217
11766a714651P972925m771o592253p376080o543712n074765J552617J0661440
$$ plain form
11822 -6408688 -2146651 -1480771 -9555202 -21568427 -24810149 -13080828 3672890 9257414
11814 9257414 1495792 -3603519 7106656 24549793 29105997 18838204 11881065 17891246
11806 17891246 22888879 12031210 -6292274 -13664973 -9011181 -5512801 -6512501 -3943258
11798 -3943258 1208048 -2588358 -15450488 -21984888 -15771243 -10214459 -15369187 -20267581
11790 -20267581 -11673531 2780554 6435286 -176476 -2247851 4408612 8606695 4368423
11782 4368423 596417 5171215 11382344 8176461 -3139622 -10711351 -7710914 991727
11774 991727 7462925 9789068 9939317 7275603 -40800 -8267523 -9391868 -1714651
11766 -1714651 6258274 6253503 -338750 -7714830 -14258542 -19333307 -17780690 -7119250
11758g119250J1681576M058846O01249M836996K634150j1096539j6664936j01792
11750a1169700J7951884R951103j4282483k1174865m707943Q463435M716240N36884
11742i715445P368486J1679817L067661n895329m038986j254147o260150p754084
11734a2802177K217901P731975m328293j5963659m431046J7300315J7818622k828606
11726D715032j3499770j865260Q589606o68164j4353864j0633516M424972R205240
11718a4085724L47517n509707J338131J1676104J2743246L743003o715176j1022776
11710g485382p408025O59397O820988O383337J135621j906836J184774N372785
11702D756659K352107p518086j3137190n789524Q588961J5385378Q599023l248130
$$ plain form
11758 -7119250 4562326 8621172 9222421 14059417 16693567 5597028 -11067908 -11169700
11750 -11169700 6782184 16733287 2450804 -18724061 -23432004 -14968569 -10252329 -9715445
11742 -9715445 -2346959 9332858 12400519 6505190 2466204 1212057 -5048093 -12802177
11734 -12802177 -10584276 -2852301 -7180594 -23144253 -27575299 -10274984 7543638 4715032
11726 4715032 -8784738 -10649998 -2060392 -2728556 -17082420 -27715936 -23290964 -14085724
11718 -14085724 -13738207 -19247914 -17909783 -6233679 6509567 10252570 3537394 -7485382
11710 -7485382 -14893407 -14234010 -7413022 -1029685 105936 -1800900 -616126 4756659
11702 4756659 7108766 -409320 -13546510 -19336034 -10747073 4638305 13237328 9989198
11694I989198q680162n125728J965949O151412L894175l392630q670355n463961
11686i332102L008281O241548M49595o028985m809194J590808N589165M905531
11678A614647J161269n751195j4254043j6699918p267352P667922J4904636R790396
11670h833638J14314m818834l196594J254606M889432O370119O233879N309307
11662G322591L134844o00674l088629q24117L917096M237875j415634o258660
11654F424692n489939l269719m709178p204683n679444q73030L722821P624177
11646i454303R794415N766012m049293r689611m414048L813304L726262k210555
11638f717817l963663j777070l544227p446668l334614Q009774J2819817N255697
$$ plain form
11694 9989198 1309036 -3816692 -1850743 4300669 8194844 4802214 -3868141 -9332102
11686 -9332102 -6323821 -82273 367322 -5661663 -10470857 -8880049 -3290884 1614647
11678 1614647 2775916 -2975279 -17229322 -33929240 -41196592 -33528670 -18624034 -8833638
11670 -8833638 -8719324 -13538158 -16734752 -15480146 -10590714 -4220595 2013284 7322591
11662 7322591 10457435 9856761 6768132 5944015 9861111 14098986 12683352 6424692
11654 6424692 934753 -2334966 -7044144 -14248827 -19928271 -20801301 -17078480 -9454303
11646 -9454303 340112 6106124 2056831 -7632780 -12046828 -8233524 -4507262 -6717817
11638 -6717817 -10681480 -12458550 -16002777 -23449445 -26784059 -18774285 -5954468 -698771
11630f98771l752367m035086j814l4435k796238k201329J880125N315408O224278
11621a00229M311123n54992m966353l812073Q35359N12129n884466q392006j832376
11612a9883884M501515J488282m286339n41176J1178712J7583631J2184353J280189
11604B3505283p058665j0529793r532496n025288l21576J175640L84223J53195
11596g249477O1315j401274k073490L70447K853217J704912K41151L436895P439918
11587E383614M119066m721008q188486k562739L603892L310465l6175j676431
11579g67802l470961o654153n532562L259351J1700892R631833r30630r054478
11571a818510r576477o416269l279593L39898L933448M668018K953113L071347
$$ plain form
11630 -698771 -4451138 -8486224 -8488038 -8522473 -11318711 -13520040 -11639915 -6324507 -100229
11621 -100229 4210894 3655902 -1310451 -5122524 -4287165 -3775036 -9659502 -18051508 -19883884
11612 -19883884 -15382369 -13894087 -18180426 -18721602 -7542890 10040741 22225094 23505283
11604 23505283 16446618 5916825 -3615671 -8640959 -8962535 -7786895 -7402672 -7249477
11596 -7249477 -7188162 -8589436 -10662926 -10292479 -7439262 -5734350 -5493199 -2056304 5383614
11587 5383614 9502680 4781672 -3406814 -5969553 -2365661 944804 908629 -767802
11579 -767802 -4238763 -10892916 -16425478 -13166127 -1465235 8166598 7235968 -1818510
11571 -1818510 -11394987 -17811256 -21090849 -20750951 -16817503 -12149485 -9196372 -6125025
11563f125025O174994P739239M248680j705048n265745n045759l056147j414410
11555d449221o94573J82579K955850P239271R347726O407847N51306m257405p865450
11546I417930j1629149j2299731n475546M697859P755469J556166l547817J70044
11538i354775O401106N299951j411661m730647l092240k668487m936561m184792
11530a8678106J800589P405047P805951M854711K025834j14746q31839K269815
11522F537256Q136271J0513801N124402m470023j0721121r398734k281465M185422
11514G625809L162562n054735j0571664n400506L495921K155415q481432j1112771
11506b4181401K108843J5384018J1447805k990775q577790k584700Q98296k712239
$$ plain form
11563 -6125025 49969 7789208 12037888 10332840 5067095 21336 -3034811 -4449221
11555 -4449221 -5143794 -4961215 -2005365 5233906 14581632 20989479 21540785 17283380 9417930
11546 9417930 -2211219 -14510950 -19986496 -15288637 -7533168 -5977002 -9524819 -9354775
11538 -9354775 -2953669 2346282 934621 -3796026 -6888266 -9556753 -14493314 -18678106
11530 -18678106 -16877517 -9472470 -1666519 3188192 5214026 5099280 4267441 6537256
11522 6537256 14673527 25187328 30311730 25841707 15120586 5721852 3440387 7625809
11514 7625809 10788371 5733636 -4838028 -10238534 -6742613 -4587198 -13068630 -24181401
11506 -24181401 -22072558 -6688540 4759265 1768490 -6809300 -9394000 -8495704 -11207943
11498a1207943j810633P858787J1870838n9614j4452090j2224708K345019P913077
11490i767267j523694q357089K18010J1298208N375098j3057497j9594574l688067
11482c9096872J6425157J8432780M176021p237221p057044l556143l186877j033640
11474b2133839N361087P083250j370956r220495m037244P939712J0313908J301035
11466d763542n191331k374923J248278p68983k466639J326432M664575J924186
11458f401947j209525K055549O940007M766842l084017q317077p390441j807984
11450a4448593O830003J3362750Q377104p952731j8774186j0709067N270354Q500081
11442i544285j279482o782266k802019j272317n531111k964885R752826J6541403
$$ plain form
11498 -11207943 -13018576 -5159789 6711049 6651435 -7800655 -20025363 -17680344 -9767267
11490 -9767267 -11290961 -19648050 -19430040 -8131832 -2756734 -15814231 -35408805 -39096872
11482 -39096872 -22671715 -4238935 -62914 -7300135 -14357179 -17913322 -21100199 -22133839
11474 -22133839 -16772752 -9689502 -11060458 -20280953 -24318197 -16378485 -6064577 -4763542
11466 -4763542 -9954873 -12329796 -11081518 -11850501 -14317140 -12990708 -8326133 -6401947
11458 -6401947 -7611472 -5555923 1384084 6150926 3066909 -5250168 -12640609 -14448593
11450 -14448593 -7618590 5744160 14121264 6168533 -12605653 -23314720 -18044366 -9544285
11442 -9544285 -10823767 -17606033 -20408052 -21680369 -27211480 -30176365 -20423539 -3882136
11434c882136Q376583o39091J945115N443052k564158j1031389m249060Q259245
11426A658161O582704m699262m882370N127099M301709r069287j1595131M451300
11418h125077J5694596O535553m973897O59488J1001223N050254r129499q488768
11410H223873N135350Q537167m223398j4455134j0941909m387720m639087n146528
11402b1897386J298197Q522465Q558962M464645K438709J256678k243017n459049
11394c059796n202374l865850m376616m927936l552433k027898j089681K206720
11386b5895864Q483001J3323983J3885797J2051749Q281275k05737j1420509j6752185
11378A751510j2358458n350663k907988j972272L371615R979773R404810R03215
$$ plain form
11434 -3882136 4494447 3855356 5800471 11243523 8679365 -2352024 -6601084 1658161
11426 1658161 8240865 3541603 -1340767 3786332 8088041 -981246 -12576377 -8125077
11418 -8125077 7569519 14105072 9131175 9790663 20791886 25842140 16712641 8223873
11410 8223873 13359223 21896390 17672992 3217858 -7724051 -12111771 -16750858 -21897386
11402 -21897386 -20599189 -12076724 -3517762 946883 3385592 4642270 2399253 -3059796
11394 -3059796 -8262170 -12128020 -16504636 -21432572 -24985005 -27012903 -28102584 -25895864
11386 -25895864 -17412863 -4088880 9796917 21848666 30129941 29924204 18503695 1751510
11378 1751510 -10606948 -15957611 -18865599 -20837871 -17466256 -7486483 1918327 2821542
11370B821542o597232n410337K477013Q228799N576945k384828o389043k540481
11362d217622K329052J360618p76503L805677R660561L599981j2046002j7614695
11354a3898933m215176J1008325Q702986n429648j1104658l099461N091473L838633
11346i106459j301854j930560J373170L208489J731099o84994j126025J178055
11338f659079L744870L158972Q5458r89930Q88959Q00568l552087o496694k776590
11329a1795553L626721N074979P69376l926113m955296j541667M806176Q692697
11321G51320M083759n693234q400905J25855P729903L407180n589074n769374
11313i354570J055861K807454j220031j71816P849530J1207492L617967n845327
$$ plain form
11370 2821542 -3775690 -9186027 -6709014 1519785 7096730 4711902 -1677141 -4217622
11362 -4217622 -1888570 -527952 -1304455 2501222 12161783 15761764 3715762 -13898933
11354 -13898933 -18114109 -7105784 1597202 -3832446 -14937104 -18036565 -12945092 -9106459
11346 -9106459 -10408313 -12338873 -10965703 -7757214 -6026115 -6711109 -7837134 -6659079
11338 -6659079 -2914209 244763 330221 -659709 229250 1029818 -2522269 -9018963 -11795553
11329 -11795553 -8168832 -3093853 -2324477 -6250590 -11205886 -12747553 -7941377 751320
11321 751320 4835079 -858155 -9259060 -9133205 -1403302 2003878 -3585196 -9354570
11313 -9354570 -8298709 -5491255 -6711286 -6883102 966428 12173920 15791887 9946560
11305I946560o367549J239356R027410J1292060O189389m099617j1818048r427812
11297E981749L94282O728127L772759l828347r060879q917763l162470N162025
11289b930517Q216304J138739q654876r233948j121034M026778K085437J433034
11281e040083O561262R526899L400707o631073j2007683j1248576n763629M892312
11273a6309864J6297194J7234404L949468j0660939j1759014j631292M766861
11266A886818l30998j0326840j4582499q942604K359092R925791O595258l795022
11258a7211004q358789p27379R578487R566393L41020n949100m050889o41918
11250a7453179j045901j002966M007804R291072Q023576L096195L157388Q076972
$$ plain form
11305 9946560 3579011 4818367 13845777 25137837 31327226 27227609 15409561 5981749
11297 5981749 6376031 13104158 16876917 13048570 3987691 -4930072 -8092542 -2930517
11289 -2930517 5285787 6424526 -2230350 -11464298 -12585332 -8558554 -6473117 -5040083
11281 -5040083 1521179 11048078 14448785 7817712 -4189971 -15438547 -21202176 -16309864
11273 -16309864 -12670 17221734 21171202 10510263 -1248751 -2880043 1886818
11266 1886818 1555820 -8771020 -23353519 -32296123 -29937031 -20011240 -13415982 -17211004
11258 -17211004 -25569793 -26297172 -16718685 -7152292 -6811272 -12760372 -16811261 -17453179
11250 -17453179 -18499080 -19502046 -15494242 -6203170 1820406 4916601 8073989 16150961
11242A6150961P858340j207112q546509m617018L047303J60335j1662456j6168835
11234a4984991p011851L320695L708664n18966o64406M71051k089084l077353
11226b0846241K624225P216559K608145l253989N18439O798533K380599o024979
11218g978709j273159J1941267J0725880p702954j8272162o772055Q726015P872181
11210b733696k569869n340453l81649K122337K216236N225433O887413J147407
11202F573159n103341j724330O302760N819005l703485j0767223r947040o094381
11194a8644876k837645R73881M652540N670431N060833M926188L384432q05004
11186B380780l083280k48190K607685N32070k128825k69511J069647m518828j1137997
$$ plain form
11242 16150961 24009301 22802189 14255680 9638662 12685965 12846300 1183844 -14984991
11234 -14984991 -21996842 -18676147 -14967483 -15486449 -16150855 -15679804 -17768888 -20846241
11226 -20846241 -18222016 -11005457 -8397312 -11651301 -11132862 -4334329 -1953730 -7978709
11218 -7978709 -9251868 2689399 13415279 5712325 -12559837 -19331892 -10605877 -2733696
11210 -2733696 -5303565 -10644018 -11025667 -8903330 -6687094 -1461661 5425752 6573159
11202 6573159 1469818 -254512 6048248 11867253 8163768 -2603455 -12550495 -18644876
11194 -18644876 -21482521 -20508640 -15856100 -10185669 -5124836 -198648 3185784 2380780
11186 2380780 -702500 -950690 1656995 2189065 60240 -209271 860376 -3658452 -14796449
11177a4796449q291391J988393Q368962P406400M935820K913481j778352o368414
11169e621550l553926M916275Q251618K779238k786591j653208J346169o99082
11161B978943n367599n386772k65192K598006j815673q356030o964871L813427
11153a8765761J2384247P910065m396294r902813n029270m3723o82674o69808
11145a9196031L304331M108738o05700p18270P849779J1314854r72141j6031818
11137a0946258j4298908K162777J4909134J4669085N790300o502902j6260831
11130a0477603j2546197O036446J9824003J1361159o539762q433480L925642N768557
11122H918765q440249j5884841l448169J2360950J3602851N727017J670091P52416
$$ plain form
11177 -14796449 -23087840 -21099447 -12730485 -5324085 -388265 2525216 746864 -5621550
11169 -5621550 -9175476 -4259201 3992417 6771655 3985064 2331856 3678025 2978943
11161 2978943 -2388656 -7775428 -8040620 -5442614 -7258287 -15614317 -22579188 -18765761
11153 -18765761 -6381514 1528551 -2867743 -12770556 -17799826 -17843549 -18526223 -19196031
11145 -19196031 -15891700 -11782962 -12388662 -13106932 -5257153 6057701 5085560 -10946258
11137 -10946258 -25245166 -23082389 -8173255 6495830 12286130 5783228 -10477603
11130 -10477603 -23023800 -16987354 2836649 14197808 7658046 -775434 3150208 8918765
11122 8918765 478516 -15406325 -18854494 -6493544 7109307 12836324 14506415 15258831
11114A5258831k630928m927917j824470J313768r00023m221581m316235n126085
11106g374640q627177p371099K834303J2748326J2141072L987227k609146n621770
11098A07096p832002q699335o440329k449904J902608O941120J0125740P738783
11090A393777K982195K340200K814426l938047j3060049r220030P120565J5236979
11082E670016N056879o696620m214834K334074l018365j3101446j0539747J783858
11074b2726185O514350J671091J570894R797119J3089568M655762n192489o678189
11066B701921l444611j803954K5823M711757P610377L594122l867246o849094
11058B679095k824707L832317P566127N737226q42669q314667j1169376n918858
$$ plain form
11114 15258831 12627903 7699986 5875516 7189284 6289261 2067680 -2248555 -7374640
11106 -7374640 -16001817 -23372916 -20538613 -7790287 4350785 8338012 5728866 107096
11098 107096 -7724906 -16424241 -22864570 -25314474 -23411866 -16470746 -6345006 1393777
11090 1393777 4375972 6716172 9530598 5592551 -7467498 -16687528 -9566963 5670016
11082 5670016 10726895 4030275 -184559 2149515 -868850 -13970296 -24510043 -22726185
11074 -22726185 -16211835 -14540744 -12969850 -3172731 9916837 14572599 9380110 2701921
11066 2701921 -742690 -2546644 -2520821 2190936 9801313 13395435 9528189 2679095
11058 2679095 -145612 3686705 11252832 16990058 16147389 7832722 -3336654 -9255512
11050i255512M683958J1872066Q789899m96362m478625J79180K997253l839095
11042A0452762j1188459o851800K871640K168452p092887p377131M257990J0228422
11034b531011K662578l335693K655560P799767L08085q295422m353130K560096
11026b529170k252584j0231729m312243R215221J0268071n72064m045227M406502
11018e3223R367727L902999j254172K9064J08560m785811p530246n444441m636088
11009a0295631n195624J29711R005849R525272R08382m330778k560636l481104
11001f294559q096808m464840P321055R156623m943483j5109512o386225P415319
10993b1402430P639113o3939L0769O079097O305992J897179J147724P79072n988733
$$ plain form
11050 -9255512 -4571554 7300512 16090411 15594049 11115424 11294604 14291857 10452762
11042 10452762 -735697 -7587497 -4715857 -2547405 -9640292 -17017423 -12759433 -2531011
11034 -2531011 131567 -3204126 -548566 7251201 7559286 -736136 -5089266 -2529170
11026 -2529170 -4781754 -15013483 -19325726 -10110505 157566 -414498 -4459725 -53223
11018 -53223 9314504 13217503 11963331 11992395 12100955 7315144 -215102 -5659543 -10295631
11009 -10295631 -15491255 -15361544 -6355695 3169577 4077959 -252819 -2813455 -6294559
11001 -6294559 -14391367 -18856207 -11535152 -2378529 -7322012 -22431524 -28817749 -21402430
10993 -21402430 -13763317 -13827256 -13796487 -7717390 -1411398 485781 1633505 2412577 -3576156
10984c576156j1356683m346331O903630O423991j651225n6432J0005759R711015
10976A2057568l964020j1401256k799483O551723L410565k519368J435337P823001
10968A0594067K796634r270734j2295332l011625O251923O455420J327572j280457
10960A567468J215397N266078M770571k525293r587926o448189M933324J0376469
10952I567899L336835m709906k075889M966358L788774l298271m498105J74390
10944G252085O6015n501324n494212K089449N018150k241929q247774l659969
10936a0719509L044547j16992q987533j0030840k13979J0742797J3798078P689036
10928E205605l143855j0256766n836823O930046J3772658P268240k093288j984804
$$ plain form
10984 -3576156 -14932839 -19279170 -12375540 -5951549 -7602774 -7659206 2346553 12057568
10976 12057568 8093548 -3307708 -6107191 444532 3855097 1335729 2771066 10594067
10968 10594067 13390701 4119967 -8175365 -11186990 -4935067 1520353 2847925 1567468
10960 1567468 2782865 8048943 12819514 10294221 706295 -5741894 -808570 9567899
10952 9567899 12904734 8194828 6118939 11085297 14874071 11575800 7077695 7252085
10944 7252085 7318100 1816776 -3677436 -1587987 3430163 1188234 -7059540 -10719509
10936 -10719509 -7674962 -7791954 -16779487 -26810327 -27024306 -16281509 -2483431 5205605
10928 5205605 2061750 -8195016 -14031839 -7101793 6670865 13939105 11845817 9861013
10920I861013K802731L56002o412939m477733N721667R508180K049506m245727
10912A5162700j010031L639138J366383k284317k21728J864336m116035j2493400
10904A907046j1328901j438034M632055J367067k908488L49303P656039Q700458
10896H936545j02142j0781102j2478280l694565O145646Q465489N271570K996158
10888D759319J116883m428979r069325l199691J0242031J4873374L510111r955184
10880G848539r995196q95557K112104m139802q851625m582712M944411J2986621
10872e73217J5943449J1761602R46753j0010165j3285669q910867l869073j775105
10864i772292Q80781P040326J2621311J0635641P8596j1218239j3629385o297462
$$ plain form
10920 9861013 12663744 13019746 6606807 2129074 7850741 17358921 19408427 15162700
10912 15162700 14152669 17791807 19158190 16873873 16652145 18516481 14400446 1907046
10904 1907046 -9421855 -10859889 -6227834 -4860767 -7769255 -7419952 236087 8936545
10896 8936545 8834403 -1946699 -14424979 -18119544 -11973898 -3508409 1763161 4759319
10888 4759319 5876202 1447223 -7622102 -10821793 -579762 14293612 17803723 7848539
10880 7848539 -2146657 -3042214 -930110 -5069912 -13921537 -18504249 -13559838 -573217
10872 -573217 15370232 27131834 28078587 18068422 4782753 -4128114 -7997187 -9772292
10864 -9772292 -8891511 -1851185 10770126 21405767 21484363 10266124 -3363261 -9660723
10856i660723J284371J146411k431936o3616P139169Q536663R60791o230746o301917
10847e621533m078221m371333k885199L454771P699508M299597K21622L619851
10839B339063R091238O023948m422432j2287152j3477875j0258709k728965P842639
10831a7878245J2271813L818203p947249p522192M086965J1060701O272346p95134
10823C367208j007021K527417K957375k60979l610674m473187j948571J450326
10815i98106o7719p221810j0674737l083594P711001Q475853K68204m401301j908143
10806a1900352o61824l993452m912706n11407K480526P51387L09714M318986O622430
10797g496698L153982m28961J315228M598899L307056j737939n163641l608897
$$ plain form
10856 -9660723 -8376352 -7229941 -9661877 -9725493 -2586324 5950339 6911130 680384 -5621533
10847 -5621533 -9699754 -14071087 -16956286 -13501515 -5802007 -1502410 -1280788 2339063
10839 2339063 11430301 17454249 13031817 744665 -12733210 -22991919 -25720884 -17878245
10831 -17878245 -5606432 -1788229 -9735478 -17257670 -13170705 -2110004 4162342 3367208
10823 3367208 2360187 4887604 7844979 7584000 3973326 -499861 -2448432 -998106
10815 -998106 -1065825 -8287635 -18962372 -22045966 -14334965 -5859112 -5590908 -9992209 -11900352
10806 -11900352 -12562176 -16555628 -21468334 -21979741 -19499215 -18747828 -18438114 -14119128 -7496698
10797 -7496698 -4342716 -4771677 -3456449 1142450 4449506 2711567 -2452074 -6060971
10789f060971K388521Q079752O533989k459589p968934j708504P065838L509929
10781I380031q139740q674583N771162J6032849Q780704m601356q138342m667877
10773E742848n512644q636446l182060J0065441J7492027J1102715k116355r951450
10765A5004076p704188o98964K461476r29509n025083l779998M00641J566800
10757A295251O88945K608410M768743L48506p634270q252351o39972L337551j785581
10748e264768o620911l139598L415726N554691M505499K897953j808887q474017
10740h934312q135967K136121J1415121J0186503L818891J484641J522281j450465
10732A2042814l863628P7124N500680K893384o838770j3615724j1781714m249695
$$ plain form
10789 -6060971 -3672450 4407302 10941291 8481702 512768 -1195736 5870102 9380031
10781 9380031 1240291 -7434292 -1663130 14369719 23150423 18549067 10410725 5742848
10773 5742848 230204 -8406242 -11588302 -1522861 15969166 27071881 24955526 15004076
10765 15004076 7299888 6600924 9062400 8132891 3107808 -672190 -271549 1295251
10757 1295251 1984196 4592606 9361349 9709855 2075585 -6176766 -6816738 -3479187 -5264768
10748 -5264768 -11885679 -15025277 -11609551 -6054860 -1549361 1348592 -460295 -8934312
10740 -8934312 -17070279 -14934158 -3519037 6667466 10486357 11970998 13493279 12042814
10732 12042814 8179186 8256310 13756990 16650374 9811604 -3804120 -15585834 -19835529
10724a9835529M139937J0242354J1821716Q566592K333292n275215j1642073j0467493
10716a0116419J055623J2647142J0395521k543886q483808j545434M708381J661645
10708G778765p35317M974585P329060m133683j7460252j4672707R28783J1163719
10700d827047Q843662J389270m617672p494129m902983K176013N677137K367513
10692a388236J567563Q897759J2820746K681740j0272273q505451L376691O232110
10684A5410649k921287q919706m935598l03790j004545j104496L049723N678855
10676D949805K518244l026402o816125p291641k664901N302310P749091J1281
10668G31662p880187m485761M541085N698248j55303j723154J231950n81594n658225
$$ plain form
10724 -19835529 -15695592 -5453238 6368478 14935070 17268362 11993147 351074 -10116419
10716 -10116419 -9060796 3586346 13981867 11437981 2954173 1408739 6117120 7778765
10708 7778765 7043448 12018033 19347093 15213410 -2246842 -16919549 -15990766 -4827047
10700 -4827047 4016615 5405885 788213 -6705916 -11608899 -9432886 -3755749 -1388236
10692 -1388236 179327 9077086 21897832 24579572 14307299 5801848 9178539 15410649
10684 15410649 12489362 3569656 -1365942 -1669732 -2674277 -3778773 -729050 4949805
10676 4949805 7468049 4441647 -2374478 -9666119 -12331020 -7028710 720381 731662
10668 731662 -7148525 -11634286 -7093201 -1394953 -1550256 -3273410 -2041460 -2623054 -8281279
10659h281279l427509M010229L109925n941359o762937N234494J3182184N673972
10651F797720n213657m193035L930393M203219n330589j2654203q837840K352728
10643a8945264R549262N286065m981856o964619M073418J3915508Q082841n823188
10635D192167q896533L0586M242601k553622p703832l022843K771526K236914
10627h703036K063305P925714J1699437N455493l510099l440456M396370R280272
10619B5167000O092349j408207p620731r223273o047373j658148J87723K23200
10611E712540M59116j227751o001800p238246Q04148J0716279J0743172L077364
10603A7044822o53738N52516j944238p002603m342900M359148N144237l910977
$$ plain form
10659 -8281279 -11708788 -7698559 -4588634 -10529993 -17292930 -12058436 1123748 6797720
10651 6797720 1584063 -2608972 1321421 5524640 194051 -12460152 -21297992 -18945264
10643 -18945264 -9396002 -4109937 -9091793 -16056412 -11982994 1932514 10015355 4192167
10635 4192167 -4704366 -4673780 -431179 -2984801 -10688633 -13711476 -10939950 -8703036
10627 -8703036 -6639731 1285983 12985420 18440913 14930814 11490358 15886728 25167000
10619 25167000 31259349 29851142 22230411 13007138 6959765 5301617 5489340 5712540
10611 5712540 6171656 4943905 -1057895 -8296141 -7491993 3224286 13967458 17044822
10603 17044822 16391084 16943600 14999362 7996759 3653859 8013007 13157244 9246267
10595I246267q317952k540079R82438m059960n579441M082718J2464460P780611
10587A4059062j295503j598789K738398k4702q576714j2363641q313803j609774
10579a6985466L719660N683858K716830j677808n35776N155561O578728K592987
10571G248574K007110N548614J618760j2069950j9258893q576376Q533990J5055066
10563A06895J0177471K542795m740335j0368445r069273j610233J583511k438946
10555a3816560k054668P862376J3346117L479634r945583j0520113j593049L361394
10547i880452K414558J262689p98466n163034n004785K926117Q521423M368790
10539a353160o77702J989984M893788P36597j208248O546731J0742933j309465
$$ plain form
10595 9246267 928315 -1611764 -629326 -4689286 -10268727 -6186009 6278451 14059062
10587 14059062 12763559 11164770 13903168 13878466 5301752 -7061889 -15375692 -16985466
10579 -16985466 -13265806 -7581948 -4865118 -6542926 -7078702 -1923141 4655587 7248574
10571 7248574 9255684 14804298 16423058 4353108 -14905785 -23482161 -14948171 106895
10563 106895 10284366 12827161 8086826 -2281619 -11350892 -12961125 -11377614 -13816560
10555 -13816560 -15871228 -8008852 5337265 8816899 -1128684 -11648797 -13241846 -9880452
10547 -9880452 -7465894 -6203205 -7001671 -12164705 -17169490 -14243373 -5721950 -1353160
10539 -1353160 -2030862 -40878 4852910 5589507 4381259 10927990 21670923 20361458
10531B0361458j5338080r657815R171392J5560717L345264r015560q352780n17600
10523E556996M527300L961162m87682l835261l20679O593983N490568m163065
10515A7323322q624967l460449r52010m015422J799036J6150683J4475456q753692
10507B3941957k0938938k710627J6778768R238039n120157J74841O856520p169125
10499B1051278j5395747Q465065K7862691K202136k8225879m004264L8233627
10492E0188907K0057695k9173368q914872O0114256L2803111j19389966k15625233
10485b09939470j14070299P0767320J30026226M9269971j4691304R424513L7365857
10478d1847186P940302k3664705n936359K0556067R638837j0010708M86089J8152191
$$ plain form
10531 20361458 5023378 -4634437 4536955 20097672 23442936 14427376 6074596 5556996
10523 5556996 10084296 14045458 13557776 9722515 9401836 15995819 21486387 17323322
10515 17323322 8698355 5237906 4285896 270474 2069510 18220193 32695649 23941957
10507 23941957 3003019 292392 17071160 26309199 21189042 21363883 28220403 21051278
10499 21051278 5655531 14120596 41983287 44185423 15959544 11955280 50188907
10492 50188907 70246602 41073234 32158362 92272618 125075729 5685763 -209939470
10485 -209939470 -324009769 -253242449 -123216223 -73946252 -88637556 -79213043 -41847186
10478 -41847186 -33906884 -57571589 -63507948 -42951881 -33313044 -43323752 -42837663 -24685472
10470b4685472Q510576r631054m938258P464256M19758j0246596L133947K3979301
10462e993542J7117872j0316715k0709388n629424Q244070N519482k113675l769063
10454a7650383k881438k736061j304753j71244j895367j865692L828219R171317
10446a5505402Q783113P653312Q634426L819690p920547j0899078K591899J3853392
10438A1010805M993245j0850872j0636727Q16930J793049p666493q277715K336537
10430a6481241O654284K14488j934045M692749N584474m097903q635723K71930
10422a3730987Q279407L698397k983864O03249P202767M887827j729077k449033
10414C778686j283526p238128j4522709j0512711K077595Q668260N632320K960134
$$ plain form
10470 -24685472 -16174896 -25805950 -30744208 -23279952 -22860194 -33106790 -29972843 -5993542
10462 -5993542 11124330 807615 -19901773 -25531197 -17287127 -11767645 -13881320 -17650383
10454 -17650383 -20531821 -23267882 -24572635 -24743879 -26639246 -28504938 -24676719 -15505402
10446 -15505402 -6722289 931023 9565449 13385139 5464592 -5434486 -2842587 11010805
10438 11010805 16004050 5153178 -5483549 -4666619 -2873570 -10540063 -18817778 -16481241
10430 -16481241 -9826957 -9612469 -11546514 -6853765 -1269291 -5367194 -14002917 -13730987
10422 -13730987 -5451580 -1753183 -4737047 -4133798 3068969 7956796 6227719 3778686
10414 3778686 2495160 -4742968 -19265677 -29778388 -27700793 -19032533 -13400213 -10440079
10406a0440079M805959L768268k831555n979323l69984N108933P70875p882469
10398a3049375p204838M633152J3518696P046815q857323j5592417m121049J2826415
10390a0799924J5277076R20185j1846964p745127O565067J3316035O586828m044580
10382H228596q477539n347930J320202N521508J065749j0508602j5636181l704512
10374b7538709J4508408J7182555K062968q957188j771552R676184O327951o947056
10366D543561j1384002m029900J106862k107900m240847J068923O425500L672253
10358d945550l783031p268597l896917K613777O462707L582601l502256n485317
10350a6222583J955166Q724865K904010r505177j1201179l8695P549212L359399
$$ plain form
10406 -10440079 -5634120 -1865852 -4697407 -10676730 -11046714 -5937781 -5166906 -13049375
10398 -13049375 -20254213 -15621061 -2102365 4944450 -3912873 -19505290 -23626339 -10799924
10390 -10799924 4477152 5397337 -6449627 -14194754 -7629687 5686348 12273176 8228596
10382 8228596 -248943 -5596873 -4276671 1244837 2310586 -8198016 -23834197 -27538709
10374 -27538709 -13030301 4152254 6215222 -2741966 -4513518 5162666 11490617 4543561
10366 4543561 -6840441 -10870341 -9763479 -11871379 -16112226 -15043303 -8617803 -4945550
10358 -4945550 -8728581 -15997178 -19894095 -17280318 -10817611 -7235010 -10737266 -16222583
10350 -16222583 -14267417 -5542552 -2638542 -12143719 -23344898 -23383593 -15834381 -12474982
10342a2474982k85193O258070J2028858M941757n377115k799595O948870M279209
10334A3519879j1592595j9387882p855285P786125R185560k6614l485406K904532
10326h951686P799895L304795m078688m135747K216726M699071j196510p384330
10318g726474n005776K203441L967483M2007j64542M807683M444338m841972j0316179
10309a2589991k459325Q014976O252039l154668m719421K705556P102218N445276
10301F596660N489218O846566N20516j0854388j2677164l010103K454576k984387
10293g618506n842543K033209P376382m14027q060758l95668J1977551R475296
10285H530936l161755m992667N771558R920357J35125q467904m937281J636711
$$ plain form
10342 -12474982 -12760175 -6502105 5526753 10468510 5091395 2291800 9240670 13519879
10334 13519879 1927284 -17460598 -25315883 -17529758 -8344198 -8370812 -11856218 -8951686
10326 -8951686 -1151791 2153004 -1925684 -6061431 -3844705 854366 -342144 -7726474
10318 -7726474 -12732250 -10528809 -6561326 -6519319 -6683861 -1876178 2568160 -2273812 -12589991
10309 -12589991 -15049316 -7034340 -782301 -3936969 -8656390 -5950834 1151384 6596660
10301 6596660 12085878 18932444 19452960 8598572 -4078592 -7088695 -4634119 -7618506
10293 -7618506 -13461049 -11427840 -4051458 -4465485 -12526243 -12921911 -944360 8530936
10285 8530936 5369181 376514 6148072 16068429 16203554 7735650 2798369 4435080
10277D435080L38133n071348o715978n396597l988712J3295P046185J0756692
10269A416750P781300K761177j462257p202584j0528547j269058J7046565K2844302
10261C1387648N192391j6713808j8650785m574585L583443J74604j733967K332090
10253I97031J812529o271039r579791j529627P554410Q058247M619093L559854
10245I220707R04022o602223j0482092k767668R216244J2127177M713290l823409
10237A2506048q310945r966989q280158j302947P267582J0148810N670046r26725
10229F804722m234714k280002L696140Q478449N946625k208108o066180j399527
10221H737405K810008j425341o988583l042230N710878N557180l373565o590921
$$ plain form
10277 4435080 4773213 -298135 -7014113 -12410710 -16399422 -16386127 -9339942 1416750
10269 1416750 9198050 11959227 10496970 3294386 -7234161 -8503219 8543346 31387648
10261 31387648 36580039 19866231 1215446 -3359139 224304 398908 -1335059 997031
10253 997031 2809560 -3461479 -13041270 -14570897 -7016487 1041760 5660853 9220707
10245 9220707 10124729 3522506 -6959586 -9727254 -511010 11616167 16329457 12506048
10237 12506048 4195103 -5771886 -14052044 -15354991 -8087409 2061401 7731447 6804722
10229 6804722 2570008 290006 3986146 12464595 18411220 16203112 10136932 8737405
10221 8737405 11547413 10122072 3133489 91259 5802137 11359317 7985752 1394831
10213A394831J450553Q914854N852780j849876m738635m368374o607376r098229
10205i049472n557521K468476P412820O743758M625726L870568K830270L18288
10197A3662913j761691k004681k076176l628037m488319p01956O959319J1095264
10189A7056636N672361n108987j0968143q885552n641205n271789l022171L178726
10181a2990124N405786r64347o052434k8522R117320P589941q75143j965004L093860
10172B331333k0678j0349106r751999N208147J3688008L884189o527971P26010
10164h12067J4381098J2413980l248631j2584312q879868k790216k18555L219626
10156A481055P103890M152907n233793j1244033r211277l842070J243037O289343
$$ plain form
10213 1394831 2845384 11760238 17613018 15763142 11024507 6656133 48757 -9049472
10205 -9049472 -14606993 -12138517 -4725697 2018061 6643787 10514355 13344625 13662913
10197 13662913 11901222 9896541 7820365 4192328 -295991 -997947 5961372 17056636
10189 17056636 22728997 17620010 6651867 -2233685 -7874890 -13146679 -16168850 -12990124
10181 -12990124 -7584338 -8548685 -14601119 -14629641 -5512321 2077620 1202477 -762527 2331333
10172 2331333 2310655 -8038451 -17790450 -12582303 1105705 4989894 -1538077 -812067
10164 -812067 13569031 25983011 22734380 10150068 1270200 -1520016 -1738571 1481055
10156 1481055 8584945 12737852 7504059 -3739974 -12951251 -16793321 -15550284 -9260941
10148i260941Q080201K351020n719373n357552L867561J0633322P903804N36169
10140A3034211m310513m921318k205547J940756K964685j255667m550041p47807
10132e1241M403867Q98756p913507r000664q34409M040697k7428l548633L72849
10123a1659713M674342K326332j103670J694278O576158N588770P1099l381029
10115D786567m014826n137460n938661l360754R76696K607198Q80418j136973
10107a0337795j158246J404295N967494R364086P491298Q47845n347486q077864
10099A53627q810822p998819l860985J641577L110894Q06023J730278Q008064
10091e220163J2025937P777420m11092n547445p072757o846901l490172K631916
$$ plain form
10148 -9260941 -1180740 1170280 -4549093 -9906645 -6039084 4594238 12498042 13034211
10140 13034211 8723698 3802380 1596833 3537589 6502274 5246607 696566 -51241
10132 -51241 4352626 5251382 -2662125 -11662789 -12497198 -8456501 -8483929 -12032562 -11659713
10123 -11659713 -6985371 -4659039 -5762709 -4068431 2507727 8096497 8167596 4786567
10115 4786567 771741 -4365719 -10304380 -13665134 -12688438 -10081240 -9200822 -10337795
10107 -10337795 -11496041 -10091746 -4124252 5239834 12731132 13578977 8231491 153627
10099 153627 -8657195 -16656014 -20516999 -18875422 -15764528 -14958505 -13228227 -5220163
10091 -5220163 6805774 14583194 14172102 8624657 1551900 -5295001 -8785173 -6153257
10083f153257N348952Q60651n259354n875313k140719Q12335K888862O690196
10075b827647J0225697Q830813J915494o710968j2120031r548330J429413J1295694
10067B490135P982345n457374j0930490j12720J2252465J0149887j14585k447297
10059A3812366K574319J918156m894066n165569L155825O595413j272242r666615
10051G057587r004921m262948k566808j227617K791864L602233k691017p609360
10043a3910987k527894O243302O794007M97030j406599K922552L719183k734066
10035d03472p201149k598283M519788M531873o76281k182343J289141K517472
10027b03254j239614l614607p1948M322638L301028l78774k14833K573069J569214
$$ plain form
10083 -6153257 -804305 56346 -5203008 -11078321 -13219040 -12406705 -9517843 -2827647
10075 -2827647 7398050 16228863 18144357 11433389 -686642 -10234972 -8805559 2490135
10067 2490135 10472480 5015106 -5915384 -6028104 6224361 16374248 16259663 13812366
10059 13812366 16386685 18304841 13410775 8245206 11401031 17996444 16724202 7057587
10051 7057587 -1947334 -6210282 -8777090 -10004707 -7212843 -3610610 -6301627 -13910987
10043 -13910987 -16438881 -10195579 -3401572 -2904542 -4311141 -1388589 2330594 -403472
10035 -403472 -7604621 -10202904 -5683116 -1151243 -1827524 -4009867 -2720726 -203254
10027 -203254 -1442868 -5057475 -5129423 -806785 2494243 2115469 1900636 4473705 6042919
10018F042919k751805l386941M00808J543129r37533J310290R283692R756944
10010B1261503l961430j6268067j0285116L965721K834994j3020607j7670577
10003c3143579o34360J5519912J0011199m755767n006130O684834Q504429l795493
9995f614955j1650050m870338M481230M853176K574805O806182J2240675R162940
9987A6983665M60886m078321l773713n118884p910155n417392K372453O415939
9979f5522J686239n204076m954623K282372O995360J564862r547671j2250891
9971a9493950J144923J9070542K1292171M810673j0458636q395554J508075P73761
9963A0252005q817393r962800M32231O594917J005762l900102J385799O881105
$$ plain form
10018 6042919 3291114 -95827 304981 1848110 910577 2220867 11504559 21261503
10010 21261503 17300073 1032006 -9253110 -5287389 -2452395 -15473002 -33143579
10003 -33143579 -33777939 -18258027 -8246828 -13002595 -18008725 -11323891 -2819462 -6614955
9995 -6614955 -18265005 -23135343 -18654113 -13800937 -11226132 -4419950 7820725 16983665
9987 16983665 17444551 13366230 9592517 4473633 -3436522 -8853914 -6481461 -65522
9979 -65522 1620717 -3583359 -8537982 -6255610 739750 2304612 -7243059 -19493950
9971 -19493950 -18349027 721515 22013686 26824359 16365723 7970169 9478244 10252005
9963 10252005 1434612 -8528188 -8095957 -1501040 -495278 -4395380 -3009581 3871524
9955C871524J180332q507161q748813j613983J226323j282832o02890M558465
9947i919035P064276N155244M348350N812718M228757k102235q322520j0522039
9939d256484q605019k938022M397498P462686L466820j398949j341198j027009
9931d239677n922851q793959n3353J2874240J3443492J818057n034172k85222
9923C806555M157781J54026m029486j254357J213352l412510p432092j921882
9915h718613O821600O791668j432729p539914p050202l596218L31368N481496
9907h911544J0470116J1215961N475409m726057j3446119j3813506n131393M010207
9899a4856926N641387K911566K768844K774714k594755p099275q06293R628105
$$ plain form
9955 3871524 5051856 -3455305 -12204118 -13818101 -12591778 -13874610 -14477500 -9919035
9947 -9919035 -2854759 2300485 6648835 12461553 16690310 14588075 6265555 -4256484
9939 -4256484 -12861503 -15799525 -11402027 -3939341 -472521 -1871470 -3212668 -4239677
9931 -4239677 -10162528 -18956487 -19009840 -6135600 7307892 9125949 4091777 3806555
9923 3806555 7964336 8118362 4088876 2834519 4047871 635361 -6796731 -8718613
9915 -8718613 -1897013 4894655 3461926 -4077988 -11128190 -14724408 -14393040 -8911544
9907 -8911544 1558572 12774533 18249942 13523885 77766 -13735740 -18867133 -14856926
9899 -14856926 -9215539 -6303973 -3535129 -760415 -3355170 -10454445 -11260738 -1632633
9891a632633Q426238k128038m322815L728975N027658l727620n276660L931280
9883D026385M101875r558352j2384532N925450J7437417K700263j2902174l581369
9875d235037R714298l02557j1358086Q537612K9811277j432845o3440567p1822451
9867a04528356m721078N7635888M7931185J433942j2692482N222858Q048216r908848
9859a1578675j2408240P019477J4196297l703915j6572751l133029J6185858J5069072
9851E074094k5799o284472O05074O737823L836561k421632l537696J491560N813188
9842A1288701K064198q115542j3745609p859309K577504O397850L233610M24108
9834c734489m00184l026283n968925l606190K803228N901159M147522L130397
$$ plain form
9891 -1632633 6793605 4665567 342752 4071727 9099385 5371765 95105 4026385
9883 4026385 8128260 -1430092 -13814624 -7889174 9548243 12248506 -653668 -4235037
9875 -4235037 5479261 5176704 -6181382 2356230 32167507 30734662 -32705905 -104528356
9867 -104528356 -109249434 -51613546 -3682361 -2248419 -14940901 -9718043 -1669827 -11578675
9859 -11578675 -23986915 -16967438 -2771141 -6475056 -23047807 -26180836 -9994978 5074094
9851 5074094 5048295 -1236177 -631103 6106720 9943281 7521649 3983953 5475513 11288701
9842 11288701 13352899 5237357 -8508252 -16367561 -13790057 -7392207 -4158597 -3734489
9834 -3734489 -4134673 -7160956 -13129881 -16736071 -13932843 -8031684 -3884162 -753765
9826g53765M571758L730889q91084m373146m193027m236631p092844r015386n904860
9817b8158096N51600N635997P201578O561778N973513O230707N779595K862728
9809A2639400j126305l094447l581511o023458r185420o624325K734808R950141
9801d311117P269920j388991o465932m148189L042296J0867643J3250704M859325
9793B2975659r241382j4007518l067867R955995Q555220m393481j2264088p554682
9785i042144K318725Q470835Q407282K767785n241045q760704m589423Q66560
9777d802129P97303j712920j438493j975144p009432p980364M036360J9435904
9769f48915K0497761P691448k499961m244652o991642j2827406j0723148J460211
$$ plain form
9826 -753765 3817993 7548882 6657798 2284652 -1908375 -6145006 -13237850 -22253236 -28158096
9817 -28158096 -27606496 -21970499 -14768921 -8207143 -2233630 3997077 9776672 12639400
9809 12639400 11513095 8418648 4837137 -1186321 -10371741 -16996066 -14261258 -4311117
9801 -4311117 2958803 1569812 -4896120 -9044309 -6002013 4865630 18116334 22975659
9793 22975659 13734277 -273241 -3341108 6614887 15170107 10776626 -1487462 -9042144
9785 -9042144 -6723419 1747416 10154698 12922483 7681438 -1079266 -5668689 -4802129
9777 -4802129 -4004826 -5717746 -7156239 -9131383 -16140815 -24121179 -20084819 -648915
9769 -648915 19848846 27540294 25040333 20795681 13804039 976633 -9746515 -8286304
9761h286304R273217M108916l982012m532135j590856j257920J46062N078473
9753a042559O218710k72426o046684n329685m637559p064283k261736J3994551
9745f441671K4994662J5118207n034404j3661333q271028k535934j117238J834451
9737D885712M548511o51224r277840q263125K047026P859495N018393L964669
9729A0131617Q950131J0208897K099371o870541q617945o454499n300821l519028
9721F27182n92902j012926m397440l209756L702093O902096J997767k474622o9623
9712A471869K675866r39686n579224m616706k616926n736688q767859m020520
9704b8129874M272635O939024N211651O472609R498876O940879m71900m692808
$$ plain form
9761 -8286304 986913 5095829 1113817 -3418318 -5009174 -6267094 -6121032 -1042559
9753 -1042559 5176151 4903725 -1142959 -6472644 -11110203 -18174486 -20436222 -6441671
9745 -6441671 18552991 33671198 28636794 14975461 6704433 4168499 3051261 4885712
9737 4885712 9434223 8782999 -494841 -8757966 -6710940 1148555 6166948 10131617
9729 10131617 19081748 29290645 31390016 24519475 15901530 9447031 4146210 627182
9721 627182 34280 -978646 -5376086 -8585842 -4883749 2018347 4016114 1541492 1471869
9712 1471869 4147735 3208049 -2371175 -6987881 -9604807 -15341495 -24109354 -28129874
9704 -28129874 -23857239 -16918215 -11706564 -5233955 4264921 11205800 10733900 6041092
9696F041092l837531l512674n436096n286975j795880J484647L395912N595756
9688c351749O415391K750773k690312m258005k360798j539064j511801R97308
9680e548257L675426J643379k745027l182208n05671M5685O705L944653P274823
9671D609508K185219o015084m828576L389023L585729n821075q877408O85399
9663a1087265Q699639N351221L21021J916403J324576p503512j1429569j61704
9655a2569190J1839795O710383o961189q259816K761371R545571Q306284P873366
9647A9246575O379397n074721j7833826j2587824O956368J4398672P35638j1796219
9639D24060n952632M686090Q78831j1230863j2422948m32665J0128884J0276133
$$ plain form
9696 6041092 2203561 -1309113 -6745209 -12032184 -13828064 -12343417 -8947505 -3351749
9688 -3351749 3063642 5814415 3124103 -1133902 -3494700 -5033764 -6545565 -5548257
9680 -5548257 -1872831 -229452 -2974479 -6156687 -6662358 -6616673 -6609968 -2665315 4609508
9671 4609508 6794727 779643 -4048933 -659910 2925819 -2895256 -11772664 -11087265
9663 -11087265 -2387626 2963595 3284616 5201019 6525595 -977917 -12407486 -12569190
9655 -12569190 -729395 5980988 -980201 -9240017 -6478646 3066925 11373209 19246575
9647 19246575 25625972 20551251 2717425 -9870399 -2914031 11484641 12220279 424060
9639 424060 -5528572 -842482 36349 -11194514 -23617462 -24050127 -13921243 -3645110
9631c645110M231758j312960m175816m894517m825475m241743m34074P315921
9623a1982016J1424080L935548r151514j3305848o216169M84843J635340M108782
9615a9066954Q647389N501880m721274o205721N349028J1568764J282113q564186
9607f208961m89911J3317051J1143843k691434p947949l318373l832832r864562
9599i893128p120133L719768N048358o427095j1801638o39836J2404226J1297303
9591c412175P71978n736588n358792k465566J773727O436170O881712K161027
9583A051493j468366n90289J4180k797395m419315j745795O51178k92331L62399
9574i234241N969242J0181075O027289k978657p763607n028225J814892Q375919
$$ plain form
9631 -3645110 586648 -726312 -4902128 -9796645 -14622120 -18863863 -19297937 -11982016
9623 -11982016 -557936 3377612 -5773902 -19079750 -25295919 -24811076 -23175736 -19066954
9615 -19066954 -10419565 -4917685 -9638959 -15844680 -10495652 1073112 2355225 -6208961
9607 -6208961 -6698872 6618179 17762022 15070588 7122639 3804266 -28566 -9893128
9599 -9893128 -17013261 -13293493 -8245135 -14672230 -26473868 -27113704 -14709478 -3412175
9591 -3412175 -2640197 -8376785 -13735577 -16201143 -14427416 -7991246 -1109534 1051493
9583 1051493 -416873 -1007162 -992982 -3790377 -8209692 -9955487 -9304309 -9596640 -9234241
9574 -9234241 -3264999 6916076 12943365 9964708 2201101 -2827124 -1012232 7363687
9566G363687J1114148P857415Q86873m040718m342177k335640K31233L068748
9558A9803569K443953n530927j4507620j1427404M284448J5175961P397078j0198202
9550G440856j7813873r591739L151054R608188R732590P368807L040541k984339
9542I952085o594584l835687K665880N186449P5462o676825o135033J678122P085941
9533C401810L635239l602071o188583l145460J594916O370376R202757M658803
9525A5927787o732488j2058260j887435J2007782J0122146n827729j4567169o517290
9517i532656M814231O534339L077834K026866O50818l240892k474021N491342
9509G347861R185888P47473q878774o222182L392738N443414j126628n760625
$$ plain form
9566 7363687 18477835 26335250 27222123 23181405 18839228 16503588 16734821 19803569
9558 19803569 22247522 16716595 2208975 -9218429 -4933981 10241980 17639058 7440856
9550 7440856 -10373017 -19964756 -16813702 -7205514 2527076 9895883 12936424 9952085
9542 9952085 3357501 -478186 2187694 7374143 7449605 772780 -5362253 -3684131 3401810
9533 3401810 7037049 3434978 -2753605 -5899065 -4304149 2066227 11268984 15927787
9525 15927787 9195299 -2862961 -4750396 7257386 17379532 11551803 -3015366 -9532656
9517 -9532656 -4718425 1815914 4893748 6920614 7571432 4330540 1856519 7347861
9509 7347861 16533749 17281222 8402448 2180266 5573004 11016418 9889790 4129165
9501D129165m572203k378304j141958L67600l76346m593066n073784L081699R984002
9492e73195L760326q530199r018980L929959J3464077R537126L01094m432699
9484H437509n767241o807636m715519J587940O325281N922034M563944N337398
9476A4883710M175481j735713p153844o539162k520925p99926j494573r15110
9468b100062J687746L567591K211514k730976q388393q826066q92733R157828
9460f313551J0655886K137317n844877m402341K712437N609899J219181m643388
9452A130563n461489o67868M666479N102931P98108k256508r2401L127740J174553
9443G522108m210986n811423k335093N31312N94302J718791M189227K321401m253412
$$ plain form
9501 4129165 -443038 -2821342 -3963300 -3595700 -3972046 -8565112 -13638896 -10557197 -573195
9492 -573195 3187131 -5343068 -14362048 -10432089 3031988 12569114 12870208 8437509
9484 8437509 2670268 -4137368 -8852887 -7264947 -939666 4982368 9546312 14883710
9476 14883710 19059191 17323478 10169634 3630472 1109547 309621 -1184952 -2100062
9468 -2100062 -412316 3155275 5366789 2635813 -5752580 -14578646 -15471379 -6313551
9460 -6313551 4342335 6479652 634775 -3767566 -1055129 4554770 5773951 1130563
9452 1130563 -4330926 -4998794 -332315 4770616 5568724 3312216 3219815 6347555 7522108
9443 7522108 3311122 -2500301 -4835394 -4304082 -3709780 -1990989 2198238 4519639 266227
9434B66227o631009k85608O139612L894671j731359n09502N412636N381049j584285
9425A0352432n356003j706950J664137q28883l919910k134560P98821M65022J076534
9416D10640O884162J1034424M625497o902122r399324j586504K626021l321455
9408D371339p486087R50273J2198674Q682287q569545j9928499j2920173L418943
9400a9282788J2118084P641121j542524m063434L263772J2235792J1278001l12815
9392B1335209r463840o151967J799027J05580r878120j3255041m493551O094150
9384a3908553J0172619J0724111J0013674L909543n550583p539042p44518J373459
9376H450710o085768p800118N661824J6810173O394438j3709067j6915962k826940
$$ plain form
9434 266227 -6364782 -6650390 -510778 3383893 1652534 1143032 6555668 11936717 10352432
9425 10352432 4996429 3289479 4953616 4124733 204823 -1929737 -1130916 -665894 410640
9416 410640 7294802 18329226 22954723 16052601 6653277 5066773 7692794 4371339
9408 4371339 -3114748 -2164475 10034199 18716486 10146941 -9781558 -22701731 -19282788
9400 -19282788 -7164704 476417 -1066107 -5129541 -1865769 10370023 21648024 21335209
9392 21335209 11871369 5719402 7518429 7624009 -2254111 -15509152 -20002703 -13908553
9384 -13908553 -3735934 6988177 17001851 20911394 15360811 7821769 7077251 8450710
9376 8450710 2364942 -5435176 226648 17036821 23431259 9722192 -7193770 -10020710
9368a0020710M731314k577534p479652J77013P117703K314579l832082P45330
9360h824039Q868462P924662Q33843k071104j649811n082501r833684p591006
9352a7425178J11085M087689L090044M382007R174923R634756K577866m200643
9344A1432549l518624J088954K117735o62482j973237r63731k263220o689005
9336a431061p642707r31221O565936N143799k503667l298749O759766J4478930
9328A7141026P268558q371118j5466639r236185p84526K70877l388509m469359
9320a7035875r32147M477975Q394023Q256432M070035j72322m05831K514286M817557
9311A3984133M447861L12767q140487j5298603j0442896O546999J7773461Q480381
$$ plain form
9368 -10020710 -5289396 -7866930 -15346582 -15169569 -8051866 -5737287 -9569369 -8824039
9360 -8824039 44423 7969085 8802928 6731824 5082013 -488 -9834172 -17425178
9352 -17425178 -17314093 -13226404 -10136360 -5754353 3420570 13055326 15633192 11432549
9344 11432549 7913925 9002879 11120614 10458132 8484895 7521164 5257944 -1431061
9336 -1431061 -9073768 -10004989 -3439053 1704746 -798921 -4097670 2662096 17141026
9328 17141026 24409584 16038466 571827 -8664358 -9448884 -9178007 -12566516 -17035875
9320 -17035875 -17968022 -13490047 -5096024 3160408 7230443 7058121 6652290 9166576 13984133
9311 13984133 18431994 18744761 10604274 -4694329 -15137225 -8590226 9183235 17663616
9303A7663616r846461j3236915J015224J2377872Q890975J147196o6328l24806
9295A7620373o203383j0327662m703435L568249L259348l394622o348225l700262
9287a0229619n74177J869828N355261P031458L074477l523599o882615o653525
9279a0532511n693621l360024K001878P395785Q239212M398891r13228m615418
9271c079036l671768K715838Q566411O209743j677296m213468P95840L392856
9263I039120j003113l854564N5012K540521k145922n278726M89538O232269K001532
9254H075667m604432j359092O660640N601863l705246q439872n060082r97686
9246c828240J098214M387345O182863J447977m467332k477391L112678N11271
$$ plain form
9303 17663616 7817155 -5419760 -4404536 7973336 16864311 18011507 17945179 17620373
9295 17620373 11416990 1089328 -3614107 -45858 3213490 -181132 -6529357 -10229619
9287 -10229619 -10803796 -8933968 -3578707 3452751 6527228 3003629 -3878986 -10532511
9279 -10532511 -16226132 -19586156 -17584278 -10188493 -1949281 2449610 1536382 -3079036
9271 -3079036 -6750804 -4034966 4531445 10741188 9063892 4850424 5646264 9039120
9263 9039120 8036007 4181443 4236455 6776976 4631054 -647672 -158134 6074135 8075667
9254 8075667 3471235 2112143 8772783 14374646 10669400 2229528 -2830554 -3828240
9246 -3828240 -2730026 1657319 7840182 9288159 4820827 2343436 5456114 5967385
9238E967385q226474r166907M7328O171038K172809l125109j160984M782026Q447367
9229E908479Q971188O719359J294551l938298m694444l201558l472750k152322
9221E434205M283279Q000816P24741q461566m752819O348828O152974n447356
9213A2283102r650510j942419Q85950p190152r864783L54546O459080k383440
9205a1048626r687323l69447J1938610Q721047j555008l73092P487024M321667
9197I434852p617101j0553273k068767L794279K645751L307087P207171O521307
9189A2671306K227662L034396O574777K294816o906427p181549J122828K942827
9181A6780636m238529n777917K247247M588314m661888q811782K614787J3468458
$$ plain form
9238 5967385 -2259089 -11425996 -11378668 -5207630 -3034821 -6159930 -7320914 -2538888 5908479
9229 5908479 14879667 21599026 22893577 18955279 14260835 11059277 7586527 5434205
9221 5434205 9717484 17718300 18443041 9981475 5228656 11577484 17730458 12283102
9213 12283102 2632592 690173 1576123 -5614029 -15478812 -15124266 -8665186 -11048626
9205 -11048626 -20735949 -21105396 -9166786 -445739 -2000747 -2373839 5113185 9434852
9197 9434852 1817751 -8735522 -10804289 -7010010 -4364259 -1057172 6149999 12671306
9189 12671306 14898968 17933364 24508141 26802957 19896530 12714981 13837809 16780636
9181 16780636 12542107 6764190 9011437 13599751 8937863 126081 2740868 16209326
9173A6209326O984385o169482o694143R22748j416989j1839702j0652651N715569
9165f940939J6827949Q824314o578557j1618854n968160q11188k26329N37855
9157e953909L823239O108185M136478j290681o588548p362406j551476O503895
9149b175223Q198798N34295q529703q476727J394984J1406694J2430923M439124
9141A9223165n305670r877548q326535n260040m893075n515555j835117O595760
9133a5194615J2814310J0947401M130203o498O07292J708760N31068r86276p82008
9124A3769637L99909J245867J029601j406645n650347p433619l480992K275582
9116G48993L535083J567886K421282N109036K986806k488048k056213M171441
$$ plain form
9173 16209326 23193711 17024229 10330086 11252834 9835845 -2003857 -12656508 -6940939
9165 -6940939 9887010 18711324 12132767 513913 -5454247 -6265435 -6491764 -5953909
9157 -5953909 -2130670 3977515 8113993 6823312 234764 -7127642 -8679118 -2175223
9149 -2175223 6023575 6557870 -1971833 -10448560 -9053576 2353118 14784041 19223165
9141 19223165 13917495 4039947 -4286588 -9546628 -14439703 -19955258 -21790375 -15194615
9133 -15194615 -2380305 8567096 12697299 12690801 13298093 15006853 15537921 14551645 13769637
9124 13769637 14169546 15415413 16445014 15038369 9388022 1954403 -1526589 748993
9116 748993 4284076 5851962 8273244 13382280 16369086 13881038 11824825 15996266
9108A5996266M142351n393591j1028171n267163o42729o973067j0767755K319412
9100a7614447J7978263J2189777q343782j4055016R62750J1057851K334027o882053
9092b372630n20021Q528736L933942n232048k647215O079125N136545l451336
9084I455098n934006j753277p78808k153667L138970J2203994J2194877J158268
9076B7531449r632397j3009703j0829343m006176P040140J4098866Q964078j766849
9068A8390065m727433p38901j587910p486412o182764M050768R089754J221369
9060A2028536r563305j2232027q298738l074066L170213R111751R558024M740187
9052E440575J855932K969840K321443j031938m98585M188218L957853l477901
$$ plain form
9108 15996266 20138617 14745026 3716855 -1550308 -2193037 -9166104 -19933859 -17614447
9100 -17614447 363816 12553593 4209811 -9845205 -8882455 2175396 4509423 -2372630
9092 -2372630 -2892651 5636085 9570027 4337979 1690764 7769889 12906434 9455098
9084 9455098 3521092 1767815 989007 -1164660 1974310 14178304 26373181 27531449
9076 27531449 17899052 4889349 -5939994 -9946170 -2906030 11192836 20156914 18390065
9068 18390065 13662632 12923731 11335821 3849409 -2333355 1717413 10807167 12028536
9060 12028536 2465231 -9766796 -18065534 -21139600 -17969387 -8857636 700388 5440575
9052 5440575 7296507 10266347 12587790 11555852 11057267 15245485 19203338 15725437
9044A5725437p951573l375875L154287M930137M770034M344132p96514q130776
9036A2669289o268691M497095O992038n304844j3533187k673488J1682474P150526
9028A5211212q764491j1269080J171279O761393j521661n961401L115489J0309736
9020I052476J915581j0610127q815205M572197J1059329K901746r088727j1814399
9012a0827129m317925M169198N123926p56608m221248J833394J2219350J4155865
9004A7378823L350919r460559j1041383j231849P537021M955458n608122j1033287
8996e152979l844754P933358R880529K2609p952934l594824N786605O807845k00889
8987I684566l851178p04212R87960k914774n207043j39363O511399O374811M52247
$$ plain form
9044 15725437 7773864 4397989 7552276 12482413 17252447 21596579 20800065 12669289
9036 12669289 6400598 10897693 17889731 12584887 -948300 -3621788 8060686 15211212
9028 15211212 6446721 -4822359 -3651080 3110313 1588652 -4372749 -1257260 9052476
9020 9052476 10968057 357930 -8457275 -3885078 7174251 10075997 987270 -10827129
9012 -10827129 -15145054 -10975856 -5851930 -6608538 -10829786 -8996392 3222958 17378823
9004 17378823 20729742 11269183 227800 -1004049 6532972 11488430 5880308 -5152979
8996 -5152979 -8997733 -1064375 8816154 8838763 885829 -2708995 3077610 9885455 9684566
8987 9684566 5833388 5129176 6117136 3202362 -2004681 -2144044 4367355 10742166 11194413
8978A1194413m208192m816739l730868k470669p12292L80227j185859m332653
8970i882632n116026j470073M133169P429405O849827M439419K448922O08088
8962I440099j615390j801842K456990P878237Q057790K642438k041042l247493
8954B1769787n302046r463315r071759j163727N527116L022995k701087j405987
8946A211977M700885N836300J388956j184997p47547k006064l055077J747217
8938G891650P460984L290642p249228q038646L713176J0439371O64907j3113142
8930E059714j3384289j832473P022778O854172K662377m19072j211169J59638
8922D911676J513451n41307m298541l631115J355750K870730j216648l026848
$$ plain form
8978 11194413 6986221 2169482 -1561386 -4032055 -4744347 -4364120 -5549979 -9882632
8970 -9882632 -14998658 -16468731 -12335562 -4906157 1943670 6383089 8832011 9440099
8962 9440099 7824709 6022867 8479857 16358094 24415884 27058322 25017280 21769787
8954 21769787 16467741 7004426 -2067333 -3231060 2296056 5319051 2617964 1211977
8946 1211977 5912862 11749162 13138118 11953121 11205574 9199510 6144433 7891650
8938 7891650 15352634 18643276 11394048 3355402 7068578 17507949 18172856 5059714
8930 5059714 -8324575 -10157048 -3134270 3719902 6382279 5963207 4752038 4911676
8922 4911676 6425127 5883820 1585279 -2045836 -690086 2180644 963996 -2062852
8914b062852Q73388K533092k488994n863615j610457K191937j646465n219356
8906a3293322O9481O725207M579595J00037M288171J0798774O519361l289773
8898A6497531k806695N766132N023361p358492j5119474j1976310r449579j1366652
8890c0790178n268591J1531284K0759938J1436835j148176n11283N111800N12972
8882A1634601q085545m346901Q216348J0503940j556819j1400345p509276K575091
8874C1094O713240K660144n105407j1298651r630792K495108J5845451J6029718
8866A7739905K209357j0119347r315002j403744J937469K88097P19894L308386
8858E365015J265500n748468q570054j905997O386103N130978m457061r606826
$$ plain form
8914 -2062852 -1189464 1343628 -1145366 -7008981 -8619438 -6427501 -8073966 -13293322
8906 -13293322 -13223841 -6498634 -1919039 -1819002 2469169 13267943 19787304 16497531
8898 16497531 13690836 19456968 24480329 17121837 2002363 -9973947 -19423526 -30790178
8890 -30790178 -36058769 -24527485 -3767547 7669288 6521112 6009829 11121629 11634601
8882 11634601 3549056 -797845 7418503 17922443 16365624 4965279 -2543997 31094
8874 31094 6744334 9404478 4299071 -6999580 -16630372 -14135264 1710187 17739905
8866 17739905 19949262 9829915 514913 -888831 1048638 1336735 2056629 5365015
8858 5365015 6630515 882047 -7688007 -9594004 -3207901 1923077 -2533984 -12140810
8850a2140810k976320P359463Q882831J404781l805869o87415L769158J459239
8842C265058l989538l050124M676388R372642N055024k482163m505829p40955
8834G600503K367390J461816q64581k120043l612048o397181p520439l998928
8826a3083511J235537J893600k581813m715857J419387J1147887J3866710O105972
8818A5287912m222511p771813m519786j745412l045024l621539J833896R749679
8810A945402J0819544K677570n817043o046753o14681K465904K092374K315925
8802I838242J519077m973607j1719181o853193O990800J0828159k783676j5098812
8794a2252191q188706O898403P752740l696398o230567M542655J0617555L881775
$$ plain form
8850 -12140810 -15117130 -7757667 1125164 2529945 -1275924 -1963339 1805819 3265058
8842 3265058 -724480 -3774604 901784 10274426 15329450 12847287 8341458 7600503
8834 7600503 9967893 11429709 10565128 8445085 4833037 -1564144 -9084583 -13083511
8826 -13083511 -11847974 -9954374 -12536187 -17252044 -15832657 -4684770 9181940 15287912
8818 15287912 11065401 3293588 -1226198 -2971610 -6016634 -9638173 -7804277 1945402
8810 1945402 12764946 15442516 9625473 3578720 2964039 5429943 7522317 9838242
8802 9838242 11357319 6383712 -5335469 -12188662 -5197862 5630297 2846621 -12252191
8794 -12252191 -20440897 -13542494 -5789754 -9486152 -15716719 -11174064 -556509 3325266
8786C325266j322723M501449R420274K954916m695069j844247L118631k637822
8778A2820675j2250939j0120149J936243Q845426O876363N292862O701934M218847
8770B4321262k259329m379643j648082l208631r739314q994622M050210J5721236
8762A3863087J1490847l568988j1723242n218418O170904Q716406J06303r589220
8754A0247679j0155490l017611J044088l535379r169225n729164M958240J1818460
8746c538402R746182M841372M147563O428235N260407k019087j0011369r732955
8738E121946O70947J0298346O731623n979080j0211803j87761P578363j004404
8730A3018177j4505094j3045153O01930O541570j36057m465843O90546M209473
$$ plain form
8786 3325266 2002543 6503992 15924266 18879182 14184113 12339866 15458497 12820675
8778 12820675 569736 -9550413 -7614170 1231256 8107619 13400481 20102415 24321262
8770 24321262 22061933 17682290 16034208 12825577 3086263 -5908359 -1858149 13863087
8762 13863087 25353934 21784946 10061704 4843286 11014190 19730596 19836899 10247679
8754 10247679 92189 -2925422 -1881334 -5416713 -14585938 -20315102 -15356862 -3538402
8746 -3538402 6207780 11049152 15196715 21624950 26885357 24866270 14854901 5121946
8738 5121946 5792893 16091239 22822862 16843782 6631979 6444218 14022581 13018177
8730 13018177 -1486917 -14532070 -13930140 -7388570 -7524627 -11990470 -11299924 -7090451
8722g090451l66119k226063O120988J3269374P185750m622971p564855k234651
8714B471002L89031j608966j274490K121586K344073j070514j751108J529864
8706C150478K385694j913932n311269k190239M136505N660277k79266p500438
8698a862190p428182R39131Q666546P068498j085960n482738k498992J682770
8690a117K624545L111416M321113J595666n459058q190003j725546N810772N444033
8681G531821R47883O75731L054476J521756j979854j044312J797134r90794o981414
8672D532427o492749K88261K893701j299754k664506L142131O937708J920167
8664I257386m275200k278405M014267N324393K321731J710176K081489l696081
$$ plain form
8722 -7090451 -7456570 -9682633 -3561645 9707729 16893479 12270508 4705653 2471002
8714 2471002 2860033 1251067 -23423 2098163 4442236 3371722 1620614 3150478
8706 3150478 5536172 3622240 -1689029 -3879268 257237 5917514 5638248 -1862190
8698 -1862190 -9290372 -8351241 315305 7383803 6297843 815105 -1683887 -1117
8690 -1117 2623428 5734844 10055957 11651623 6192565 -1997438 -3722984 2087788 7531821
8681 7531821 8479704 9155435 12209911 13731667 11751813 10707501 12504635 11513841 4532427
8672 4532427 -1960322 -1672061 1221640 -78114 -2742620 399511 7337219 9257386
8664 9257386 4982186 2703781 6718048 12042441 14364172 16074348 18155837 14459756
8656A4459756j3284308j4544169l344688Q328431P838506j276395n037021J855747
8648e004141J0043722Q712089j284750r967397j0086219l174763M146634O425744
8640a89081K603274l715410o634003l047848L673650O724513L265842k654156
8632B6781n012914k063783K805581M905123K420958j869458k814441J815380Q321145
8623H534372J0814474P471187J429679l339569m649342k194881J474998J535271
8615B1076189l391919p608171n447558j50591J064145q94740J005177N872971
8607A1525503M347172m625324q689609r17001P421403L412249p035919q295983
8599b857509R83303P167598L022406l962812n843280m415934l553402j692543
$$ plain form
8656 14459756 1175448 -13368721 -16713409 -8384978 -546472 -1822867 -6859888 -5004141
8648 -5004141 5039581 13751670 12466920 2499523 -7586696 -10761459 -6614825 -189081
8640 -189081 2414193 -1301217 -7935220 -10983068 -7309418 -584905 2680937 26781
8632 26781 -4986133 -7049916 -4244335 660788 3081746 1212288 -1602153 213227 8534372
8623 8534372 19348846 26820033 28249712 24910143 20260801 18065920 19540918 21076189
8615 21076189 17684270 10076099 4628541 4477950 5542095 4647355 5652532 11525503
8607 11525503 15872675 11247351 2557742 1640741 9062144 12474393 5438474 -2857509
8599 -2857509 -1874206 5293392 8315798 4352986 -1490294 -5906228 -9459630 -11152173
8591a1152173K812835O368478N238854P34628m007643p282167o678208j92414
8583a4157810P520237P161809k259179r139619m039206O952476J0895934N565511
8575H500153k32101j239509r71987k153152j449816K943895O084238L527303j696216
8566A3312808m352435m587935m868856l750948O80720M670033L661805N67095
8558E332287O71055J025863m010734q329857j62518J5005743J5240829n529426
8550A9243242k3283505j6434787K538253P660442l01310N14766J2898328J5065844
8542A7901273j381147j5647929j0541641K134087L628470l044246l422277L409029
8534f964381P581823O572691M934718L177231K0872j378461o16281m480792j3089063
$$ plain form
8591 -11152173 -8339338 -1970860 3267994 4002622 -5021 -7287188 -13965396 -14157810
8583 -14157810 -6637573 524236 -1734943 -10874562 -14913768 -7961292 2934642 8500153
8575 8500153 8268052 7028543 6056556 3903404 2453588 5397483 11481721 15009024 13312808
8566 13312808 8960373 4372438 -496418 -4247366 -3566646 1103387 4765192 5332287
8558 5332287 6003342 7029205 3018471 -5311386 -5473904 9531839 24772668 19243242
8550 19243242 -4040263 -20475050 -17936797 -10276355 -10577665 -10062899 2835429 17901273
8542 17901273 16520126 872197 -9669444 -7535357 -3906887 -6951133 -10373410 -6964381
8534 -6964381 617442 7190133 12124851 15302082 15322954 13944493 13328212 8847420 -4241643
8525d241643j3093181J434563J3691805P232268o904735o957163M845686Q355198
8517D362798O10937j749186N259794N519465o920384j5168321p278670M351946
8509a1011621M081134l419372m376604K377316Q300556R944663Q821482M209980
8501A8927534l281504p318964m109416O59008Q20444n08023K110365N671444L334581
8492A6305469m307541j0001459r214828l403036L231748O262471L818467r314
8484B681977J150707O207188O220378k504409j0782960p459649N766717J5647435
8476A6927384J2211426p48482r931516p173579M18550r65616j1528157j4632120
8468a5422110r86784J3811556R733644o961706j2205893o69414P689285O35984
$$ plain form
8525 -4241643 -17334824 -15900261 -2208456 5023812 -1880923 -8838086 -3992400 4362798
8517 4362798 4973735 3224549 8484343 14003808 7083424 -8084897 -15363567 -11011621
8509 -11011621 -6930487 -10349859 -14726463 -12349147 -4048591 5896072 14717554 18927534
8501 18927534 15646030 8327066 4217650 4876658 5697102 5189079 7299444 12970888 16305469
8492 16305469 11997928 1996469 -7218359 -10621395 -7389647 -1127176 2691291 2681977
8484 2681977 3832684 10039872 16260250 13755841 2972881 -4486768 1279949 16927384
8476 16927384 29138810 28390328 18458812 11285233 11703783 10738167 -789990 -15422110
8468 -15422110 -16408894 -2597338 7136306 174600 -12031293 -12700707 -5011422 -4375438
8460d375438q609250n406301L867274O110675K797774K612491M423087K053317
8452C473629k259026k279066N28036O83399j586719l502516o264530r907743q700539
8443b9815075l68703P282856P513863M795488N254835N528354R69812l385036
8435b223606j008932M206263N026657K969947K695013J485035m333204r237210
8427d20037o575926p52978J94738j826591m45787K313036R06621j818973k08115
8418h634012K173148j059735n794195l535085L877186Q302378Q776118Q167867
8410A2273670L070426q085534j3626857l034250J2233941J1686139l053178j0302616
8402A161741j516911Q178008N886562k018770m924477l508439k861403l167795
$$ plain form
8460 -4375438 -12984688 -18390989 -14523715 -8413040 -5615266 -3002775 1420312 3473629
8452 3473629 1214603 -1064463 -536427 146972 -1439747 -4942263 -11206793 -21114536 -29815075
8443 -29815075 -30183778 -22900922 -15387059 -10591571 -5336736 191618 1161430 -2223606
8435 -2223606 -3232538 973725 6000382 8970329 11665342 13150377 8817173 -420037
8427 -420037 -6995963 -7748941 -7554203 -9380794 -9826581 -7513545 -6606924 -8425897 -8634012
8418 -8634012 -6460864 -7520599 -13314794 -16849879 -12972693 -4670315 4105803 12273670
8410 12273670 15344096 7258562 -6368295 -9402545 2831396 14517535 11464357 1161741
8402 1161741 -355170 7822838 13709400 11690630 6766153 3257714 396311 -2771484
8394b771484l562915m486485k503892O097695J4632961J1785125j26521o935813
8386A2128671m948676n335501j2097234j3167134j435782J1176009J0961437J106204
8378a612006o748927q511075n881822R18348R109603J0958292M035522l941046
8370a673111o772648o988071o084262L75135J0785314J3829877O193858P87957
8362A0454049O039492J0327920J196776j2333210j4001750p008896o645778j2451733
8354b4423130r325579M679455J2851667O118795l457483k759958L854257N539167
8346f922809K742020K837197N611386M631955l26469k493027N58097L092155M57707
8337A0188212m315438o251019n772761n814249n037321j12353O270937O830778
$$ plain form
8394 -2771484 -6334399 -10820884 -13324776 -7227081 7405880 19191005 19064484 12128671
8386 12128671 7179995 1844494 -10252740 -23419874 -24855656 -13679647 -2718210 -1612006
8378 -1612006 -8360933 -16872008 -22753830 -21835482 -12725879 -1767587 2267935 -1673111
8370 -1673111 -8445759 -15433830 -21518092 -21142957 -10357643 3472234 9666092 10454049
8362 10454049 16493541 26821461 28018237 15685027 1683277 -5325619 -11971397 -24423130
8354 -24423130 -33748709 -29069254 -16217587 -10098792 -13556275 -16316233 -12461976 -6922809
8346 -6922809 -4180789 -1343592 4267794 8899749 8573280 6080253 6638350 9730505 10188212
8337 10188212 5872774 -378245 -6151006 -11965255 -17002576 -17114929 -10843992 -4013214
8329d013214R40829k614778J566083O515471L484622l812691m588337K488822
8321c3193Q292990P906904N749856M768852J017622p063245j2750217r770151
8313a880582q30565O893822R600359P024989M93449n672236n991118n04405M614374
8304A3748087N150424K822506Q9547l033373n606857n613850m537554n480362
8296b461432o128498j673276M621920L827971l561960o058433J196589Q324335
8288a912784O096835r35477l713660j642265J311633M810802Q295066O675027
8280A8985177j729576r419069r424304m605416p40949K375355N830880N292271
8272F564369j814523r169965r453711l751748L077593R330735J2700065Q323073
$$ plain form
8329 -4013214 -3072385 -5687163 -4121080 2394391 5879013 2066322 -2522015 -33193
8321 -33193 8259797 16166701 21916557 26685409 27703031 20639786 7889569 -1880582
8313 -1880582 -2711147 4182675 13783034 20808023 21301472 15629236 9638118 9133713 13748087
8304 13748087 18898511 21721017 21810564 18777191 13170334 7556484 3018930 -2461432
8296 -2461432 -8589930 -10263206 -5641286 -1813315 -5375275 -11433708 -10237119 -1912784
8288 -1912784 4184051 3248574 -465086 -2107351 -795718 4015084 12310150 18985177
8280 18985177 17255601 7836532 -1587772 -6193188 -6934137 -4558782 1272098 6564369
8272 6564369 4749846 -4420119 -13873830 -17625578 -14547985 -5217250 7482815 15805888
8264A5805888k007776p496929l062030K671406J799832j116894n97653j220246
8256D775598n741546n139253N185168J1633082K107555j1236531q663938N876734
8248a203131J1324532K035532p822710r602595q389632o330791J178768J0542345
8240h267682J0537213J361459l931270o4688M490599M379688L798579L943768
8232A6247666P61469k599074J705474R201443O924618l446557o344316M22047
8224B2872770J236303q700517j3710536n618836K022539m64541k202617M708099
8216A42664P832090j389894p762281J808825J2270108N040152q413849n776305
8208C751510O710127N201973r509686j3423634r78672O772541p76278q360753
$$ plain form
8264 15805888 13798112 6301183 3239153 5910559 7710391 6593497 5995844 4775598
8256 4775598 -965948 -6105201 -920033 10713049 12820604 1584073 -7079865 -1203131
8248 -1203131 10121401 12156933 4334223 -5268372 -13658004 -19988795 -18810027 -8267682
8240 -8267682 2269531 3630990 -300280 -364968 4125631 8505319 12303898 16247666
8232 16247666 17009135 14410061 16115535 25316978 32241596 28795039 22450723 22872770
8224 22872770 24109073 15408556 1698020 -3920816 -1898277 -2362818 -4565435 142664
8216 142664 7974754 6584860 -1177421 631404 12901512 17941664 9527815 3751510
8208 3751510 10461637 15663610 6153924 -7269710 -8248382 -1475841 -2252119 -10612872
8200a0612872m478398M95455k583826l966595N034238J3802372J0160933J206943
8192I058250L10850N095151M181004k884994p360876o651689m568784j282061
8184d103149M628987Q068883L082275n968557r155460m821539J99280J507025
8176f562255k52777m318659q269947n319943O475506J5747814J0591562k409765
8168E681536n556379L807649R610926K496081o615801n447979J115428J757913
8160F849374l124978n965604o236544p365611n877654K729098J1484926R590004
8152B083011O02661j533608N182568P410518j590446j1154371j0409666l525109
8144a2934442K83214J213461M002677P151883O739177M517787L474293J447157
$$ plain form
8200 -10612872 -15091270 -14595815 -17179641 -21146236 -16111998 -2309626 7851307 9058250
8192 9058250 9369100 14464251 18645255 15760261 8399385 1747696 -2821088 -4103149
8184 -4103149 525838 8594721 11676996 5708439 -3447021 -8268560 -8069280 -6562255
8176 -6562255 -6815032 -11133691 -19403638 -24723581 -18248075 -2500261 8091301 5681536
8168 5681536 125157 3932806 13543732 16039813 9424012 3976033 5091461 6849374
8160 6849374 3724396 -2241208 -8477752 -15843363 -21721017 -18991919 -7506993 2083011
8152 2083011 2685672 1152064 6334632 13745150 12154704 1000333 -9409333 -12934442
8144 -12934442 -12651228 -11437767 -7435090 -283207 6455970 10973757 14448050 15895207
8136A5895207k623556l136134K169060M166622m264964j3691407j0607450Q54038
8128a1238584N238238N05723r29462M445747N640694j245973m378762K706509
8120G44130P977446O12005r773246p876700L079228P330943R72163m933489l503049
8111e370569j34570l54483j486110J83814K840426L714552L785066M238450L149465
8102A0566041o76444l976061k746382J803758L821670l54741p064986q434079
8094g061224j662263O224011O062620j449873o108605j801209N360719N637555
8086E201731j838454r129821r167465j941515O546106R059621L775291k183057
8078C22437q2559Q083770J0898581L806811l979839l873827k99930p70336k288909
$$ plain form
8136 15895207 13271651 10135517 12304577 16471199 12206235 -1485172 -12092622 -11238584
8128 -11238584 -6000346 -5494623 -6424085 -1978338 3662356 2416383 -1962379 744130
8120 744130 8721576 9333581 -439665 -8316365 -5237137 2093806 3065969 -1867520 -5370569
8111 -5370569 -5505139 -5859622 -7345732 -7161918 -4321492 -606940 3178126 7416576 10566041
8102 10566041 9889597 5913536 3167154 4970912 8792582 8437841 1372855 -7061224
8094 -7061224 -8723487 -2499476 3563144 2113271 -3995334 -5796543 -435824 5201731
8086 5201731 3363277 -5766544 -14934009 -16875524 -10329418 -1269797 2505494 322437
8078 322437 239878 8323648 19222229 23029040 19049201 15175374 14875444 14105108 11816199
8069A1816199J153354M621287k54975q212753o517763L134325N603569k872250
8061H470993q127854k124906L436553k100352q870337k514022J0900765J3180482
8053A2251322J878263p399449n558559n05429l51783j232565J465558K127567
8045B674925m943173j2581552r131664L921424J2930837J0057145J516963l254848
8037A190057k792044p43996J504094L777110K714917m655588j3532952j3863130
8029b6401532k500150J1498014J6965355J2967851P132698M040208J109413l736519
$$ plain form
8069 11816199 12969553 17590840 17335865 9123112 2605349 5739674 11343243 8470993
8061 8470993 343139 -1781767 1654786 -445566 -9315903 -11829925 -929160 12251322
8053 12251322 14129585 6730136 1171577 666148 314365 -918200 547358 2674925
8045 2674925 -2268248 -14849800 -23981464 -20060040 -7129203 2927942 4444905 1190057
8037 1190057 -1601987 -2345983 -841889 2935221 5650138 994550 -12538402 -26401532
8029 -26401532 -28901682 -17403668 -438313 12529538 19662236 23702444 24811857 21075338
$$ [...]
##END NTUPLES=NMR SPECTRUM
##END=
