##TITLE=31Pdec_LR-748-C1-PE
 CDCl3, 24 sc
 18.3.2022
##JCAMPDX= 6.0         $$ Bruker NMR JCAMP-DX V2.0
##DATA TYPE= NMR SPECTRUM
##DATA CLASS= NTUPLES
##ORIGIN= UXNMR, Bruker Analytische Messtechnik GmbH
##OWNER= root
$$ XWIN-NMR		Version 3.5
$$ Fri Mar 18 13:28:33 2022 Russian Standard Time (UT+4h)  she@DPX200
##.OBSERVE FREQUENCY= 81.013821
##.OBSERVE NUCLEUS= ^31P
##.ACQUISITION MODE= SIMULTANEOUS
##.ACQUISITION SCHEME= undefined
##.AVERAGES= 24
##.DIGITISER RES= 16
##SPECTROMETER/DATA SYSTEM= spect
##.PULSE SEQUENCE= zgpg30
##.SOLVENT NAME= CDCl3
##.SHIFT REFERENCE= (INTERNAL, CDCl3, 0, 248.564)
##AUDIT TRAIL= $$ (NUMBER, WHEN, WHO, WHERE, WHAT)
$$ ##TITLE= Audit trail, XWIN-NMR		Version 3.5
$$ ##JCAMPDX= 5.01
$$ ##ORIGIN= Bruker BioSpin GmbH
$$ ##OWNER= she
$$ F:/spectra/data/she/nmr/P31/1/pdata/1/auditp.txt
$$ ##AUDIT TRAIL=  $$ (NUMBER, WHEN, WHO, WHERE, WHAT)
(   1,<2022-03-18 13:27:27.67 +0400>,<she>,<DPX200>,
      <created by zg, POWCHK disabled, PULCHK disabled
       configuration hash MD5:
       00 E9 B6 7A A2 85 ED C7 34 08 36 98 17 FE 4E 26
       data hash MD5: 32K
       94 69 90 6B 60 97 A5 C7 87 15 59 61 F3 04 A3 7A>)
(   2,<2022-03-18 13:27:31.73 +0400>,<she>,<DPX200>,
      <Start of raw data processing
       efp BC_mod = 2 LB = 1 FT_mod = 6 PKNL = 1 PHC0 = -9290.966 PHC1 = 54.2756 SI = 64K 
       data hash MD5: 64K
       9C 83 3E FF EE EA 71 16 6D 50 21 9C 86 68 E7 9E>)
(   3,<2022-03-18 13:27:47.40 +0400>,<she>,<DPX200>,
      <pk PHC0 = 136.778 PHC1 = 0 
       data hash MD5: 64K
       CB E9 15 C0 29 C9 55 B3 D3 5F A5 34 9A 40 1F 6A>)
(   4,<2022-03-18 13:27:51.50 +0400>,<she>,<DPX200>,
      <abs ABSG = 5 
       data hash MD5: 64K
       4C CF 60 66 74 B0 E3 49 E4 88 68 A0 4A C3 A4 32>)
$$ ##END=
$$ 
$$ hash MD5
$$ 78 CB 35 C8 D6 45 49 36 A5 F5 B1 25 11 93 08 B4
##$RELAX= 
##$RELAX= 
##$RELAX= 
##$RELAX= 
##$RELAX= 
##$RELAX= 
##$RELAX= 
##$RELAX= 
$$ Bruker specific parameters
$$ --------------------------
##$DU= <F:/spectra>
##$EXPNO= 1
##$NAME= <P31>
##$PROCNO= 1
##$TYPE= <nmr>
##$USER= <she>
##$AMP= (0..31)
100 100 100 100 100 100 100 100 100 100 100 100 100 100 100 100 100 100 
100 100 100 100 100 100 100 100 100 100 100 100 100 100 
##$AQSEQ= 0
##$AQ_mod= 1
##$AUNM= <au_zg>
##$AUTOPOS= <>
##$BF1= 81.014009
##$BF2= 200.13
##$BF3= 200.13
##$BF4= 200.13
##$BF5= 200.13
##$BF6= 200.13
##$BF7= 200.13
##$BF8= 200.13
##$BYTORDA= 1
##$CFDGTYP= 0
##$CFRGTYP= 5
##$CHEMSTR= <none>
##$CNST= (0..31)
1 1 145 1 1 1 1 1 1 1 1 1 1 1 1 1 1 1 1 1 1 1 1 1 1 1 1 1 1 1 1 1 
##$CPDPRG= <waltz16>
##$CPDPRG1= <>
##$CPDPRG2= <waltz16>
##$CPDPRG3= <>
##$CPDPRG4= <mlev>
##$CPDPRG5= <mlev>
##$CPDPRG6= <mlev>
##$CPDPRG7= <mlev>
##$CPDPRG8= <mlev>
##$CPDPRGB= <>
##$CPDPRGT= <>
##$D= (0..31)
0 1 0 0 0 0 0 0 0 0 0 0.03 2e-05 3e-06 0 0 0 0 0 0 0 0 0 0 0 0 0 0 0 0 
0 0 
##$DATE= 1647595647
##$DBL= (0..7)
120 120 120 11 120 120 24 19 
##$DBP= (0..7)
150 150 150 150 150 150 150 150 
##$DBP07= 0
##$DBPNAM0= <>
##$DBPNAM1= <>
##$DBPNAM2= <>
$$ [...]
##$SUBNAM3= <"">
##$SUBNAM4= <"">
##$SUBNAM5= <"">
##$SUBNAM6= <"">
##$SUBNAM7= <"">
##$SUBNAM8= <"">
##$SUBNAM9= <"">
##$SW= 501.771253377433
##$SWIBOX= (0..15)
0 1 3 0 0 0 0 0 0 0 0 0 0 0 0 0 
##$SW_h= 40650.406504065
##$TD= 32768
##$TD0= 1
##$TE= 0
##$TE2= 300
##$TE3= 300
##$TEG= 300
##$TL= (0..7)
0 120 53 12 22 120 120 120 
##$TP= (0..7)
150 150 150 150 150 150 150 150 
##$TP07= 0
##$TPNAME0= <>
##$TPNAME1= <>
##$TPNAME2= <>
##$TPNAME3= <>
##$TPNAME4= <>
##$TPNAME5= <>
##$TPNAME6= <>
##$TPNAME7= <>
##$TPOAL= (0..7)
0.5 0.5 0.5 0.5 0.5 0.5 0.5 0.5 
##$TPOFFS= (0..7)
0 0 0 0 0 0 0 0 
##$TUNHIN= 0
##$TUNHOUT= 0
##$TUNXOUT= 0
##$USERA1= <user>
##$USERA2= <user>
##$USERA3= <user>
##$USERA4= <user>
##$USERA5= <user>
##$V9= 5
##$VALIST= <valist>
##$VCLIST= <CCCCCCCCCCCCCCC>
##$VD= 0
##$VDLIST= <DDDDDDDDDDDDDDD>
##$VPLIST= <PPPPPPPPPPPPPPP>
##$VTLIST= <TTTTTTTTTTTTTTT>
##$WBST= 1024
##$WBSW= 4
##$XGAIN= (0..3)
0 0 0 0 
##$XL= 0
##$YL= 0
##$YMAX_a= 3264
##$YMIN_a= -3771
##$ZGOPTNS= <>
##$ZL1= 120
##$ZL2= 120
##$ZL3= 120
##$ZL4= 120
##$ABSF1= 248.5645
##$ABSF2= -253.2056
##$ABSG= 5
##$ABSL= 3
##$ALPHA= 0
##$AQORDER= 0
##$ASSFAC= 0
##$ASSFACI= 0
##$ASSFACX= 0
##$ASSWID= 0
##$AUNMP= <proc_1d>
##$AZFE= 0.1
##$AZFW= 0.5
##$BCFW= 0
##$BC_mod= 2
##$BYTORDP= 0
##$COROFFS= 0
##$CY= -3
##$DATMOD= 1
##$DC= 0
##$DFILT= <>
##$DTYPP= 0
##$F1P= 0
##$F2P= 0
##$FCOR= 1
##$FTSIZE= 65536
##$FT_mod= 6
##$GAMMA= 0
##$GB= 0
##$INTBC= 1
##$INTSCL= 5.30512e-09
##$ISEN= 30
##$LB= 1
##$LEV0= 0
##$LPBIN= 0
##$MAXI= 10000
##$MC2= 0
##$MEAN= 0
##$ME_mod= 0
##$MI= 50
##$NCOEF= 0
##$NC_proc= -7
##$NLEV= 6
##$NOISF1= 182.463
##$NOISF2= 159.3651
##$NSP= 0
##$NTH_PI= 0
##$NZP= 0
##$OFFSET= 248.5645
##$PC= 4
##$PHC0= -9154.188
##$PHC1= 54.2756
##$PH_mod= 1
##$PKNL= yes
##$PPARMOD= 0
##$PSCAL= 0
##$PSIGN= 0
##$REVERSE= no
##$SF= 81.014009
##$SI= 65536
##$SIGF1= 159.3651
##$SIGF2= -187.1042
##$SINO= 113.3802
##$SIOLD= 16384
##$SREGLST= <1H.CDCl3>
##$SSB= 0
##$STSI= 65536
##$STSR= 0
##$SW_p= 40650.406504065
##$SYMM= 0
##$S_DEV= 0
##$TDeff= 32768
##$TDoff= 0
##$TI= <>
##$TILT= no
##$TM1= 0
##$TM2= 0
##$TOPLEV= 0
##$USERP1= <user>
##$USERP2= <user>
##$USERP3= <user>
##$USERP4= <user>
##$USERP5= <user>
##$WDW= 1
##$XDIM= 65536
##$YMAX_p= 384579991
##$YMIN_p= -30060520
$$ End of Bruker specific parameters
$$ ---------------------------------
##NTUPLES= NMR SPECTRUM
##VAR_NAME=  FREQUENCY,     SPECTRUM/REAL,   SPECTRUM/IMAG
##SYMBOL=    X,             R,               I
##VAR_TYPE=  INDEPENDENT,   DEPENDENT,       DEPENDENT
##VAR_FORM=  AFFN,          ASDF,            ASDF
##VAR_DIM=   65536,         65536,           65536
##UNITS=     HZ,            ARBITRARY UNITS, ARBITRARY UNITS
##FACTOR=    0.620285442955139, 1,           1
##FIRST=     20137.2065510759, 0,            0
##LAST=      -20513.1999529892, 0,           0
##MIN=       -20513.1999529892, -30060520,   0
##MAX=       20137.2065510759, 384579991,    0
$$ Real data points
##PAGE= N=1
##DATA TABLE= (X++(R..R)), XYDATA
$$ [...]
39354H63902P94620n0343j610333j616697O22993K837262K542361J44940k029082
39345B499623k788588k459284j147580J085626K710904J951931k48339r80610
39337F23683L31729R81456o19296k292083j680962n1095O3957q41963m02338J225530
39327b661382J452110m11702k063798j934141j112391o16423N14890K786576M193721
39318A47460K795587r6704j513655p67836K61630K80711r0976j84475n23878j529636
39308a221772k302976j589615N96048K756240L042713P82076k462212l661759
39300d061257j307888K372041L512729J249710j184226p40690J553967K388663
39292C783049P50460j206644j541901p85891m03726o71053r84422j091636r42659
$$ plain form
39354 863902 1658522 1608179 -2154 -1618851 -995858 1841404 4383765 4528705 2499623
39345 2499623 -288965 -2748249 -3895829 -2810203 -99299 1852632 1604293 623683
39337 623683 955412 1936868 1317572 -974511 -2655473 -2706568 -2642611 -3484574 -3886912 -2661382
39327 -2661382 -1209272 -1620974 -3684772 -5618913 -6731304 -7347727 -6832837 -4046261 147460
39318 147460 2943047 2846343 1332688 564852 826482 1107193 1016217 831742 307864 -1221772
39308 -1221772 -3524748 -5114363 -4518315 -1762075 1280638 2062714 -399498 -4061257
39300 -4061257 -5369145 -2997104 515625 1765335 581109 -159581 1394386 3783049
39292 3783049 4533509 3326865 1784964 999073 595347 -75706 -1060128 -2151764 -3094423
39283c094423j69104J126364J668564M18050j564216k046771n99983O71833l4537
39274c624223j747177k063378k97020J893992K842574K642658K246495J790753
39266C684674P15411q16909j638863j050247N6881J84804q57223j712579j272093
39257b706144m4462O96886N90633L12899L44559M79771N34501O50820O83377J41896
39247A684736q44635j289929o30573M48092J071012J302908J411444Q21786r12586
39238C062255k586147k374928m61391Q84334L07140q93730p89852N46268J484297
39229h21754J146364J36334o50363q84679n75011J19132P15980O59074p7873q89929
39219a122725j028543j43687J258240J779050L44977k033813k666499l78176K476376
$$ plain form
39283 -3094423 -3263527 -2137163 -468599 -50549 -1614765 -3661536 -4261519 -3589686 -3624223
39274 -3624223 -5371400 -7434778 -7731798 -5837806 -2995232 -352574 1893921 3684674
39266 3684674 4400085 3583176 1944313 894066 950947 1135751 278528 -1434051 -2706144
39257 -2706144 -2750606 -2053720 -1463087 -1150188 -805629 -325858 208643 859463 1542840 1684736
39247 1684736 840101 -449828 -1080401 -632309 438703 1741611 3153055 3974841 3062255
39238 3062255 476108 -1898820 -2360211 -1475877 -1168737 -2062467 -2852319 -2306051 -821754
39229 -821754 324610 460944 -189419 -1074098 -1649109 -1529977 -813997 -154923 -232796 -1122725
39219 -1122725 -2151268 -2294955 -1036715 742335 1087312 -946501 -3613000 -3991176 -1514800
39210a514800K654107K33407j595269r53798N44560P43533O4646J34006P50262
39201A060654L56282j009847j405976N7662J684165J430540m26831j762992j134012
39192a150355Q60972K366599J947280j65011k144810k273603q11713L35707K8850
39183a006084q14337p82639J09944R22972J347878J543246J081667l29632j391211
39174F81804m37858J615623J706951r73008l079393j509888J857721K484434l91291
39165A955095k672954j344840J378186J612869n77994j750321l77705J242167
39157e35497P84566p84029j061007J48735R01874K59866n26799k60869L85862
39148f87298K59529j80061M30842J966826K626157J354955p74548k089701k153801
$$ plain form
39210 -1514800 1139307 1372714 -222555 -1176353 -631793 111740 176386 310392 1060654
39201 1060654 1416936 407089 -998887 -941225 742940 2173480 1746649 -16343 -1150355
39192 -1150355 -289383 2077216 4024496 3859485 1714675 -558928 -1370641 -1034934 -1006084
39183 -1006084 -1820421 -2603060 -2493116 -1570144 -222266 1320980 2402647 2073015 681804
39174 681804 243946 1859569 3566520 2593512 -485881 -1995769 -138048 2346386 1955095
39165 1955095 -717859 -2062699 -684513 928356 350362 -1399959 -1777664 -535497
39157 -535497 249069 -534960 -1595967 -1447232 -545358 -285492 -812291 -1073160 -687298
39148 -687298 -427769 -607830 -176988 1789838 4415995 5770950 4996402 2906701 752900
39139G52900j457355l49844P71927J095630L81063l02409J7368O50712L39622
39130A899614o74311j153257r19381o87179k65768R92042K108762J277128r67802
39121A609848j931336p96264K28594j23902o3666J536965K293890L1655l018325
39112b32541l153526o87790J083599J203319J437290J988064J069514r80670j325340
39103D01919N85357J651851J18359j558789r02139O45358N53020n66216n16137
39094D12583M82182M13465q87405j531862p06362K97715K54340m88221q55553
39085b609118l38131O00048R01826J15722o31303Q3029J574390J654794J01557
39076A452814p33544J88472O91814q26343k293930j262946Q71735J132020j71212
$$ plain form
39139 752900 -704455 -1054299 -282372 813258 1194321 891912 909280 1559992 1899614
39130 1899614 1225303 72046 -847335 -1534514 -1800282 -808240 1300522 2577650 1609848
39121 1609848 -321488 -1117752 -889158 -1013060 -1076726 460239 2754129 2785784 -232541
39112 -232541 -3386067 -4073857 -2990258 -1786939 -349649 1638415 2707929 1727259 401919
39103 401919 987276 2639127 2757486 1198697 296558 941916 1494936 928720 412583
39094 412583 894765 1308230 420825 -1111037 -1817399 -1519684 -1265344 -1753565 -2609118
39085 -2609118 -2947249 -2347201 -1445375 -1329653 -1960956 -1877927 -303537 1351257 1452814
39076 1452814 719270 907742 1599556 773213 -1520717 -2783663 -1911928 -779908 -951120
39067i51120l22383J016832J500168K53816j008479j104666o23175Q6735J295425
39058A43153K102744J120421q15305j434064p32097q66482k050833j906002L16579
39049d121886K212196K086203J144284M97634p28431k554349k669863j11994K360105
39040a886101K043957L9962j175260j486270j802702j351862N80631K096019J148524
39031a793102q20070q81969Q53825J810038J113612J49808l35528p26967p27908
39022a358261R7499N92269l58122j257211j74645J386632N01760j843266j698041
39013d111386J369388L208727J562372p13261o76362M42835L96557k02977k1267
39004A254626m2248j308291k026786k86222K142969K080007k70947j988382j902461
$$ plain form
39067 -951120 -1273503 -256671 1243497 1497313 488834 -615832 -1239007 -1152272 143153
39058 143153 2245897 3366318 2551013 1116949 384852 -481630 -2532463 -4438465 -4121886
39049 -4121886 -1909690 176513 1320797 1818431 1090000 -1464349 -4134212 -4246206 -1886101
39040 -1886101 157856 197818 -977442 -2463712 -4266414 -5618276 -5037645 -2941626 -1793102
39031 -1793102 -2613172 -3495141 -2641316 -831278 282334 432142 96614 -630353 -1358261
39022 -1358261 -1260762 -668493 -1026615 -2283826 -2458471 -1071839 -570079 -2413345 -4111386
39013 -4111386 -2741998 466729 2029101 1315840 639478 1082313 1478870 1275893 1254626
39004 1254626 1212378 -95913 -2122699 -2408921 -265952 1814055 1543108 -445274 -2347735
38995b347735j246185n84865O49297J838851J563278M14426M61370J574161J256143
38986C578741j130041k885585j999019p8994M20201k21015j84032O85293J050829
38977g63622N74446K10643L70748M56911J48679j50296j56269R707L05200O50251
38967A656398N00922n25057j717920j924797j092476k32223J40305M96299J080479
38958a618070J310694Q33688K17104j9914k18449o77309p37585J88389J228670
38949E07218R93799k32386o40993M25990J290604L06093j612982k139904p51482
38940a854043O80131O53247j5373K31207J225315J457740N19950k62008M8876
38931B685042M71918l60343j886055k175003p74215M06743k32180j516366j033934
$$ plain form
38995 -2347735 -3593920 -4178785 -3529488 -1690637 -127359 287067 748437 2322598 3578741
38986 3578741 2448700 -436885 -2435904 -2514898 -2094697 -2315712 -2499744 -1814451 -763622
38977 -763622 -189176 21467 392215 849126 997805 847509 691240 700947 1006147 1656398
38967 1656398 2157320 1632263 -85657 -2010454 -3102930 -3335153 -3194848 -2698549 -1618070
38958 -1618070 -307376 526312 743416 723502 505053 -172256 -909841 -721452 507218
38949 507218 1501017 1268631 627638 1053628 2344232 2650325 1037343 -1102561 -1854043
38940 -1854043 -1173912 -520665 -536038 -304831 920484 2378224 2898174 2636166 2685042
38931 2685042 3156960 2796617 910562 -1264441 -2038656 -1631913 -1864093 -3380459 -4414393
38922d414393J303843K839281J653673r32848k268170j730555q51704o37282l94514
38913e432669N75631J586787J674211J129017Q99963R89634N56146m98389j137348
38904C42983p07057O1790K10247J0895K91668O80848r7856j889687k522399o36983
38894d255551J973848K469676Q19408m06600j4263L78866m29999j030616p8997
38885e74228R33554J9373j657357j364294P03590J608701L12731r69686o36396
38876a624012P4017j55559m93934o8883J42460o20658j088918j91740Q65238P90866
38866b371123M78284Q56200O61140q85754j422125R76511L498812K236498j220428
38857B808015j902600L52622O27407k410836l749115m09414L157223K051530j413903
$$ plain form
38922 -4414393 -3110550 -271269 1382404 449556 -1818614 -3549169 -4400873 -5038155 -5432669
38913 -5432669 -4857038 -3270251 -1596040 -467023 432940 1422574 1978720 1480331 342983
38904 342983 -364074 -302284 -92037 -81142 210526 891374 793518 -1096169 -3618568 -4255551
38894 -4255551 -2281703 187973 1007381 600781 586518 965384 535385 -495231 -574228
38885 -574228 359326 378699 -1278658 -2642952 -1939362 -330661 -17930 -987616 -1624012
38876 -1624012 -1549995 -1705554 -2199488 -2268371 -2125911 -2746569 -3835487 -4027227 -3161989 -2371123
38866 -2371123 -1892839 -1036639 -375499 -1261253 -2683378 -1706867 1791945 4028443 2808015
38857 2808015 905415 1258037 1885444 -525392 -4274507 -4683921 -1526698 524832 -889071
38848h89071j995993J19632Q42287l30050l33389J021705O25829j727408k315997
38839d982455J61313K228647J459330J44127P06659J460666L3350k162889k293425
38830c244677o20685O46561J192684J978386K228902N26065j864755k133884k15518
38821a506921J077936L01137j037912j424943j170290p13673L37858J583111J550100
38812a003597J23286q41418m48401j80547j003508j264620M96626K509874K117084
38803E04779n9555j086287k55341K71528n63321j040791J07425J360607R05893
38794A44937m12751n57938M99149R89670J36821j016595j329628o90104M03211
38785a833228J160711O88682q85263j844370q92048O55611M92575j059270j286318
$$ plain form
38848 -889071 -2885064 -2765432 -1923145 -2253195 -2586584 -1564879 -939050 -2666458 -4982455
38839 -4982455 -4821142 -2592495 -1133165 -989038 -282379 1178287 1211637 -951252 -3244677
38830 -3244677 -3865362 -3218801 -2026117 -47731 2181171 2707236 842481 -1291403 -1506921
38821 -1506921 -428985 -127848 -1165760 -2590703 -3760993 -4474666 -4136808 -2553697 -1003597
38812 -1003597 -880311 -1721729 -2170130 -2350677 -3354185 -4618805 -4122179 -1612305 504779
38803 504779 445224 -641063 -896404 -624876 -1188197 -2228988 -2121563 -760956 144937
38794 144937 -267814 -825752 -326603 663067 799888 -216707 -1546335 -2236439 -1833228
38785 -1833228 -672517 16165 -869098 -2713468 -3605516 -2949905 -2457330 -3516600 -4802918
38776d802918P21861K499682J814906l28860j675740j720907j069632L06805K063292
38767b191511K350803K04891k095914j708916N76906J609000P05583O2926M56636
38758b9596L8148j771071k488192l63075K559805L158289J268819p94082j425630
38749A53415q26322Q8261N24444K58642K1336N78687J167133L27460j406869j702514
38739h16327O436J432455R90842K8625L2373J03596p94058j405642m19066Q69470
38729B8704P11900l3526L08023J041729O16501j73379L49087J317944O67835j075006
38719C759812j722106j296961j417853j528396K70866K851552K751173k59460
38711C408627k323473j192931R08926J308123K95950q02857j663774j654053K32647
$$ plain form
38776 -4802918 -4081057 -1581375 233531 -95329 -1771069 -3491976 -4561608 -4254803 -2191511
38767 -2191511 159292 364183 -1731731 -3440647 -2863741 -1254741 -549158 -486232 -29596
38758 -29596 8552 -1762519 -4250711 -4613786 -2053981 1104308 2373127 1579045 153415
38749 153415 -672907 -584646 -60202 198440 219776 798463 1965596 2293056 886187 -816327
38739 -816327 -809891 622564 1613406 1642031 1674404 1778000 983942 -421700 -840766 28704
38729 28704 740604 707078 1015101 2056830 2673331 2499952 2849039 4166983 4834818 3759812
38719 3759812 2037706 740745 -677108 -2205504 -1934638 916914 3668087 3408627
38711 3408627 1085154 -107777 801149 2109272 2405222 1602365 -61409 -1715462 -1482815
38702a482815K615791K256554r00923k679724q03754J476738O86841j357465r70776
38693a159533J213857J713988J12004q52478l29256l33847j575330k032810n78199
38684c821604R64662P27556l72155k33821J268787K206846J294665m17467r26731
38675F90738O1641P44723o8997r66410q8785J562670J274672j101530k680247
38666e71525j790810J0408R40895J137366P42462r78373l014647k441847R09309
38657e056762K922143J090596j362266o92882J278711O94419j409513r70234J884668
38648a621120L052921J400808Q1600N78887N93016j032566k010509r48598J09559
38639B03998n09553j295395o68289J85274j89847q35929m16340L12977J85184
$$ plain form
38702 -1482815 1132976 3389530 2488607 -191117 -994871 481867 1168708 -188757 -1159533
38693 -1159533 54324 1768312 1880316 1027838 698582 364735 -1210595 -3243405 -3821604
38684 -3821604 -2856942 -2129386 -2501541 -2735362 -1466575 740271 2034936 1617469 690738
38675 690738 752379 1497102 1428105 461695 372910 1935580 3210252 2108722 -571525
38666 -571525 -2362335 -2351927 -1411032 -273666 468796 -509577 -3524224 -5966071 -5056762
38657 -5056762 -2134619 -1044023 -2406289 -3099171 -1820460 -1126041 -2535554 -3505788 -1621120
38648 -1621120 1431801 2832609 2914209 3493096 4086112 3053546 1043037 94439 203998
38639 203998 -305555 -1600950 -2269239 -2083965 -2273812 -3109741 -3526081 -3213104 -3027920
38630c027920j45914L69281J181462J332964J109213R56376L34340q31237j162222
38621A16343P5815J350797J001485k70657o73436k948N18576K48784m00821q79687
38611A084251r00429n27147l99694j002472j495613o42310R00538J086233k80263
38602b176906j014290o7138Q72032N41521L09627J361676K084010O77509j513659
38593A074382j916946n54109O21037R84712J210849J015868k59931j488014r67893
38584b80045N57322Q10492l19142p64049O2103N64261K91696Q18989K293286K223137
38574F258050m40839k718208j671269R15566J038833j419122k560417n65383J490491
38565C27702L62100k502359l234299j097460J051849J328251R23682J165563J203440
$$ plain form
38630 -3027920 -3173834 -2804553 -1623091 -290127 819086 1775462 2109802 1278565 116343
38621 116343 192158 1542955 2544440 2273783 1600347 1597399 2115975 2364759 1963938 1084251
38611 1084251 183822 -343325 -743019 -1745491 -3241104 -3883414 -2982876 -1896643 -2176906
38602 -2176906 -3191196 -3258334 -2386302 -1844781 -1535154 -173478 1910532 2588041 1074382
38593 1074382 -842564 -1396673 -775636 209076 1419925 2435793 2175862 687848 -280045
38584 -280045 277277 1087769 768627 4578 66681 630942 922638 1741627 4034913 6258050
38574 6258050 5817211 3099003 1427734 2343300 3382133 1963011 -597406 -1162789 327702
38565 327702 689802 -1812557 -5046856 -6144316 -5092467 -3764216 -2840534 -1674971 -471531
38556d71531R5635r28199l58187Q35375N97330q47636j308646j6021J442087J605141
38546F45348O57485o40452j702702j665864o8901J751921J785497J43097j112045
38537b06616j097959r31897j134787p13462M76757J027710O38068Q50847J875729
38528G84390J516370r21497k516083j028111J230618R01061j100330j307514N84980
38519a856116J533495K36656j173647q63370L19995R16731Q67262O34529K27049
38510H42584j96900k48819k01290n84365q91129k67836O30438L67547o80521n95650
38500a825941Q74346J585177K61867j524139j790101q86662m43251p99175r35324
38491e483203k81337O59178J226374J285147J042921O49205L2629q23820j361804
$$ plain form
38556 -471531 -375896 -1304095 -1662282 -826907 -229577 -1077213 -2385859 -2401880 -959793 645348
38546 645348 1302833 662381 -1040321 -2706185 -2775086 -1023165 762332 905429 -206616
38537 -206616 -1304575 -2236472 -3371259 -4084721 -3607964 -2580254 -1942186 -1091339 784390
38528 784390 2300760 1379263 -1136820 -2164931 -934313 -33252 -1133582 -2441096 -1856116
38519 -1856116 -322621 -85965 -1259612 -2122982 -1802987 -886256 -18994 615535 842584
38510 842584 645684 396865 195575 -388790 -1279919 -1547755 -917317 -549770 -1230291 -1825941
38500 -1825941 -951595 633582 895449 -628690 -2418791 -3305453 -3748704 -4547879 -5483203
38491 -5483203 -5764540 -5105362 -3878988 -2593841 -1550920 -901715 -869086 -1692906 -3054710
38482c054710p07129J004147K151716J408661m75684j705699j698238j030609
38474d107545J77403J941579K853168J255609j664148k424878Q2713K735972K521256
38465C371129O69570K34283J105740M44233k277537l802957j721663J788851K768621
38456B580270P27127j124603n82186Q55679P00601r77038k213050k176402j622601
38447c832203q62061N84601K158437K213005N49330q29879n13818M44086O11398
38438E22896L88188N89751N24454m88268j136253o7456J299817O71610j131106
38429A173633j143798Q98072J892729J68935k040025k143851o93773K07850k5952
38420a706180n95664r03138n60217P39726K078438J620164n76088j804568m72092
$$ plain form
38482 -3054710 -3761839 -2757692 -605976 802685 327001 -1378698 -3076936 -4107545
38474 -4107545 -3930142 -1988563 864605 2120214 456066 -1968812 -1886099 849873 3371129
38465 3371129 4040699 4274982 5380722 5824955 3547418 -255539 -1977202 -188351 2580270
38456 2580270 3307397 2182794 1600608 2456287 3156888 2179850 -33200 -2209602 -3832203
38447 -3832203 -4694264 -4109663 -1951226 261779 811109 -18770 -532588 -88502 522896
38438 522896 911084 1500835 2025289 1537021 400768 333312 1633129 2304739 1173633
38429 1173633 29835 927907 2820636 2989571 949546 -1194305 -1888078 -1680228 -1706180
38420 -1706180 -2301844 -3204982 -3765199 -3025473 -947035 673129 97041 -1707527 -2179619
38411b179619J205889N14847j393504j382684M67862J048102m42781j017821J069684
38402b110025L083411J819056j460828k837438j127385J316203K481317K488768
38394C653079J585087o01411k954815k843783J52070K768951K318531L84546j86353
38385D275902M499j341962l106587j846516J931776L312141K86539k854900k079984
38376a419092L58282J75954j803797j520266J146416K293686P39520k41143J157467
38367H87027K208108N17210j819015j712445k7285J47639j405260j887947p4408
38358c166376J739809J083000j219971k200377o87708J259273J282570L4841R5081
38349a779858J827967K512127N55987j663221j238890Q06607J333433J02953m02537
$$ plain form
38411 -2179619 -973730 -458883 -1852387 -3235071 -2767209 -1719107 -2161888 -3179709 -2110025
38402 -2110025 973386 2792442 1331614 -1505824 -2633209 -1317006 1164311 3653079
38394 3653079 5238166 4636755 1681940 -1161843 -1009773 1759178 4077709 4462255 4275902
38385 4275902 4280401 2938439 -168148 -2014664 -82888 3229253 3515792 660892 -1419092
38376 -1419092 -1060810 -884856 -2688653 -4208919 -3062503 -768817 -29297 -270440 887027
38367 887027 3095135 3612345 1793330 80885 53600 201239 -1204021 -3091968 -3166376
38358 -3166376 -1426567 -343567 -1563538 -3763915 -4451623 -3192350 -1909780 -1874939 -1779858
38349 -1779858 48109 2560236 3116223 1453002 214112 1020719 2354152 2457105 2054568
38340B054568L95128M78260o24722q49207L19646N34549j058830j751134K14133
38331b87609K309270J703995k02283m69331M01862j68447j951858k215200m21108
38322a300709Q65512J9637j528946j782828n93251R73039J992636J968110J012336
38313A625536p3011p70403j455337k110567j517602P22060K532792J856334j17779
38304F92023o32651M45983Q86232J36073k6015Q82252R66170n82770j831385j263025
38294c27113j07034L4650k81121J32037Q81781J037875P97598M95476m92997k182416
38284a1264k863461j444561M55680P16418k41874o45634l11969j03913L34871
38275d115707J588916K169832L37078k244378k081098P56932K329052O99069j362653
$$ plain form
38340 2054568 2449696 2927956 2303234 1454027 1773673 2308222 1249392 -501742 -287609
38331 -287609 2021661 3725656 3523373 3054042 3455904 3287457 1335599 -879601 -1300709
38322 -1300709 -435197 -415560 -1944506 -3727334 -4320585 -3347546 -1354910 613200 1625536
38313 1625536 1552525 782122 -673215 -2783782 -4301384 -3579324 -1046532 809802 692023
38304 692023 59372 505355 1391587 1527660 1501645 2383897 3350067 2767297 935912 -327113
38294 -327113 -434147 -399497 -680618 -548581 333200 1371075 2168673 2664149 2171152 -11264
38284 -11264 -2874725 -4319286 -3863606 -3147188 -3389062 -4034696 -4346665 -4450578 -4115707
38275 -4115707 -2526791 -356959 -19881 -2264259 -4345357 -3588425 -1259373 -560304 -1922957
38266a922957j011136O24183J138773P30292P65898Q20403L7103m16653P16873
38257A482779J902956J013458q46555j082232j69598p02739k408648k262816J63689
38248b909706J668871P23438k19429O79010J557478N92314o19466j50257P12582
38239B034835M0721j071967o34644M79339K16093q68143q67800j96721n20121
38230a388408j138150j15974J673492J437338p78654j917842p49876O38994P38669
38221a600411N84680R23246O35840o76186j345165m01599O76174M77261j57865
38212h84025K5958M83098K7573j135803j818808j321581J99181J815570K086615
38203e22222N85051r16474n51331O20841J00123j686024j627467R14379K631586
$$ plain form
38266 -1922957 -2934093 -2309910 -1171137 -440845 325053 1145456 1182559 765906 1482779
38257 1482779 3385735 4399193 3552638 2470406 2300808 1598069 -810579 -3073395 -2909706
38248 -2909706 -1240835 -517397 -736826 -57816 1499662 2091976 1472510 1322253 2034835
38239 2034835 2075556 1003589 368945 848284 1064377 196234 -671566 -868287 -1388408
38230 -1388408 -2526558 -2642532 -969040 468298 -310356 -2228198 -2978074 -2339080 -1600411
38221 -1600411 -1015731 -92485 543355 -132831 -1477996 -1879595 -1203421 -726160 -884025
38212 -884025 -858067 -374969 -347396 -1483199 -3302007 -4623588 -4424407 -2608837 -522222
38203 -522222 62829 -853645 -1404976 -784135 -684012 -2370036 -3997503 -3083124 -451538
38194d51538J349261o65942n40888Q93422J175606L34054P9134M08670j13625
38185B468154j432232j847083o69409P79888R97443P7155n21395K65608J527244
38176A645373J188954q63015j818303n76J717566r7259l224954k323030K339120
38167a436124M318737P76515k954207j771720J500188J403748j386306k083016
38159a632185J43720J667101O08555j265700k074475j330576J047866L654056
38151H18362L082946j538116n235006l004804K479758M151754O98796k192854
38143g39164q60090J765288J905719K11573q16688p19778k22361M71529P92580
38134A788608j70118j550305j234742N88608J245452j89036j467811r93637j7840
$$ plain form
38194 -451538 897723 231781 -309107 584315 1759921 2093975 2173109 2581779 2468154
38185 2468154 1035922 -811161 -1480570 -700682 296761 373916 -147479 118129 1645373
38176 1645373 2834327 1971312 153009 152433 1869999 1772740 -1452214 -3775244 -1436124
38167 -1436124 2882613 3659128 704921 -1066799 433389 1837137 450831 -1632185
38159 -1632185 -1488465 178636 787191 -478509 -2552984 -3883560 -2835694 818362
38151 818362 3901308 2363192 -2871814 -5876618 -3396860 754894 1453690 -739164
38143 -739164 -1599254 166034 2071753 2283326 1466638 746860 524499 996028 1788608
38134 1788608 1618490 68185 -1166557 -577949 667503 478467 -989344 -1982981 -2000821
38125b000821J67679K39373O83232M81148n80504r39959p858O69860K88707J60420
38115h38723Q73691Q92685m11259j110297K2021J194605N95626o51760p04489
38106a37900p4340k17706p71432m16728P57398J590586J509749N60885j002885
38097A797627k212028j951399p91014m42619q30272p9597J860749K528482J114697
38088I94626J63599J314275K487569J592704J2136k97231l10696j441270k157354
38079B358358o36425J329956Q37454j338860k177222j322597p94657q05382J98747
38070b350628J800050J752393r2518j412301j148448m98375p3481P63448J481506
38061B21646N61409j331088j517914M61445J800245P49556q75420r87451l62798
$$ plain form
38125 -2000821 -1833142 -1593769 -910537 -429389 -1009893 -1949852 -1957710 -1287850 -999143 -838723
38115 -838723 34968 927653 516394 -593903 -571882 622723 1218349 566589 -137900
38106 -137900 -212240 -429946 -1201378 -1618106 -860708 729878 2239627 2800512 1797627
38097 1797627 -414401 -2365800 -3156814 -3599433 -4429705 -4509302 -2648553 -120071 994626
38088 994626 1158225 2472500 4960069 6552773 6564909 6267678 5956982 4515712 2358358
38079 2358358 1721933 3051889 3889343 2550483 373261 -949336 -1743993 -2549375 -2350628
38070 -2350628 -550578 1201815 1109297 -303004 -1451452 -1949827 -2023308 -1259860 221646
38061 221646 783055 -548033 -2065947 -1604502 195743 945299 69879 -917572 -1280370
38052a280370n90008j113422n57233N73655P89384K40910L10029J043480R83672
38043D00097l36304j364361o17168J224079K145231J300333j97514j047280j359011
38034A48102j754700j714854l54329J390935J358136n26705j616646l98547J103759
38025b364849O02448p35094m07408J073591J118706m16910j071463j16806L93571
38016a924214m13486n80620R80598K167354J072486p69827q80310L41971Q39196
38007H33148M68404N69340Q85911o2614j694568j469678R97844K582584Q95161
37998D005532k101361k710467n33678J357241R14898m89576p29970n2471j36664
37989d76516j167557j635457q51617j8318k97173j011498o44234J001986K499636
$$ plain form
38052 -1280370 -1870378 -2983800 -3541033 -2967378 -2177994 -1937084 -1627055 -583575 400097
38043 400097 63793 -1300568 -1917736 -693657 1451574 2751907 2554393 1507113 148102
38034 148102 -1606598 -3321452 -3675781 -2284846 -926710 -1453415 -3070061 -3468608 -2364849
38025 -2364849 -1762401 -2497495 -2904903 -1831312 -712606 -1129516 -2200979 -2317785 -1924214
38016 -1924214 -2337700 -2918320 -1937722 229632 1302118 532291 -348019 -6048 833148
38007 833148 1301552 1870892 2756803 2694189 999621 -470057 527787 3110371 4005532
37998 4005532 1904171 -806296 -1339974 17267 932165 442589 -287381 -339852 -476516
37989 -476516 -1644073 -3279530 -4131147 -4149465 -4446638 -5458136 -6102370 -5100384 -2600748
37980b600748K456726Q91863r85091j948734j681472p46306K21619J079306J759434
37971a553403J724913N81822q55741j039689M34128K116529K307646Q80882q39864
37962C757223j582520j184777m87137l82710p87189p27245J78671Q39345J58261
37953b18078j091150j157288J28700J191573J147771P54997O41731L21014m45965
37944A273305r40415q43106p55768p43534p6815R03736O77971p65844j339677
37935b610147k01513O89074J7318m49587Q18687J875353M69315j624756j176186
37926b192442J009509J293224p26356j658902r5414J291881N49047n05407J12233
37917i22627J120635N34182p94353p88510L50670P73393J02935l52348q564L30159
$$ plain form
37980 -2600748 -144022 747841 -237250 -2185984 -3867456 -4613762 -4392143 -3312837 -1553403
37971 -1553403 171510 753332 -102409 -1142098 -707970 1408559 3716205 4597087 3757223
37962 3757223 2174703 989926 502789 120079 -667110 -1394355 -1215684 -376339 -218078
37953 -218078 -1309228 -2466516 -2337816 -1146243 1528 756525 1398256 1719270 1273305
37944 1273305 332890 -510216 -1265984 -2009518 -2086333 -1182597 -504626 -1270470 -2610147
37935 -2610147 -2811660 -2122586 -2105268 -2554855 -1736168 139185 608500 -1016256 -2192442
37926 -2192442 -1182933 110291 -616065 -2274967 -2370381 -1078500 -529453 -1034860 -922627
37917 -922627 198008 732190 -62163 -850673 -500003 273390 376325 23977 15413 345572
37907C45572J10400k11795j75284J5451k743k49803m46631j80194P13916J556867
37897A475756J127692p64801k424918j941130K76635J584806K43283k190156k519384
37888e132217J54351L214184L679509J580961o85735j452316q77873K89558J239793
37879B010215Q43111r95492j984563m2379K779032K259959j499611l501221j352072
37870a483021R97828q2528j872015l64110K352834J600911j460735j547626J624487
37861b33975K836280L18336j658570o65110J07377j357636j693920J275440L374411
37852B302633O32012l404331k780501J477048L223770P38855j691110j308829
37844h10453k66698o70102j191752l20780Q76820J188883J384904J937552J255045
$$ plain form
37907 345572 455972 244177 68893 84344 81601 -168202 -614833 -795027 -81111 1475756
37897 1475756 2603448 1838647 -586271 -2527401 -2250766 -665960 -422677 -2612833 -5132217
37888 -5132217 -4977866 -1763682 1915827 3496788 2811053 1358737 480864 770422 2010215
37879 2010215 2853326 1857834 -126729 -169108 2609924 4869883 3370272 -130949 -1483021
37870 -1483021 -485193 -567721 -2439736 -2803846 -451012 1149899 -310836 -1858462 -233975
37861 -233975 2602305 2920641 1262071 596961 704338 -653298 -2347218 -1071778 2302633
37852 2302633 2934645 -469686 -3250187 -1773139 1450631 2189486 498376 -810453
37844 -810453 -1077151 -1747253 -2939005 -3259785 -2382965 -1194082 190822 2128374 3383419
37835C383419j472834l632467k099183K064240M323905K211720j758770l430681
37827d10651j925303M6728K33035n09222k33033Q97247J103032R1851l98599N59272
37817e45643J613632J344648L20609k10652l50110q82912j519679j223523J43052
37808a310578J525960J751070M04297j715999k721924j314782J174051J782624
37800d25281k95138k418841k048802n1724R79256L71221m17232l31519L00442
37791d337618Q77078J156770J020843O10566L64093K79552j80127r39753j122110
37782b270706n72972k37220l38009J87439J536750K175537J304284K56292N9533
37773B100928k73671j358704j678446l62404O32673k32363r50396O94628K721053
$$ plain form
37835 3383419 1910585 -1721882 -3821065 -1756825 2567080 4778800 3020030 -410651
37827 -410651 -2335954 -2289226 -2056191 -2565413 -2798446 -1901199 -798167 -706316 -1104915 -545643
37817 -545643 1067989 2412637 2733246 2522594 2172484 1289572 -230107 -1453630 -1310578
37808 -1310578 215382 1966452 2370749 654750 -2067174 -3381956 -2207905 -425281
37800 -425281 -720419 -3139260 -5188062 -5239786 -4260530 -3889309 -4306541 -4638060 -4337618
37791 -4337618 -3460540 -2303770 -1282927 -672361 -308268 -28716 -208843 -1148596 -2270706
37782 -2270706 -2843678 -3080898 -3418907 -3231468 -1694718 480819 1785103 2041395 2100928
37773 2100928 1827257 468553 -1209893 -1572297 -939624 -1171987 -2122383 -1427755 1293298
37764A293298J736743j320186k424976p13964P23092J62586p14560m89077M7019
37755a700025L07057Q99048J436643N16475j334404j708979j29719J072122M53811
37746a87971p60703j266093j223209o66056P13051J733494Q04345q39246m81008
37737b173396J228654R41959j306838j595269R94706K325488L22860j334468R2077
37728e04227J438880k99003k037091j49167K467781J206317j886200j577095J235363
37719a04442J267663j464828j737827J123812J778247j298553k465209J414042
37711a487095N082342L232658j152236k269361p20774j087415l310603l078049
37703d790533K76695K376332Q38092j314313p99222J215200J673208L06688n82989
$$ plain form
37764 1293298 3030041 1709855 -715121 -1429085 -705993 -543407 -1257967 -1747044 -1700025
37755 -1700025 -1392968 -493920 942723 1459198 124794 -1584185 -1713904 -641782 -187971
37746 -187971 -948674 -2214767 -3437976 -4104032 -3390981 -1657487 -853142 -1692388 -2173396
37737 -2173396 -944742 -2783 -1309621 -2904890 -1910184 415304 738164 -596304 -504227
37728 -504227 934653 635650 -1401441 -1550608 917173 2123490 237290 -1339805 -104442
37719 -104442 1163221 -301607 -2039434 -915622 862625 -435928 -2901137 -1487095
37711 -1487095 3595247 6827905 5675669 3406308 2685534 1598119 -1712484 -4790533
37703 -4790533 -4513838 -2137506 -1299414 -2613727 -3412949 -2197749 -524541 -217853 -800842
37694h00842K39429J487070J361441r5137j058728k56300J136832P64651j571961
37685A206455l164820j945465N00575J126570k29593q33719P44198K638560K580991
37676B623752R70221j99506l10755m71179j217213j333733M28506L149339M198155
37667G837587K122418j512093l764283l494989k091478j155506o91361n9582M90124
37658b319163L35833j81244j45975M96560R20609O69004M1866n77348r35836p00880
37648b396574L9905L62408l06877q75063J08789J870948J918120l24262k180512
37639a783118j265427J103344J816265M06475o10509K13883J125490O8637j993493
37630i18453k403000o80871Q68986N74577l75469q7296R79982P77249r55432j938171
$$ plain form
37694 -800842 -561413 925657 2287098 2191961 1133233 876933 2013765 2778416 1206455
37685 1206455 -1958365 -3903830 -3403255 -2276685 -2506278 -3339997 -2595799 42761 2623752
37676 2623752 3593973 3394467 3083712 2612533 1395320 61587 490093 3639432 7837587
37667 7837587 9960005 8447912 4683629 1188640 -902838 -2058344 -2749705 -2809287 -2319163
37658 -2319163 -1983330 -2164574 -2310549 -1813989 -893380 -224376 -182510 -759858 -1695694 -2396574
37648 -2396574 -2356669 -1994261 -2301138 -3176201 -3067412 -1196464 721656 397394 -1783118
37639 -1783118 -3048545 -1945201 -128936 277539 -332970 -119087 1006403 1075040 -918453
37630 -918453 -3321453 -4002324 -3133338 -2558761 -2934230 -3021526 -2041544 -1264295 -2219727 -4157898
37620d157898n16256J898388K693571J470246J67198Q6146L37382l31660j426503
37611B20614j440460j05262J214278J373155P41322K71615P2497k84344n07335
37602A556080J51156J249221J125615o64617k075609j171803Q31496J105900n25110
37593A582329j318203r5988P24076q10461k531887j234236K097549L324086R94560
37584B731825j925945k516343j279174j45743M19984Q63621R36433K96281m26959
37575a046020m81820p2615K87853N49710N88972P6248n08710j50740P98968P71745
37565H13591k02592j00115J409404J576349r31391k849077r34309K377003K157994
37556C316857j313045k814108k41017K420716J587626q10930j196085J38468N10287
$$ plain form
37620 -4157898 -4674154 -2775766 -82195 1388051 1555249 1641395 1978777 1647117 220614
37611 220614 -1219846 -1325108 -110830 1262325 2003647 2275262 2347759 2063415 1556080
37602 1556080 1707236 2956457 4082072 3417455 1341846 170043 1001539 2107439 1582329
37593 1582329 264126 168138 892214 81753 -2450134 -3684370 -1586821 1737265 2731825
37584 2731825 805880 -1710463 -2989637 -3135380 -2715396 -1851775 -915342 -619061 -1046020
37575 -1046020 -1527840 -1600455 -1312602 -762892 -173920 -97672 -606382 -757122 41846 813591
37565 813591 610999 510884 1920288 3496637 2565246 -283831 -1218140 1158863 3316857
37556 3316857 2003812 -810296 -1051313 1369403 2957029 2146099 950014 1088482 1598769
37547A598769m67211r36487k85625K27022k46036j321063k281334k212017k06362
37538f130344K884546M100628J832995j414015k036738k18303Q60850J14817l00467
37529c06031Q08761J527213J84890j704308j750594k44592N77977j33039j071958
37520b111681r46631Q0662J092406J436236R14654k24168j234660j314800l70128
37511b678110Q38731J420119J159122N74652J87543j45974q85875j783981j790590
37502c104363m16991J311912J933655J223165Q6579p95414j247324q84495N12746
37493a380530J846929J425247n81168j734841l85097J894406K219149J75443j766198
37484A713340j615890k48348K10027o20374j145952l43101P22668N27766o18693
$$ plain form
37547 1598769 1131558 195071 -90554 136468 -109568 -1430631 -3711965 -5923982 -6130344
37538 -6130344 -3245798 854830 2687825 1273810 -762928 -981231 -120381 -5564 -306031
37529 -306031 502730 2029943 2214833 510525 -1240069 -1484661 -906684 -1039723 -2111681
37520 -2111681 -3058312 -2977650 -1885244 -449008 465646 241478 -993182 -2307982 -2678110
37511 -2678110 -1839379 -419260 739862 1314514 1502057 1356083 470208 -1313773 -3104363
37502 -3104363 -3521354 -2209442 -275787 947378 1033957 238543 -1008781 -1893276 -1380530
37493 -1380530 466399 1891646 1310478 -424363 -809460 1084946 3304095 3479538 1713340
37484 1713340 97450 -150898 59129 -561245 -1707197 -2050298 -1327630 -799864 -1418557
37475a418557j074533l91005P7222n22316j047162k36789J023666Q95259m87205
37466c181420j035955K51119J863921J933478N96402n24319m16131M07653O83522
37457E78270k21620j433440j274237N86162K181916J539887n46369j574796q88152
37448a052379j72476l06282j29216Q49845J024824m58516j627427n75596J316575
37439a130648J500269K68821p8062P44757P46703p40420j980539j686042n21433
37430b876594P05321K011260K782127J753573n30113j477558j6194J599829J092069
37421E043720o01814j271426r71925j282291k114171j841164k85785Q05376M85317
37412b034163j84748r0757M75794Q85398J170479J244035N12795p97841j146010
$$ plain form
37475 -1418557 -2493090 -2884095 -2806873 -3329189 -4376351 -4613140 -3589474 -2694215 -3181420
37466 -3181420 -4217375 -3966256 -2102335 -168857 427545 -96774 -512905 -105252 578270
37457 578270 356650 -1076790 -2351027 -1764865 417051 1956938 1410569 -164227 -1052379
37448 -1052379 -1224855 -1531137 -1660353 -810508 214316 -244200 -1871627 -2447223 -1130648
37439 -1130648 369621 638442 560380 1305137 2051840 1311420 -669119 -2355161 -2876594
37430 -2876594 -2171273 -160013 2622114 4375687 3845574 2368016 2351822 3951651 5043720
37421 5043720 4441906 3170480 2198555 916264 -1197907 -3039071 -3324856 -2519480 -2034163
37412 -2034163 -2218911 -2309668 -1833874 -948476 222003 1466038 1978833 1180992 34982
37403C4982K87831J923990J532645p46620k515249k241452r63954m59918q61235
37394d008980r81422k98282N29013R07342R31776O24758k75811j247843q96817
37385d716266R96822K317405J106951j283479j532765R85612L016900J868996
37377B760176q89967j869791n88052M49122k15289j215013q93894L39922J025910
37368a096876P22088J45970k8868J59358J19021o71195j775076j778142l4077
37359d237797J867303J752973n9749j071882k99655M16153k51137p18355O54452
37350a947694K199865J234890j269342j582368J058286K831996P57592k878281
37342D04944l648803q98080J896916J965748J16302j291488j226909j68408J110356
$$ plain form
37403 34982 322813 2246803 3779448 3032828 517579 -1723873 -2687827 -3147745 -4008980
37394 -4008980 -4990402 -5288684 -4759671 -3852329 -2920553 -2295795 -2571606 -3819449 -4716266
37385 -4716266 -3719444 -1402039 -295088 -1578567 -3111332 -2125720 891180 2760176
37377 2760176 1870209 418 -587634 -138512 -353801 -1568814 -2462708 -2122786 -1096876
37368 -1096876 -374788 -228818 -257686 -98328 20693 -650502 -2425578 -4203720 -4237797
37359 -4237797 -2370494 -617521 -677270 -1749152 -2048807 -1632654 -1883791 -2602146 -1947694
37350 -1947694 252171 1487061 217719 -1364649 -306363 2525633 3283225 404944
37342 404944 -3243859 -4141939 -2245023 -279275 -162973 -1454461 -2681370 -2849778 -1739422
37333a739422J895568J497249j07515j833555k358417j395264J81810J252611
37325b606935J237299L31176o12081o59256K85668J237749J166455J85790o18377
37316e2512m50408M22553J044525O31527p18151j830813j360806N20258J768932
37307b4895P56168j370045j897701j66315J576966J435493L13719M6870O31889
37298A302149R12471P69816O71302J4947j719459k799212j065920K034223K404727
37289B525044p78298l203038j354918K375804L199512N95821j720426j487555
37281A51946j95666K68881J62529K51171J32055n25799q15253J579J079596J114326
37271A625365O8644j068582j537132j153675j14757R33745J249109Q74997N32913
$$ plain form
37333 -1739422 156146 1653395 1545880 -287675 -2646092 -4041356 -3859546 -2606935
37325 -2606935 -1369636 -1038460 -1650541 -2309797 -2024129 -786380 380075 565865 -52512
37316 -52512 -502920 -80367 964158 1595685 877534 -953279 -2314085 -1793827 -24895
37307 -24895 731273 -638772 -2536473 -2702788 -1125822 309671 623390 670260 1302149
37298 1302149 2214620 2984436 3655738 3670685 1951226 -847986 -1913906 120317 2525044
37289 2525044 1746746 -1456292 -2811210 -435406 2764106 3359927 1639501 151946
37281 151946 -43720 225161 387690 638861 770916 245117 -570136 -568557 511039 1625365
37271 1625365 1694009 625427 -911705 -2065380 -2180137 -1246392 2717 877714 1410627
37262A410627L54261l55306j651413k329727j547806j48806N91734P81166J314798
37253a580472J960984J441369m33247j911670j333906N61073J323161q6825j751955
37244a811488j208137J106256K241431P81025j206972j288290r7628J46352p00300
37235b037751r34701k04136K31774K53012R69860J787469N91986k189486l047501
37226d579474o10490J810953J286692k08408M27624J828636O20967k201406k279172
37217c904078R79513L072734J217299j715301j932985L3482J196883O39861l89205
37208h01797j091297j324318m29967J746014L344895K202027j059818l339909
37200g54170k598282O4532J939170J481127m79947j775737j182937K50085O43737
$$ plain form
37262 1410627 1764888 1409582 -241831 -2571558 -4119364 -4268170 -3676436 -2895270 -1580472
37253 -1580472 380512 1821881 1388634 -523036 -1856942 -1295869 27292 -59533 -1811488
37244 -1811488 -3019625 -1913369 328062 1109087 -97885 -1386175 -1483803 -1337451 -2037751
37235 -2037751 -2972452 -3176588 -2944814 -2691802 -1721942 65527 657513 -1531973 -4579474
37226 -4579474 -5189964 -3379011 -2092319 -2300727 -1873103 -44467 576500 -1624906 -3904078
37217 -3904078 -2924565 148169 1365468 -349833 -2282818 -2249336 -1052453 -412592 -801797
37208 -801797 -1893094 -3217412 -3647379 -1901365 1443530 3645557 2585739 -754170
37200 -754170 -3352452 -3287920 -1348750 132377 -347570 -2123307 -3306244 -3056159 -2412422
37191b412422q4790k39420P90675J379013L29870r49175n53296Q76421J200056
37182C36932J55022m61399J39640N61938l98693j849710k108919q69945P07250
37173c787884J424799R92320k4563p74407q22434m11628L3970L65397M46883L4630
37163b522917n57987l90320O83847J285081L73731q47459m62273J155409J729573
37154D46685M65688r02004q47313L5405N52395N90406L76797k71875r01447k83182
37144g38445J392331J883419J21702j571908o80006J434823J353687j192948k896456
37135h93801j720339O53671J909561K030948J916904J258086m66413k283851k703158
37126b98392j605731J5426J381531J981341J284173l85209j479944r50694L07238
$$ plain form
37191 -2412422 -2497212 -2736632 -1945957 -566944 -237074 -1186249 -1739545 -863124 336932
37182 336932 491954 30555 170195 732133 333440 -1516270 -3625189 -4495134 -3787884
37173 -3787884 -2363085 -1370765 -1395328 -2169735 -2992169 -3403797 -3369827 -3004430 -2557547 -2522917
37163 -2522917 -3080904 -3471224 -2787377 -1502296 -1128565 -1976024 -2438297 -1282888 446685
37154 446685 912373 10369 -836944 -801539 -249144 341262 718059 446184 -455263 -738445
37144 -738445 653886 2537305 2659007 1087099 407093 1841916 3195603 2002655 -893801
37135 -893801 -2614140 -1960469 -50908 1980040 3896944 5155030 4688617 2404766 -298392
37126 -298392 -1904123 -1888697 -507166 1474175 2758348 2373139 893195 -57499 249739
37117B49739P95854M65929K55079L16311R5415l28766l91729k32774m15892o70459
37107A38707k09417P59630J060898J96508r95759j426705q01686L09817Q96587
37098g1420L88392l82087R3579J633922J988982L8637k060508j794793r0916K32638
37088b3574j093792j729345o91673N99413J234619J697099J571211l07595k687029
37079a430666k380136P49991K746140J367100n07469J45001J407271j11488l206818
37070a221074l685262q12144J893006J993417O89228j73532m79151n28476Q7609
37061b236379J317882K107511J790101Q54284O5230j94571R5146K97255n61391
37052C535068k045510j985920M74491K752675J952314r09943k368036j423655
$$ plain form
37117 249739 1045593 1511522 1766601 2082912 2178327 1849561 1457832 1225058 809166 138707
37107 138707 -70710 688920 1749818 1946326 950567 -476138 -1277824 -968007 -71420
37098 -71420 316972 -65115 28464 1662386 3651368 3690005 1629497 -165296 -256212 -23574
37088 -23574 -1117366 -2846711 -3538384 -2938971 -1704352 -7253 1563958 1256363 -1430666
37079 -1430666 -3810802 -3060811 -314671 1052429 544960 689961 2097232 1985744 -1221074
37070 -1221074 -4906336 -5718480 -3825474 -1832057 -1142829 -1316361 -1795512 -2323988 -2236379
37061 -2236379 -918497 1189014 2979115 3833399 3898629 3704058 3799204 4096459 3535068
37052 3535068 1489558 -496362 -21871 2730804 4683118 3773175 1405139 -18516
37044a8516j66202N5345J3036J60275j40317n76391P9602J402519J545261N53451
37034B908063N39861J809228J879532l95191k632153k496385r64365k23366m58079
37025c2855n60046k66321R0856M89235N77807l34197j663102j751463n82453r4110
37015d126649p57659m55513J734546L389658K430249M12294k48011Q896l90482
37006A997329q45024J5296J300200J246308K85800j13218l19949j333402k047858
36997A85482q95272R23777J164149M81798J098236K327593J398614j486558k983805
36988B214014j871900n80883o93375p41579K91338R51216M87971O46281K170060
36979B873143K609094J99690k639581k610600m02068P82186K09230l1832R14336
$$ plain form
37044 -18516 -184718 -129373 -116337 43938 -96379 -672770 -593168 809351 2354612 2908063
37034 2908063 3447924 5257152 7136684 6741493 4109340 1612955 648590 425224 -32855
37025 -32855 -592901 -859222 -768366 -279131 298676 -35521 -1698623 -3450086 -4032539 -4126649
37015 -4126649 -4884308 -5339821 -3605275 -215617 2214632 2626926 2378915 2387811 1997329
37006 1997329 1152305 1167601 2467801 3714109 3999909 3886691 3566742 2233340 185482
36997 185482 -709790 213987 1378136 1859934 2958170 5285763 6684377 5197819 2214014
36988 2214014 342114 -238769 -932144 -1673723 -1382385 -431169 56802 703083 2873143
36979 2873143 5482237 5681927 3042346 431746 29678 811864 1021094 989262 1903598
36970A903598J327103q585j759874j998457p19488N30745P70249N08798O67666
36961A221755J044367M05068j529576k870318j624286J186851K263341M38399
36953E35601j520931p67588J647089K528448J114591l94379m64622k3066k46170
36944B408973n98602r9510Q46282J123005O30867J63253o3636o15699j503671
36935B291262j631197j73350J944050K678072J117204j336207k368619j201797
36927A319418O72274J214299K5900j370140j363670j16323P01858N2699j095586
36918D0729j067523J88315J048439O08519n1444L00181J018107O63939n04013
36909B245249p60420L18121R44393k64767j986672j770885N54408K372222J465960
$$ plain form
36970 1903598 3230701 3222116 1462242 -536215 -1255703 -724958 45291 554089 1221755
36961 1221755 2266122 2671190 1141614 -1728704 -3352990 -2166139 97202 535601
36953 535601 -985330 -1752918 -105829 2422619 3537210 3142831 2678209 2655143 2408973
36944 2408973 1810371 1710861 2557143 3680148 4311015 4474268 4410632 3794933 2291262
36935 2291262 660065 486715 2430765 5108837 6226041 4889834 2521215 1319418
36927 1319418 1991692 3205991 3231891 1861751 498081 381758 1083616 1136315 40729
36918 40729 -1026794 -838479 209960 818479 767035 1067216 2085323 2749262 2245249
36909 2245249 1484829 1802950 2747343 2482576 495904 -1274981 -720573 1651649 3117609
36900C117609j194331k607434j341530R24079J674043N28048q04080r83654l56914
36891a044164J02569M1308l16717n04543J12248J593158K613636J706277m00524
36882C903248j320314m79416p4599j398881k377475q05184J790299K240151N19456
36873A997285n58835J17331Q19642M00543j77615k44813n02649q70886o148J851635
36863B825490K206027R4326j834868j023580J229459J948376P88392l10378n87549
36854E335695r04571j280839o37134Q46970J367491J12032j423163j497160l53414
36845A565907L52247l39146j686086k018194l94182K195309L473298K200221m35975
36836D913399k291909k630533k169321j331337J41582J831776K396484J311264
$$ plain form
36900 3117609 1923278 -684156 -2025686 -1101607 572436 1100484 296404 -687250 -1044164
36891 -1044164 -941595 -900287 -1217004 -1721547 -1609299 -16141 2597495 4303772 3903248
36882 3903248 2582934 2103518 2028919 630038 -1747437 -2552621 -762322 1477829 1997285
36873 1997285 1438450 1555781 2375423 2775966 2598351 2353538 1850889 980003 973855 2825490
36863 2825490 5031517 5125843 3290975 2267395 3496854 5445230 6233622 5923244 5335695
36854 5335695 4431124 3150285 2513151 3360121 4727612 4839644 3416481 1919321 1565907
36845 1565907 1918154 1579008 -107078 -2125272 -2519454 -324145 3149153 5349374 4913399
36836 4913399 2621490 -9043 -2178364 -3509701 -3368119 -1536343 860141 2171405
36828B171405j82934o49993k12627R0371N7576L30680Q86264P59606l75959j353249
36818A521140r79365K63601Q87571M33080j79883k51543r0778O1785O58234J654347
36808C978189J787551K13985j811939k210646p64246O87645P10165j71235n59552
36799A859917L3764P80090M53880j210770k804379k430841j53487J644331J361458
36790d66037N84430J682218L811678L728412N81777k596276k951597j200214K12562
36781C386953N27282O76605J086525J120896K74179j160067k346938k354161r44901
36772B66373P09237R65019k21130j118247n72695N35052P62292k0970q77315r91723
36762e64107j22190J163492J432246j39344k006142j700849N29437J695592N51840
$$ plain form
36828 2171405 1988471 1338478 1125851 1216222 1273798 1604478 2490742 3250348 2874389 1521140
36818 1521140 541775 805376 1692947 2126027 1946144 1694601 1603823 1665608 2323842 3978189
36808 3978189 5765740 5979725 4167786 1957140 1192894 1880539 2590704 2419469 1859917
36799 1859917 1893681 2673771 3127651 1916881 -887498 -3318339 -3471826 -1827495 -466037
36790 -466037 118393 1800611 5612289 9340701 9922478 7326202 4374605 3174391 3386953
36781 3386953 3914235 4590840 5677365 6798261 7072440 5912373 3565435 1211274 266373
36772 266373 975610 1940629 1719499 601252 28557 563609 1325901 1304931 427616 -564107
36762 -564107 -686297 477195 1909441 1770097 -236045 -1936894 -1407457 288135 839975
36753H39975m24597P88241K162820R14118j547208j423374J502167L253677J336929
36744G402748k023097l333159k135367m55430L50982N56871O99577P17033M24632
36735B204790P4050J63451P56739J114185L89730j092453j802884p76848J031118
36726B061878J810181R93914k98279o51734K96226J598666J759569K30922j599571
36717F201772j669603J78782J869463J829700Q35922L24816K09686l35995j033122
36708H411421r95304l37303K08102O79390J410621J704374O04065j235380j976227
36699H473759r39906P00553J618316J680239J517480J575031J724578J479395
36691A7829445Q09040P51237K314934M598649N411856M334496L481317M293097
$$ plain form
36753 839975 415378 1203619 3366439 4280557 2733349 1309975 2812142 6065819 7402748
36744 7402748 5379651 2046492 -88875 -544305 -193323 363548 1063125 1780158 2204790
36735 2204790 2278840 2442291 3199030 4313215 4702945 3610492 1807608 1030760 2061878
36726 2061878 3872059 4865973 4567694 3915960 4212186 5810852 7570421 7801343 6201772
36717 6201772 4532169 4710951 6580414 8410114 9246036 9570852 9780538 9444543 8411421
36708 8411421 7416117 7078814 7286916 7966306 9376927 11081301 11685366 10449986 8473759
36699 8473759 7533853 8234406 9852722 11532961 13050441 14625472 16350050 17829445
36691 17829445 18638485 19389722 21704656 26303305 31715161 36049657 39530974 43824071
36683D3824071N488134N641025N793019P446408R734177J1081165J2279088J5157584
36675A16444671J9211050K2435631K4946253K8916520L4947726M0604365M2116537
36668C29622753L5755941J9201297n044138k8323590m1676922m3538883l9285535
36661B26710923l3971675k8865630k4275307k1039027j8416191j4582785j0331615
36654G5228693q581872r274377q809125n885310l646273m121392m815315l390075
36646B6704954j688448j938065k588236j508676j54626o72412j600155n60191
36638A5994145J081396N51274j228605j362629l59891j071879l095694l114127
36630G393990p75340N26254n49318j174796M97479K025884P16067k015594k802284
$$ plain form
36683 43824071 49312205 54953230 60746249 68192657 77926834 89007999 101287087 116444671
36675 116444671 135655721 158091352 183037605 211954125 246901851 287506216 329622753
36668 329622753 365378694 384579991 379535853 351212263 309535341 265996458 226710923
36661 226710923 192739248 163873618 139598311 118559284 100143093 85560308 75228693
36654 75228693 66646821 57372444 48563319 42678009 39031736 34910344 30095029 26704954
36646 26704954 25016506 23078441 20490205 18981529 18826903 18154491 16554336 15994145
36638 15994145 17075541 17626815 16398210 15035581 14675690 13603811 10508117 7393990
36630 7393990 6618650 7144904 6595586 5420790 5918269 7944153 8660220 6644626 3842342
36621C842342r77214J115775J375655j11937j734073j930497n57496R53904J331185
36612C307644J093243J391589J690740L76393k295528l762660k280438Q88769
36604D09752K965511K369697j80261k321451j995801K12904J288281l44415k225378
36595A78839j271407J317181J698252n09656j588009K16977J974868J128518m11923
36586B733640O2457J288864L89146j948704k373392j41156J948377J859293O09976
36577D428501j79293m73304o71048k98499R11138J903638J453584j82939j539412
36568E352366j510719k38374J229777J845235J329656K33125p45693j301898j378548
36559D814927j008380n52039m67687m59748L58016J829059K194221K43261k618539
$$ plain form
36621 3842342 2865128 3980903 5356558 5244621 3510548 1580051 1022555 1976459 3307644
36612 3307644 4400887 5792476 7483216 7859609 5564081 1801421 -479017 409752
36604 409752 3375263 5744960 5564699 3243248 1247447 1460351 2748632 2404217 178839
36595 178839 -1092568 224613 1922865 1413209 -174800 42177 2017045 3145563 2733640
36586 2733640 2796097 4084961 4474107 2525403 152011 10855 1959232 3818525 4428501
36577 4428501 4249208 3775904 3104856 2806357 3717495 5621133 7074717 6891778 5352366
36568 5352366 3841647 3603273 4833050 6678285 8007941 8241066 7495373 6193475 4814927
36559 4814927 3806547 3254508 2786821 2327073 2685089 4514148 6708369 6951630 4333091
36550D333091l747142k417430l88246N38189L01465r5161J09107R95740J908751
36541A538364J763893L12868j022505p13816N98068Q32302m52022j413550q08301
36532F35301L10888O17616M03211K17776n35301j909800k055379J04503K206793
36523d392J352153j189509j555933O30018J622021k20109j661618j44416J704641
36514E32856N14283j853413j187897J911788K707552j20501k475007j395173Q32669
36505e32843J090786J31975J39870O41002M6602r65327r27149p41798j914718
36496c031600k920240j149891K130252K855575M58036j019835O77908K421679
36488D21884Q20556k264765k579125J69409K352103J966768P10522L71757K75590
$$ plain form
36550 4333091 585949 -1831481 -2219727 -1681538 -1380073 -1475234 -1366127 -370387 1538364
36541 1538364 3302257 3615125 2592620 1878804 2476872 3309174 2857152 1443602 635301
36532 635301 946189 1563805 1967016 2184792 1649491 -260309 -2315688 -2211185 -4392
36523 -4392 1347761 158252 -1397681 -767663 854358 634249 -1027369 -1171785 532856
36514 532856 1047139 -806274 -1994171 -82383 2625169 2504668 29661 -1365512 -532843
36505 -532843 557943 689918 829788 1470790 1517392 552065 -375084 -1116882 -3031600
36496 -3031600 -5951840 -7101731 -4971479 -2115904 -1657868 -2677703 -1999795 421884
36488 421884 1242440 -1022325 -3601450 -3432041 -1079938 886830 1597352 1969109 2244699
36479B244699n55706j104217k3790J744423J899683r9788k316361k742418j347383
36470b300858M28721J307813R78417M583o29141l89536R0872j93322q30579r3590
36460a626620K291138L713851J830548j593623k483601j82180J514670J48120
36452C612303j618069m37608K017575J492237j959487l750784j636275J261255
36444a018853J660905P37944J149563K269434J540342r94450k679654k216983
36436D48248r44880j92665L12178J013934J369253P80016m73579j635767k039204
36427a362466j352234j12206L61212l69547q66158J31577J358408O94003j250045
36418b767456j678195J12271J695460J512812J082854J682501J564169r53677
$$ plain form
36479 2244699 1688993 584776 560986 2305409 4205092 4105304 1788943 -953475 -2300858
36470 -2300858 -1872137 -564324 414093 418676 -210465 -600001 -509129 -702451 -1533030 -1626620
36460 -1626620 664518 4378369 6208917 4615294 2131693 1949513 3464183 3612303
36452 3612303 1994234 1556626 3574201 5066438 3106951 -643833 -2280108 -1018853
36444 -1018853 642052 1379996 2529559 4798993 6339335 5344885 2665231 448248
36436 448248 -496632 -689297 -377119 636815 2006068 2786084 2312505 676738 -1362466
36427 -1362466 -2714700 -2826906 -2465694 -2835241 -3701399 -3569822 -2211414 -1517411 -2767456
36418 -2767456 -4445651 -4333380 -2637920 -1125108 -42254 1640247 3204416 2250739
36410B250739l668381l063911K36815K022096N72737j090091j09703J873639J365730
36401C89670j713537l847595k603229N25180K385277J928153P75939O00522J078876
36392d80744Q77281r3449n34068J41398Q59120O79486L01608O18593Q74442l8003
36382C205664j213015q17556P18503J001115n29796j588599p12893M97582K89852
36373H50857l05901N02890K027391K229040R55807k72882q89345j390779j490096
36364B216982n83278L11633l78900j788080j253896J566983L589596K188231j623761
36355D245510m674183m756024j837856K098195L957965K145985j147740k128389
36347b096537k66375J309859Q28226K78278J362950K190411N98717j729204j755083
$$ plain form
36410 2250739 -1417642 -4481553 -4244738 -2222642 -1649905 -2739996 -2849699 -976060 389670
36401 389670 -1323867 -5171462 -7774691 -7249511 -4864234 -2936081 -2160142 -1559620 -480744
36392 -480744 396537 303088 -230980 -89582 769538 1449024 1750632 2369225 3243667 3205664
36382 3205664 1992649 1175093 1893596 2894711 2364915 776316 63423 561005 850857
36373 850857 544956 1047846 3075237 5304277 6260084 5987202 5097857 3707078 2216982
36364 2216982 1633704 1945337 1566437 -221643 -1475539 91444 3681040 5869271 4245510
36355 4245510 -428673 -5184697 -7022553 -4924358 -966393 1179592 31852 -2096537
36347 -2096537 -2362912 -1053053 -224827 53451 1416401 3606812 4205529 2476325 721242
36338G21242l7508L52741r76804j296419M19390J671474M74816j507853j479792
36329a658713N79865K164989J565716l22811j317990m44049J004451J036535l97110
36320B210883j203481j60970J071997L44951j573298j979316k68622J209653O65398
36311C17195p26224q11348N52755J603355J100550k29074o46260M27753J435258
36302C023960N39504j530534j945437J68843J997430J047972r35317p17751J165584
36293B814254J398094m01597r40140J165720K956319J886256l61033j032127m54854
36284G030892l94961n33400L97053J474070P09096j399542k288594j169847k657
36275C822110m07604j634733k070509j236906J74635J137102Q75634m37561j450076
$$ plain form
36338 721242 683734 1036475 59671 -1236748 -817358 854116 1328932 -178921 -1658713
36329 -1658713 -1078848 1086141 2651857 2329046 1011056 567007 1571458 2607993 2210883
36320 2210883 1007402 846432 1918429 2263380 690082 -1289234 -1557856 -348203 317195
36311 317195 -409029 -1220377 -667622 935733 2036283 1807209 1160949 1588702 3023960
36302 3023960 3563464 2032930 87493 256336 2253766 3301738 2366421 1648670 2814254
36293 2814254 4212348 3810751 2870611 4036331 6992650 8878906 8517873 7485746 7030892
36284 7030892 6635931 6102531 6499584 7973654 8682750 7283208 4994614 3824767 3822110
36275 3822110 3414506 1779773 -290736 -1527642 -1353007 -215905 659729 222168 -1227908
36266a227908r66835M32513R92274R6049q57712k03298J886273L389651K497380
36257F038387l42061k654517k579039r24253J89389K73865N82838J426361J469376
36248C480346L33337k87172N80284J252999O6236j678542j619047L4834J100001
36239C263276Q18332L11763J73002q4988m52233m84179p07320j747524k299788
36230a209659n06480K544618L438332J178182j320664j516789m79388l15231o81147
36221A131774l2752J271165J553297P12884K79592P72403R55527j0765j237032
36212E396093j523003j038171p99557j019369q30766K59979J309165R93942m01442
36203B346871j027098K5738J250056Q06103p41898j341307o46124l10252r61484
$$ plain form
36266 -1227908 -2194743 -1762230 -769956 -673907 -1531619 -1734917 151356 3541007 6038387
36257 6038387 5696326 3041809 462770 -461483 -272094 1771 584609 2010970 3480346
36248 3480346 3813683 3526511 4106795 5359794 5426030 3747488 2128441 2163275 3263276
36239 3263276 4081608 4393371 4566373 4481385 4029152 3544973 2837653 1090129 -1209659
36230 -1209659 -1716139 828479 4266811 5444993 4124329 2607540 2128152 1812921 1131774
36221 1131774 1099022 2370187 3923484 4636368 4915960 5688363 6643890 6633125 5396093
36212 5396093 3873090 2834919 2035362 1015993 185227 445206 1754371 2748313 2346871
36203 2346871 1319773 1345511 2595567 3401670 2659772 1318465 672341 362089 -599395
36194e99395j048314M30241J962574J704537K36915m27268L13016J266798J300766
36185E139870K92949j233483k312132j970627n50456J64053o49032j258915J51426
36176b226347K304959K350156K00483j197394k74555J032198N92088p75634j090343
36167I15611l26132K31564M29366Q93230J111871J69383j037391o93426Q09900
36158B503976J073450n22788j727150j137600m80290j324886j819434M33948L668483
36149F67709L664017O5835k523537q70727K468651L031627M92583j745904j670813
36140C579441n49344m9952j07163j32906k44257l88772J55891J378685J914296
36131E555919R88021o3956L89832J656758J560244k95850j846880j578367n69866
$$ plain form
36194 -599395 -1647709 -1217468 745106 2449643 2686558 2259290 2572306 3839104 5139870
36185 5139870 5432819 4199336 1887204 -83423 -633879 -469826 -1118858 -2377773 -2226347
36176 -2226347 78612 2428768 2629251 1431857 1157302 2189500 2781588 2005954 915611
36167 915611 589479 821043 1250409 2143639 3255510 3424893 2387502 1694076 2503976
36158 2503976 3577426 3054638 1327488 189888 -290402 -1615288 -3434722 -3000774 667709
36149 667709 4331726 4397561 1874024 1003297 3471948 6503575 6996158 5250254 3579441
36140 3579441 3030097 2980145 2872982 2740076 2495819 2107047 2262938 3641623 5555919
36131 5555919 6543940 6479984 6869816 8526574 10086818 9790968 7944088 6365721 5795855
36122E795855m46012o43337M60743K338716K540353N19423j030708J4547K003114
36113A1552694K202512J195172J581487K909477J678363k610793n097147j923251
36105A1488514L582507M651174p5446n066386n379913k257061p6840m64380j512944
36096D889225j343955j97185P16830Q28384L92531r8131l59212m25175m02208
36087D001104j91162K69957O05841L87842r1307r2506M22381O62348K32263l39393
36077E867368o63825j170273k031651k234473q11800J388719K378738J535038
36069D257841L14360P4455K78512k18111r48615m30121J170605J742930L07587
36060F549443j204559o14045J299174K099443J382175R02631J356974J603654
$$ plain form
36122 5795855 5349843 4706506 5167249 7505965 10046318 10565741 9535033 9549580 11552694
36113 11552694 13755206 14950378 16531865 19441342 21119705 18508912 13411765 11488514
36105 11488514 15071021 19722195 19646749 14580363 9200450 6943389 6866549 6402169 4889225
36096 4889225 3545270 3348085 4064915 4893299 5285830 5187699 4828487 4403312 4001104
36087 4001104 3809942 4079899 4685740 5073582 4982275 4889769 5312150 5974498 6206761 5867368
36077 5867368 5203543 4033270 2001619 -232854 -1044654 344065 2722803 4257841
36069 4257841 4572201 4646656 4925168 4707057 3758442 3328321 4498926 6241856 6549443
36060 6549443 5344884 4730839 6030013 8129456 9511631 10414262 11771236 13374890
36052A3374890J348262J892686L379691M016116L356464L608801N868675P907713
36044D4753298Q166164Q929304J1864823J2951702O918652m151150j1857274j1663849
36036F5911670p441324m722354m006883l052307j845266j804437k337443j614292
36028C9087364J64346Q90423l41917j984256j827230Q20525M475353O741667O826477
36019E4852752O552279P855140J0073920J1545553J2783557J5054867J6546991
36012A35265059J3999978Q241986L505005M22305m997897j3409050j8826048j7019695
36004A07181643j2226437j0700382j1791181j0992664q350884p349091p636747
35997C8134257n652108j636512L14836r09861k348721k712821l449693l918779
$$ plain form
36052 13374890 14723152 16615838 19995529 24011645 27368109 30976910 36845585 44753298
36044 44753298 52919462 61848766 73713589 86665291 93583943 89432793 77575519 65911670
36036 65911670 58470346 53747992 49741109 46688802 44843536 43039099 40701656 39087364
36028 39087364 39251710 40142133 39800216 37815960 35988730 36809255 41284608 48026275 54852752
36019 54852752 61405031 69260171 79334091 90879644 103663201 118718068 135265059
36012 135265059 149265037 157507023 161012028 161434333 156436436 143027386 124201338 107181643
36004 107181643 94955206 84254824 72463643 61470979 53120095 45771004 38134257
35997 38134257 32482149 30845637 31160473 30250612 27901891 25189070 21739377 17820598
35989A7820598j663338J740327J466830k432470m080175j153568J260066o48141
35981A2310129l218709k154888K18180j24235j558949m50478J626666P64461j840384
35972E571793j888208K83574N04375j528676j865297L06366J223311m76540j308714
35963H21984O28215K197117Q86490p61051K68801K219138J680123p17442j555186
35954E668189j1205J436091R56372p17820j997076k045763j020147j42184q62530
35945A263927k682118k902239j12414L245788L766019J602419j29409O5008N33783
35936D650764l34723j703485j895262p88266L99604P59124L43318k14948k33354
35927I82772M42002J178415J268761Q06031K93679l07645j230724j835154j136044
$$ plain form
35989 17820598 16157260 17897587 19364417 16931947 12851772 11698204 12958270 12310129
35981 12310129 9091420 6936532 7154712 7030477 5471528 5021050 6647716 7412177 5571793
35972 5571793 3683585 3967159 4471534 2942858 1077561 1383927 2607238 2130698 821984
35963 821984 1450199 3647316 4533806 3772755 4041556 6260694 7940817 7223375 5668189
35954 5668189 5656984 7093075 8049447 7331627 5334551 3288788 2268641 2126457 1263927
35945 1263927 -1418191 -4320430 -4432844 -1187056 2578963 4181382 4051973 4116981 4650764
35936 4650764 4316041 2612556 717294 -70972 328632 1087756 1431074 1216126 982772
35927 982772 1424774 2603189 3871950 4677981 4971660 4664015 3433291 1598137 462093
35918D62093M76235J327003P18212n0601M22696J724117K449624K220971J933899
35909A1684249K318130K965218K734415R39850j572680k690109j231745J144271
35901A6291599J495842p08915l015285l585501l319462l228589k126987P23720
35893B526422K748499J200973k038136k668778n52620K31850j583036k127949
35885b262775R49945M014685K974648l13587j351926l6269L80886l69562M10950
35876D396995K479088K197959j041401k913478p26825K304276K126933k32142
35868H591405j140508k05803R6949p95521r15217L26510R11209m10468j951403
35859D507153j498847N37389J650437M48407j569516j765103L12641K076734J072181
$$ plain form
35918 462093 938328 2265331 2983543 2932942 3355638 5079755 7529379 9750350 11684249
35909 11684249 14002379 16967597 19702012 20641862 19069182 16379073 15147328 16291599
35901 16291599 17787441 17078526 14063241 10477740 7158278 3929689 1802702 2526422
35893 2526422 5274921 6475894 4437758 1768980 1216360 1448210 -134826 -2262775
35885 -2262775 -1312830 2701855 5676503 5362916 4010990 3974721 4355607 3986045 4396995
35876 4396995 6876083 9074042 8032641 5119163 4392338 6696614 8823547 8591405
35868 8591405 7450897 7245094 7342043 6546522 5631305 5957815 6869024 6458556 4507153
35859 4507153 3008306 3545695 5196132 5644539 4075023 2309920 2622561 4699295 5771476
35850E771476j634400k700347r84711J120183J266833L2341p59478o66382j96713
35841A248802N27774J078619K71169j811246k828231j207766J203491J700424
35833A83036O44718L35007J050994J112548K69302n763M85413K98298p71156j195091
35823B407306n55418k05526m85397K2481J550322K111278O72356j058846j476459
35814B982097j433841k067369k381200j083608P93798J277494L29974n74707q05172
35805b962534p29699l81871L20514P57192N43104M77267J082726J243451N1755
35796D01905j082470l74440J130883R01114r02001j466385J12483J251464O6311
35787C8864j449553n11620J943221K460009K16174j644591m75749K097277K448710
$$ plain form
35850 5771476 4137076 1436729 452018 1572201 2839034 2871375 2111897 1445515 1248802
35841 1248802 1776576 2855195 3126364 1315118 -1513113 -2720879 -1517388 183036
35833 183036 827754 1162761 2213755 3326303 3595605 3589842 4075255 4373553 3602397 2407306
35823 2407306 1851888 1646362 1160965 1183446 2733768 4845046 5517402 4458556 2982097
35814 2982097 1548256 -519113 -2900313 -3983921 -3190123 -1912629 -1582655 -2157362 -2962534
35805 -2962534 -3692233 -4074104 -3753590 -2996398 -2453294 -1976027 -893301 350150 401905
35796 401905 -680565 -1055005 75878 976992 74991 -1391394 -1278911 -27447 38864
35787 38864 -1410689 -1922309 20912 2480921 2697095 1052504 576755 2674032 5122742
35778E122742j6278k157566j592013J52282L11965q37199p53788Q65401J281821
35769B377367q27420k877369k152747J37136J065859O23613J066869K444314K237816
35760D095438j81845j953241q71379J355301J701264j24471k018074k578476k043971
35751b619454r46326M05632J372329J318558N27455j08641j98706J8319L38482
35742A07648O43501N83265j3405n85167l89394M96530J294862J527805J369844
35733E035489J090567O63966M1338m39462j08027J331377K967484L040484Q63755
35724A4486971j922163l032604k313324j570789j687884j612223o29919K59472
35716A977537K36416J62499Q19666J246784M82308m71064k97203L38692K23118
$$ plain form
35778 5122742 5106464 2948898 1356885 1509167 1821132 983933 230145 1095546 2377367
35769 2377367 1549947 -1327422 -3480169 -3343033 -2277174 -1653561 -586692 1857622 4095438
35760 4095438 3913593 1960352 1088973 2444274 4145538 4021067 2002993 -575483 -2619454
35751 -2619454 -3565780 -3160148 -1787819 -469261 58194 -50447 -249153 -230834 107648
35742 107648 751149 1334414 1321009 735842 346448 842978 2137840 3665645 5035489
35733 5035489 6126056 6790022 6831360 6391898 6283871 7615248 10582732 13623216 14486971
35724 14486971 12564808 9532204 7218880 5648091 3960207 2347984 1718065 1977537
35716 1977537 2213953 2376452 3196118 4442902 4925210 4454146 4156943 4495635 4718753
35707D718753j1612N75585N81121j650662m068146k906211J201964L172157P01153
35698B314102k343950j843543P94154J717983O25057l2992M9925r37304k635674
35689b292242k288300O42253K988358K304419K33128k16395J035843J482627j76741
35680C712950k351911k768000j266155K12131K11978l55052M20233K478803L504866
35671C799843K123752m328n27462L06840N04622k13339n3188J589060K698097
35662A0223897J528216n62052n92291K317572N887523P231286N572364K251890
35654C3858405j060599l231144l156655k24015L691344M413968Q6484n238370
35646B9139418n782653j832512M18585k189484n365784m444297j541386j327127
$$ plain form
35707 4718753 4707141 5282726 5863847 4213185 145039 -2761172 -1559208 1612949 2314102
35698 2314102 -29848 -1873391 -1079237 638746 1263803 1230811 1280736 343432 -2292242
35689 -2292242 -4580542 -3938289 -949931 1354488 1587616 1371221 2407064 3889691 3712950
35680 3712950 1361039 -1406961 -2673116 -2460985 -2249007 -2604059 -2183826 294977 3799843
35671 3799843 5923595 5919267 5391805 5698645 6203267 5989928 5936740 7525800 10223897
35662 10223897 11752113 11190061 10597770 12915342 18802865 26034151 31606515 33858405
35654 33858405 32797806 29566662 26410007 26185992 29877336 34291304 34377788 29139418
35646 29139418 23356765 21524253 21942838 19753354 14387570 9943273 8401887 7074760
35638G074760l041873k341479P79221J976965K8043j549581q54528q0096n40867
35629A450565m82496N89958M70625r98150q08970J374032J541970j644077l546048
35620b052591r76490K253717J762897k73578J94998J612618K57268k253716j647064
35611a121941J193252J861502K06806k29031P38409L36167o42762R48700L217803
35602F508905R79398m429750n441562m18500K867002m51394m480154k321268L088523
35593d098800M454820J390967q33183m37334o7728m87874J79716J570614J068354
35584B739552j235526k240019q38637O95185P02885R6419j16529k98939o79559
35575a175168p46410m13792N4405R70956K258846K382594M07051j807474j895334
$$ plain form
35638 7074760 4032887 1691408 2470629 4447594 4475637 2926056 2071528 1991432 1450565
35629 1450565 968069 1558027 2028652 1030502 221532 1595564 3137534 1493457 -2052591
35620 -2052591 -3029081 -775364 987533 713955 908953 2521571 2778839 525123 -1121941
35611 -1121941 71311 1932813 2139619 1910588 2648997 2985164 2342402 3291102 6508905
35602 6508905 7488303 3058553 -2383009 -2801509 65493 -385901 -4866055 -7187323 -4098800
35593 -4098800 356020 1746987 913804 476470 408742 -79132 100584 1671198 2739552
35584 2739552 1504026 -735993 -1574630 -879445 -176560 -80141 -196670 -495609 -1175168
35575 -1175168 -1921578 -2335370 -2280965 -1310009 948837 3331431 3738482 1931008 35674
35566C5674n57086k26693j078586j272862m63374N4463K36848J126512K052674
35557i2430J321992l08531l30891J032260P37080j782449k950577m66510K821802
35548a8254K900172J28012j834162j203787L44165P19672m3383n11986N7232Q52726
35538A390407N94973o72435j430365p31502M74310R90472J259831K060989K428709
35529F365389J100060p53407r32234M8038l28824k080801k376345m30534Q27126
35520A438468m19546j765591p09577J048127N73431j204288j039905J082828J760139
35511G64086l74559k401979j471135J133321K053454N10543j086271p90491M34148
35502a228883N64808l93865o22620M63880J163210K72763p37424o5397J130904
$$ plain form
35566 35674 -521412 -748105 -1826691 -3099553 -3562927 -3508464 -3271616 -2145104 -92430
35557 -92430 1229562 921031 590140 1622400 2359480 577031 -2373546 -2840056 -18254
35548 -18254 2881918 3009930 1175768 -28019 316146 1035818 992435 480449 537681 1390407
35538 1390407 1985380 1312945 -117420 -848922 -374612 615860 1875691 3936680 6365389
35529 6365389 7465449 6712042 5779808 5827846 5499022 3418221 1041876 611342 1438468
35520 1438468 1018922 -746669 -1456246 -408119 165312 -1038976 -2078881 -996053 764086
35511 764086 389527 -2012452 -3483587 -2350266 -296812 213731 -872540 -1663031 -1228883
35502 -1228883 -664075 -1057940 -1680560 -1216680 -53470 219293 -518131 -583528 547376
35493E47376K84245k158880k783625k68381K398941K214757L22896j76981J112368
35484A492716J862131Q34810o36107r81007l76431L6759k49403p61533o93790
35475E28145K94507J577523J921598P13673j198556k127904j092810J075970K116922
35466C809068M67112k503089l326292o14828K586522K405458o63898k569904j401715
35457a811566O08882J163112Q42185P66754K89917j033813j671250n93525N01801
35448i37503j37510j199561m72067J336789J756132N34105l52432r7407J97614
35439F28160n1597j81885M4279J46712K75026R24852J413321N16101j431482k771666
35429d88179k702883j685865j71326J364413J786521O83219l18126K46109J057064
$$ plain form
35493 547376 831621 -1327259 -4110884 -4379265 -1980324 234433 557329 380348 1492716
35484 1492716 3354847 4189657 3553550 2572543 2196112 2232871 1983468 1221935 528145
35475 528145 822652 2400175 4321773 5035446 3836890 1708986 616176 1692146 3809068
35466 3809068 4276180 1773091 -1553201 -2168029 418493 2823951 2160053 -409851 -1811566
35457 -1811566 -1202684 -39572 802613 1569367 1859284 825471 -845779 -1439304 -937503
35448 -937503 -1075013 -2274574 -2746641 -1409852 346280 880385 527953 430546 628160
35439 628160 576563 394678 438957 585669 860695 1785547 3198868 3714969 2283487 -488179
35429 -488179 -3191062 -4876927 -5048253 -3683840 -1897319 -1214100 -1532226 -1286117 -229053
35420b29053J82877j133510k47894J886746J603817j234804k280310N28293L380803
35411B456965K280945j160587k749051j820757p87714m01650P25367K546327K979728
35402D069573J181742j118862k100307j850388j415884j232372j003171l47061
35394c816730O71927J378082J217533Q02726J185136J756024N86462k175458l345188
35385a739486j064103J790094J353711j387770j982781O88564K834477J731957
35377B224663l85113l43805J063265J022979l92944n91952R13502J472003n22115
35368D460483k941701k781695j20245K277663K421155P39649j196907k129534
35360G28868j425127N36106J968242J097961j356767k481838r38085R77062O35281
$$ plain form
35420 -229053 -46176 -1179686 -1427580 459166 2062983 828179 -1452131 -923838 2456965
35411 2456965 4737910 3577323 828272 -992485 -1780199 -2181849 -1456482 1089845 4069573
35402 4069573 5251315 4132453 2032146 181758 -1234126 -2466498 -3469669 -3816730
35394 -3816730 -3144803 -1766721 -549188 253538 1438674 3194698 3781160 1605702 -1739486
35385 -1739486 -2803589 -1013495 340216 -1047554 -3030335 -2341771 492706 2224663
35377 2224663 1839550 1495745 2559010 3581989 3189045 2597093 3510595 4982598 4460483
35368 4460483 1518782 -1262913 -1383158 894505 3315660 4055309 2858402 728868
35360 728868 -696259 -160153 1808089 2906050 1549283 -932555 -1870640 -893578 -258297
35351b58297q72270m89509J637119J996456o46437k776276j289543J605961J719320
35342F26524n91834r55164K230319N253081M444663J107564q69435k59470J100328
35333A2086576K068090L524949N567139N773955K121381l197197m993544r82552
35325B1968797M747890N709962K60589o658506r340128p190708l790151j799286
35317C908459r45231l15256q0143m16515o38679l58410k27959o62763r00128k29680
35307h66305P27794R07283K88613l72390p04703p16477j56445J044761J923189
35298B075320J224053p38471j875169o60284J742905K572933Q41004j284404j269710
35289B628177L22118P54026n90795j090438Q68209K816398J686396j294499k309370
$$ plain form
35351 -258297 -1130567 -1620076 17043 2013499 1367062 -1409214 -2698757 -1092796 626524
35342 626524 34690 -920474 1309845 6562926 11007589 12115153 11245718 10986248 12086576
35333 12086576 14154666 17679615 23246754 29020709 31142090 27944893 22951349 21968797
35325 21968797 26716687 32426649 32687238 26028732 16688604 9497896 5707745 3908459
35317 3908459 2963228 2647972 2567829 2151314 1512635 1154225 926266 263503 -636625 -866305
35307 -866305 -138511 768772 1057385 684995 -19708 -736185 -892630 152131 2075320
35298 2075320 3299373 2560902 685733 25449 1768354 4341287 5182291 3897887 2628177
35289 2628177 2950295 3704321 3113526 2023088 2891297 5707695 7394091 6099592 3790222
35280C790222p30526L80612l97439q60875M10714J392783L50362j057057r68572
35271B310224o96405j822166k508110m71698K280042J935783r56071k159902k91493
35262b379796J604185J361045M32477L80705M83412K11819N35962J153549r8552
35253C684806l084377m036839r41662K804845L095431P92090o16386o65302j301905
35244b69299k267675j410557R47805K012721J041543K28698N43434J67761j801684
35235h07253l205923k071515L53065J622462J416682J094616J210309J163375
35227G75818N94555k12850r16382j227731q77741r3961L73534J96539o0660K08422
35217a240457Q40830J220319R23234n0261j141982j394309m40466P83404J100221
$$ plain form
35280 3790222 3059696 3440308 3042869 2181994 2592708 3985491 4335853 3278796 2310224
35271 2310224 1613819 -208347 -2716457 -3188155 -908113 1027670 71599 -2088303 -2379796
35262 -2379796 -775611 585434 1017911 1398616 1882028 2093847 2629809 3783358 3684806
35253 3684806 600429 -3436410 -4378072 -1573227 1522204 2314294 1697908 1032606 -269299
35244 -269299 -2536974 -3947531 -2999726 -987005 54538 283236 826670 994431 -807253
35235 -807253 -4013176 -6084691 -5731626 -4109164 -2692482 -1597866 -387557 775818
35227 775818 1370373 1157523 241141 -986590 -1864331 -1958292 -1584758 -1388219 -1448879 -1240457
35217 -1240457 -399627 820692 1743926 1693665 551683 -842626 -1283092 -499688 600533
35208F00533O29348L21397L24694Q0408k51773p967M51191J16761p31372q05345
35198G27875j87283l39134j305989j241048L60423J316169J03157j576787j417049
35189c559666J05271J026439J079527J313397J666778J276432M48670P6678k83364
35180C150162j478751k462308j483595O18956J072467n14936j233349P08615L072943
35171A450204K721272j26937k596357k947221j845017n26518N01100J015692Q25224
35162a528558L24738L73436J190948J909328J558888J97460j184890j719838j412556
35153b91044q61597m31531K1304N45656O48122n4100r12699o90866Q24516K186247
35143I84008J744351m44610k549235k783931j079457J016209J881652J247985
$$ plain form
35208 600533 1229881 1551278 1875972 1956380 1704607 1696640 2147831 2264592 1533220 727875
35198 727875 540592 201458 -1104531 -2345579 -1985156 -668987 -565830 -2142617 -3559666
35189 -3559666 -3454395 -2427956 -1348429 -35032 1631746 2908178 3356848 3433526 3150162
35180 3150162 1671411 -790897 -2274492 -1655536 -583069 -1098005 -2331354 -1622739 1450204
35171 1450204 4171476 4044539 1448182 -1499039 -3344056 -3870574 -3369474 -2353782 -1528558
35162 -1528558 -1203820 -830384 360564 2269892 3828780 4026240 2841350 1121512 -291044
35153 -291044 -1152641 -1584172 -1562868 -1017212 -369090 -423190 -1335889 -2026755 -1202239 984008
35143 984008 2728359 2283749 -265486 -3049417 -4128874 -3112665 -1231013 16972
35135A6972K64334K17024J111684J585974M70823j567009k449998j158199P34908
35126g73487Q92795o30275j393834r2631J463911J053561n81569r14032N15244
35117d60317J613955J084784M9033k18401j38927m49352p44182o16824p37314
35108f17545j442175j614104m57583Q48513R17685M32311P77165J399927P67148
35099A011342o77943j008429j46330r2039j331721j601838M78712K690207K066208
35090A388169q36766k641790j634489M33090J175173M76408k08293j87220P9143
35081a956575L06841O89365Q71124L6592j431871j714637m0694J708719J401385
35072a29751k04639o70798L25086Q46455L23847M37230J573831J416442j153362
$$ plain form
35135 16972 281306 498330 1610014 3195988 3666811 2099802 -350196 -1508395 -773487
35126 -773487 119308 -510967 -1904801 -1997432 -533521 520040 -61529 -975561 -460317
35117 -460317 1153638 2238422 2287455 2069054 1930127 1480775 736593 119769 -617545
35108 -617545 -2059720 -3673824 -4131407 -3282894 -2365209 -1932898 -1155733 244194 1011342
35099 1011342 333399 -675030 -821360 -913399 -2245120 -3846958 -3368246 -678039 1388169
35090 1388169 551403 -2090387 -3724876 -3291786 -2116613 -1640205 -1848498 -2035718 -1956575
35081 -1956575 -1649734 -960369 -89245 -52653 -1484524 -3199161 -3239855 -1531136 -129751
35072 -129751 -334390 -1005188 -680102 166353 490200 927430 2501261 3917703 2764341
35063B764341l378120k327887P27829K383036J922499J120623N29137o36752j612239
35054A492467p01203J196274J154407j145046k627285j542413K14530P24183Q16947
35045d17139J467201J423227j32812j079070N46582K760402K140087r55939k870251
35036B882288j914318o5969P15171Q44635R66850K05948j816053l215969k137882
35027c535299L08432J356325L05619q89442o70768K42365M81621O7498q2058K94944
35017b120763P48812J039234J216149J183988R33699P64993O09419j57605j372047
35008B845879j558916j28347R94352j5666j530102n15396K408103L323833R33335
34999F757075j490032j383801m51842p42990p84811J116578K762561J307125j547384
$$ plain form
35063 2764341 -613779 -2941666 -2213837 169199 2091698 3212321 3741458 3104706 1492467
35054 1492467 791264 1987538 3141945 1996899 -630386 -2172799 -1958269 -1234086 -417139
35045 -417139 1050062 2473289 2340477 1261407 1807989 4568391 6708478 5752539 2882288
35036 2882288 967970 902001 1617172 2461807 3428657 3634605 1818552 -1397417 -3535299
35027 -3535299 -3226867 -1870542 -1564923 -2454365 -3125133 -2882768 -2401147 -2333649 -2415707 -2120763
35017 -2120763 -1371951 -332717 883432 2067420 3001119 3766112 4375531 4217926 2845879
35008 2845879 1286963 1158616 2152968 2137302 607200 91804 2499907 5823740 6757075
34999 6757075 5267043 3883242 3431400 2688410 1903599 3020177 5782738 7089863 5542479
34990E542479j963275j25570N41626n49779o27509R72378J576934J66108q11787
34981D721605O9527Q42981r8854j368605j461481j124549j098033m84568Q15972
34972H13995R65460n63647j416128j37170J203069M88729r42025q74207N6716
34963d05208M1059n07627j79313M71334J96238p2237J260838K982667K293166
34954F080917p75643l011743k322873q0938J254267J002019J40312l83422m74547
34945A428349m77031l66269L12715J348122J391430j85378j637207j041284L84810
34936A158257n8400j764791j356349J372954K317959l57386k845756j759818N25176
34927b768154M06150p21265M59939K680060K086432q59803j986307k97534R59369
$$ plain form
34990 5542479 3579204 3453634 3995260 3445481 2817972 3790350 5367284 5533392 4721605
34981 4721605 4791132 5634113 5535259 4166654 2705173 1580624 482591 -1977 813995
34972 813995 1779455 1215808 -200320 -337490 865579 1354308 412283 -461924 -405208
34963 -405208 -364149 -871776 -1051089 -579755 -383517 -455754 805084 3787751 6080917
34954 6080917 5305274 2293531 -29342 -110280 1143987 2146006 2286318 1902896 1428349
34945 1428349 951318 585049 897764 2245886 3637316 3451938 1814731 773447 1158257
34936 1158257 1099857 -664934 -2021283 -648329 1669630 1312244 -1533512 -3293330 -2768154
34927 -2768154 -2362004 -3083269 -2623330 56730 2143162 1283359 -702948 -1000482 -41113
34918d1113J98624m47524L41209R66326M50246J41335O25889M86202n92255q33506
34908A295433J90740M22392q74491j380900L22022J997472J198553r36167j708875
34899E26179q25042k656J0711j46700j21970q9863R3630N49046O70323j04571
34889E59087j224782j557003o27348J096118K586441K675092R40037j441494k523507
34880D82641j643706n453Q97086O84579q1305o35916n47214j91281m46662j262937
34870b750168j249330K77083J765732J479380J89788j06897N32310L39894q25893
34861c48101j026164N40288K117167J879385J16035j644762k274252j495982p565
34852b143951P74543K74230l14730L4735K56159q59194j891817p16848J551203
$$ plain form
34918 -41113 157511 -290013 51196 1017522 1467768 1609103 2234992 2721194 2128939 1295433
34908 1295433 1486173 1908565 1034074 -346826 -24804 1972668 3171221 2235054 526179
34899 526179 -298863 -301519 -290808 -437508 -559478 -649341 -555711 -6665 663658 559087
34889 559087 -665695 -2222698 -2850046 -1753928 832513 3507605 4447642 3006148 482641
34880 482641 -1161065 -1166518 -269432 415147 333842 -302074 -849288 -1040569 -1487231 -2750168
34870 -2750168 -3999498 -3722415 -1956683 -477303 -287515 -394412 137898 477792 -348101
34861 -348101 -1374265 -833977 1283190 3162575 3278610 1633848 -640404 -2136386 -2143951
34852 -2143951 -1369408 -1095178 -1409908 -1375173 -1119014 -1978208 -3870025 -4586873 -3035670
34843c035670J794082j29301j112176J53069J383214Q38603j30540k7241L27030
34834F1070j02128n61396k35784K18094K40923L95319P14615K31650q45571q78814
34824g62022K84378P22231j96168p05084j04657j67695j488649j780472L3144
34815d164994J356058K62582q58373O71353K897367K242320n57922j685335k54754
34806i1698R80483N27384q0548K70199M09041o06559j660279j418152k98579M03176
34796a565532K79349k8895J70477Q37113J190473N96113m58658q27037k62851
34787f9448L01101J89554k93622o98424q35190l62750O46500R39446l29610j599990
34777b112433q69764P05964L36784j352667q19481K126044L171242M96732j794379
$$ plain form
34843 -3035670 -1241588 -1370889 -2483065 -2329996 -946782 -108179 -238719 -265960 61070
34834 61070 -41058 -602454 -838238 -620144 -379221 16098 730713 962363 116792 -762022
34824 -762022 -477644 244587 48419 -656665 -761322 -929017 -2417666 -4198138 -4164994
34815 -4164994 -2808936 -2546354 -3404727 -2733374 163993 2406313 1848391 163056 -91698
34806 -91698 888785 1416169 1335621 1605820 2014861 1408302 -251977 -1670129 -1968708 -1565532
34796 -1565532 -1286183 -1315078 -1144601 -307488 882985 1479098 1020440 193403 -69448
34787 -69448 231653 421207 127585 -570839 -1406029 -1768779 -1122279 -182833 -512443 -2112433
34777 -2112433 -2982197 -2276233 -1939449 -3292116 -4111597 -1985553 1185689 1682421 -111958
34768a11958k86313K073958R87569k124658k848155r57910J52379m33826n56549
34759d105463L65033O29011l6730r205R99893J601980J443987J253111O90905
34750B832522p92204j703168m02323J474197J013313j142368j688999m0331J072954
34741F23593L88044m11970l77655o30406j294935p40870J046635J689754L16391
34732F08581p75390J55350J512723R81071j061176k305519j411631Q57584K488928
34723A050521J909962k92715j675424r54848K70823K05119l25872J44908P14753
34714A047227m7932r44766k60038N60353o36392k012021k73936L009709L044437
34705C486641l51281k255429p09116N68771q35707k060903o11687J155171M96117
$$ plain form
34768 -111958 -398271 1675687 2663256 538598 -2309557 -3267467 -3115088 -3548914 -4105463
34759 -4105463 -3740430 -3111419 -3148149 -3157354 -2157461 -555481 888506 2141617 2832522
34750 2832522 2040318 337150 -65173 1409024 2422337 1279969 -409030 -449361 623593
34741 623593 1011637 599667 222012 -408394 -1703329 -2444199 -1397564 292190 608581
34732 608581 -166809 -11459 1501264 2482335 1421159 -884360 -2295991 -1438407 1050521
34723 1050521 2960483 2667768 992344 37496 308319 513438 187566 332474 1047227
34714 1047227 999295 54529 -205509 354844 -281548 -2293569 -2567505 442204 3486641
34705 3486641 3135360 879931 170815 739586 -96121 -2157024 -2768711 -1613540 -1117423
34696a117423j038008q45752M07681J064431J757268L030915K754799m44593l696525
34687A872793l482325p72909P85271J85372n81345k06234O86860J069478K86398
34678a56641j567769k718792j059775K274988L297818Q16409j386644l16454J603184
34669G86324P89071j663899k242863p49351K85526K00954K84678N69027K67858
34660a472675K40013J414379J971110r4806k663311j901252J551798L058290P84268
34651B887814j957837j879889K13847J565720R45372r44886k426792j754797R95988
34642b355460L011429J852320q76280j538504K28761J330835L60675n39362K31602
34633A706016J094159K87515j164011j336608l22436M83100N96720M70462L73679
$$ plain form
34696 -1117423 -2155431 -3001183 -2593502 -1529071 228197 3259112 6013911 5569318 1872793
34687 1872793 -1609532 -2382441 -1597170 -1411798 -1993143 -2199377 -1512517 -443039 -156641
34678 -156641 -1724410 -4443202 -5502977 -3227989 69829 886238 -500406 -816860 786324
34669 786324 1575395 -88504 -2331367 -3080718 -2795192 -2594238 -2309560 -1740533 -1472675
34660 -1472675 -1232662 181717 2152827 2058021 -605290 -2506542 -954744 2103546 2887814
34651 2887814 929977 -949912 -736065 829655 1775027 830141 -1596651 -3351448 -2355460
34642 -2355460 655969 2508289 1632009 93505 322266 1653101 2013776 1474414 1706016
34633 1706016 2800175 3087690 1923679 587071 264635 747735 1344455 1814917 2188596
34624B188596M04492P12731R15956K90591q11495r16442M18383J565180R49443
34615E717435p00312j390166o37983R187o54619j583942p73082J725858L220766
34606D933142J657260j380127k522912j104140K83119j20498j048534r73283m85404
34597g61377l62060K92592J884334K517253Q41387j196470j172422m8426k73511
34588A721300j567188j811540q61524r6504O70124K208994K840605M65326k949075
34579F20518l240702l61455J550875O80788m50503k23490l52221j501316j170623
34570d448129J579344L402437J656270j282608j819011l52037N30549N42374R35479
34561G44668J187976l1487j794705j978287o52365K77241J86469J03113M80767
$$ plain form
34624 2188596 2593088 3305819 4221775 4512366 3700871 2784429 3202812 4767992 5717435
34615 5717435 5017123 3626957 2988974 2998161 2343542 759600 -13482 1712376 4933142
34606 4933142 6590402 5210275 2687363 1583223 1866342 1745844 697310 -275973 -761377
34597 -761377 -1123437 -830845 1053489 3570742 4412129 3215659 2043237 1994811 1721300
34588 1721300 154112 -1657428 -2518952 -2615456 -1945332 263662 3104267 3569593 620518
34579 620518 -2620184 -2981639 -1430764 -749976 -1200479 -1423969 -1776190 -3277506 -4448129
34570 -4448129 -2868785 533652 2189922 907314 -911697 -1263734 -733185 -190811 744668
34561 744668 1932644 1901157 106452 -1871835 -2524200 -2246959 -2060490 -1957377 -1476610
34552a476610P29180N87899K83550j74593n57802j93250O40002M97549o82813
34543c46888o87120J427038K937979J225146j873307k622761r28921K49659J13970
34534e05205O16052J911258J449775j322845l137683j676096Q51888J220899p3385
34525f65342k67294J036301J571991K49356j274856j218569j3997P26508M27214
34516E71312j21785j14841L01615L39007n02751j822449k510545j665471M64480
34507e061428K480272L017234J981638L84146r60030j949031k312862j310864
34499c730925Q27673K163931J264378m56813n18005P73128O60005j452924k497075
34490b966627l47386K517347K370794l86848k010068p80864J196156J556907N49449
$$ plain form
34552 -1476610 -747430 -159531 124019 -50574 -608376 -801626 -161624 335925 -346888
34543 -346888 -1034008 393030 3331009 4556155 2682848 60087 -868834 -619175 -505205
34534 -505205 110847 2022105 3471880 2149035 -988648 -2664744 -1812856 -591957 -665342
34525 -665342 -932636 103665 1675656 1925012 650156 -568413 -582410 144098 571312
34516 571312 449527 334686 636301 975308 472557 -1349892 -3860437 -5525908 -5061428
34507 -5061428 -2581156 436078 2417716 2801862 1841832 -107199 -2420061 -3730925
34499 -3730925 -2903252 -739321 525057 68244 -449761 323367 983372 -469552 -2966627
34490 -2966627 -3314013 -796666 1574128 1187280 -822788 -1603652 -407496 1149411 1698860
34481A698860k44526j99242J25821q7976j155792k236587j693516P46517K730192
34472c16249J881063p24138j818920o05017L96662l53105j055600P3701J585748
34463i35855J126082p22459j394007k31089R10136O09698n80759j531118j757201
34454d506572j126554K16837J434643J653032J106759O41557L50896o3306r228
34445c01936J182639K354356J552440p15058j523229K87515K197881J693510k03063
34436F525055j038528p85973j070772j782292j416038l07339m28125j700607j546286
34427c550905Q92033K821207J745023q35269j687976k46093J403477J850639J486951
34418C879087Q47121q8324r62446j098857o57554m65919o55479o17574k63008
$$ plain form
34481 1698860 1454334 1255092 1380913 1292937 137145 -2099442 -3792958 -3046441 -316249
34472 -316249 1564814 840676 -978244 -1583261 -1186599 -1539704 -2595304 -2521603 -935855
34463 -935855 190227 -532232 -1926239 -2157328 -1247192 -637494 -1218253 -2749371 -4506572
34454 -4506572 -5633126 -5416289 -3981646 -2328614 -1221855 -580298 -229402 -292708 -301936
34445 -301936 880703 3235059 4787499 4072441 2549212 2836727 5034608 6728118 6525055
34436 6525055 5486527 4700554 3629782 1847490 431452 124113 -304012 -2004619 -3550905
34427 -3550905 -2658872 162335 1907358 1072089 -615887 -861980 541497 2392136 3879087
34418 3879087 4726208 4637884 3675438 2576581 1919027 1453108 797629 180055 -82953
34409h2953j29768k28834K7052O47647R58711Q27672Q80355J226979J034008j83772
34399D977097j676019k345698j947416j034015j79805L92674O62813N59117j1842
34390f03094p03356n84975P21049J831809Q97640j484497k363962m88880J560494
34381a217772J033856q94758j151449L83273J065949n410q83102l54561M02505
34372a621469M37006N36633J137325J193542K66345m81022m67601o87890j423576
34363a110707j284055J36086J001980K73876l21205O63765J574772L33225j831777
34354e64040k060380j24734J612710J768193J024899J37447q25951j405098r74058
34345a411012j30858j93293j189979j687174o85679J295263K872305K802312Q71634
$$ plain form
34409 -82953 -212721 -441555 -414503 233144 1191855 2019527 2899882 4126861 5160869 4977097
34399 4977097 3301078 955380 -992036 -2026051 -2205856 -1813182 -1150369 -591252 -603094
34390 -603094 -1306450 -1891425 -1170376 661433 1559073 74576 -2289386 -2778266 -1217772
34381 -1217772 -183916 -1078674 -2230123 -1846850 -780901 -786311 -1669413 -2023974 -1621469
34372 -1621469 -1184463 -647830 489495 1683037 1949382 1468360 1000759 312869 -1110707
34363 -1110707 -2394762 -2258676 -1256696 -982820 -1304025 -640260 934512 1267737 -564040
34354 -564040 -2624420 -2749154 -1136444 631749 1656648 1794095 968144 -436954 -1411012
34345 -1411012 -1541870 -1735163 -2925142 -4612316 -5297995 -4002732 -1130427 1671885 2543519
34336B543519j459890k073896o41628Q98073J031008M52522K24280o0216p99816
34327A13956r25124J56266Q85704N5530o98211M87470K153707J639098m91431
34318C376965j509274j128787j366165k195141j303794J428847K991603J777686
34310B071940k13992q67701o38984n23151k37369J45035m98770j811736j403830
34301c978558J317619L281144J923305r32387j820995n33041L72614j86338p09996
34292a266633Q8930J499484J958644P72205j209544k018782l97176K198553K625990
34283D251671J1950k724018k605680m65845O61269j15458r31535l95366O87647
34274a625365J011400N75943K54282M66752P53405L83855o19627j117161j59546
$$ plain form
34336 2543519 1083629 -990267 -1631895 -733822 297186 749708 973988 913772 113956
34327 113956 -811168 -654902 230802 286332 -411879 75591 2229298 3868396 3376965
34318 3376965 1867691 738904 -627261 -2822402 -4126196 -2697349 294254 2071940
34310 2071940 1857948 990247 351263 -171888 -409257 -264222 -762992 -2574728 -3978558
34301 -3978558 -2660939 620205 2543510 1611123 -209872 -742913 -370299 -556637 -1266633
34292 -1266633 -1177703 321781 2280425 3052630 1843086 -175696 -572872 1625681 4251671
34283 4251671 4263621 1539603 -1066077 -1531922 -870653 -986111 -1917646 -2313012 -1625365
34274 -1625365 -613965 -38022 216260 683012 1436417 1820272 1200645 83484 -76062
34265g6062J265095R94491j233102k846393j705726Q95587J994232Q58982n73715
34256d26611o98124R6581P53031R19536O07625k38203j203061j325208k67208
34247a781642R33122R49445j63355r74502m96858M99640N34572m96635j222729
34238b218942r06509l94025k98683K64295J726540K324241N67155j583398r31894
34229a451220J900422K949651Q33143j296197r13487K41007k75401j555087j559868
34220a127037p79330n83237r8957J826621L292633J806883j039990j420947O80053
34211B556692J464125m04860j804346o02065R50361M17774o41574L38617K190096
34202D464820J681302j232362l124957j992388K95316J015614n0050j264127j569033
$$ plain form
34265 -76062 1189033 2183524 950422 -1895971 -3601697 -2706110 -711878 147104 -426611
34256 -426611 -1124735 -1028154 -275123 644413 1252038 1013835 -189226 -1514434 -1781642
34247 -1781642 -848520 100925 -62430 -1036932 -1533790 -1034150 -499578 -996213 -2218942
34238 -2218942 -3125451 -3519476 -3818159 -3553864 -1827324 496917 1064072 -519326 -1451220
34229 -1451220 449202 3398853 4231996 2935799 2022312 2263319 1987918 432831 -1127037
34220 -1127037 -1906367 -2489604 -2588561 -761940 2530693 4337576 3297586 1876639 2556692
34211 2556692 4020817 3615957 1811611 1209546 2159907 2577681 1936107 2274724 4464820
34202 4464820 6146122 4913760 1788803 -203585 91731 1107345 1057295 -206832 -1775865
34193a775865r87442L09169J926425K614896J262507j227001k418253j356692
34185a652256J75794M14120K35610J280543K579985J678695j155317k779939j759403
34176i82168j49203L56596Q96298K170952J925717j225823m032732k582930J516295
34167b106998L135571J059173r57813o43874j65366j372612k288063p62196J506972
34158b595206J532649l84500j476111p31147K91711L87574K14112P21089J601004
34149d38825J781801Q27422l92583m60896P88823J488667j69161l052177l874657
34140c501586j472755J329857J352780p57705j679071m5930J995058K044734O32082
34131a02536J20239J200923J865221K75485k333536k895079n34524K116261K250808
$$ plain form
34193 -1775865 -2763307 -2454138 -527713 2087183 3349690 2122689 -295564 -1652256
34185 -1652256 -1476462 -1062342 -826732 453811 3033796 4712491 3557174 777235 -982168
34176 -982168 -1131371 -774775 121523 2292475 4218192 2992369 -1040363 -3623293 -2106998
34167 -2106998 1028573 2087746 1129933 486059 320693 -1051919 -3339982 -4102178 -2595206
34158 -2595206 -1062557 -1447057 -2923168 -3654315 -3362604 -2975030 -2760918 -2039829 -438825
34149 -438825 1342976 2170398 1777815 1316919 2105742 3594409 3425248 373071 -3501586
34140 -3501586 -4974341 -3644484 -2291704 -3049409 -4728480 -4774410 -2779352 -734618 -102536
34131 -102536 17703 1218626 3083847 3359332 1025796 -1869283 -2403807 -287546 1963262
34122A963262K13785j560706j748267q38116L67353J193908P13122j177054k668051
34113c540764j907073L04505J500160R18054q8336o48263j060547j021132K50315
34104e293081J852937J752090J298j087064n80216j03176n95531o89912M55549
34095d287106J391553R67220K29464J30897k43979j370909j568428L14064K543741
34086a893483K983421K087196J343949N74479r57969k350737k268060j085383
34078a566587N4554R31897J385800O10562r28920j036487P63605J740993K37230
34069B192647j312356n00303Q41101J59651r77621j1966J241542l24249k670334
34060a361888j393141K126164K086029k061646m226366j438244J726769J189925
$$ plain form
34122 1963262 2177047 616341 -1131926 -1970042 -1602689 -408781 304341 -872713 -3540764
34113 -3540764 -5447837 -5143332 -3643172 -2725118 -2813454 -3461717 -4522264 -5543396 -5293081
34104 -5293081 -3440144 -1688054 -1686756 -2773820 -3354036 -3457212 -4052743 -4742655 -4287106
34095 -4287106 -2895553 -1928333 -1698869 -1567972 -1811951 -3182860 -4751288 -4437224 -1893483
34086 -1893483 1089938 3177134 4521083 5095562 4137593 1786856 -481204 -1566587
34078 -1566587 -1512033 -580136 805664 1416226 487306 -549181 214424 1955417 2192647
34069 2192647 880291 379988 1221089 1380740 403119 391153 1632695 1308446 -1361888
34060 -1361888 -2755029 -628865 1457164 -604482 -4830848 -6269092 -4542323 -3352398
34052c352398l66414Q39242L015397K503412J59058q95298r14729k009350l158613
34043d179693j688167J503580K803528J468120K70857O87598J156705M36945n66279
34034A893194r27107r85688r58694n13234n9966l50924o54366L99177J986776
34025a70832J644889p93605k392624j328306M48974L69606q64730o40736J429779
34016b297585K932000K028408l26819j912460j787692p07283K90535Q95132J199711
34007C13947J050952K11644r87291j693926j423421n56418K37130P10409R17329
$$ plain form
34052 -3352398 -3718812 -2879570 135827 2639239 2798297 1902999 988270 -1021080 -4179693
34043 -4179693 -5867860 -4364280 -1560752 -92632 178225 865823 2022528 2459473 1893194
34034 1893194 966087 -19601 -978295 -1491529 -1551495 -1902419 -2556785 -2157608 -170832
34025 -170832 1474057 680452 -1712172 -3040478 -2591504 -2221898 -3086628 -3727364 -2297585
34016 -2297585 634415 2662823 2336004 423544 -1364148 -2071431 -1780896 -885764 313947
34007 313947 1364899 1576543 589252 -1104674 -2528095 -3084513 -2847383 -2136974 -1219645
$$ [...]
##END NTUPLES=NMR SPECTRUM
##END=
