##TITLE=31Pdec_LR-747-V2-CM1
 CDCl3, 24 sc
 10.3.2022
##JCAMPDX= 6.0         $$ Bruker NMR JCAMP-DX V2.0
##DATA TYPE= NMR SPECTRUM
##DATA CLASS= NTUPLES
##ORIGIN= UXNMR, Bruker Analytische Messtechnik GmbH
##OWNER= root
$$ XWIN-NMR		Version 3.5
$$ Thu Mar 10 11:57:19 2022 Russian Standard Time (UT+4h)  she@DPX200
##.OBSERVE FREQUENCY= 81.013821
##.OBSERVE NUCLEUS= ^31P
##.ACQUISITION MODE= SIMULTANEOUS
##.ACQUISITION SCHEME= undefined
##.AVERAGES= 24
##.DIGITISER RES= 16
##SPECTROMETER/DATA SYSTEM= spect
##.PULSE SEQUENCE= zgpg30
##.SOLVENT NAME= CDCl3
##.SHIFT REFERENCE= (INTERNAL, CDCl3, 0, 248.564)
##AUDIT TRAIL= $$ (NUMBER, WHEN, WHO, WHERE, WHAT)
$$ ##TITLE= Audit trail, XWIN-NMR		Version 3.5
$$ ##JCAMPDX= 5.01
$$ ##ORIGIN= Bruker BioSpin GmbH
$$ ##OWNER= she
$$ F:/spectra/data/she/nmr/P31/1/pdata/1/auditp.txt
$$ ##AUDIT TRAIL=  $$ (NUMBER, WHEN, WHO, WHERE, WHAT)
(   1,<2022-03-10 11:55:52.65 +0400>,<she>,<DPX200>,
      <created by zg, POWCHK disabled, PULCHK disabled
       configuration hash MD5:
       00 E9 B6 7A A2 85 ED C7 34 08 36 98 17 FE 4E 26
       data hash MD5: 32K
       0C E3 D3 3B 81 10 4F 20 D1 10 77 05 90 C0 66 CF>)
(   2,<2022-03-10 11:55:55.23 +0400>,<she>,<DPX200>,
      <Start of raw data processing
       efp BC_mod = 2 LB = 1 FT_mod = 6 PKNL = 1 PHC0 = -9173.809 PHC1 = 88.8745 SI = 64K 
       data hash MD5: 64K
       25 9E 75 9B 08 15 AF 8A 68 55 E2 5B 60 25 EC E1>)
(   3,<2022-03-10 11:56:26.82 +0400>,<she>,<DPX200>,
      <pk PHC0 = 34.0022 PHC1 = -67.20001 
       data hash MD5: 64K
       42 87 90 6D 8B 40 ED 68 E4 5F C2 F2 D5 03 E2 FD>)
(   4,<2022-03-10 11:56:31.10 +0400>,<she>,<DPX200>,
      <abs ABSG = 5 
       data hash MD5: 64K
       BE 67 C1 FD 6C 80 2D F7 85 31 1A 73 D7 F0 8B 18>)
$$ ##END=
$$ 
$$ hash MD5
$$ 6D 29 9D A5 03 85 87 2D F2 69 40 63 D3 B6 E6 2A
##$RELAX= 
##$RELAX= 
##$RELAX= 
##$RELAX= 
##$RELAX= 
##$RELAX= 
##$RELAX= 
##$RELAX= 
$$ Bruker specific parameters
$$ --------------------------
##$DU= <F:/spectra>
##$EXPNO= 1
##$NAME= <P31>
##$PROCNO= 1
##$TYPE= <nmr>
##$USER= <she>
##$AMP= (0..31)
100 100 100 100 100 100 100 100 100 100 100 100 100 100 100 100 100 100 
100 100 100 100 100 100 100 100 100 100 100 100 100 100 
##$AQSEQ= 0
##$AQ_mod= 1
##$AUNM= <au_zg>
##$AUTOPOS= <>
##$BF1= 81.014009
##$BF2= 200.13
##$BF3= 200.13
##$BF4= 200.13
##$BF5= 200.13
##$BF6= 200.13
##$BF7= 200.13
##$BF8= 200.13
##$BYTORDA= 1
##$CFDGTYP= 0
##$CFRGTYP= 5
##$CHEMSTR= <none>
##$CNST= (0..31)
1 1 145 1 1 1 1 1 1 1 1 1 1 1 1 1 1 1 1 1 1 1 1 1 1 1 1 1 1 1 1 1 
##$CPDPRG= <waltz16>
##$CPDPRG1= <>
##$CPDPRG2= <waltz16>
##$CPDPRG3= <>
##$CPDPRG4= <mlev>
##$CPDPRG5= <mlev>
##$CPDPRG6= <mlev>
##$CPDPRG7= <mlev>
##$CPDPRG8= <mlev>
##$CPDPRGB= <>
##$CPDPRGT= <>
##$D= (0..31)
0 1 0 0 0 0 0 0 0 0 0 0.03 2e-05 3e-06 0 0 0 0 0 0 0 0 0 0 0 0 0 0 0 0 
0 0 
##$DATE= 1646898952
##$DBL= (0..7)
120 120 120 11 120 120 24 19 
##$DBP= (0..7)
150 150 150 150 150 150 150 150 
##$DBP07= 0
##$DBPNAM0= <>
##$DBPNAM1= <>
$$ [...]
##$SUBNAM3= <"">
##$SUBNAM4= <"">
##$SUBNAM5= <"">
##$SUBNAM6= <"">
##$SUBNAM7= <"">
##$SUBNAM8= <"">
##$SUBNAM9= <"">
##$SW= 501.771253377433
##$SWIBOX= (0..15)
0 1 3 0 0 0 0 0 0 0 0 0 0 0 0 0 
##$SW_h= 40650.406504065
##$TD= 32768
##$TD0= 1
##$TE= 0
##$TE2= 300
##$TE3= 300
##$TEG= 300
##$TL= (0..7)
0 120 53 12 22 120 120 120 
##$TP= (0..7)
150 150 150 150 150 150 150 150 
##$TP07= 0
##$TPNAME0= <>
##$TPNAME1= <>
##$TPNAME2= <>
##$TPNAME3= <>
##$TPNAME4= <>
##$TPNAME5= <>
##$TPNAME6= <>
##$TPNAME7= <>
##$TPOAL= (0..7)
0.5 0.5 0.5 0.5 0.5 0.5 0.5 0.5 
##$TPOFFS= (0..7)
0 0 0 0 0 0 0 0 
##$TUNHIN= 0
##$TUNHOUT= 0
##$TUNXOUT= 0
##$USERA1= <user>
##$USERA2= <user>
##$USERA3= <user>
##$USERA4= <user>
##$USERA5= <user>
##$V9= 5
##$VALIST= <valist>
##$VCLIST= <CCCCCCCCCCCCCCC>
##$VD= 0
##$VDLIST= <DDDDDDDDDDDDDDD>
##$VPLIST= <PPPPPPPPPPPPPPP>
##$VTLIST= <TTTTTTTTTTTTTTT>
##$WBST= 1024
##$WBSW= 4
##$XGAIN= (0..3)
0 0 0 0 
##$XL= 0
##$YL= 0
##$YMAX_a= 1895
##$YMIN_a= -3077
##$ZGOPTNS= <>
##$ZL1= 120
##$ZL2= 120
##$ZL3= 120
##$ZL4= 120
##$ABSF1= 248.5645
##$ABSF2= -253.2056
##$ABSG= 5
##$ABSL= 3
##$ALPHA= 0
##$AQORDER= 0
##$ASSFAC= 0
##$ASSFACI= 0
##$ASSFACX= 0
##$ASSWID= 0
##$AUNMP= <proc_1d>
##$AZFE= 0.1
##$AZFW= 0.5
##$BCFW= 0
##$BC_mod= 2
##$BYTORDP= 0
##$COROFFS= 0
##$CY= -3
##$DATMOD= 1
##$DC= 0
##$DFILT= <>
##$DTYPP= 0
##$F1P= 0
##$F2P= 0
##$FCOR= 1
##$FTSIZE= 65536
##$FT_mod= 6
##$GAMMA= 0
##$GB= 0
##$INTBC= 1
##$INTSCL= 5.30512e-09
##$ISEN= 30
##$LB= 1
##$LEV0= 0
##$LPBIN= 0
##$MAXI= 10000
##$MC2= 0
##$MEAN= 0
##$ME_mod= 0
##$MI= 50
##$NCOEF= 0
##$NC_proc= -8
##$NLEV= 6
##$NOISF1= 182.463
##$NOISF2= 159.3651
##$NSP= 0
##$NTH_PI= 0
##$NZP= 0
##$OFFSET= 248.5645
##$PC= 4
##$PHC0= -9139.807
##$PHC1= 21.67448
##$PH_mod= 1
##$PKNL= yes
##$PPARMOD= 0
##$PSCAL= 0
##$PSIGN= 0
##$REVERSE= no
##$SF= 81.014009
##$SI= 65536
##$SIGF1= 159.3651
##$SIGF2= -187.1042
##$SINO= 113.3802
##$SIOLD= 16384
##$SREGLST= <1H.CDCl3>
##$SSB= 0
##$STSI= 65536
##$STSR= 0
##$SW_p= 40650.406504065
##$SYMM= 0
##$S_DEV= 0
##$TDeff= 32768
##$TDoff= 0
##$TI= <>
##$TILT= no
##$TM1= 0
##$TM2= 0
##$TOPLEV= 0
##$USERP1= <user>
##$USERP2= <user>
##$USERP3= <user>
##$USERP4= <user>
##$USERP5= <user>
##$WDW= 1
##$XDIM= 65536
##$YMAX_p= 421235672
##$YMIN_p= -359173702
$$ End of Bruker specific parameters
$$ ---------------------------------
##NTUPLES= NMR SPECTRUM
##VAR_NAME=  FREQUENCY,     SPECTRUM/REAL,   SPECTRUM/IMAG
##SYMBOL=    X,             R,               I
##VAR_TYPE=  INDEPENDENT,   DEPENDENT,       DEPENDENT
##VAR_FORM=  AFFN,          ASDF,            ASDF
##VAR_DIM=   65536,         65536,           65536
##UNITS=     HZ,            ARBITRARY UNITS, ARBITRARY UNITS
##FACTOR=    0.620285442955139, 1,           1
##FIRST=     20137.2065510759, 0,            0
##LAST=      -20513.1999529892, 0,           0
##MIN=       -20513.1999529892, -359173702,  0
##MAX=       20137.2065510759, 421235672,    0
$$ Real data points
##PAGE= N=1
##DATA TABLE= (X++(R..R)), XYDATA
$$ [...]
41364 8762500 10399016 7588356 4547695 4914336 5271463 349996 -7629645 -10869336
41356 -10869336 -7074773 -2612546 -2948845 -5467653 -5221208 -3359079 -4769533 -9595501
41348 -9595501 -12391346 -9537746 -3290295 2022622 4294033 3430120 247389 -3078098
41340 -3078098 -4221351 -3804269 -4936101 -8506736 -11580302 -11824870 -10459197 -8764823
41332 -8764823 -5060524 1534742 7172840 7480167 4021828 1970086 2239950 1013220
41324 1013220 -2666287 -4131284 55796 6645578 9944619 8746145 6275714 5142041
41316 5142041 4929467 3776936 490232 -4162979 -7245168 -6015966 -1488127 1902325
41308 1902325 1242277 -1844208 -4162053 -4968421 -5482431 -6145110 -6323951 -5650029 -4041370
41299 -4041370 -1337500 1784028 3509228 2635631 -283807 -4105304 -7926233 -10337873
41291 -10337873 -10124815 -8641134 -8894269 -10908053 -10978653 -7599829 -4844948 -6508309 -9556364
41282 -9556364 -7801242 -835915 5093705 5093032 747639 -3316451 -4837075 -4671439 -4237705
41273 -4237705 -3617459 -1778034 1426745 3623760 1926934 -2678275 -5324080 -3364773
41265 -3364773 13587 690391 -635531 -973578 -620445 -1544819 -2060037 1293841 6969188
41256 6969188 9106526 5768936 1450845 98977 399125 -152254 -967334 -687940 -57173
41247 -57173 239934 1507304 4208720 6017234 5269458 3745331 3416147 3080886 1214649
41238 1214649 -337320 879630 3308976 3490993 1787719 1800486 3992009 4172336 134774
41229 134774 -3542236 -714918 7444969 12505571 8986206 1746681 63783 5430144
41221 5430144 9549801 5671535 -2433945 -6191823 -3549390 277376 1422940 1045729
41213 1045729 775428 285334 332608 2792259 5966263 5039688 -428296 -4388136 -2570294
41204 -2570294 1808730 3918342 4092298 4475388 3474532 -813962 -4902372 -3748448
41196 -3748448 1480699 4998940 4475380 2381495 516392 -1433522 -2637724 -1805585
41188 -1805585 -736584 -1944767 -3216791 -362572 4682869 5107204 -363238 -5075015
41180 -5075015 -4711205 -3216307 -4914194 -7062838 -5375365 -1823952 -868627 -1579237 23914
41171 23914 3084937 2956463 -746032 -3330167 -2525042 -1224051 -1725311 -2298640 -1305592
41162 -1305592 -423463 -1357838 -2647238 -2160576 -216306 1880999 4041961 6140291 6919301
41153 6919301 6239956 6020692 6616830 4975022 -334392 -4741298 -2910112 2867172 4684338
41144 4684338 -279985 -6248715 -7702837 -6693576 -7774804 -9652913 -7220980 -345315
41136 -345315 4880179 4350914 1010718 -144584 1275871 2057079 755768 -1127813 -2456773
41127 -2456773 -3798548 -5160969 -5085665 -3277841 -2152724 -3736572 -6034732 -4881478
41119 -4881478 510505 6184504 8643337 9295583 11625233 15378707 16582536 13179284
41111 13179284 7539065 2589867 -1423075 -4588530 -4886290 -1384722 2100243 675763
41103 675763 -4694195 -7885774 -5876844 -2584840 -2825490 -5706928 -6694141 -4011076 114944
41094 114944 3349675 5114664 4793785 1374148 -4003755 -7575483 -6900754 -3994399 -2735753
41085 -2735753 -3948278 -4971018 -3807711 -1484057 240747 1340557 2391446 2864306
41077 2864306 2504231 2846989 4767025 5712864 2742745 -2208090 -4096115 -2187216 -1259931
41068 -1259931 -3966777 -6758753 -6192003 -4578770 -5093302 -5378234 -1683239 3588006 4994549
41059 4994549 3073272 3284008 6335534 6789256 2373028 -2311865 -3673628 -4215348 -6470798
41050 -6470798 -7787740 -5421920 -1901063 -615422 -185881 1843370 3304542 904162
41042 904162 -3149506 -3659147 -171231 2911157 3059083 1728287 319387 -1346207 -2514655
41033 -2514655 -1688966 223566 529419 -1035336 -1867972 -613689 1245915 2212527 2381557
41024 2381557 1992905 1059570 647623 1926764 3780379 3890641 2283971 1259383 1792126
41015 1792126 2650213 3051011 3336899 2910403 584101 -2530308 -3513877 -1817335 -147966
41006 -147966 -332570 -1141025 -1410430 -2515002 -5809049 -9557262 -10407854 -7088066 -1624080
40997 -1624080 2371917 2422451 -563510 -2688922 -1123924 2461562 4268748 3631507 3283345
40988 3283345 4455506 4969652 3255334 1358488 2091318 5035884 7070250 5803301
40980 5803301 1621128 -2512694 -2930821 1386279 6778467 7889113 3265305 -3436959
40972 -3436959 -7866354 -8717477 -7229225 -5542138 -5874626 -8608711 -10617077 -8310895
40964 -8310895 -2999783 2844 -1385855 -3368801 -2636758 -1487544 -3544900 -7584482
40956 -7584482 -9493951 -8266773 -6093977 -3927076 -1110592 1144251 180604 -3543953
40948 -3543953 -5900421 -4560443 -2329735 -3117287 -6411992 -8006454 -5530768 -1252943
40940 -1252943 871265 -550479 -3826150 -6762645 -8220865 -7470843 -4129510 363024
40932 363024 2995996 2500018 1113461 1389297 2682893 2938345 2339766 2130390 1126890
40923 1126890 -2558748 -6791478 -7001667 -3114857 -278144 -1238376 -2639767 -1257198
40915 -1257198 624350 -429456 -3008691 -3471817 -1937803 -1389813 -2576153 -3819321
40907 -3819321 -4556604 -5256449 -4945402 -2627337 -314090 -871888 -3449816 -4734214 -4149855
40898 -4149855 -3779433 -3390724 -138236 5945873 10475168 10473820 8123836 6740668 6033123
40889 6033123 3847802 444180 -1574627 -510721 2995503 6768028 8140624 5676584
40881 5676584 1295425 -773070 1194175 4048395 4116867 2420272 2745579 5256576 5601190
40872 5601190 1384429 -3474367 -3145644 2940087 9666553 12161710 9924435 5578619
40864 5578619 2151437 1771352 4319170 6439320 4428229 -648281 -3392988 -1282945
40856 -1282945 1678654 1141129 -1105896 -921071 780723 -17666 -2709485 -2777916 -111037
40847 -111037 212189 -3201031 -5094443 -2114488 1940941 3007057 3000847 4667087 5585625
40838 5585625 2889564 -464004 -228692 1818732 1279870 -1189002 -2149266 -2722289 -6339860
40829 -6339860 -10673927 -9569623 -3065713 1789427 1183442 -982453 -554357 887763
40821 887763 -66041 -3416982 -6659055 -7401025 -4063102 2286333 6401962 3618437 -3371750
40812 -3371750 -7210697 -5724815 -3798154 -4922535 -7038006 -8095581 -9161672 -9659298
40804 -9659298 -6136910 846385 4712099 1707897 -3678715 -6068693 -6393017 -7351307
40796 -7351307 -7350241 -4492667 -1821570 -2699227 -4902494 -4946703 -4370437 -5803693 -6649145
40787 -6649145 -3339875 1275914 1783984 -1010272 -2131783 -1257630 -2254146 -5202393 -6140336
40778 -6140336 -4253760 -2552179 -1744483 -101679 939432 -1903190 -6649879 -7437775
40770 -7437775 -3826901 -1753214 -4003757 -6675917 -6689625 -5806641 -5035635 -2018832 3160064
40761 3160064 6100764 5145259 4138074 5128925 4872594 2085007 1212082 4396865 6482503
40752 6482503 3574382 224548 1687878 4912275 4576568 2864431 4816735 8038237
40744 8038237 6306923 1034582 -211236 4303424 8792394 9990687 10025176 8747907
40736 8747907 2668463 -6012717 -8369154 -1239822 6692899 6702988 1751613 314410
40728 314410 3438142 5124202 2801156 37509 -752984 -1810812 -4773852 -6877293
40720 -6877293 -5136464 -1351310 155112 -1362257 -2150876 362985 3343698 2196022
40712 2196022 -2471201 -4734850 -1188195 4288435 6054370 4201615 2765095 2713834
40704 2713834 1961844 1365549 4276410 8996368 8233519 -536364 -9535841 -10159864 -4018497
40695 -4018497 665693 727147 165579 1937218 3827836 3307160 1563764 879753 1380725
40686 1380725 2098416 2653695 2461953 686145 -1502546 -894153 3595147 8504805 9798213
40677 9798213 8036353 7058289 7947301 7213518 2030011 -5032324 -8769876 -7808053 -5594667
40668 -5594667 -4888332 -4346475 -2116567 116347 -213237 -1734387 -1007565 1444867 1419579
40659 1419579 -2104511 -4902145 -3993963 -1894791 -1694029 -1958969 -462319 330573 -3324701
40650 -3324701 -9199385 -10705674 -5910783 -272284 738598 -2144675 -4924629 -6329044
40642 -6329044 -8128553 -10961509 -12584411 -10746019 -6479990 -3237572 -2443073 -1262526
40634 -1262526 3358105 9254061 10939739 7469459 4378435 5678403 8030323 6554861
40626 6554861 2788870 1734178 3514035 3938600 2134106 1284806 1793390 88702 -4482599
40617 -4482599 -7463170 -6070816 -2942638 -769120 1565660 4389277 3928758 -1933715
40609 -1933715 -8412792 -9228204 -4806589 -599177 802770 1221486 1744118 866630 -1792508
40600 -1792508 -3670761 -2435907 1143828 4428795 5738589 5417618 4747701 4103759 2501762
40591 2501762 -306875 -2047409 -344243 3277674 4737352 3246919 2416973 4250321
40583 4250321 5786575 4153858 1572901 2017531 5340044 8068104 8218678 6302457
40575 6302457 3299781 571313 35834 1513194 1651511 -1605574 -5444957 -6128993 -4326480
40566 -4326480 -3105276 -3028277 -3309365 -5347677 -9922864 -12658149 -8304487 875294 6813541
40557 6813541 6020373 2646806 514720 -1788442 -5721942 -8326507 -6577007 -2432350
40549 -2432350 -81968 -750349 -2961951 -5525884 -7584054 -7735961 -5714959 -3502719
40541 -3502719 -2724763 -2280926 -375273 2314616 3245602 1159684 -2398543 -4308511 -2631299
40532 -2631299 980164 2390877 143885 -1825968 539953 4906748 5622255 2507107
40524 2507107 909597 2458700 2369916 -1537925 -3888895 -531882 3521182 1515877
40516 1515877 -3712495 -3509513 3337607 8996989 8521913 5972822 6455427 8457316 7977219
40507 7977219 5596325 4620818 4866035 3222180 -444527 -2449178 -1055602 515982
40499 515982 -1168531 -4303882 -3979936 722167 4544530 2235085 -4680491 -9312765
40491 -9312765 -7290711 -1326711 2648398 2261589 186597 -254902 1068301 2264376
40483 2264376 2865941 4191193 6254189 6427844 2854521 -2017008 -3754908 -1535535
40475 -1535535 1327846 2699020 4007310 5993563 6029549 2730678 -181814 1081556
40467 1081556 4001264 3414375 -183556 -1695381 1776 767134 -1089531 -2136140
40459 -2136140 -425372 1316917 1461833 2429445 4655372 3617226 -2524846 -7661642
40451 -7661642 -5915617 -963187 -664431 -5167182 -7338436 -3970535 168676 76793 -3236126
40442 -3236126 -5736817 -5479171 -3066473 112553 2712912 4194413 5154243 5728299 4638318
40433 4638318 1659086 -488809 675351 3717901 5657728 6380005 7192838 6554351 1741355
40424 1741355 -5640753 -10203308 -9353775 -5984183 -4386176 -6387241 -10992737 -14521930
40416 -14521930 -12026076 -2763836 6370374 7642217 2500073 -376159 2789459 6712010
40408 6712010 6371975 4052149 3807250 4408602 2349255 -1874944 -5002160 -5974938 -5703567
40399 -5703567 -3908003 13602 4286024 6156483 5187430 2968451 811065 -437358
40391 -437358 -91302 870921 119 -2880626 -4441523 -2712284 -595257 -1499464 -3920059
40382 -3920059 -4061598 -1914125 -568025 -754544 -486224 314768 -714592 -3695344 -5185568
40373 -5185568 -2934656 856191 2474450 987672 -1433860 -2044902 164512 3421391
40365 3421391 4354199 1533696 -2471614 -4054751 -2890203 -1382458 -773224 -583162 -1312806
40356 -1312806 -4110058 -7339870 -7165103 -2970476 963256 1092018 -911238 -1647773 -1377253
40347 -1377253 -2664819 -5201925 -5676193 -2783248 710401 1812267 1104467 1519643 4546737
40338 4546737 8666556 10900649 9312534 4610221 -141015 -1878866 -241039 2193670
40330 2193670 2553580 306062 -2762438 -4478750 -3739625 -788444 2867752 4942325
40322 4942325 3965083 938479 -1349626 -1292224 -160813 -198557 -1733069 -3276471 -3993536
40313 -3993536 -4497623 -5034023 -4465161 -1905706 1703943 4555006 5661794 4788019 1776911
40304 1776911 -2610298 -5874412 -5672172 -2719616 -257934 -99204 -626174 330387 1977628
40295 1977628 1753079 -462807 -1687417 -324427 699660 -2449670 -8608212 -12227687
40287 -12227687 -10492287 -7027705 -6727170 -9251482 -10514785 -8984177 -6725122 -4683268
40279 -4683268 -1286964 3221561 5318028 3601721 2258687 5564012 11166034 12867644
40271 12867644 9056235 4410163 3323462 5276021 7270313 7551905 5870294 2981205
40263 2981205 1276349 3313813 8070013 10923947 9180478 5509743 3857279 4048651
40255 4048651 3230823 1087866 141068 1268367 2364681 2093763 1975623 3302573 4304881
40246 4304881 2450755 -1698380 -4959919 -5440610 -4374685 -4041452 -5046418 -5959607 -4947809
40237 -4947809 -1549514 2724926 5489061 5568473 4031456 2821054 2484616 1841927 36752
40228 36752 -1801619 -1764020 19818 768107 -1840390 -6335838 -8599894 -6680104 -2969488
40219 -2969488 -552200 939551 3540470 6125938 4870891 -890647 -6657466 -8351945
40211 -8351945 -7017607 -5655877 -4379389 -2274714 -1628799 -5263384 -10392813 -10489015 -4234836
40202 -4234836 2081720 2883203 -209023 -2501410 -2771813 -2438580 -1614780 -24947 432865
40193 432865 -1905771 -4976813 -5566552 -4086657 -3201709 -3072257 -2012057 -864283 -2203850
40184 -2203850 -5412796 -7009423 -6143740 -5364689 -5346792 -3561842 396679 2795781 1419427
40175 1419427 -707985 -29349 2486439 4009508 4577305 5621428 5945952 3036830 -2404196
40166 -2404196 -6328477 -5769246 -1711785 2060455 2024472 -2007282 -5905812 -4874460 944297
40157 944297 6357286 7469079 5678734 4259120 4093086 4653075 5910624 6719056 4422066
40148 4422066 -1049742 -5748615 -7246090 -7883177 -8999643 -6666364 1182197 7662609
40140 7662609 4822877 -3726225 -6666525 -945310 4897977 4408175 1246475 520742
40132 520742 461823 -2235933 -5436158 -5721427 -4488299 -4225359 -3045123 1180734 4922333
40123 4922333 3572561 -731084 -2227604 -601998 -479337 -2887797 -3853304 -1799046
40115 -1799046 -226730 -1640329 -3897610 -4425128 -3877008 -3719720 -3664907 -3300277 -3387190
40106 -3387190 -4046587 -4132752 -3355519 -2532613 -1364042 947485 2621703 880515 -2470871
40097 -2470871 -1647193 4768931 10418571 9254641 3421893 -541483 -261324 1835595
40089 1835595 3945540 6126066 7215247 5156322 635067 -3058085 -4128179 -3519791
40081 -3519791 -2158160 124161 2592666 3213092 1031005 -2715941 -5978741 -6952747
40073 -6952747 -4494223 360756 3953686 3566792 924027 -420230 -391270 -1792597 -4900394
40064 -4900394 -6747014 -6297344 -6150742 -7621529 -7972873 -4791340 -21123 2813954 2978152
40055 2978152 1906118 549009 -371466 406410 2758912 4187623 2984441 884638
40047 884638 642584 2498277 4665187 5471962 3571662 -1459685 -6867706 -7927205 -3794516
40038 -3794516 764924 2058427 2293218 4252114 5226846 1589653 -3713400 -4662135 -1388276
40029 -1388276 714953 146421 513461 2496539 1925447 -2556656 -6659000 -7592403 -7762907
40020 -7762907 -8558192 -6810811 -1381157 2533866 676331 -3225469 -2862510 1845748
40012 1845748 6406337 8906116 10093168 9012222 4429073 -889005 -2821734 -2083146
40004 -2083146 -2887891 -6051006 -8172004 -7409249 -5435264 -3518862 -1000921 1956198
39996 1956198 4129760 6114051 9440694 12425059 11219866 6019508 1946002 2164725
39988 2164725 4159256 4845015 5175413 6476931 5919326 406068 -6788415 -8457931 -3063753
39979 -3063753 2393754 1192752 -4474757 -6957336 -3688123 -3100 -732766 -3361766
39971 -3361766 -2792778 322561 1199315 -483926 22386 3473621 3495179 -3842673 -12584667
39962 -12584667 -14162646 -8506576 -2477307 32144 491913 84041 -1783282 -3569244
39954 -3569244 -2429744 124430 -1141599 -7359048 -13062459 -13298377 -9155103 -4535926
39946 -4535926 -1376736 -1367 -538327 -1671244 -954803 1559216 2664491 711318
39938 711318 -1739695 -1802515 -238253 430611 -338752 -1110203 -698162 794505 1963724
39929 1963724 1080047 -1215150 -1168987 3078391 6982812 4778444 -1324163 -3019376 2221894
39920 2221894 7618034 7519145 4651684 3292318 1770326 -2760139 -7353558 -7511221 -4698380
39911 -4698380 -3317512 -3106983 -963841 1997844 2028942 60861 613571 3764390 4910740
39902 4910740 3092181 2954058 6613196 9500261 7276519 2262364 -458986 49537
39894 49537 1121020 1695511 3387877 6932474 10130958 9819759 5083238 -1495470 -5781392
39885 -5781392 -5928935 -4230260 -4329011 -6807483 -8618406 -6851618 -2041248 2415702 3546506
39876 3546506 1533689 -679985 -852441 -22165 -362073 -1254178 -267082 2028788 2046162
39867 2046162 -847034 -2474666 -259617 2609327 2575726 1194000 1057412 200956 -3942146
39858 -3942146 -8064133 -6885867 -1786100 1012181 -6813 -601707 834760 891193 -1570849
39849 -1570849 -2479895 416113 3239188 2110877 -842399 -1306548 560001 886458 -2136136
39840 -2136136 -5798756 -5582013 306286 8056874 10727392 5870735 -571088 -1308624
39832 -1308624 2980124 6012102 5978327 6786713 9454083 9679092 5688829 1511398 -231172
39823 -231172 -2265479 -6297819 -9090534 -8511192 -7274747 -6779645 -3798511 2066614 4613607
39814 4613607 708654 -3012596 -390900 3570386 971635 -5398497 -6956954 -4041402
39806 -4041402 -4417177 -8685669 -8894583 -2512736 3338693 4285697 5084305 9371621 12241515
39797 12241515 8905043 3312196 1408209 1475328 -1597989 -6307820 -6249793 -282555 5490172
39788 5490172 6068890 3126816 1428134 2976319 5750802 6446494 3852248 141133
39780 141133 -1586619 -1238128 -1742871 -4613258 -7520767 -7454411 -4441701 -885325 1049431
39771 1049431 350528 -2433899 -4531422 -3071973 643622 1585407 -2372972 -6951350
39763 -6951350 -7169422 -4028877 -2096050 -2273834 -1148217 2816100 6325706 5586277 1087065
39754 1087065 -3273137 -4563193 -3395978 -2712300 -4460420 -7473465 -8893195 -7497735
39746 -7497735 -4616525 -1854962 356527 1596833 1044361 -701695 -1507491 -807835 -723863
39737 -723863 -2466436 -3925788 -3002456 -1114244 -737527 -1456463 -1450623 -1056292 -1416870
39728 -1416870 -1248879 1048837 3297591 2072049 -1311383 -2324521 -827790 -1570944
39720 -1570944 -5710452 -7576445 -3135052 3101291 4107369 39359 -2961415 -1717641
39712 -1717641 1145213 2603345 2810520 2760637 2215488 1101554 62760 -1396293 -4565468
39703 -4565468 -8163515 -8265797 -3698570 922827 483146 -3726419 -5725530 -3107598
39695 -3107598 50953 -314920 -2189170 -768646 4069832 7393465 6359904 4182140
39687 4182140 5298722 9112456 10994146 8227050 2614066 -2159127 -3669421 -1826706
39679 -1826706 961979 905579 -3690340 -9963145 -13373772 -12728917 -10126426 -6685705 -1982655
39670 -1982655 2111880 1682415 -3019677 -5675211 -1620541 5407501 7989263 4403517
39662 4403517 -572910 -2730937 -2237962 -1167950 -1114331 -2994425 -5775085 -5801833 -981553
39653 -981553 4843910 5734951 1588320 -2280391 -3406407 -4450001 -6194675 -4777033
39645 -4777033 786034 4183616 233135 -6289676 -6289429 1226363 8118569 7882818 2399494
39636 2399494 -2356068 -3085399 -650747 2117515 2949742 2133885 2106833 3949379 5613257
39627 5613257 5369064 4806126 5527496 5316876 1781514 -2223125 -2105824 686747 471301
39618 471301 -3174989 -4351716 -661070 2563942 860226 -2450193 -2106649 1123998
39610 1123998 3063115 3008376 3114540 3616534 3368021 3071735 3646839 3291463 408507
39601 408507 -2444674 -1990243 175549 273624 -932878 333321 3381844 3215343 -1226083
39592 -1226083 -4834712 -4063546 -1647770 -1106877 -1138897 1129105 4699079 6138863 4421368
39583 4421368 1389554 -1053605 -1820919 -240245 2856118 4811851 4004199 2058845
39575 2058845 1497423 2327095 2807798 2541680 2676373 3470651 3485748 1295765 -2968340
39566 -2968340 -7572064 -10076929 -8946357 -5004613 -748105 2244937 4451631 6725543
39558 6725543 8731155 9564379 8669882 5668114 799443 -3815995 -5136876 -2551497
39550 -2551497 1137393 3057355 3152904 2897685 2965222 3407511 4360641 5139950 4285228
39541 4285228 1866650 -51298 -566325 -1285918 -2828138 -2762322 246556 2885658 1547312
39532 1547312 -1625058 -1377913 2892493 6585094 7103383 6951879 8368087 9032300 5696135
39523 5696135 -511515 -5072903 -5226670 -2345676 135994 50819 -1756866 -2454970 -395737
39514 -395737 2778079 3744235 744611 -5326226 -11734703 -14638148 -11054121 -2620586
39506 -2620586 4236905 4956028 2214860 1264169 1912766 327459 -2479413 -911997 5548223
39497 5548223 10075230 8677296 5962103 6544283 7001069 2439743 -3870857 -4857335 -811792
39488 -811792 1331604 -1172711 -3878057 -3252615 -1400400 -1357941 -2963744 -5065861 -7462459
39479 -7462459 -9134408 -8444353 -6310342 -5362933 -5073032 -2161249 2843329 4457754 161905
39470 161905 -5119137 -5788122 -2965447 -1359949 -2113089 -3113098 -3927663 -5589697 -6695595
39461 -6695595 -4427010 424000 3251536 1313547 -2954809 -5117393 -3570052 -754197
39453 -754197 -548401 -4299082 -8845258 -9535176 -5975224 -2900758 -3833550 -6202250 -5434398
39444 -5434398 -1944784 -402959 -2848455 -6221935 -6952863 -4956943 -2521357 -1606544
39436 -1606544 -2675827 -4266787 -3813633 -880694 1053260 -1340584 -6032831 -7787053
39428 -7787053 -5273865 -2246248 -1304856 -776496 868200 1787585 444076 -1057707 -343472
39419 -343472 1310566 1580991 1264769 2444095 4283258 4193207 2072179 112839 -785434
39410 -785434 -1333196 -1412032 -573768 -356691 -2612894 -5771036 -6442457 -4901404 -4954036
39401 -4954036 -7467235 -8288363 -4731457 -337077 62943 -2704045 -3853474 -1637009
39393 -1637009 1211336 2354634 2434497 2518362 2360756 2208149 3379488 5390997 4914642
39384 4914642 -52855 -6372895 -8581981 -5191211 -290267 1105879 -2214305 -7542279
39376 -7542279 -11171205 -10937781 -7273702 -2736653 61075 586927 69425 -800477 -2554755
39367 -2554755 -4900243 -5590836 -2818939 2082324 5862244 6859484 5793495 3456476
39359 3456476 -228494 -4240522 -5626070 -2469090 3059171 6354090 5142310 1396633
39351 1396633 -1589132 -2641164 -2532716 -1695180 184156 2461405 3194061 1343305 -1734074
39342 -1734074 -3942985 -4744393 -4718449 -3800089 -1691444 451330 843346 -255145 -663584
39333 -663584 557096 2110106 3079991 4066821 4800827 3523111 491220 -871764 1023818
39324 1023818 2580369 218836 -3460333 -3305134 134477 1403573 -1017832 -2434723
39316 -2434723 188296 3543307 3840256 2621482 2982095 3693997 1714028 -1639103 -1862626
39307 -1862626 1833156 4906777 3504494 -793714 -3487455 -2696625 -781020 -856045 -2820404
39298 -2820404 -3817137 -2599971 -1566411 -2883768 -4555315 -3489605 -1071332 -1210555
39290 -1210555 -3317857 -2759996 846202 2064827 -1162330 -3226911 -47980 3494593
39282 3494593 1306467 -3749014 -4678888 -1735351 -936525 -3328235 -4065842 -1690496 -280477
39273 -280477 -1602395 -2383583 -773050 969905 1569214 2324523 2594223 259418 -2338639
39264 -2338639 -407534 3855162 2446899 -4900473 -7767419 -751712 7085328 5912546
39256 5912546 168946 430092 6374044 8726337 4695533 500466 -235527 -245897 -442553
39247 -442553 2354703 7647531 9605257 5855519 982459 -1145990 -1942072 -2653677 -1248695
39238 -1248695 2042471 2640978 -861071 -3005105 85208 3887111 2414850 -2456800
39230 -2456800 -4365760 -1852937 1322259 2780065 2913914 1565940 -1297873 -2893965
39222 -2893965 -728259 2605873 2685862 293119 -154343 1563412 1350853 -1222850 -1542185
39213 -1542185 1518287 2260143 -2705465 -7346738 -3699384 6734777 14700236 14755262
39205 14755262 9815569 4663123 538622 -2292458 -1507237 3985409 10122373 11169669
39197 11169669 7006471 3610334 5109460 8059928 6279730 -56261 -4026985 -1456634
39189 -1456634 3087624 2836887 -1423390 -2939049 530286 3555599 2006859 -260532
39181 -260532 2266778 7593287 8865098 4521366 121814 -110612 1730483 2325706 2564796
39172 2564796 4799209 7741290 7801979 4328638 519553 -693581 337946 1180375 333026
39163 333026 -1120656 -670865 2337011 5013325 4208923 1300133 894459 3969690 5679844
39154 5679844 2197602 -3373721 -5334152 -3378603 -2114182 -3696806 -5328356 -4355752
39146 -4355752 -2157458 -1911397 -4985628 -10126576 -14161571 -13650959 -8340376 -2679695
39138 -2679695 -1069584 -2127940 -1282226 1479938 1502818 -2100454 -3649889 578765 5982006
39129 5982006 6007324 1267614 -2472137 -2919961 -2808899 -3986339 -4755591 -3312503 -297174
39120 -297174 2461919 3335668 1478436 -1553195 -1805128 2390747 6691644 5344207 -943957
39111 -943957 -5660324 -5123804 -2343731 -1395450 -2097551 -2274161 -1940681 -2581933 -4378911
39102 -4378911 -6451536 -8338818 -9393518 -8161105 -4275580 -16060 1676144 285852
39094 285852 -2028110 -2621346 -389097 3365066 5779225 5337971 3905685 4215378 5642249
39085 5642249 5127317 2444216 1028134 2369696 3408933 1911016 773167 3299147
39077 3299147 7040937 6910575 2698244 -1395130 -3839373 -6972847 -10689937 -10624962 -5135785
39068 -5135785 457959 393212 -3652491 -5191288 -1820081 2571640 4152835 3889981 4780966
39059 4780966 6992742 7725869 5013147 206537 -3370312 -3725879 -1971895 -731824
39051 -731824 -1030758 -1598648 -1487400 -1973353 -4485028 -7519405 -7629968 -3677322 1476586
39042 1476586 4089823 3306177 1342753 797682 2216584 3767683 3254371 942925 -250598
39033 -250598 1388159 3238033 1484796 -2821718 -4138971 55030 5481372 7089993
39025 7089993 5788757 5576943 6253310 3883412 -1841729 -5717870 -4046719 295294
39017 295294 2129219 440663 -2194655 -4556801 -7642235 -10995265 -11461392 -7042827
39009 -7042827 -430279 3160121 1675311 -1648645 -2706744 -1867224 -2763574 -6050691
39001 -6050691 -7630874 -4684449 -353220 691050 -961533 -1071288 1352090 3367981
38993 3367981 3700868 4019679 4369382 2590203 -477311 -510074 3363352 6157863 4512791
38984 4512791 1850660 2375234 4283324 3503677 647484 -752415 -232072 390531 1596881
38975 1596881 4740919 7512021 6055090 1084317 -2618354 -2418383 377107 4093764
38967 4093764 7841010 9732973 8264728 5297535 4014260 4522470 5004260 5728958 7469540
38958 7469540 7557078 3110106 -2736891 -4045677 -1379870 -1289936 -5696989 -8656882 -5849347
38949 -5849347 -886029 1054317 417876 386426 1289919 1791139 2180204 2910591 2579502
38940 2579502 407620 -1524200 -871634 2118858 5662142 7911562 6860444 2196638
38932 2196638 -2296668 -2433508 -205634 -1469901 -6252768 -7857202 -3775993 -389451
38924 -389451 -2874931 -7097175 -6813527 -3307386 -1895076 -3337916 -4655285 -4800818 -4134848
38915 -4134848 -1928991 516048 -1407974 -8116749 -11767164 -6504225 1594522 2649003
38907 2649003 -2634650 -5404222 -2730877 253014 871696 1652896 2326159 -1232592 -8208688
38898 -8208688 -11695905 -9028950 -5578203 -5334790 -5155349 -2055534 738266 -209715 -2157363
38889 -2157363 -1004680 1727645 1851086 -521755 -1707230 -424754 896708 40243
38881 40243 -2519259 -4829982 -5755924 -6207724 -8019747 -10865700 -11552757 -8225413 -3464010
38872 -3464010 -424618 1721607 4472404 4964125 336810 -4822452 -2954498 4928796
38864 4928796 10092814 9027023 6987740 6881586 4071401 -3546717 -9079333 -6542674
38856 -6542674 -483328 1001162 -2366681 -5042545 -4516993 -1917372 2237051 6636699
38848 6636699 7036989 1653529 -4389276 -5847896 -5279960 -7854240 -11501292 -9758096
38840 -9758096 -2724555 2312339 1039818 -3394967 -6286901 -6366389 -4591063 -2531338
38832 -2531338 -2084102 -3122330 -2333331 1925757 5546568 3992844 -476085 -2312122
38824 -2312122 -1280657 -1169893 -1555417 1646176 7582611 9977314 6373115 1130690
38816 1130690 -2146954 -4509038 -6224863 -4406843 889497 4365892 3119034 1510317
38808 1510317 4403150 9730295 11879208 9321771 5223193 2814889 2979018 4398173
38800 4398173 4266183 1075240 -2503445 -2747318 -1169390 -2773260 -7028434 -6964764 -261951
38791 -261951 5241802 2139827 -5784983 -9489270 -7270725 -4681019 -4568433 -4374136 -2477677
38782 -2477677 -739844 -311420 -75222 223060 -307162 -650523 1048955 3087227 1486872
38773 1486872 -3412913 -6175641 -3797147 -110826 -407323 -4688502 -8626917 -8915500
38765 -8915500 -5451824 -123845 4267657 5116504 2172516 -1855761 -4090231 -4247833
38757 -4247833 -3779264 -3414475 -3012406 -3082175 -4624916 -7252348 -8812480 -7656839 -4625797
38748 -4625797 -1910128 -237193 1563617 3835484 4555729 2145563 -1326369 -2348936
38740 -2348936 -1108684 -1232026 -3654520 -4391744 -654374 4143805 5074019 2987454 2629274
38731 2629274 4705192 5043649 2158024 457472 3442237 7620246 6913393 1123122
38723 1123122 -3743700 -3237160 469138 1952725 -1039967 -5732890 -7849863 -5712461
38715 -5712461 -953568 3672432 6367958 6656090 4911958 2005537 -1263118 -4721974
38707 -4721974 -8218085 -10531613 -10279762 -8233052 -6916020 -7039102 -6419985 -3866523 -1622607
38698 -1622607 -1451925 -760220 3489162 8568398 8591289 3249895 -1134848 -612498 1214397
38689 1214397 -304615 -3409779 -3120051 726842 3337099 2204975 313287 1252968
38681 1252968 4171098 5363201 3459292 1075052 1025314 2123888 482779 -4572616
38673 -4572616 -8107273 -5504179 740326 3986412 2815352 2434463 5389453 6554942
38665 6554942 1413270 -5292388 -5256133 1397812 6378958 5046459 1488632 511817 627458
38656 627458 -1674404 -5106133 -5465497 -2209633 799430 549173 -1900978 -3383850 -1995787
38647 -1995787 1416709 3960698 3200274 -184784 -2813891 -2419880 -439794 47978 -1859683
38638 -1859683 -4065783 -3806641 -126263 5203548 8725198 8335807 5804720 4823586 5938665
38629 5938665 5577547 1643791 -2256222 -1078783 4479913 8521558 7527814 4029031
38621 4029031 1903009 1216169 -314196 -3102724 -5603729 -7184843 -8320383 -8259529 -5341223
38612 -5341223 -439195 2277302 -181801 -5690690 -9441581 -9538958 -8016996 -6607800
38604 -6607800 -4344964 -454934 2960369 3476117 2047927 1476248 1997918 1405160 -557694
38595 -557694 -1261610 346570 1453882 -455822 -3545589 -4274525 -2488257 -1121825 -1760730
38586 -1760730 -3250437 -4273441 -4462003 -2880646 1480791 6545043 7267895 1329338
38578 1329338 -6666468 -9226635 -4075996 3712106 7912716 7523068 5901430 5283649
38570 5283649 4585585 2544305 469576 311743 1477730 1653380 244753 -1086727 -1338944
38561 -1338944 -1558649 -2753710 -4203974 -4729918 -4238780 -3213176 -1969930 -1064116 -940302
38552 -940302 -594918 1535350 4574230 5479638 3734690 3155447 6678610 11612329 13030064
38543 13030064 10083567 5633877 1231525 -3399197 -6737797 -6182870 -3003407 -1988397
38535 -1988397 -4409574 -5383061 -982578 5209518 6242259 783962 -5564590 -7495722
38527 -7495722 -5458957 -3328942 -2983801 -2853552 -1123591 1264720 1669057 -728851 -3832452
38518 -3832452 -5508048 -6062112 -6582794 -6294954 -3906934 -873903 -413334 -2828126 -4380101
38509 -4380101 -2014018 2561343 4746053 1940952 -4163604 -9263952 -10006700 -6717130
38501 -6717130 -2687341 -315106 972016 1956570 1131040 -2145740 -4131535 -1001785
38493 -1001785 4227873 4604610 -569299 -4476949 -3351402 -1792085 -4092620 -6647553
38485 -6647553 -4611949 -1016934 -1994346 -5960175 -5476262 906188 6304936 6149913 4439733
38476 4439733 6551784 10911626 11671892 6882458 592739 -2102648 -23797 3699479
38468 3699479 5394741 5106620 6140310 9294711 9806488 3419525 -5992951 -9758253
38460 -9758253 -5618069 -660131 -1522355 -6406668 -9561987 -9498636 -8773123 -8527526 -7798928
38451 -7798928 -6879913 -7034810 -7076204 -4031887 2053177 6974697 7256480 4045606 846515
38442 846515 -862693 -2033113 -3188445 -3371081 -2074526 -309888 1314475 4050760
38434 4050760 8522921 11618490 9038086 1862233 -2599134 908687 8658786 12572802
38426 12572802 10208269 6078625 3795632 1974420 -1018000 -3307970 -3351415 -3506599
38418 -3506599 -5948265 -7936040 -5653515 -1079050 -181986 -4484519 -8911210 -8915442 -5838428
38409 -5838428 -3522696 -2921084 -2542345 -1927463 -1797006 -1817231 -739082 1529774 3805042
38400 3805042 5358945 6350852 6917990 7210032 7748766 8197551 6612471 2171863 -1990795
38391 -1990795 -1799905 1707808 2927603 -444400 -3844671 -2666438 892043 1722148
38383 1722148 -124552 -288946 2222682 3640097 1896070 -639407 -1994469 -3317745
38375 -3317745 -4900078 -4033262 410512 5000885 6304735 5249643 4114562 2399910
38367 2399910 -975106 -4167715 -4741448 -3455496 -2585119 -2460671 -2463316 -3129586 -4518950
38358 -4518950 -5175353 -5354945 -7690993 -11467928 -10887092 -3804198 2548844 919624 -5069577
38349 -5069577 -6903452 -4361305 -3629099 -4691399 -1221196 6941980 11730671 9207255
38341 9207255 4508396 1995600 -154602 -2387205 -523741 5258585 7430705 2945848
38333 2945848 -465015 3437656 8884636 7745399 2505850 576176 1512977 -228098
38325 -228098 -3987999 -4351433 -1301656 454690 496330 2026194 3630649 883528 -4372736
38316 -4372736 -5462113 -1856308 219989 -938283 123209 5078190 7249634 2170482
38308 2170482 -4788353 -6555560 -4446265 -4677352 -8717466 -12208973 -11350413 -6618922
38300 -6618922 -1563405 -116395 -3386364 -7720327 -8117374 -4476929 -1681514 -2632192
38292 -2632192 -4612611 -3985605 -1144874 1082007 1162130 -758272 -3805250 -6325015 -6941781
38283 -6941781 -6343128 -5949103 -5251516 -3596379 -3642718 -8199671 -13761157 -13135269 -5837031
38274 -5837031 154207 -612235 -4217410 -4863990 -3441142 -3841759 -5372451 -4453212 -977283
38265 -977283 2165340 3926369 5059793 5037053 3075978 705627 -320402 -1009727 -2651440
38256 -2651440 -3475649 -1674364 275514 -1198584 -4630193 -5251264 -2240136 343797
38248 343797 -6782 -1097489 -177834 2183726 3583703 2708685 -190683 -3912001 -6700344
38239 -6700344 -7383385 -6419197 -4896609 -2883218 105099 3534359 5948277 6285272 4561354
38230 4561354 2119109 1314182 3128775 4839420 2736330 -2130220 -4340618 -1717784
38222 -1717784 1349894 704830 -1394107 -462903 3207950 5901355 6119390 4717810 1898504
38213 1898504 -1674365 -3222455 -1761171 -1068821 -3943569 -6437178 -3733692 853937
38205 853937 -90490 -6533958 -11069091 -10149551 -7480515 -5643623 -2406917 2554045 4761228
38196 4761228 2031453 -1651630 -2517723 -1781810 -1330234 -406375 448983 -1820644 -6507132
38187 -6507132 -7640312 -2911789 1836326 1780950 719806 3614779 7225664 5478693
38179 5478693 -239560 -4097522 -5848485 -9362062 -13107900 -11130680 -3619322 1851312
38171 1851312 1201464 -1235863 -837048 884111 1045474 908613 2700967 5120222 5947761
38162 5947761 6106023 7438794 8704032 7316316 3779458 1338634 1728997 3488722
38154 3488722 4307100 3571531 2687978 3619818 6701227 9528827 8862914 4203709 -1164242
38145 -1164242 -3160185 -682631 3388004 4495182 391809 -6251426 -9911465 -7901667
38137 -7901667 -3096921 61155 689978 775773 1150688 1054538 609990 521627 -150996 -2737665
38127 -2737665 -5822594 -6607183 -5132364 -3705287 -2436018 546491 4278342 5096173
38119 5096173 2762439 1741053 4299518 6798109 5704713 3249229 3354380 5034659
38111 5034659 4019670 -827019 -6355159 -9301501 -8771341 -5643610 -1957675 156307
38103 156307 830115 2260263 4623183 4705775 910406 -3243170 -3913735 -2691911 -3561670
38094 -3561670 -6131113 -6519510 -3910371 -1426218 -555006 779009 3787660 6288980
38086 6288980 5998868 3709626 2066326 2948581 6311068 9892848 10469018 7393449 4126162
38077 4126162 3921161 5147340 3843858 -243969 -3735507 -4789803 -4282704 -2558792
38069 -2558792 603485 3180546 2778819 1216189 2191726 4448378 3330898 -84939
38061 -84939 1457812 10059245 17773027 17367172 12047031 9220943 9712501 9381351 7528039
38052 7528039 6811949 7124575 6108044 4475557 4730925 5364644 2258627 -4194733 -8897103
38043 -8897103 -9338096 -7978652 -6800805 -4612698 -1022890 1615049 2033148 1951959 2503244
38034 2503244 2300392 683446 -474304 121462 1312025 2180537 3514244 5118085 4949854
38025 4949854 2703173 1062417 1470242 1899858 1010122 992864 3284847 4742716 2069130
38016 2069130 -2292951 -3088791 179267 2930505 2364596 479201 -271343 -477005 -1337142
38007 -1337142 -1632708 553111 4542033 7549151 7960134 6561555 4517619 1501037
37999 1501037 -3234364 -8360096 -10460417 -7623090 -2616530 -928289 -4925428 -10887288
37991 -10887288 -12795910 -8700485 -2503359 516051 -775845 -2842218 -2343575 -459400
37983 -459400 -960061 -4336636 -6447833 -4339915 -822292 -434948 -2783191 -3759776 -2412385
37974 -2412385 -1921954 -3448266 -3966875 -1935679 -485578 -2170456 -4500880 -4143409 -2197041
37965 -2197041 -1412549 -1155352 311254 930622 -2407497 -7433669 -8352718 -4158706 95404
37956 95404 1057153 935187 1908822 1763186 -1525913 -4585961 -2394238 4387990 9681936
37947 9681936 9313059 5141993 1567984 225755 -756440 -3406241 -7117041 -9316127
37939 -9316127 -8291486 -4732049 -608049 2453833 3397713 1917363 -364963 -420665 2457932
37930 2457932 4618156 2298606 -2883751 -5790615 -4796981 -3331272 -3883300 -4493700 -2969879
37921 -2969879 -856166 -282983 240886 3166511 6671299 6032883 183138 -6104809 -7240277
37912 -7240277 -2337261 4469542 7926542 6026217 1670874 -206892 2101767 5486271
37904 5486271 6240830 4123263 906212 -2782672 -6554101 -8085901 -5419990 -595302
37896 -595302 2508713 3461499 4752966 6354974 5344938 1710057 -225146 1747381
37888 1747381 4023008 2786149 -320609 -1549605 -950641 -917259 -1327780 -678980 -363757
37879 -363757 -2856625 -6364713 -6390209 -2879134 -813230 -2567802 -4603461 -3941729 -3299374
37870 -3299374 -6160231 -10111654 -9599547 -3934034 1438267 1621706 -2492192 -5876383
37862 -5876383 -4501345 1086958 6120801 6153431 2213722 31919 2759512 6526078
37854 6526078 5791411 1299891 -991769 1786931 6276872 8563256 9014413 9572532 9361634
37845 9361634 6047685 305940 -3877647 -3690397 -822457 384687 -2200718 -6086136
37837 -6086136 -7233482 -5314292 -4230772 -6568902 -9678950 -9553533 -6821866 -5373338
37829 -5373338 -5832307 -4726840 -783667 2326613 1633652 -344357 516313 3738868 5243214
37820 5243214 3226050 32007 -1321962 -101129 2425745 4315632 4088603 1950708
37812 1950708 -167099 -574493 621181 2351516 3917128 4923328 5229061 5532529 6355520
37803 6355520 6005006 2048815 -4147834 -7388057 -5089974 -784866 1349473 2255387
37795 2255387 4708895 7232526 6238954 2589465 633479 1099127 226528 -3343228 -5755371
37786 -5755371 -3744039 624855 2959605 1404118 -2853987 -7048469 -7645517 -2835381
37778 -2835381 4247630 7643905 5384248 1438025 -291529 -446408 -950374 -1137565 -100015
37769 -100015 306043 -1638701 -3967645 -3950824 -2644845 -2853036 -4118937 -3732620 -1773395
37760 -1773395 -989036 -1792340 -1465372 860854 2028954 -717807 -5628475 -8445793 -6939078
37751 -6939078 -2289704 2608382 5171067 4712767 3160048 3402754 6070028 8456272
37743 8456272 7205125 1756816 -4923929 -8596109 -7052061 -2135083 1671557 1606472
37735 1606472 -618592 -1400348 5044 1063556 179296 -893500 271760 3484023
37727 3484023 6671503 8615852 9389559 8931867 7045390 4761885 4060603 5506441 7054962
37718 7054962 6093263 2497694 -954496 -1408555 1117393 3870602 4284939 2276287 -464743
37709 -464743 -2720609 -4519625 -6047063 -6960940 -7167166 -7395319 -8268010 -9250551 -9278869
37700 -9278869 -8221467 -6935161 -5823530 -4147327 -1242939 2063480 3972404 3701827
37692 3701827 2507073 2389450 3821587 5001522 3705703 41286 -3085423 -2980462
37684 -2980462 -556650 383726 -2251443 -6165241 -7710916 -6473125 -4884536 -3900073
37676 -3900073 -1765425 2313701 5909339 6438685 4637605 3072393 2648721 2723962 3472117
37667 3472117 5494940 7532516 7233600 4523184 2011420 1499590 1961111 1649169 430346
37658 430346 -970510 -2617387 -4920411 -7135261 -7320909 -3945743 2405793 8719279
37650 8719279 11444745 9422630 4645918 -201130 -3942441 -6111345 -5930372 -3954766
37642 -3954766 -3008919 -4732821 -6295123 -3687952 2253052 6430825 5991738 2937171
37634 2937171 153451 -1523745 -1660455 592484 4256324 6545847 6395267 5147920
37626 5147920 3108422 -880288 -5391716 -6311335 -2811956 687535 995341 539159 2481333
37617 2481333 5545553 7044832 7059905 5923465 1792771 -4763610 -7961999 -4116383
37609 -4116383 1859931 3359822 2142047 4432831 9754455 11980612 10214044 9565575
37601 9565575 10642436 7477638 -1559757 -9170824 -9420773 -5621199 -3446143 -2444456
37593 -2444456 297841 3278230 3371555 1854721 1897784 2662508 1244741 -1511720 -2306803
37584 -2306803 -1190787 -1302287 -3496600 -5441842 -5669673 -4811438 -3130983 -311074 2391947
37575 2391947 2888081 1254954 -427897 -969419 -650915 238739 1078202 254495 -2422933
37566 -2422933 -3904292 -1756125 1347128 901147 -2428561 -3626430 -1158195 986976
37558 986976 189192 -910799 217808 1426579 379020 -245584 3006425 7299418 6489332
37549 6489332 815359 -2232237 1461626 6159092 4138389 -3317119 -7750579 -5123539
37541 -5123539 -292613 953732 -676378 -1436149 -1471435 -3553219 -6741105 -6643694 -2329063
37532 -2329063 1671076 1727959 -470001 -1930819 -3043618 -5096271 -6031239 -2743958 3718304
37523 3718304 8923117 10399643 9028283 5718212 388990 -5369957 -8101030 -6347096
37515 -6347096 -2415085 896160 3327883 5789590 7923288 8674947 8099802 7137155 6262337
37506 6262337 5349365 4235890 2711236 719446 -757487 -8696 3182764 6382272
37498 6382272 6807173 4429035 1596492 -199749 -1614883 -3002427 -2370845 2279231
37490 2279231 8997798 12678356 10954429 7485460 7341799 10289321 11386059 7953890
37482 7953890 2816585 -149672 -575742 -14433 1368691 3816598 5582569 4547507
37474 4547507 1392014 -1323379 -2488812 -2599022 -1661118 189283 666291 -2743255 -8541501
37465 -8541501 -11815794 -9873582 -5084548 -1540122 -970932 -2462741 -4052357 -3869979
37457 -3869979 -1545935 885927 1035684 -824218 -2633590 -4022281 -6067379 -7606851
37449 -7606851 -5572761 -299647 3100648 997177 -3949071 -6828445 -6870340 -6675655 -6921373
37440 -6921373 -5559597 -1883555 1834650 3352436 2973661 2357262 2175136 1634134 -260337
37431 -260337 -3312769 -6078304 -7511726 -8273546 -9302349 -9571546 -7303504 -3394422 -971933
37422 -971933 -944747 -975965 88581 393624 -397522 1094279 6094911 9395806 6008353
37413 6008353 -526052 -2437863 978042 2859374 -299810 -3906840 -3302845 -379795
37405 -379795 1163847 2088486 4787041 7909628 8553160 7431905 7271587 7591432 5692305
37396 5692305 2275692 1572573 5077512 8626395 7287160 1270738 -4150086 -3694915
37388 -3694915 3013941 10553966 12180003 6576215 -407094 -2099443 1994460 7349313
37380 7349313 10864642 12790395 13084262 10322967 5324325 2006772 2527175 4374183
37372 4374183 4392884 3041027 2137956 919997 -2195919 -5475215 -5413555 -2204266 -108750
37363 -108750 -1647674 -4341051 -4535827 -2208693 -180427 88887 26694 1544346 4391106
37354 4391106 6309290 5580732 3132720 1562942 1796595 1682049 -963542 -4683224 -5566498
37345 -5566498 -2094186 2921590 5573384 4460899 691934 -3814604 -6949189 -6908674
37337 -6908674 -3721764 292634 2681258 3067732 2635602 2282769 2218896 2678818 3856779
37328 3856779 5206671 5487714 3715938 318355 -2351009 -1541817 2425274 4967570
37320 4967570 1926344 -4587055 -7914778 -5075937 -68402 2338916 2388265 2369079 1625152
37311 1625152 -1293055 -4122584 -3547341 -1055823 -1061968 -3598600 -4041241 -607538 2914435
37302 2914435 3298413 2069134 1507354 690767 -1738078 -4243865 -4762641 -3823037 -2791547
37293 -2791547 -1400864 689466 2349031 3245230 4990301 7637790 8055386 4849799
37285 4849799 1991693 3746457 8301407 10416853 8501378 4987607 1548442 -1393458
37277 -1393458 -1789993 2068518 6938008 7127596 2354282 -1404417 43508 4290272
37269 4290272 6809855 6435344 4782078 3520596 3874538 6062265 7937460 6807255
37261 6807255 3487076 1673342 2619198 3819808 3754262 3862465 4325528 2233619 -3519621
37252 -3519621 -9291424 -11451967 -10714298 -8964844 -5484619 123494 4639991 5147812
37244 5147812 3751428 4212179 6102266 6611036 6067491 6769545 7711291 5663846 1115624
37235 1115624 -1702655 -985000 649930 658967 -766628 -2799619 -4978009 -5876523 -4534372
37226 -4534372 -3333934 -5381356 -8791360 -8214046 -2926052 1479534 1196422 -730948
37218 -730948 49427 2902037 4699510 5121266 5837347 6785425 6470651 4292582 362897
37209 362897 -4861032 -8915258 -8350565 -3955046 -1675610 -4958417 -9251647 -8263111 -3053220
37200 -3053220 -15773 -1569990 -4173996 -4956591 -5022828 -5577931 -5386159 -3525997 -1281920
37191 -1281920 1743 367244 -87731 -1387504 -2170496 -769534 1847941 2989876 2251377
37182 2251377 1556741 1140170 -712614 -3201142 -2469468 2622324 7751537 8501506 5662693
37173 5662693 2921314 1778674 1125359 -137648 -2173186 -4338329 -4964913 -3017652
37165 -3017652 -729110 -1526354 -4311839 -3964780 375340 2388272 -2207045 -8019468
37157 -8019468 -7150296 -823913 2684843 257733 -2707486 -1358224 2469947 4785258
37149 4785258 4921606 4106879 2457096 -79344 -2354442 -3352675 -2947760 -840363 2640534
37140 2640534 4606326 2120240 -2688188 -3970472 96371 4764011 5405420 2725441
37132 2725441 -533353 -3673834 -6176310 -6122160 -4020908 -4284873 -8805416 -12665273 -10951088
37123 -10951088 -6585100 -5857547 -8723158 -9842562 -7768528 -6200829 -6178048 -4057990
37115 -4057990 1150020 4879382 4282852 2949033 4702493 7287392 6639022 3886031
37107 3886031 2995566 3599297 1572019 -3684293 -7468957 -6297074 -2363667 196495
37099 196495 613058 839684 1593456 1734010 962025 628285 1346709 1636144 59044
37090 59044 -2437213 -3702933 -3308269 -2783852 -3101768 -3437194 -2645392 -616593 1979897
37081 1979897 3743728 2333731 -3376245 -10181522 -12407974 -8711829 -4479247 -4952039
37073 -4952039 -8266725 -8599203 -4501625 -245919 329863 -2479338 -6343997 -8867122
37065 -8867122 -7404909 -981968 6655135 9440244 5829212 484253 -1798192 -967038
37057 -967038 295549 232969 -1635127 -4831922 -7217801 -6715338 -4731191 -4669651 -6120530
37048 -6120530 -4645653 842777 5003972 3476125 -610173 -1507754 857085 1908164
37040 1908164 -282468 -3022035 -3292158 -571160 3720479 6801619 5819724 1160852
37032 1160852 -3017874 -3816623 -2886609 -2300226 -561046 3444430 6053602 3767463 -48384
37023 -48384 402278 3910880 4075873 -53907 -2435068 -75423 2420105 780554 -2524295
37014 -2524295 -3127869 -1210679 349436 440535 -855835 -3991924 -8135699 -10515377 -10177638
37005 -10177638 -9587467 -10211420 -9714557 -6155324 -1729053 656320 1480392 2076055 1077027
36996 1077027 -2667911 -6088958 -5203920 -1064536 1575470 584523 -2195842 -5014257
36988 -5014257 -7698562 -9289480 -8020176 -4436826 -1649580 -1464151 -2272512 -1557899 1009572
36979 1009572 3505920 3738727 1213940 -2056032 -3053779 -850627 2436125 4349692
36971 4349692 4423496 3041212 179187 -2879202 -2841753 1628360 6762534 7834092 5498923
36962 5498923 4325776 5394834 4651955 -318748 -5880922 -7164308 -4552355 -2352544
36954 -2352544 -2536555 -3032266 -1981950 -584385 -510532 -752244 739840 3303943 4115748
36945 4115748 2687095 2084586 4338781 7240379 8108450 8405012 10932179 14004815 13206175
36936 13206175 8738580 5795012 6554901 7232070 5428794 4931831 9102726 14090978
36928 14090978 13985063 9638892 6792584 7464503 8823628 9298709 10046844 10790402 9820446
36919 9820446 8395549 9713689 12736739 12439752 7704763 3727381 4208580 5958499
36911 5958499 4538876 1327646 952775 4168991 7158344 6766053 3504146 38876
36903 38876 -1229315 228757 2411046 2613671 839582 -158944 826954 1413038 -384488
36894 -384488 -2430505 -1511987 1382810 2038295 -1026894 -4506566 -4939950 -3196387 -2848096
36885 -2848096 -5129489 -7307619 -6419641 -3260542 -1114759 -989075 -520900 1484403 2153679
36876 2153679 -1295473 -6498669 -8519925 -6451237 -3761506 -2699389 -2525233 -3138172
36868 -3138172 -5496028 -7521030 -4916734 1726245 5754541 3605981 343291 1853623
36860 1853623 6015940 7160861 5717506 6592033 9882485 10646186 7920026 6718158
36852 6718158 9279328 10880598 7656974 3215785 3098608 6557431 8694405 8235836
36844 8235836 8041920 8952981 8185739 4479355 850826 757322 4260075 9309817 14331142
36835 14331142 17900012 18185082 15122874 11718274 10655939 10502362 7982942 3568778
36827 3568778 1480456 3434132 5717920 4457332 1060326 -410093 728954 1913145
36819 1913145 2352528 3713397 5528509 4218119 -1363604 -6625315 -6210423 -384295
36811 -384295 6000515 9435135 10081330 9229050 7416397 5287160 4044886 4242046 5321262
36802 5321262 6756351 8673488 11146430 13866031 16813945 20415182 24519753 27646801
36794 27646801 27693491 23595980 16603819 9973820 6763984 7320173 9112871 9366287 7593640
36785 7593640 5378462 4222536 4137816 4097584 3372110 2292055 1722746 1942949 2534653
36776 2534653 3408604 4836414 5848001 4171252 -484931 -4309795 -3117671 2223616
36768 2223616 6779045 7913411 7679689 8373412 9024604 7816777 5212505 2809380 1336039
36759 1336039 1441949 4065542 8076695 9937017 7970862 4839534 3553806 3404198
36751 3404198 2434341 1383821 1818206 2568019 1897934 1406967 3473824 6173897 5488792
36742 5488792 1903806 -188123 369139 244296 -1596428 -1289498 3446515 8845618 10163110
36733 10163110 7649889 4487457 2106844 996706 3138709 9261991 15406859 16676419
36725 16676419 13895479 12597285 15244293 18073309 16608915 11352228 6463583 4792370
36717 4792370 5810205 7291951 7631684 6905274 6383214 6821343 7292620 6418731 4593477
36708 4593477 3770067 4842948 6565190 7554389 7926644 7978214 6704617 3431286 213965
36699 213965 513711 5218084 11596817 16689554 20257200 23685525 27442735 30765972
36691 30765972 32761070 32690011 30338753 27438129 27370731 31475385 36704695 39461004 41194265
36682 41194265 47389635 61028121 79898055 100624849 122343144 146142693 174897768
36675 174897768 214664135 270498649 335869048 389181263 407237917 383832050 333277862
36668 333277862 276657419 227240812 187438076 154272641 125265297 101107018 84364258
36661 84364258 75248476 69455228 62097092 53065876 45828768 41239030 35905478 27565438
36653 27565438 19103501 15437428 17998375 23499721 27022054 25769344 21080625 17092847
36645 17092847 16266891 16536081 14435401 10150372 6801417 5365027 3881766 1805792
36637 1805792 1059894 1822514 1596688 245523 1343830 5574241 7500182 3662331 -404
36628 -404 4600453 14823060 19027223 11937783 1370273 -3155729 -2314182 -2513327 -4235457
36619 -4235457 -2196848 3999194 7048843 2403612 -4151350 -4044363 2331009 7029938
36611 7029938 6465757 5632789 8976637 12807579 11023694 4873620 1619396 4367607
36603 4367607 8155025 7093097 1791094 -1999234 29290 6686344 12233690 11019118
36595 11019118 3165211 -4185661 -3919393 2306545 5620009 1430637 -4466215 -4105344
36587 -4105344 1667837 4915765 1780409 -3003284 -3269503 1074808 5548471 7175092
36579 7175092 6639843 6038196 6900280 9778906 13660471 15803423 14009624 9607766 6764338
36570 6764338 7921157 10888661 11526874 8613291 4787233 3062943 3897548 5787394
36562 5787394 7258475 7653973 6998445 5696887 3806333 797366 -2850391 -4497587
36554 -4497587 -2208439 1271008 690546 -4451003 -8399047 -7098861 -4016459 -4371167
36546 -4371167 -6598264 -4646313 2524802 8971069 9543549 5363708 882670 -848135
36538 -848135 750801 4091488 5962970 4530109 2055892 1929401 3603622 4205162 4407459
36529 4407459 7524744 12423612 13190385 7770381 1586673 -157078 1025998 1166474
36521 1166474 11333 -736692 -1343193 -2224189 -1571241 1371379 3840526 4108751 5080447
36512 5080447 9100952 12570515 10780318 5422012 1951477 1568559 1262602 163098
36504 163098 77217 615179 -459981 -2163723 -955300 3246596 6661030 7528186 7420443
36495 7420443 6387801 2440114 -2814876 -3751318 1320509 6521597 6117898 2137233
36487 2137233 611654 3126051 6193832 7355326 7731386 8617913 8892770 6899185 3038679
36478 3038679 -768034 -3402158 -5167638 -6175951 -5425215 -2551811 453902 1399384
36470 1399384 1577752 4384381 9325121 10810321 5422923 -2473109 -5846612 -3645256
36462 -3645256 -413300 1203520 2868127 5569526 6797730 4245117 -499642 -3475882
36454 -3475882 -2224291 2203464 6104983 6660782 5545578 7105240 11489049 12945932
36446 12945932 8140042 2401682 2461148 6023986 5490459 359066 -2155966 898261
36438 898261 3993081 3000639 1306449 2206817 2331270 -1930228 -6940163 -6924405 -2864723
36429 -2864723 -207375 -72853 1277677 5069518 7494893 5369368 670489 -2038518
36421 -2038518 -1116639 279221 -2047040 -7574514 -10443127 -6681090 -616771 -66590
36413 -66590 -5542772 -9367208 -6421613 -221176 3847791 5689076 7463100 8536112
36405 8536112 7902619 7558476 8893403 9193964 6155738 2479701 1404327 1101690 -1365822
36396 -1365822 -3706991 -1841781 2648022 4445523 2432708 243925 75526 1038839
36388 1038839 2417700 3490345 1535720 -4491148 -9489078 -7300730 266704 5216721
36380 5216721 3909045 313777 -1011569 495274 3794649 7436204 8195297 4331164
36372 4331164 351960 2343752 8278403 9823844 4611417 -835958 -2154334 -2944656
36364 -2944656 -6078817 -7115121 -1796466 6090613 10250785 10472668 10051936 8903237
36356 8903237 5240194 941000 -591551 164587 401564 -157537 -238821 -457702 -1525533
36347 -1525533 -1607960 194584 645861 -2534440 -5461328 -3621076 183774 -1145 -3201274
36338 -3201274 -2918874 2143080 6218872 5782289 3554889 1977099 -260639 -2909640
36330 -2909640 -2210655 2222433 4536469 1135594 -2840241 -728084 5505892 7932515
36322 7932515 3686532 -1823879 -2461546 1774690 5789699 4766477 -1654569 -8901051
36314 -8901051 -11444054 -8289531 -3479387 -370907 2220234 6331388 10088971 10073122
36306 10073122 6752564 3661232 1910252 -429370 -3363792 -3558722 690296 6362938
36298 6362938 9575497 10071092 9721421 8601726 5300898 249901 -3839258 -4980198
36290 -4980198 -3616052 -1117452 1892173 5132608 7723770 8616159 7695211 5891384
36282 5891384 4201635 2870066 1565455 148056 -1048734 -1820113 -2561066 -3498436 -3588339
36273 -3588339 -1253822 3208749 6956571 7588015 6349505 6772046 9916349 12661723
36265 12661723 11667340 7578077 3685134 1438910 -374525 -2067203 -1330561 3533731
36257 3533731 10435845 15438337 16953514 16215864 14336303 11255595 7757907 6068836
36249 6068836 7163298 9035325 9074037 7062298 4405810 1556585 -1640210 -3566401
36241 -3566401 -1620808 3635662 7426712 5912866 1222485 -986968 1300790 4147753
36233 4147753 3144965 -1051823 -4296121 -4438401 -2867225 -1211931 720689 3024981
36225 3024981 4083239 2650799 301970 -133321 1792445 3632700 3133667 570478
36217 570478 -1964837 -2331781 549840 5614211 9064501 6733936 -1241564 -9008531
36209 -9008531 -10234116 -4817676 1196283 2677420 686226 -189027 1928686 4642504
36201 4642504 5282107 4061595 2716604 2047501 2121634 3403787 5917340 8190557 8934632
36192 8934632 9244015 11095802 13898107 14861443 13077361 10710458 9232551 7082657
36184 7082657 2870350 -1323229 -2435860 -899438 69569 -986565 -2544346 -3281764
36176 -3281764 -3945768 -5485241 -7243910 -7811164 -6563742 -4095749 -2030053 -2060930 -3920892
36167 -3920892 -4852958 -2712024 1062964 3496258 4193805 4710459 4507609 1267872 -4280267
36158 -4280267 -7607274 -5934968 -1527227 1977919 3504847 3381776 1725086 81565
36150 81565 1200019 4496270 5201573 1263864 -2465359 -1147182 2227579 1292661 -3785842
36141 -3785842 -6982092 -5841935 -3846535 -3349837 -2546116 -606554 174974 -735972 -622123
36132 -622123 930279 617947 -1713793 -875907 4816116 8383488 3882584 -3361355 -3568260
36123 -3568260 3187894 7372181 3912875 -2079977 -4616974 -4560188 -4992201 -4708338 -859977
36114 -859977 5323161 9711428 10473032 9023140 7207506 6144898 6589659 7941749 7833727
36105 7833727 4949874 1465698 569758 2265967 3789400 3648579 2918826 2620062 2229440
36096 2229440 1475880 1662360 3907237 6970521 7920958 4960985 -481236 -4306795 -3036450
36087 -3036450 2492910 7234312 7095119 3645781 1945384 3903653 6316622 6103514
36079 6103514 4480611 3885746 3414534 796197 -2440623 -1888730 3376942 8957944 10660100
36070 10660100 8686034 5115530 845984 -2606485 -1844754 3880406 9127331 7850463
36062 7850463 1624644 -2211294 -365318 3311729 5232071 7222357 11671538 16152771
36054 16152771 17120858 16101293 17540380 21825246 24892625 24564487 23188212 23254119 23930852
36045 23930852 23492221 22475188 22405057 23079029 23090523 22160125 21373479 21695079 23626121
36036 23626121 27957455 35460124 45700527 57202900 69084510 81683277 95066856
36029 95066856 107615461 116975867 122334353 125117481 127565614 131366352 137439180 145456342
36021 145456342 152804691 155514783 151811387 143976927 135258114 125909554 114323295 101198794
36013 101198794 89603942 80654440 72070402 62055532 52080343 44468014 39469317 36220176
36005 36220176 34426624 33371379 31314327 27878075 25226533 24903887 25381455 24860255
35997 24860255 24384110 25457824 26579283 25475765 23225659 22420340 22322344 19981170 15755067
35988 15755067 13422891 14411373 15951359 15756267 14574557 12985782 9842556 5793509
35980 5793509 4255338 6050482 6703223 2704381 -2506035 -3220390 -98035 1003959
35972 1003959 -1706347 -3206172 494736 6307707 8589308 6478015 3342708 996936
35964 996936 -1603200 -4477507 -5307437 -2902204 861476 3726658 5262372 5276569 2950134
35955 2950134 -447797 -1030193 2319405 4708755 1737904 -2863869 -1822927 4313527
35947 4313527 7271082 3581578 -284813 1442502 5061995 4627699 2011403 2559423
35939 2559423 4855028 3118663 -2139242 -4249326 -1047652 2408090 2853176 3218845
35931 3218845 5906187 8394239 8624634 8833124 10301475 9498559 3885410 -2478559 -3765885
35922 -3765885 -25804 4057937 5709377 5548930 4466865 2724775 1123457 350362
35914 350362 173405 883525 3420199 6413539 6209136 2372089 -161784 2158458 5726587
35905 5726587 4950529 562239 -2039282 -848195 1460688 3122740 4801237 5743751
35897 5743751 3628327 -1024395 -4664151 -5644671 -5240958 -3373544 1691319 8009923
35889 8009923 9619079 4503427 -1367245 -1604403 2388311 4750277 3850526 2874373 3465230
35880 3465230 4059568 4374385 6407888 9689271 10064183 5746180 1107478 1172113 4709807
35871 4709807 6446873 4669397 2549577 2225630 1861076 -166213 -1801602 -412257
35863 -412257 3083964 5739827 6606716 6776071 6598407 5452219 3764388 2961812 3432056
35854 3432056 4106120 3810380 1879042 -1638768 -4936018 -4956293 -1024325 3211130 3806582
35845 3806582 1369018 -691377 -1413389 -2411319 -3643048 -3080954 -733711 861532 920266
35836 920266 1696136 4409007 7059768 7733100 7528730 8795801 12214446 16262125 18011975
35827 18011975 14928944 8209182 3401388 4430133 7954977 7837663 4378125 3674904
35819 3674904 7614799 10660827 8334813 3131398 -634308 -2706117 -4626184 -6284060
35811 -6284060 -7814348 -10546818 -13082710 -11021557 -3885591 2369981 3412060 2311175
35803 2311175 3132492 3728890 252104 -5289013 -7849724 -6703500 -4515714 -1886766
35795 -1886766 1635939 3633135 1783523 -936190 395355 5188313 8226364 7053312
35787 7053312 3940997 1435079 148749 105366 613493 -36001 -1649502 -914424 3700942
35778 3700942 8491628 9507470 7918367 6584614 5077448 2797146 2878269 7059434
35770 7059434 10395833 7771393 2509019 1390096 3882913 3935737 287964 -2886854
35762 -2886854 -3934647 -4340223 -2878866 2367046 6974017 3998300 -4940725 -10744960
35754 -10744960 -9488746 -5795830 -3126596 357362 4534782 4701336 -633014 -6382360
35746 -6382360 -8199493 -7144612 -5218159 -2512810 -464398 -1537809 -3986013 -3084706
35738 -3084706 1119565 3529817 2306283 875121 1081910 1374083 2216396 5794329 9952198
35729 9952198 10262874 8157484 8630004 10510832 8754512 5624238 8279297 15522773
35721 15522773 19412805 19929381 24239783 31945771 37497969 46479366 68612630 94662421
35713 94662421 109047768 131220602 206247610 330538479 421235672 399578937 287215508
35706 287215508 179349470 132038787 118980638 97981868 70895284 59501507 61007373
35699 61007373 57578688 48451052 44864708 45358287 39658954 29577772 25477471 26299813
35691 26299813 21236766 9378687 1588773 2448629 4231649 1041871 -2604103 -944851
35683 -944851 4088815 7302874 7492232 6384174 4437335 1259618 -1706026 -1471171 3374698
35674 3374698 10071644 12847558 8564359 1334127 -1431947 1674460 4522837 2801335
35666 2801335 296727 2569066 8539918 12889534 13796741 13467113 13121490 12424285 12644907
35657 12644907 15585440 19737773 21711547 21565565 23195052 29302673 38944648 49636158
35649 49636158 58540371 62104873 58978944 54221627 56232715 66855128 77376611 77411897
35641 77411897 66210486 52331216 43115790 37837573 31712035 23419754 16187254 12782159
35633 12782159 12216660 11708884 9983841 7897900 7109141 8675359 11619526 12489298 8312997
35624 8312997 1004888 -3358886 -1439373 3147658 4731455 2761018 1077237 1584686
35616 1584686 2586160 3012316 4142486 6230396 7004041 5171908 2708285 1944534 2656969
35607 2656969 3753671 5674247 8902609 11664120 11567682 8888912 6242443 5444801 6522699
35598 6522699 9356101 13886158 18195792 18778096 14446993 8580389 5460269 5266208
35590 5266208 5044004 4007921 4598871 7898331 11765961 14974739 19123068 24078532
35582 24078532 26290882 25596718 28576011 39350235 52675305 64854886 85580257 124387412
35574 124387412 166419520 179271860 150570918 104476817 71764082 56533002 44398349
35567 44398349 31043948 24679749 26246760 26043800 20250090 15446644 14795547 13166185
35559 13166185 8812833 7446322 10737023 12017658 8092473 5078471 7335350 10114999
35551 10114999 8987901 7721577 10255654 12769662 10883110 7905962 8410471 9441562
35543 9441562 6098262 1315593 1820017 7079984 9976422 7318552 3250011 2410502
35535 2410502 4713094 7127018 7222531 4952339 2850208 3482838 5686518 5752089 3375704
35526 3375704 2748769 5911512 9210677 9048994 7054824 6304336 6261598 5130424 3929988
35517 3929988 4590409 6679501 8893407 10913430 11584191 9056718 5025864 4171424 6622969
35508 6622969 6400094 1028516 -3253208 -1035620 3199274 2163387 -2595593 -3508586
35500 -3508586 1487351 7307251 9714623 8667000 5369184 1881167 1943697 6350236
35492 6350236 9173921 4597903 -3892590 -7181430 -2383414 4751168 8354813 7546076
35484 7546076 3756771 -1060022 -3546377 -1522071 2506411 4760514 5951627 8723649
35476 8723649 11189591 9379581 5036007 3899491 6280807 6522717 2694812 -312227
35468 -312227 792582 2855534 2539130 1603112 2733309 4844301 5702867 5439333 4820062
35459 4820062 3403447 1565938 1170968 2473260 3409192 3115227 2813568 2500741 782087
35450 782087 -1230654 -500343 2324048 2983508 964594 1189977 5673463 9141134 7001614
35441 7001614 2780120 2607093 5946195 7167200 4121477 224492 -775975 1884591
35433 1884591 6753858 10718402 10073680 4634275 -230654 818277 6207755 9501344
35425 9501344 7652966 3642799 1123285 272097 -230739 -482387 -345924 -901946 -2947239
35416 -2947239 -5087847 -4778720 -916711 5164573 10671134 12931701 10963919 6439818
35408 6439818 2777899 2407088 4688333 6725616 6092221 2532190 -2538852 -7236162
35400 -7236162 -9800580 -9204008 -6126293 -2737504 -650086 316655 621083 -390863 -2724170
35391 -2724170 -4025300 -2318445 496931 1194020 646988 2539938 6598217 8136816
35383 8136816 5545894 2778896 2132108 451361 -3787860 -5707591 -1848087 2680950
35375 2680950 1880738 -848425 1449732 6408466 5204415 -2669466 -7773033 -5234208
35367 -5234208 -1219858 -1696795 -3419506 -928298 4452834 8017518 8781024 8160913 5972107
35358 5972107 2361259 -147523 -597207 -1596644 -3703942 -2776504 2403792 5223717 447910
35349 447910 -6062329 -4694269 3601198 8889735 7202239 4933577 6890416 8590662
35341 8590662 4833829 -575537 44587 6695813 11664317 10662568 8597372 12211064
35333 12211064 20589532 26861959 28625876 32385783 44795806 61521640 69314937 60641943
35325 60641943 43432866 33718820 39461700 53402948 61261347 55358620 40289505 26646629
35317 26646629 20306303 18433346 15439275 10313272 5969957 3444818 863385 -2072033
35309 -2072033 -2994192 -1365060 2248 -359912 -265011 1512703 2304691 318605 -1369372
35300 -1369372 448635 3394509 2996291 -311629 -2334208 -1750661 -945617 -1151836 -1359961
35291 -1359961 -1595309 -2741540 -3199893 -347374 4212658 5440431 2020856 -1538342
35283 -1538342 -1543088 240499 757486 647862 1904963 3391777 2425091 -502988 -1924075
35274 -1924075 -72269 3029563 4206251 2121197 -2379432 -7345604 -10714358 -11213175
35266 -11213175 -8970557 -5262518 -1674033 662857 1551194 1696947 2018138 3102825
35258 3102825 5408791 9038179 12432295 12446820 7667354 1186371 -2189503 -1594377 -630624
35249 -630624 -1960482 -4323872 -6071900 -8177462 -10854911 -10105655 -2366103 8177557
35241 8177557 12010546 5561465 -3775525 -6253280 -448213 7471004 12408913 14069947
35233 14069947 13335160 10014159 5323908 2512493 2678946 2758589 73297 -3535330 -4974972
35224 -4974972 -5211946 -7524807 -11378496 -12252567 -8278044 -3460026 -2454600 -4539867
35216 -4539867 -5001074 -1357290 3705639 5464874 2258233 -2681215 -4550761 -2358484
35208 -2358484 -130059 -1663868 -5245389 -5886311 -2252016 1738980 2682711 1751865 1430069
35199 1430069 1226738 -572021 -2777826 -2234938 1450520 4806806 4740327 2203878 715937
35190 715937 2019417 4263238 4814439 4149847 5343496 9098127 11473024 8973754 4345373
35181 4345373 3550658 7316686 10093113 8409341 5600481 5696839 6908261 5218154 1394143
35172 1394143 -355857 888402 2019053 1267813 66775 -399373 -571662 -152214 1858448
35163 1858448 4094009 3528657 499279 -471038 3246701 8384287 10011789 7399764
35155 7399764 3421002 259568 -1642117 -2004514 -1104975 -988890 -3422740 -6765092 -7445142
35146 -7445142 -4791978 -1976867 -1594120 -2763374 -3763915 -5056587 -7423724 -8802728
35138 -8802728 -6052915 333908 5988707 7651086 6174348 3917274 1657530 -412409
35130 -412409 -973036 617739 2183070 1127846 -1568693 -2295553 364043 4035323 5817886
35121 5817886 4954099 2184273 -1122599 -2759054 -1061412 2604060 4827781 4471154
35113 4471154 3905765 5092639 6763728 6779868 5033322 2430003 -834798 -4053814 -5079676
35104 -5079676 -3016316 -385898 -163122 -1693889 -1978107 -219953 1476183 1697156 1474053
35095 1474053 1952389 2312376 1081985 -1481582 -3332673 -2879615 -858585 444138 37726
35086 37726 -453607 664437 2057098 817937 -3066716 -6184784 -6354585 -5392070 -5911941
35077 -5911941 -7537927 -8043267 -6576168 -4001554 -1382421 391562 804809 798638 2102003
35068 2102003 4400711 5233061 3960493 3172822 4201729 4243327 988403 -2549293 -1878569
35059 -1878569 1953959 3596977 1076615 -1979275 -2104913 -213377 932171 408695
35051 408695 -1021084 -2498452 -3222703 -2593713 -1240900 -894071 -2595123 -5578454 -7858153
35042 -7858153 -7498942 -4178795 -325782 594304 -1782494 -3798601 -2690794 -625751
35034 -625751 -1312844 -4152392 -5046711 -2335618 1402792 3393301 3403016 2160276 -38122
35025 -38122 -2374597 -3517017 -3371325 -2957879 -2086193 805751 5677808 9452137 8775274
35016 8775274 3682468 -1981088 -3799862 -980932 2531825 2240597 -1459118 -3941957
35008 -3941957 -2885175 -1247962 -2418887 -5720199 -8882867 -11319857 -11873715 -7346058
35000 -7346058 2167826 10001476 10560619 7404708 7454072 9752190 7792303 1739459 -761886
34991 -761886 2829595 5365111 1300510 -4970689 -6624994 -4139758 -2330069 -2303940 -1728451
34982 -1728451 -12532 1504133 2417772 2719105 1558666 -485358 -544535 2107848 3639699
34973 3639699 1083849 -2585547 -2628011 556791 2796653 2642800 2200824 2353143 1266022
34964 1266022 -2057722 -5700579 -6960876 -5008309 -1367513 1425961 2307913 3197714
34956 3197714 6511296 10876719 11830131 7702977 2094879 -752593 -211443 2291517
34948 2291517 5614905 7931516 7116102 4388339 3906711 6334481 6983865 3342167 -259212
34939 -259212 392241 2434324 1234230 -1557910 -1610333 -105882 -1042478 -2733598 -64954
34930 -64954 5679292 7551083 4127430 1957909 4891798 8489207 8289305 6859091 8108260
34921 8108260 10065907 8647674 4790965 2431860 1811522 -18294 -3259341 -4728856
34913 -4728856 -3070358 -604677 687414 1760539 3736384 5009362 3264555 -648569
34905 -648569 -3106193 -2326924 -777300 -1534377 -3504096 -2776206 1453942 5447592 6382681
34896 6382681 5896045 6061073 5315355 2041730 -656146 1236039 5486642 5686077 400749
34887 400749 -4898420 -5807025 -3967874 -2665379 -2156209 -1659207 -1983692 -3482634 -4507992
34878 -4507992 -4238860 -4116631 -4455570 -2986833 818790 3489704 2612017 823080 1318597
34869 1318597 2628009 1989783 873613 1944960 2739178 -1453545 -8950826 -12236750
34861 -12236750 -8360416 -3249443 -3262508 -6963767 -8479994 -5656052 -1294734 1527669
34853 1527669 1910038 211474 -2146249 -2712976 -692298 941177 -1145622 -5447049
34845 -5447049 -7088497 -4793295 -2667743 -3527405 -4300385 -1383947 2503073 1974496 -1644833
34836 -1644833 -835010 6526840 11976214 7391238 -2787048 -6380802 811217 10429712
34828 10429712 13452828 10625414 8067912 7468473 5661286 1522545 -2031324 -2824930
34820 -2824930 -2045000 -1303029 -426519 526936 -28435 -2329322 -3074441 1052606 8110252
34811 8110252 11710259 8008043 405113 -4050564 -2332910 1965527 3782561 2601541
34803 2601541 1946653 3955354 6856077 8220124 8308284 8454168 7802600 4348063 -1104904
34794 -1104904 -4705532 -4079443 -1072039 1094058 1521435 1009966 -259316 -1720847 -416881
34785 -416881 6050120 14001174 15254962 6952422 -3097347 -4840404 1670883 6878149
34777 6878149 4663564 -385164 -831499 3028790 4898137 2399193 -46708 1567003
34769 1567003 5250588 6475843 4196574 1024471 -932059 -1989573 -3050583 -3645026
34761 -3645026 -2406456 862814 3962929 3853967 156300 -3684603 -4237598 -2549658
34753 -2549658 -2571780 -5154160 -6501283 -3731389 892819 3497292 4003428 4929884 6348516
34744 6348516 5846625 3303524 1871105 3128338 4512452 3428037 1250583 760895
34736 760895 1654530 1740281 1385654 3018711 6120972 6597960 2748222 -1397497 -1420570
34727 -1420570 1209792 1808997 -14276 -153849 2335406 2390508 -3405470 -10128606 -10120291
34718 -10120291 -3716850 682385 -2192887 -7832819 -8821412 -4852151 -2060887 -3897413
34710 -3897413 -6928817 -6438839 -2768540 205492 918211 1272044 2186777 1436244 -2083541
34701 -2083541 -4360823 -409683 7652993 10870526 4275626 -5443755 -7075822 1355077
34693 1355077 10287077 10672933 4117244 -1257801 -1549020 198704 319188 -812507 -984719
34684 -984719 266556 1832866 2898396 3162573 2336489 611614 -1068700 -1982276 -2190595
34675 -2190595 -1649163 188250 3078484 5316230 5440394 3939607 2332818 1306959
34667 1306959 705876 345621 -482809 -3182467 -7549849 -10171832 -7718898 -1675872 2929302
34658 2929302 3748519 3068357 2886789 1697574 -1767628 -4917941 -4583631 -1573401 1302200
34649 1302200 3611020 5978240 6421049 2753697 -2455308 -4541759 -4047052 -5681715
34641 -5681715 -9417170 -9023096 -1960589 5237690 5546418 742999 -2485243 -2006338 -824611
34632 -824611 -955036 -1762369 -2608474 -2759293 -519617 3370818 4028298 -813651 -4961952
34623 -4961952 -1125011 7702952 11794951 9128496 7764093 12228439 16188031 12896855
34615 12896855 5748029 2578728 4524762 6701054 6612093 5917913 5817463 6026667 7223458
34606 7223458 9863398 11336573 8623596 3534919 1492752 4888585 10608480 14143729
34598 14143729 13548715 9578896 4610063 1532194 1537462 2921983 3536128 3620281 4478967
34589 4478967 5613491 5540878 4396876 3171610 1370901 -1713285 -4223028 -3410871 117389
34580 117389 2744107 2389237 74149 -2838012 -6001028 -8491657 -8764952 -6975742 -5242982
34571 -5242982 -5117123 -6378483 -8022656 -8540705 -6025098 -491677 4714653 6600881
34563 6600881 6495056 6976330 6452900 1889562 -3793662 -3623616 2737155 6788696 2921008
34554 2921008 -3541491 -4661103 -1264013 67163 -1988878 -2483462 795847 3905924
34546 3905924 3329978 788424 -443479 -220222 -325495 -1212121 -2065996 -2511544 -2591933
34537 -2591933 -2104271 -1175586 -763706 -1675300 -3453710 -4655564 -4037337 -1667243 709953
34528 709953 914832 -1342396 -3863667 -4331161 -2544853 236877 2731995 3327112 383801
34519 383801 -4789557 -6945321 -2312441 5550592 9005134 5803903 1569250 1537968 3714220
34510 3714220 3177922 289089 141885 4391350 7966180 5699612 -479631 -3801814
34502 -3801814 -1219925 3256061 4563642 3244026 3560947 6445857 8116397 6232777
34494 6232777 3580860 3425961 4446433 3701797 2177700 2914298 4923195 4097571 290654
34485 290654 -1709755 401350 3076997 3383113 4020824 8035774 12390866 11829663 6889387
34476 6889387 2919428 2158947 1776993 -342512 -2744609 -4160219 -5603594 -6993151
34468 -6993151 -5667378 -929323 2917191 1277599 -4596710 -8987473 -8331029 -4102152
34460 -4102152 291307 3109407 4611921 5607112 6412659 6626494 5729878 4124386 3085253
34451 3085253 3228743 3677046 3355280 2385590 1445936 547536 -554219 -1377844 -1176583
34442 -1176583 177995 2686514 6694151 11479719 14232349 12531915 7818909 4401264
34434 4401264 4506684 5990967 5656385 3294720 1341794 1568962 3232229 3984554 2033821
34425 2033821 -1969717 -4918221 -4164640 -757470 1702960 1856428 2010967 3555956 3750903
34416 3750903 65375 -4300381 -3509699 2633285 7821601 7550607 4259093 2453874
34408 2453874 2624043 2890578 3388536 5070842 6308311 4973045 2794831 3405340 6471195
34399 6471195 7957524 6275233 3808942 1720939 -1962271 -7226882 -9674162 -6500528
34391 -6500528 -1327701 717059 11201 372425 2091354 1945892 -493758 -1534040 761759
34382 761759 3420277 3051693 479451 -1244071 -1350990 -1569010 -2835525 -3856239 -2986491
34373 -2986491 -440743 1773853 2024008 1053714 1369084 4249327 7956474 9570928 8032902
34364 8032902 4744298 2029639 1756157 4208074 7155779 7494210 5304517 4453296 6965560
34355 6965560 8943729 5589449 -1207172 -4691761 -2242079 2025427 3909352 3485583
34347 3485583 1719166 -1949413 -5994238 -5691512 290771 5808655 4431756 -1614912
34339 -1614912 -4427609 -1031302 3637888 4150441 861185 -1991858 -1519528 1369860
34331 1369860 2944768 -18274 -6257038 -9962658 -6771495 772556 6029276 5929589
34323 5929589 3232448 1600067 1573905 1843261 1564359 299091 -2158612 -4679945 -5052954
34314 -5052954 -2315834 2110836 5865248 7142994 5040156 131558 -5151160 -8223281
34306 -8223281 -8509916 -6763188 -3053153 2465169 7456030 8927853 7051458 4915708
34298 4915708 4233634 3887397 2957560 2150483 1547868 154329 -1208097 97830 4011650
34289 4011650 6696311 6234271 5921538 8609987 10901160 7555129 -70786 -5057331
34281 -5057331 -4239564 -1783462 -2448365 -5467823 -7272132 -7029731 -6449065 -5912847 -4037811
34272 -4037811 -721096 2007816 2728891 2407534 2505692 2589839 1231001 -1135221 -1882736
34263 -1882736 494446 3733697 3945157 472036 -2774962 -1700686 3153736 7406460
34255 7406460 8025773 6168589 4535528 3561481 1728630 -1068451 -2495076 -752613
34247 -752613 2792803 5130164 5040608 3858905 3338483 4095516 5800838 7278474 6563778
34238 6563778 2952686 -661037 -39087 4480501 6799328 2230328 -5862233 -9595128
34230 -9595128 -5923355 658679 4668887 5574299 6075184 7160674 7042588 4059119 -908798
34221 -908798 -4889089 -5369127 -2702428 262018 1476943 1743151 2317421 1952625 -1024490
34212 -1024490 -4482582 -4059888 331562 3264444 997635 -3209893 -3819127 -714323
34204 -714323 1321415 -363614 -3494827 -5102515 -5058837 -4261813 -2195518 1480183 4607146
34195 4607146 4505224 1963351 751729 2430924 3860632 1662579 -2412970 -3335388
34187 -3335388 386199 4798797 6122647 5234438 4897437 5360996 5283567 4730944 4141230
34178 4141230 2153446 -1961472 -5135666 -3844663 198747 2026209 768378 338035
34170 338035 2450500 4003668 2702152 369485 -1353083 -3815652 -7134959 -7752381
34162 -7752381 -3858545 589349 1306678 -82607 567930 3179546 4616970 4238844 3538198
34153 3538198 2168414 -673773 -2428443 -254018 2776823 457488 -6998325 -11833639
34145 -11833639 -8993049 -2657005 38724 -2141007 -5082765 -5760275 -4556839 -2751099
34137 -2751099 -1042486 -297862 -1258740 -3045763 -3436629 -1283659 1952296 3525310 2098715
34128 2098715 -1164925 -4136369 -5659187 -5464089 -3273796 216583 2164329 278461
34120 278461 -2985350 -2322957 3009927 7302282 6126322 2148672 -120302 -1442456
34112 -1442456 -4745087 -8093472 -7220480 -3502598 -2466392 -4500331 -4171271 88804
34104 88804 2878130 1087843 -634667 1991330 5219758 3466859 -1167296 -2040432 1833863
34095 1833863 5085158 4468301 2098130 71846 -2608392 -6288061 -8350656 -7036675
34087 -7036675 -4573744 -4153307 -5754249 -6992882 -6676951 -5554181 -4339330 -2784350
34079 -2784350 -633313 1671009 3443299 4358463 4527966 4344056 4293029 4582131 4695787
34070 4695787 3495960 312721 -3772709 -6293030 -5815718 -3740380 -2754718 -3617512 -4603091
34061 -4603091 -4152284 -2579524 -721673 1306175 2789646 1543708 -3423496 -9108299
34053 -9108299 -10885497 -7995472 -4472143 -3775820 -4694490 -4269693 -2766247 -2646491 -3442437
34044 -3442437 -1723799 2691772 4540464 312706 -5289907 -4743693 1714990 6115075
34036 6115075 3658507 -1725314 -4402579 -4300041 -3914306 -2819494 104063 2376197
34028 2376197 1157729 -1482152 -1843599 -1299624 -3905464 -8514100 -9831828 -7390433
34020 -7390433 -6685635 -9987865 -12582592 -10722146 -7219280 -5554918 -3949735 66182
34012 66182 3700948 2898227 -824067 -2835485 -2498480 -2633375 -3429389 -2296146 510772
34003 510772 1132118 -2056103 -5590239 -5339335 -1487383 1900071 1014631 -4019383 -8628178
33994 -8628178 -7876563 -2268401 2227043 1606264 -1184635 -1459297 -192248 -1749975 -6066022
33985 -6066022 -8637429 -8046367 -7718505 -9011910 -8108632 -2538889 3670382 5065772 2043507
33976 2043507 -592614 -409657 795596 871364 -2570 -240212 1555339 5418181 8905999
33967 8905999 8318917 3042609 -2448799 -3332440 -265762 2301542 2907215 4410243 7970712
33958 7970712 9738369 6084173 -621200 -4818131 -4931586 -4164823 -4506227 -3913648 -862475
33949 -862475 1683278 -65905 -4607221 -6095201 -1718669 4473069 6428326 3211183
33941 3211183 -519469 -723448 1212512 963250 -2401933 -4799600 -2814972 1015139
33933 1015139 1362684 -2218740 -4585951 -2836967 -617788 -1785450 -3581250 -888965
33925 -888965 5012534 7765054 5448833 2771871 2855249 2935243 830706 10601 3783051
33916 3783051 8552229 8171125 2713164 -2174863 -3416206 -3107218 -3349891 -3280854 -2169341
33907 -2169341 -1493193 -2097240 -1990236 985543 5749309 8886131 8365910 5392638 2698040
33898 2698040 1429079 123170 -2692014 -5461875 -5103794 -1870974 -84857 -2436481
33890 -2436481 -6056293 -6687339 -4567034 -2999059 -2806964 -2063082 -502971 -136766 -1332640
33881 -1332640 -2040491 -1595009 -1858461 -3488915 -4217848 -2406640 239887 1177454 200593
33872 200593 -1342525 -2575053 -2827522 -1237092 1549397 2795233 914432 -1664928
33864 -1664928 -1178425 2101946 3527426 189340 -4376711 -4117711 957024 3437097
33856 3437097 -1663028 -8390917 -6466584 3787162 9854801 3541813 -7232938 -9289358
33848 -9289358 -2107960 3534165 2564121 1220909 4447634 7584746 5420155 1707730
33840 1707730 2832178 7114845 7811963 3966560 1210491 2786792 6054688 8045680
33832 8045680 8997743 9362451 7912988 4499477 1250836 -605187 -2476319 -5575515
33824 -5575515 -8601341 -9597722 -8459558 -6587729 -5356539 -5311402 -5423654 -3213536 2309841
33815 2309841 7844363 8671843 4943138 2039898 3268579 5354652 3734272 -411605
33807 -411605 -2168794 -472412 698417 -1033161 -2677239 -545357 4278827 7595919
33799 7595919 7358707 4793776 1589012 -1258940 -2453004 -1279060 280014 -872354
33791 -872354 -4418036 -6280801 -4110384 -634958 334411 -987500 -1717699 -961739 -91858
33782 -91858 500752 1648835 2842619 2699406 2028868 3056854 5024012 4071396 -1050812
33773 -1050812 -6327703 -7587407 -5593215 -3581507 -2048445 788562 4560259 6104579
33765 6104579 3351892 -2380026 -8048650 -11076639 -10119739 -5791532 -1039715 921602
33757 921602 -242140 -1967455 -2137073 -1081500 165207 1880300 4440517 6066701
33749 6066701 4002148 -1359829 -5126976 -2564406 5073490 11265108 11552501 8418130
33741 8418130 7253219 8981328 9434858 5693436 -60939 -3898537 -4690646 -3689377
33733 -3689377 -1661961 1334672 4364251 5776528 4691961 1346921 -3262124 -7216524
33725 -7216524 -8404389 -6680765 -4187606 -2399293 -501781 1688121 1459116 -2928229
33717 -2928229 -7513430 -6100165 1172966 6898824 5798292 1407016 385521 2989790
33709 2989790 3635283 9491 -3367182 -2164634 1287233 1852375 -596932 -1570337 432132
33700 432132 1391296 -1621275 -5320309 -4942719 -1509200 -181777 -2334749 -3656094 -814970
33691 -814970 3859410 6236929 5996750 5787750 6545912 6502916 4522988 2233172 2224117
33682 2224117 5011325 8232772 8869609 6438449 3717508 3706729 6298136 8945188 9979789
33673 9979789 9572210 7820687 4187097 -831199 -5474726 -8535134 -9591800 -7703172
33665 -7703172 -2601519 2753742 4277962 2253005 1159595 2825241 3750646 1241039
33657 1241039 -2055207 -2718025 -1649025 -911511 629693 3912967 5455002 2157896
33649 2157896 -2290282 -2051601 1583582 2239237 -1124602 -3066528 -1305996 -81628
33641 -81628 -2016856 -3640157 -2083825 43078 277769 982299 3783869 4727791 812300
33632 812300 -3038482 -485456 5578770 6463378 721172 -3963766 -2813307 -435191
33624 -435191 -2192582 -5387564 -4213743 422194 2063648 -1582212 -5682548 -5791654
33616 -5791654 -3691633 -3424384 -4874402 -4825026 -2758602 -1612789 -2602248 -2978584 -575591
33607 -575591 2314319 2229431 -121298 -848675 1566505 4664915 5880088 5343222 4497975
33598 4497975 4335997 5524740 7993565 9716372 8171536 3986788 1102705 2157023
33590 2157023 5300871 6492066 3540164 -2466377 -7933708 -8865084 -4629731 195537
33582 195537 709922 -1447859 -130837 5729522 9868991 8378462 5855774 7405413
33574 7405413 9780021 7034306 1270424 -92860 3902613 6707804 4886309 1949798
33566 1949798 554255 -1248652 -3582188 -2303298 3128369 6422812 4097378 1793875
33558 1793875 4756045 8034369 4228508 -3514153 -5694823 -1351365 1235640 -1378040
33550 -1378040 -3062324 291509 3761092 2347525 -847009 -925754 693392 680492 955586
33541 955586 4357129 7182376 3904239 -2926575 -5353709 -1745964 1805303 2130934
33533 2130934 3318781 8330078 13169555 13083629 9531649 7122086 7233694 8034442 7848368
33524 7848368 5656447 1095180 -3490455 -3889464 670938 6036216 8954333 10510563
33516 10510563 11342638 8567538 1791151 -2788524 -403154 3979325 2460545 -3495930
33508 -3495930 -5710771 -2696198 -1081416 -2872944 -1085859 7982059 16470768 15192004
33500 15192004 6455726 -52153 -549178 408688 -1164875 -3877722 -5159458 -5088678 -4772080
33491 -4772080 -4278654 -3377239 -2229784 -822794 682175 1135906 -347761 -2543323 -3224388
33482 -3224388 -1941581 -163169 1006553 1656529 1987046 2135581 2954573 5233569 7855174
33473 7855174 8105959 4506834 -1158023 -4997976 -4377075 -480964 2803857 3370014 3416313
33464 3416313 5601064 7622708 4430073 -3534641 -8911493 -7003411 -2729261 -3642594
33456 -3642594 -8949973 -11078931 -6986525 -1882034 -925583 -2741271 -3615727 -3756081 -5602173
33447 -5602173 -8321684 -7993968 -3039046 3298569 6562907 5704292 3302535 1975388
33439 1975388 1781510 1558911 1600134 3092520 5033811 4339974 303528 -3492678 -3864094
33430 -3864094 -2465744 -2682927 -3977928 -3185940 -498726 204303 -2617397 -5640511 -5161445
33421 -5161445 -1002656 4743475 9609123 10722200 6767712 1480167 1300295 7202727
33413 7202727 12266663 10144039 2865524 -2877569 -4213219 -2975006 -729629 2047231
33405 2047231 2974254 -636774 -6479655 -8208320 -3587903 1911296 2218583 -1325572
33397 -1325572 -2341472 1503836 5429544 4206878 -1004188 -4678290 -4359154 -3017053
33389 -3017053 -3571660 -4240210 -1839433 2380891 4092480 2672812 2351431 5372167 8089175
33380 8089175 6509403 2360447 -28364 -471651 -2125488 -5106975 -5667926 -2136772
33372 -2136772 2399097 4529319 4274222 3026715 982941 -1352815 -1981687 -530035
33364 -530035 -451970 -4711575 -10253693 -10479531 -3720089 4001441 6330626 4244576 3686896
33355 3686896 6882801 9622806 7877961 3718483 2043041 3527414 4451109 2945478
33347 2945478 1510300 2507844 4726492 6118781 6778926 6959964 5140607 968727 -2553105
33338 -2553105 -3171308 -3095771 -4723232 -5458476 -2135066 1653998 -371374 -6407860 -7797621
33329 -7797621 -2439494 1186190 -3015495 -9440554 -10078004 -6587462 -5732628 -7549370
33321 -7549370 -6586688 -2304918 520426 1045136 3590840 8847932 11625794 9346172
33313 9346172 5869206 4394133 3114568 962533 1062594 4167751 4666532 -1315500
33305 -1315500 -8553061 -9519230 -4995762 -1678013 -1869037 -2067762 -244777 1938496 3629667
33296 3629667 5546466 6385847 4271867 1930027 4305306 10089216 11859456 6615112
33288 6615112 149598 -1924337 -1639316 -3082914 -4662584 -2616031 1332541 2051871
33280 2051871 -958394 -3368628 -3243586 -3050166 -4085589 -4017559 -1605814 326836 -828764
33271 -828764 -3137354 -2915232 -229174 1081548 -1630665 -6868346 -11022007 -11857567 -9674534
33262 -9674534 -6240873 -3461113 -2524212 -3231305 -3946721 -3062775 -985367 84531 -1113810
33253 -1113810 -3383658 -5086790 -6191730 -6719504 -4913384 98836 4968826 5373389
33245 5373389 2435467 1498910 3814138 4511835 938560 -2280276 -372388 3867848
33237 3867848 4529489 1329007 -1742167 -3845497 -6839824 -8825869 -5346224 2466072
33229 2466072 7585013 6629474 3823756 3177478 2461241 -1427720 -5844743 -5843259 -1473908
33220 -1473908 2676554 3771679 3027120 2490859 2322046 1282023 -1399922 -4443670 -4902118
33211 -4902118 -1681588 1800126 1455489 -1090995 -256997 4397063 6045736 417020
33203 417020 -7179838 -9000349 -5135048 -1513730 -690346 -530303 -314538 -1787862 -4149682
33194 -4149682 -3762701 -70298 2770981 1661838 -1737391 -4351700 -5209308 -4175885
33186 -4175885 -643352 4357844 7350503 6033245 2137055 -933440 -1824758 -1331625
33178 -1331625 -431227 238854 182668 -233596 249277 1993642 3562093 3681351 3223066
33169 3223066 3925148 5623309 6156514 4253468 1445377 228571 752417 764290 -586727
33160 -586727 -664968 2811901 7008233 6512177 944337 -3797314 -3492225 -1044990 -1277353
33151 -1277353 -3748728 -4652093 -3261329 -1878967 -793641 2030987 6552247 9911587
33143 9911587 10211212 8065987 4968026 2903074 4164045 8157201 10244328 7817596
33135 7817596 5208840 7338773 10958344 9155345 2973386 283934 3331212 6363622
33127 6363622 6661978 8291485 12412642 13949325 12036232 13656637 21362217 27766278
33119 27766278 29294735 34227766 47511585 59840307 66421193 85297262 134736664
33112 134736664 195519902 220136894 186509392 124128776 77412204 58961540 51233416
33105 51233416 40149922 28517443 21682440 17736231 14059051 11906044 11336777 9388890
33097 9388890 5575191 3023036 2567470 1303991 -1571991 -2837443 -949865 1038690
33089 1038690 337048 -1777669 -2993523 -3304630 -3341853 -2471590 -619322 539323 20347
33080 20347 -995623 -1459687 -1875378 -2192352 -969874 1680389 2871392 669327 -3106805
33071 -3106805 -5665026 -6570294 -6392374 -4695135 -2045970 -1481057 -4442797 -7173728 -5167446
33062 -5167446 70101 3089137 2617256 2613386 4834691 5796132 3234877 663332 1906976
33053 1906976 4850657 4956698 2462456 1352120 2518645 2766464 532330 -1729161
33045 -1729161 -1623649 258820 2402163 4231324 5039911 4078862 2642283 2977285 4179947
33036 4179947 2753023 -1351240 -3410962 -1191226 686077 -2441244 -7661243 -8828218
33028 -8828218 -6040231 -4689290 -5986447 -5104735 47995 4417748 3313162 -373177
33020 -373177 -613758 3113470 6096292 5783991 4527690 4910518 6020378 5575375 3265838
33011 3265838 351977 -2526857 -5284071 -6787783 -5403538 -1756698 600922 -1157425
33003 -1157425 -5431107 -7941465 -7164999 -5955236 -7106683 -9568453 -10593858 -9647795
32995 -9647795 -8032736 -6252110 -4307069 -3422070 -4663404 -6520605 -6470683 -4290918 -1388875
32986 -1388875 1880196 5115568 5742887 2440312 -395650 2778118 9518604 11066559
32978 11066559 4603370 -2556590 -3769978 -1634359 -1470529 -2230203 30800 4033997
32970 4033997 5422481 4198956 3486207 3047491 770853 -975111 2216249 8311247
32962 8311247 10036687 5376926 155579 -1186074 -702702 -796947 250920 3195929 4291871
32953 4291871 1196087 -2447419 -2806867 -1940613 -3303494 -5059975 -3339469 710196
32945 710196 2796366 2551769 3250878 5566415 6810293 5903989 4365188 2677794 217972
32936 217972 -1572527 -703592 903521 -307262 -2656603 -693860 5138564 6881545
32928 6881545 432207 -7321738 -7681881 -1943773 1909139 1240019 695628 3144081 5521067
32919 5521067 4934925 3237740 2990599 3165973 1916755 377496 301058 261161 -2007637
32910 -2007637 -4800280 -3984781 663063 4348229 3513662 180040 -1564937 -731032 1256493
32901 1256493 4099075 7965102 10346885 7833851 1830620 -1390502 1409009 5545821
32893 5545821 4614739 -613309 -3524998 -933582 3447532 5228160 4659299 3991623 3381192
32884 3381192 2302450 2206549 4376449 6902142 7062954 5458611 4553610 4159229 1923851
32875 1923851 -2115967 -5092906 -5583227 -4962961 -4124019 -2254533 346652 1607245 968673
32866 968673 248624 210910 -348758 -1023201 577747 3772787 3986890 31819 -2407833
32857 -2407833 1079316 6255630 6719582 4257319 5509533 10294395 11596379 7466907
32849 7466907 4429567 6427192 8191654 4337832 -1261884 -1456385 3009876 5113717
32841 5113717 2321972 -789435 -452829 1521494 2095622 1555462 1597480 2002875 1614764
32832 1614764 824314 899252 1617180 1288774 -934109 -3967461 -6375369 -8188074 -10162205
32823 -10162205 -11566708 -10482518 -7132432 -4864639 -5636677 -6292875 -2852149 2492752
32815 2492752 3402697 -1051929 -4090789 -815283 4667439 5461991 1493712 -1628648
32807 -1628648 -856569 1801319 3519125 3196778 804586 -2129565 -2476525 612635 3227579
32798 3227579 1699803 -1726578 -2360682 -194008 1421525 2355142 4928538 7742119
32790 7742119 7085295 4284035 4324861 6485331 4326421 -2918783 -7344464 -4669966 -1468574
32781 -1468574 -4294786 -8676284 -6556093 496360 4040255 1629098 -1621307 -2994994
32773 -2994994 -5400703 -10068275 -13222752 -11993762 -8302863 -5045245 -2767102 -1552872
32765 -1552872 -1991649 -2625069 -241714 5434577 10465153 11606658 9584912 6307715
32757 6307715 2203076 -1817606 -2879546 662285 6235880 9325044 7762027 2874662
32749 2874662 -2111625 -4128786 -2640409 -765224 -2060055 -5542787 -6387027 -2568397
32741 -2568397 1980564 2587555 -342213 -2998790 -3543895 -3087892 -2640534 -1897197 -666145
32732 -666145 648811 1872182 2866655 2932230 1824332 868603 1537404 3260707 4130668
32723 4130668 3543736 2607503 1883238 319548 -2808479 -5864025 -5976333 -2496959 1335397
32714 1335397 1304901 -2797438 -6283317 -4947595 -379151 2162061 660789 -1676449
32706 -1676449 -1770744 -826431 -1473354 -3478626 -4841879 -5272523 -5757930 -5870531 -4361988
32697 -4361988 -1817267 -60117 719604 1696503 2588793 1919458 161708 -393323 389425
32688 389425 -391058 -4142983 -7830139 -7383546 -2278761 4887981 11480453 15500059 15088676
32679 15088676 10291438 4564779 1704855 1262792 -583074 -5347944 -9802882 -10007305
32671 -10007305 -5850565 -593834 2476290 1871987 -1989467 -6881965 -9860000 -9684727
32663 -9684727 -7715878 -5612630 -3252667 -191883 2060753 1381437 -1698973 -4142183
32655 -4142183 -4097104 -2810340 -2466138 -3562037 -4912963 -5023688 -3001908 749917 4332277
32646 4332277 5897413 5689238 5471040 5902299 5925518 4787678 2819528 9221 -3879029
32637 -3879029 -7148566 -6870455 -3121398 187492 649584 712037 2915266 4567891 1384943
32628 1384943 -5103561 -8625359 -6676176 -3481158 -3421266 -5480550 -6089318 -4223296 -1270447
32619 -1270447 1780037 4458872 5772475 5561830 5942079 8967541 13039673 13671330 8502303
32610 8502303 594672 -4092648 -2652878 1685230 3183603 379078 -2348510 -1101482
32602 -1101482 1725852 845262 -3912642 -6988242 -4908615 -789750 582765 -1157433
32594 -1157433 -3049613 -3283551 -1949678 623717 3500343 4533128 2771130 465250
32586 465250 323473 1715996 1968902 575554 -484824 -234586 148435 -28275 567076
32577 567076 3212517 6771977 8387082 6297795 1720383 -2202494 -3610298 -3652828 -4074154
32568 -4074154 -3869484 -681607 4458948 6848957 3832825 -1809638 -5662127 -6179405
32560 -6179405 -3836633 774244 5211941 4879076 -1500522 -8347167 -9390305 -5631001
32552 -5631001 -2753010 -2233618 -511068 3361845 5212145 2556891 -950772 -728175
32544 -728175 2246294 3097382 -398895 -5279346 -7055689 -4782167 -2096917 -2678858 -5022465
32535 -5022465 -4192860 441915 3176576 470476 -2907040 -1253710 2505040 1753283
32527 1753283 -2092232 -1747674 2818851 3486908 -2101295 -5937206 -3070498 8983
32519 8983 -3225918 -7930216 -6115864 78007 2531195 264672 -980065 206600 -431681
32510 -431681 -3703690 -4931516 -1817963 2459047 4861333 5325456 3634178 -562757
32502 -562757 -4090270 -2674912 2023009 3642095 438818 -2624444 -2521615 -2519280 -5408865
32493 -5408865 -8405242 -8235397 -6207917 -4563530 -2406202 791937 1927966 -895827
32485 -895827 -3668553 -1472394 4141453 7434579 6579061 5021603 5443793 6375796 5223653
32476 5223653 1994390 -656093 -97587 3150413 4752700 923560 -5995314 -9277398
32468 -9277398 -6420377 -2325381 -1531368 -1533090 1916152 6429697 5904921 268268 -3890266
32459 -3890266 -2690366 523557 1331914 52635 -827238 -1082873 -1635774 -1650051 172077
32450 172077 2816199 4122377 4028478 4422805 5906034 6584642 4647212 1004722 -1548694
32441 -1548694 -1524064 -207106 456501 684407 2391081 6069609 9646243 10894101 9594414
32432 9594414 6738696 3265554 547275 231855 1964158 2866074 1168252 -1149037
32424 -1149037 -1503985 -917800 -2114133 -4398591 -3995889 214448 4427475 4501552 682735
32415 682735 -3320263 -4428885 -2563351 -196057 -138293 -2793977 -5451969 -5304228 -2946386
32406 -2946386 -1588339 -3053044 -5963777 -7572673 -6000402 -1406661 3228585 3465161
32398 3465161 -1814642 -7566791 -7678252 -2892707 -212048 -3700617 -9441800 -11298214
32390 -11298214 -8575089 -5468890 -4915528 -5595090 -4368674 -162129 4252765 4225619 -1695154
32381 -1695154 -8826581 -10805411 -7107281 -3135178 -2303430 -1986986 810587 3920902
32373 3920902 3721101 1360690 894911 2804716 3780101 2534795 1778531 3713237 6655935
32364 6655935 7378070 4969967 1406344 -797321 -1125478 -1576746 -4034537 -6960266 -6575121
32355 -6575121 -2313391 1414099 1009113 -1227922 -873440 1812831 2749784 486629 -2400134
32346 -2400134 -3957093 -4799371 -5299923 -4835091 -4351197 -5803560 -8216885 -8107225 -4891539
32337 -4891539 -2071465 -1750763 -1974560 -1222654 -1242521 -2782564 -2632373 1451510 6176628
32328 6176628 7083997 4869383 3221167 2679340 1327637 -65022 1125493 3796440
32320 3796440 3492994 -836895 -4817123 -4716738 -1921143 170048 531178 121377 -166962
32311 -166962 520838 2722949 4843346 4003173 319101 -2139602 -683809 1982557 1478626
32302 1478626 -2420560 -6310542 -8053205 -8351254 -8387568 -8645849 -9591351 -11065027 -11396662
32293 -11396662 -9417986 -6793233 -5816478 -5564540 -3439745 -214056 478246 -1639763
32285 -1639763 -2263531 339212 1314827 -3710312 -10803665 -12201831 -7120662 -2421471
32277 -2421471 -2329889 -3357505 -1604359 284997 -2184486 -7252315 -8952986 -6022329
32269 -6022329 -3459098 -4704429 -6911667 -5855442 -2016180 782699 551667 -1441872
32261 -1441872 -2892506 -2171172 672975 2886022 888059 -4636614 -7689217 -4147202
32253 -4147202 1818068 2625440 -2409802 -6456342 -4948867 -768526 1733106 2495843
32245 2495843 2555893 69410 -5748142 -10230481 -8354298 -2300194 1523460 1832001 3001499
32236 3001499 6435425 7812794 4758753 1515752 2588769 6015174 6900167 4642061
32228 4642061 2604034 2565971 3356000 3821278 3643830 1883454 -2024796 -6024864 -7101682
32219 -7101682 -5343730 -3892625 -4592255 -5909923 -5651457 -3852306 -2265487 -2196502 -3292587
32210 -3292587 -3776230 -2098375 905768 2292521 574145 -2025051 -2502002 -1213590
32202 -1213590 -877883 -2112945 -2576519 -652818 2341833 4223373 4537483 4637900 6295068
32193 6295068 9998630 13437880 12628831 6623008 219712 -745630 3606539 7847644
32185 7847644 8539213 7280128 6157220 4327079 825286 -2815973 -5169795 -7299742
32177 -7299742 -9982550 -10984788 -7997284 -2511637 2052459 4724563 6759152 8197012
32169 8197012 7641620 5078001 2306898 558395 -237656 103864 2145412 5063804 6619891
32160 6619891 5616958 3258748 1567559 1325753 1951481 2614888 2870025 2469679 1170976
32151 1170976 -829348 -2377548 -2144616 -427884 873563 1107499 2315491 5819936
32143 5819936 8628934 6492065 330724 -4043715 -3447248 -997417 -829384 -2764663
32135 -2764663 -4642377 -6700400 -10206070 -13730088 -14234418 -11032220 -6182454 -1788088
32127 -1788088 1114489 2096824 1731692 1456107 1600409 969359 -474617 -801419 426478
32118 426478 664751 -1374041 -2843800 -950758 2692420 4967527 5707989 5898583 4585357
32109 4585357 1751841 1067053 4550703 7275990 3554005 -3559449 -5755076 -1521489
32101 -1521489 2434140 1920051 138294 500916 1512761 1295937 1145585 1525103 -295923
32092 -295923 -5332057 -9876123 -10376811 -7707594 -4410344 -1629257 -701938 -3244048 -7235720
32083 -7235720 -7574878 -3181826 973774 1530473 1286350 2857952 3369085 80975 -3627729
32074 -3627729 -3347091 -697826 231347 -79186 1046948 2261897 741106 -1428652 -67569
32065 -67569 3361011 3486193 -80251 -2025380 189340 2974487 2578722 -713023 -5263918
32056 -5263918 -10188219 -13626156 -13225986 -9624572 -5904377 -3061021 197750 3083700
32048 3083700 2962872 744350 899900 4353901 6263782 3381816 -933389 -2245675
32040 -2245675 -1498043 -1988990 -3135602 -1898378 1376783 3097092 1891619 104665
32032 104665 -280819 136299 642061 2047046 4431560 5591773 3842443 1058001 552300
32023 552300 2304341 2819992 318700 -2653829 -3644311 -4671085 -8508672 -12169425 -9441800
32014 -9441800 -716510 5212689 2078429 -5674099 -9576103 -8023338 -5366421 -3401854
$$ [...]
##END NTUPLES=NMR SPECTRUM
##END=
