##TITLE=31Pdec_LR-747-V1-PE-Mat
 CDCl3, 24 sc
 10.3.2022
##JCAMPDX= 6.0         $$ Bruker NMR JCAMP-DX V2.0
##DATA TYPE= NMR SPECTRUM
##DATA CLASS= NTUPLES
##ORIGIN= UXNMR, Bruker Analytische Messtechnik GmbH
##OWNER= root
$$ XWIN-NMR		Version 3.5
$$ Thu Mar 10 12:06:47 2022 Russian Standard Time (UT+4h)  she@DPX200
##.OBSERVE FREQUENCY= 81.013821
##.OBSERVE NUCLEUS= ^31P
##.ACQUISITION MODE= SIMULTANEOUS
##.ACQUISITION SCHEME= undefined
##.AVERAGES= 24
##.DIGITISER RES= 16
##SPECTROMETER/DATA SYSTEM= spect
##.PULSE SEQUENCE= zgpg30
##.SOLVENT NAME= CDCl3
##.SHIFT REFERENCE= (INTERNAL, CDCl3, 0, 248.564)
##AUDIT TRAIL= $$ (NUMBER, WHEN, WHO, WHERE, WHAT)
$$ ##TITLE= Audit trail, XWIN-NMR		Version 3.5
$$ ##JCAMPDX= 5.01
$$ ##ORIGIN= Bruker BioSpin GmbH
$$ ##OWNER= she
$$ F:/spectra/data/she/nmr/P31/1/pdata/1/auditp.txt
$$ ##AUDIT TRAIL=  $$ (NUMBER, WHEN, WHO, WHERE, WHAT)
(   1,<2022-03-10 12:05:32.21 +0400>,<she>,<DPX200>,
      <created by zg, POWCHK disabled, PULCHK disabled
       configuration hash MD5:
       00 E9 B6 7A A2 85 ED C7 34 08 36 98 17 FE 4E 26
       data hash MD5: 32K
       CA A0 B7 FA 2F 32 40 6D AD 6E E7 41 A2 10 C8 D3>)
(   2,<2022-03-10 12:05:35.21 +0400>,<she>,<DPX200>,
      <Start of raw data processing
       efp BC_mod = 2 LB = 1 FT_mod = 6 PKNL = 1 PHC0 = -9139.807 PHC1 = 21.67448 SI = 64K 
       data hash MD5: 64K
       67 F2 77 9C E4 96 13 53 24 39 85 AE AA C6 08 87>)
(   3,<2022-03-10 12:06:02.21 +0400>,<she>,<DPX200>,
      <pk PHC0 = -43.07691 PHC1 = 96.40001 
       data hash MD5: 64K
       35 B2 F7 50 44 1C D5 22 79 91 1E 38 99 90 A1 80>)
(   4,<2022-03-10 12:06:05.56 +0400>,<she>,<DPX200>,
      <abs ABSG = 5 
       data hash MD5: 64K
       BA CA 66 9C 6D 7B DA 39 AD 19 85 AB 62 03 B5 59>)
$$ ##END=
$$ 
$$ hash MD5
$$ 9B BE 7F 50 80 ED B7 83 7D 4A 38 05 F1 C1 0E AE
##$RELAX= 
##$RELAX= 
##$RELAX= 
##$RELAX= 
##$RELAX= 
##$RELAX= 
##$RELAX= 
##$RELAX= 
$$ Bruker specific parameters
$$ --------------------------
##$DU= <F:/spectra>
##$EXPNO= 1
##$NAME= <P31>
##$PROCNO= 1
##$TYPE= <nmr>
##$USER= <she>
##$AMP= (0..31)
100 100 100 100 100 100 100 100 100 100 100 100 100 100 100 100 100 100 
100 100 100 100 100 100 100 100 100 100 100 100 100 100 
##$AQSEQ= 0
##$AQ_mod= 1
##$AUNM= <au_zg>
##$AUTOPOS= <>
##$BF1= 81.014009
##$BF2= 200.13
##$BF3= 200.13
##$BF4= 200.13
##$BF5= 200.13
##$BF6= 200.13
##$BF7= 200.13
##$BF8= 200.13
##$BYTORDA= 1
##$CFDGTYP= 0
##$CFRGTYP= 5
##$CHEMSTR= <none>
##$CNST= (0..31)
1 1 145 1 1 1 1 1 1 1 1 1 1 1 1 1 1 1 1 1 1 1 1 1 1 1 1 1 1 1 1 1 
##$CPDPRG= <waltz16>
##$CPDPRG1= <>
##$CPDPRG2= <waltz16>
##$CPDPRG3= <>
##$CPDPRG4= <mlev>
##$CPDPRG5= <mlev>
##$CPDPRG6= <mlev>
##$CPDPRG7= <mlev>
##$CPDPRG8= <mlev>
##$CPDPRGB= <>
##$CPDPRGT= <>
##$D= (0..31)
0 1 0 0 0 0 0 0 0 0 0 0.03 2e-05 3e-06 0 0 0 0 0 0 0 0 0 0 0 0 0 0 0 0 
0 0 
##$DATE= 1646899531
##$DBL= (0..7)
120 120 120 11 120 120 24 19 
##$DBP= (0..7)
150 150 150 150 150 150 150 150 
##$DBP07= 0
##$DBPNAM0= <>
##$DBPNAM1= <>
$$ [...]
##$SUBNAM3= <"">
##$SUBNAM4= <"">
##$SUBNAM5= <"">
##$SUBNAM6= <"">
##$SUBNAM7= <"">
##$SUBNAM8= <"">
##$SUBNAM9= <"">
##$SW= 501.771253377433
##$SWIBOX= (0..15)
0 1 3 0 0 0 0 0 0 0 0 0 0 0 0 0 
##$SW_h= 40650.406504065
##$TD= 32768
##$TD0= 1
##$TE= 0
##$TE2= 300
##$TE3= 300
##$TEG= 300
##$TL= (0..7)
0 120 53 12 22 120 120 120 
##$TP= (0..7)
150 150 150 150 150 150 150 150 
##$TP07= 0
##$TPNAME0= <>
##$TPNAME1= <>
##$TPNAME2= <>
##$TPNAME3= <>
##$TPNAME4= <>
##$TPNAME5= <>
##$TPNAME6= <>
##$TPNAME7= <>
##$TPOAL= (0..7)
0.5 0.5 0.5 0.5 0.5 0.5 0.5 0.5 
##$TPOFFS= (0..7)
0 0 0 0 0 0 0 0 
##$TUNHIN= 0
##$TUNHOUT= 0
##$TUNXOUT= 0
##$USERA1= <user>
##$USERA2= <user>
##$USERA3= <user>
##$USERA4= <user>
##$USERA5= <user>
##$V9= 5
##$VALIST= <valist>
##$VCLIST= <CCCCCCCCCCCCCCC>
##$VD= 0
##$VDLIST= <DDDDDDDDDDDDDDD>
##$VPLIST= <PPPPPPPPPPPPPPP>
##$VTLIST= <TTTTTTTTTTTTTTT>
##$WBST= 1024
##$WBSW= 4
##$XGAIN= (0..3)
0 0 0 0 
##$XL= 0
##$YL= 0
##$YMAX_a= 1220
##$YMIN_a= -1477
##$ZGOPTNS= <>
##$ZL1= 120
##$ZL2= 120
##$ZL3= 120
##$ZL4= 120
##$ABSF1= 248.5645
##$ABSF2= -253.2056
##$ABSG= 5
##$ABSL= 3
##$ALPHA= 0
##$AQORDER= 0
##$ASSFAC= 0
##$ASSFACI= 0
##$ASSFACX= 0
##$ASSWID= 0
##$AUNMP= <proc_1d>
##$AZFE= 0.1
##$AZFW= 0.5
##$BCFW= 0
##$BC_mod= 2
##$BYTORDP= 0
##$COROFFS= 0
##$CY= -3
##$DATMOD= 1
##$DC= 0
##$DFILT= <>
##$DTYPP= 0
##$F1P= 0
##$F2P= 0
##$FCOR= 1
##$FTSIZE= 65536
##$FT_mod= 6
##$GAMMA= 0
##$GB= 0
##$INTBC= 1
##$INTSCL= 5.30512e-09
##$ISEN= 30
##$LB= 1
##$LEV0= 0
##$LPBIN= 0
##$MAXI= 10000
##$MC2= 0
##$MEAN= 0
##$ME_mod= 0
##$MI= 50
##$NCOEF= 0
##$NC_proc= -8
##$NLEV= 6
##$NOISF1= 182.463
##$NOISF2= 159.3651
##$NSP= 0
##$NTH_PI= 0
##$NZP= 0
##$OFFSET= 248.5645
##$PC= 4
##$PHC0= -9182.884
##$PHC1= 118.0745
##$PH_mod= 1
##$PKNL= yes
##$PPARMOD= 0
##$PSCAL= 0
##$PSIGN= 0
##$REVERSE= no
##$SF= 81.014009
##$SI= 65536
##$SIGF1= 159.3651
##$SIGF2= -187.1042
##$SINO= 113.3802
##$SIOLD= 16384
##$SREGLST= <1H.CDCl3>
##$SSB= 0
##$STSI= 65536
##$STSR= 0
##$SW_p= 40650.406504065
##$SYMM= 0
##$S_DEV= 0
##$TDeff= 32768
##$TDoff= 0
##$TI= <>
##$TILT= no
##$TM1= 0
##$TM2= 0
##$TOPLEV= 0
##$USERP1= <user>
##$USERP2= <user>
##$USERP3= <user>
##$USERP4= <user>
##$USERP5= <user>
##$WDW= 1
##$XDIM= 65536
##$YMAX_p= 239066383
##$YMIN_p= -360179270
$$ End of Bruker specific parameters
$$ ---------------------------------
##NTUPLES= NMR SPECTRUM
##VAR_NAME=  FREQUENCY,     SPECTRUM/REAL,   SPECTRUM/IMAG
##SYMBOL=    X,             R,               I
##VAR_TYPE=  INDEPENDENT,   DEPENDENT,       DEPENDENT
##VAR_FORM=  AFFN,          ASDF,            ASDF
##VAR_DIM=   65536,         65536,           65536
##UNITS=     HZ,            ARBITRARY UNITS, ARBITRARY UNITS
##FACTOR=    0.620285442955139, 1,           1
##FIRST=     20137.2065510759, 0,            0
##LAST=      -20513.1999529892, 0,           0
##MIN=       -20513.1999529892, -360179270,  0
##MAX=       20137.2065510759, 239066383,    0
$$ Real data points
##PAGE= N=1
##DATA TABLE= (X++(R..R)), XYDATA
$$ [...]
13043f401193k908163J09877M987831O671980M018963P11220K3419J348200K052976
13034A0615110M29565l294308o700210o301453j538366K892236J976893k709396
13026d629929m898680k342026R98601K084894K780240M679916N243543K571640
13018F488199k44407K83838K288116J634732j582139l760811l368774k066312
13010c27558j419912j629141k419736k621557l90821L662064N592493L178228
13002C624060m18517j295168o29118j760124l657945k386059J933959M796097
12994B07185L979046J850208M91557r97828l093169l638505r84422L186573N594990
12985F595635M259831n05635n792243p061683k459269L641786M660633k0170m208291
$$ plain form
13043 -6401193 -9309356 -9199479 -4211648 2460332 6479295 7190515 7213934 8562134 10615110
13034 10615110 11044675 7750367 1050157 -5251296 -6789662 -3897426 -1920533 -4629929
13026 -4629929 -9528609 -11870635 -10872034 -8787140 -6006900 -1326984 3916559 6488199
13018 6488199 6243792 6527630 8815746 10450478 8868339 5107528 1738754 -327558
13010 -327558 -1747470 -3376611 -5796347 -8417904 -8808725 -5146661 445832 3624060
13002 3624060 3205543 1910375 1281257 -478867 -4136812 -6522871 -4588912 207185
12994 207185 4186231 6036439 6527996 5530168 2436999 -1201506 -2185928 1000645 6595635
12985 6595635 10855466 10349831 4557588 -2504095 -4963364 -1321578 3339055 3318885 -889406
12976h89406l188213O23738K090332L02842j537461j259066j9544o2174j928112
12967e867064l826842l273201Q2344L364164L536367J415068O27799K382384L827531
12958B268550K615383M54304J05432Q70448j49207l119293m628880k269228J953516
12949a898975L942275K239784p66367k035562j103387J60218Q6469j184325k065585
12940b625455r23772K123598M224886K111666l182344n850730k296432L175154
12932c243429L736781o5343j393914J747147L319229m24932m454435l459171n88031
12923d826098j292471l517249j805803K366034K998239L89025N21938L923069
12915a243316M244477n38524m093592j894149K072206K634557J053907Q50515
$$ plain form
12976 -889406 -4077619 -3453881 -1363549 -1060707 -2598168 -3857234 -3876778 -3938952 -5867064
12967 -5867064 -9693906 -12967107 -12884763 -9520599 -5984232 -4569164 -3941365 -1558981 2268550
12958 2268550 4883933 5338237 5443669 6314117 6164910 3045617 -1583263 -3852491 -1898975
12949 -1898975 2043300 4283084 3516717 1481155 377768 537986 624455 -559870 -2625455
12940 -2625455 -3549227 -1425629 2799257 4910923 1728579 -4122151 -6418583 -3243429
12932 -3243429 493352 428009 -965905 781242 4100471 3675539 -778896 -4238067 -4826098
12923 -4826098 -6118569 -9635818 -11441621 -9075587 -6077348 -5688323 -5166385 -1243316
12915 -1243316 3001161 2462637 -1630955 -3525104 -1452898 1181659 2235566 3086081
12907C086081J329981O3482k118669k917945k244508p54364J972598M728322L896819
12898G041797j074279m938635l259286J252699K821514L65424k524086l002747
12890c317599r47973K279647M078882K141075j499045j186055M323565Q262671
12882A4135168M606814k988425o239966l603263p60542j248565k598376j831124
12874e28279L33533J701003J426567m1637j314244o31177J622471K123284r82221
12865C709300m440825l883358Q2932L238614L627348K341753J36048k498524l346591
12856a033303j131122J067040k09631k694422j639048J930755K488906o32161
12848a852986k027760M67746K158927j75743k623551q06398K790857K907432m53505
$$ plain form
12907 3086081 4416062 4479544 2360875 -557070 -2801578 -3555942 -1583344 3144978 7041797
12898 7041797 5967518 1028883 -2230403 -977704 1843810 2209234 -314852 -3317599
12890 -3317599 -4265572 -1985925 2092957 4234032 2734987 1548932 5872497 14135168
12882 14135168 18741982 15753557 9513591 5910328 5149786 3901221 1302845 -528279
12874 -528279 -194746 1506257 2932824 2891187 1576943 945766 2568237 4691521 3709300
12865 3709300 -731525 -4614883 -4531951 -1293337 2334011 4675764 4811812 2313288 -1033303
12856 -1033303 -2164425 -1097385 -1307016 -4001438 -5640486 -3709731 -1220825 -1852986
12848 -1852986 -3880746 -3413000 -1254073 -1429816 -4053367 -4859765 -2068908 838524 385019
12839C85019k793875k005853k73022K27545J97465J371297L511480M023436R13077
12830E556569l645711m395077L87288N249585M013009j693950m990455l743247
12822c261989k025522j605020P72668N541691P127275K773620j787212r05072
12814F630439K035498N77567m019809n152565j620922J242884M17642j440529
12806a329795j762515j376626j061983K27039K297476K995620J923278J321012
12798C233506K010952J834619m61394k854964l201355k224585j700722j665138
12790e029081j051091K21260J052909M23407j450600k643128r71165K852318M830311
12781a764860K524185j144958j812865j8068K23341j626455j836012J030889L590382
$$ plain form
12839 385019 -2408856 -4414709 -4687731 -4460186 -4262721 -2891424 620056 4643492 5556569
12830 5556569 1910858 -2484219 -2096931 3152654 7165663 5471713 481258 -3261989
12822 -3261989 -5287511 -6892531 -6119863 -578172 6549103 9322723 7535511 6630439
12814 6630439 8665937 9243504 5223695 71130 -1549792 -306908 110734 -1329795
12806 -1329795 -3092310 -4468936 -5530919 -5303880 -3006404 -10784 1912494 3233506
12798 3233506 5244458 7079077 6617683 3762719 561364 -1663221 -3363943 -5029081
12790 -5029081 -6080172 -5858912 -4806003 -4382596 -5833196 -8476324 -9447489 -6595171 -1764860
12781 -1764860 759325 -385633 -2198498 -2216566 -1993225 -3619680 -5455692 -4424803 -834421
12772h34421L171378J494607P78481K59451q29722o29065J755392L201933P52407
12763I120441l502019n198279l447045n43288K097666M102925L899234L78467
12755F908102l905138m896130k178559J060752K636577K800521J774567n10470
12747C690222k392584j851815p5385o7961j480399q49107K230588L605210J135538
12738C944307j452412l67173K031424Q77597l416285n513011k898902P78377J145124
12729d870954j183228k307605p24044J199410J282443P24933J752098L461742
12721f65205K733009m99348j941630J132633N096587M268350j301846n848625
12713B973925n332175j435793K058706L458497K851165O70344j987811l608983
$$ plain form
12772 -834421 2336957 3831564 4610045 4869496 4039774 3410709 5166101 8368034 9120441
12763 9120441 5618422 420143 -3026902 -3570190 -1472524 2630401 6529635 6908102
12755 6908102 3002964 -1893166 -4071725 -3010973 -374396 2426125 4200692 3690222
12747 3690222 1297638 -554177 -629562 -697523 -2177922 -3027029 -796441 2808769 3944307
12738 3944307 2491895 2124722 4156146 5033743 1617458 -3895553 -6794455 -6016078 -4870954
12729 -4870954 -6054182 -8361787 -9085831 -7886421 -6603978 -5879045 -4126947 -665205
12721 -665205 2067804 1568456 -373174 759459 5856046 10124396 8822550 2973925
12713 2973925 -2358250 -3794043 -1735337 1723160 4574325 5244669 3256858 -352125
12705c52125l656035k258855Q92894M913717O270356K964957q33522L18891L988364
12696A2248642K429844m650366p959116k659935L597600K537413k146972k043741
12688A353369J782786J527798l496615n793013k035474K475756K800491K70097
12680a114805k086760l453429k992526K93969L916000L714112O64469J68584L200638
12671B310252M333129O94317l257270k935696j11433J329417J392356J978843
12663E733915K678753K145302Q14682m80641j985737l223428k673613p33797J91762
12654B467198m09442p46999o69135j531645j863172J158455N187343M312506j348082
12645F557027m903445l599935k369903l537916k246333L001896M890739n06777
$$ plain form
12705 -352125 -4008160 -6267015 -5374121 -460404 5809952 8774909 7941387 8260278 12248642
12696 12248642 14678486 10028120 2069004 -590931 3006669 5544082 3397110 1353369
12688 1353369 3136155 4663953 1167338 -4625675 -6661149 -4185393 -1384902 -1114805
12680 -1114805 -3201565 -6654994 -9647520 -9353551 -5437551 -1723439 -1058970 -890386 2310252
12671 2310252 6643381 7337698 4080428 1144732 1033299 2362716 3755072 5733915
12663 5733915 8412668 10557970 11372652 10892011 8906274 5682846 3009233 2275436 2467198
12654 2467198 2057756 1310757 641622 -890023 -2753195 -1594740 3592603 7905109 6557027
12645 6557027 1653582 -1946353 -4316256 -7854172 -10100505 -7098609 -2207870 -2714647
12637b714647n081021j188447N154269M066535j816552k607140J926569L321969
12629A061535k67301k159471K21556K402257K640924L629138M001030o43988p067868
12620C817812o272049J572982N561253R81873l633181j425785K072263J61013
12612B836181l257657j931839J085909n0436k249469J033122O768867N826566
12604A0061244k093205p284793m500041L49279M12119k442800k232258J598454
12596f132001L883576J320489l181083m217124m62283L731947L684656J17965
12588a253858k330457j626831k95498n13579q98215K25975J732401K164978K386526
12579d08558L173775K814364L1732k875472k882684o25603Q40043L22235r30033
$$ plain form
12637 -2714647 -7795668 -8984115 -3829846 236689 -1579863 -4187003 -2260434 1061535
12629 1061535 794234 -1365237 -1143681 1258576 3899500 7528638 11529668 10885680 3817812
12620 3817812 -2454237 -881255 4679998 5661871 2028690 602905 2675168 2836181
12612 2836181 -421476 -2353315 -1267406 -1317842 -3567311 -2534189 4234678 10061244
12604 10061244 7968039 683246 -3816795 -3467516 -3055397 -5498197 -7730455 -6132001
12596 -6132001 -2248425 -927936 -4109019 -8326143 -8788426 -5056479 -1371823 -1253858
12588 -1253858 -3584315 -5211146 -5506644 -6020223 -6918438 -6692463 -4960062 -2795084 -408558
12579 -408558 2765217 5579581 5611313 2735841 -146843 -772446 67597 389832 -540201
12570e40201j683125j583412p70948k80724j224444k311582p41909K830762L692208
12561b613375R6784k873855n36828L681163L167163j468941l262979K45571L430418
12552a34879J384249l085947m180332j099913K036339K232440N29278n00369j9904
12543b839038O30840m3183j677678k470838j678035n09968K01283J524242L880075
12534b982300M755667J889494k325583l230673n41375J300718J60995n92273J916681
12525C51351M653059K898544k412429n698117m170544m16492K283262L321663
12517H10297K809073K42275l001141l338467L3764K645437O80515k930427k632220
12508d680894J123678K588880k18998k834124j887898L13053J192181K381765
$$ plain form
12570 -540201 -2223326 -3806738 -4577686 -4858410 -6082854 -8394436 -9136345 -6305583 -2613375
12561 -2613375 -2516591 -5390446 -5927274 -2246111 921052 -547889 -3810868 -3565297 -134879
12552 -134879 1249370 -1836577 -6016909 -7116822 -5080483 -2848043 -2318765 -2819134 -2839038
12543 -2839038 -2208198 -2251381 -3929059 -6399897 -8077932 -8587900 -8386617 -6862375 -2982300
12534 -2982300 1773367 3662861 1337278 -1893395 -2434770 -1134052 -973057 -1565330 351351
12525 351351 5004410 7902954 5490525 -207592 -4378136 -4794628 -2511366 810297
12517 810297 3619370 3861645 860504 -2477963 -2444199 201238 881753 -2048674 -4680894
12508 -4680894 -3557216 -968336 -1187334 -4021458 -5909356 -5596303 -4404122 -2022357
12500b022357M967708N240202M37657n053226n221279j559882m18590k923030
12492f552797m121981j616065J458339K425910K051363R00998j382732k468567
12484i305532O66450M987705L686497k595927m451321K367288R071096N992902
12476A0419158l297538p491555l244475K490197L851094K102906L96506p17790
12468D508503j222107l09721J160903P95895j394656k560564j611902r02420j930220
12459c466289k544594m54999K933624M446021L212051P04996j892003l903530
12451i64723l614729L66967N635005O900276K452509k571175k496632R05705J173572
12442G786775k554744l897501K53692L931748J347560l621091l824550m50599
$$ plain form
12500 -2022357 2945351 8185553 8623210 3569984 -1651295 -3211177 -3629767 -6552797
12492 -6552797 -10674778 -12290843 -10832504 -8406594 -6355231 -5454233 -6836965 -9305532
12484 -9305532 -8639082 -3651377 35120 -2560807 -7012128 -4644840 4426256 10419158
12476 10419158 7121620 -369935 -3614410 -1124213 2726881 4829787 5226293 4508503
12468 4508503 3286396 2976675 4137578 4933473 3538817 978253 -633649 -1536069 -3466289
12459 -3466289 -6010883 -6465882 -3532258 913763 4125814 4830810 2938807 -964723
12451 -964723 -4579452 -4212485 1422520 8322796 10775305 8204130 5707498 6613203 7786775
12442 7786775 5232031 1334530 1588222 5519970 6867530 3246439 -578111 -1028710
12434a028710K8879k170706q91937L752678M210963j552561n832204l648621k11456
12425g343675p93594j824655J180817M436518K751304m99528P92120M144526K425528
12416E269361l615462o221453l131373l06538j443697k652002K10012M935210
12408f955942O462244L130681k434764o093484n171001q67569K538951K712178
12400f678706J936599K607867K871924L76334k487333j893379R59476J802923
12392e04295J63064q64865m68828n56089j205536p11338M98186P05731P74784
12383b169186K405724L634671J238376l226423n006572l106855o79911N78850
12375f331326J337597J207497j74970k12441K678392M256647N18309l768055j222165
$$ plain form
12434 -1028710 -999831 -3170537 -4062474 -309796 3901167 2348606 -3483598 -7132219 -7343675
12425 -7343675 -8137269 -9961924 -8781107 -4344589 -1593285 -2092813 -1300693 2843833 5269361
12416 5269361 1653899 -4567554 -7698927 -8005465 -9449162 -12101164 -11891152 -6955942
12408 -6955942 -493698 2636983 202219 -5891265 -11062266 -11929835 -9390884 -6678706
12400 -6678706 -4742107 -2134240 737684 1114018 -1373315 -3266694 -2307218 -504295
12392 -504295 -341231 -1206096 -1674924 -2231013 -3436549 -4147887 -3649701 -2943970 -2169186
12383 -2169186 236538 3871209 5109585 1883162 -3123410 -6230265 -6910176 -6331326
12375 -6331326 -4993729 -3786232 -3961202 -4173643 -1495251 2761396 3279705 -488350 -1710515
12366a710515N024203M716034k742532o223044l99081N721926L079889m135572
12358C331308o276125j949691L088932N083335L760556o26325n704842o478009
12350e770861j776886K661824K269369K50847J096507K570805N17150k722417
12342i03662j995310J487923K007262j237189l334267j642055J399085L243655
12334i74558L829750L152816Q01993j829162k529226j455679m53285j0105K93380
12325H25924k07850j629681j721803P10127K518338N25614k702913k219037J474127
12316b427154L197447J193980r12717o21941J58692l76602o90919P59320K365582
12307B645688J750703q93054l410351m007710k206521Q79060K861989K370856
$$ plain form
12366 -1710515 3313688 8029722 5287190 -935854 -1334935 4386991 7466880 3331308
12358 3331308 -2944817 -4894508 -1805576 3277759 7038315 6411990 707148 -5770861
12350 -5770861 -7547747 -4885923 -2616554 -2365707 -1269200 1301605 1818755 -903662
12342 -903662 -2898972 -1411049 596213 -640976 -3975243 -5617298 -4218213 -974558
12334 -974558 2855192 6008008 6810001 4980839 2451613 995934 542649 532544 825924
12325 825924 618074 -1011607 -2733410 -2023283 495055 1020669 -1682244 -3901281 -2427154
12316 -2427154 770293 1964273 1051556 429615 588307 211705 -479214 280106 2645688
12307 2645688 4396391 3503337 92986 -3914724 -6121245 -5242185 -2380196 -9340
12299i340R96941J087284K000121J069756j808714l414332j595357J953732L956091
12290D236182K673644j368722n595314o366120k451621K248430K487379j243268
12282e379410k871014O96845M985853M609897J067956k98084J077586P66400k458325
12273B197704l906605o53130K914300J378204l134532m007171k45005K532837
12265b923398J518885O47167K656721L518433m36919m862068l320784K330095
12257h71868M592187J646817j385292j919634k691832m140182k217563L314393
12249c672974N919143J921841l226818l252876j17782O52444j089969j793257
12241d660248j003053m53896N27355K796016L365652k92950m324131l174704J684476
$$ plain form
12299 -9340 987601 2074885 4075006 5144762 3336048 -78284 -1673641 280091 4236182
12290 4236182 6909826 5541104 -54210 -6420330 -8871951 -6623521 -4136142 -5379410
12282 -5379410 -8250424 -7553579 -2567726 2042171 3110127 2812043 3889629 4656029 2197704
12273 2197704 -1708901 -2362031 552269 1930473 -1204059 -5211230 -5456235 -2923398
12265 -2923398 -1404513 -757346 1899375 5417808 4980889 118821 -3201963 -871868
12257 -871868 3720319 5367136 3981844 2062210 -629622 -4769804 -6987367 -3672974
12249 -3672974 2246169 4168010 941192 -2311684 -2429466 -1777022 -2866991 -4660248
12241 -4660248 -5663301 -6117197 -5589842 -2793826 571826 278876 -4045255 -7219959 -5535483
12232e535483M105502K717808J334553J123003l74704k675668k189514O89931
12224h04572J376834q39284j503806N87290R69764j847612k661983J446594N104025
12215A827250K884770j964576l015223n30073N00725j003072k106266k366866
12207e773331l839431n302803k814049L325114P524227O249381K191272l59401
12199A200979o22958j84971Q3941O8366k81340j54494J539337L683166L428579
12190H760605M76717j692778p20265J005819J29919k377062k927808j090488j14066
12181A450593j783642l910351l619742p40651K766819M743068L780020M40636
12173C126750k059306q98131K039239J868225k227172n135184l069217Q94369
$$ plain form
12232 -5535483 -1429981 1287827 2622380 3745383 3370679 695011 -1494503 -804572
12224 -804572 572262 -267022 -1770828 -1183538 -213774 -2061386 -4723369 -3276775 1827250
12215 1827250 4712020 2747444 -267779 -797852 -297127 -1300199 -3406465 -5773331
12207 -5773331 -9612762 -14915565 -17729614 -14404500 -6880273 -630892 1560380 1200979
12199 1200979 578021 393050 476991 545357 264017 109523 1648860 5332026 8760605
12190 8760605 9237322 7544544 6824279 7830098 7960017 5582955 2655147 1564659 1450593
12181 1450593 -333049 -4243400 -7863142 -8603793 -5836974 -1093906 2686114 3126750
12173 3126750 1067444 169313 2208552 4076777 1849605 -3285579 -6354796 -5460427
12165e460427J678087n89607k259629k353468k188140q64009L075054O425238
12157b536901M167545k021577m510956n93959L593775K686758m61681r02952L48438
12148b31510k52198j456590M36534M231335M895534J273000k347078k474815k52904
12139C821308J249633N77019j389218k217959j80295K764792K359901j573996
12131E411185l481379j27473L530612J590840l153470l506330N73046K533988
12123C371019M46801q14339P29786R87469j406360j738664J458778K036901l201195
12114A870196p094415k685676M920241O031059J337046m18008K554245L015807
12106I530495j871250n352161k566696J601658J298038p83825Q35534M275992
$$ plain form
12165 -5460427 -3782340 -4371947 -6631576 -8985044 -11173184 -12037193 -8962139 -2536901
12157 -2536901 1630644 -390933 -4901889 -5495848 -1902073 784685 323004 -579948 -231510
12148 -231510 -483708 -1940298 -1503764 2727571 7623105 8896105 6549027 4074212 3821308
12139 3821308 5070941 5647960 4258742 2040783 1860488 4625280 6985181 5411185
12131 5411185 1929806 1802333 5332945 6923785 3770315 263985 837031 3371019
12123 3371019 3817820 3003481 3733267 4720736 3314376 1575712 3034490 5071391 1870196
12114 1870196 -5224219 -7909895 -2989654 3041405 4378451 3960443 6514688 9530495
12106 9530495 7659245 2307084 -259612 1342046 2640084 1856259 2691793 6967785
12098F967785L368847j870021n208788l919545j842633k053334k454208o34989
12090g646886J829065K676720K689494L126359K621912k3067k481875j967216
12082H24506J43820M83253p77840n66800J469990K167416J36301j981244j786751
12073A12651l99500J73682J70897O08780Q69387r1489j546128j861962o45449
12064b609131J217941K654579K645898P27926j781375k485184q99302O48794J43139
12055B63285j534174k220276j284597K54599J173578P55174o75154j431796k10920
12046d910281J712526K068063J212419J236499J565695m08664l656003l562551
12038d742297M35428K793491O18838j266498J287102M006235J404038l107624
$$ plain form
12098 6967785 10336632 8466611 3257823 -661722 -2504355 -4557689 -7011897 -7646886
12090 -7646886 -5817821 -3141101 -451607 2674752 5296664 5273597 2791722 824506
12082 824506 968326 1451579 673739 106939 1576929 3744345 3880646 1899402 112651
12073 112651 -286849 -113167 57730 666510 1535897 1444408 -101720 -1963682 -2609131
12064 -2609131 -1391190 1263389 3909287 4637213 2855838 370654 -528648 120146 263285
12055 263285 -1270889 -3491165 -4775762 -4521163 -3347585 -2592411 -3267565 -4699361 -4910281
12046 -4910281 -3197755 -1129692 82727 1319226 2884921 2476257 -1179746 -4742297
12038 -4742297 -4306869 -1513378 -894540 -2161038 -873936 3132299 4536337 1428713
12030A428713k588802J302543J069818l281593m082389J48257J528253l159528
12022g634728n633129N43600Q472208Q039128J207730k215604j32983P30111j997997
12013A378336k450962K144112N337868J439116m915132n251953N85867N031335
12005C298587L723885j30782k273718k819889l559223m073531l142976j292551
11997a0270198M94798K473618M341827M031084R99771j417429l18885J915944
11989B250530J112367j761841k059512O21109J575931j051798l133321j559543
11981d006078R29439J152083R27618K903203M870035L174455q46599k708230j396006
11972D999920J99181K38793n73712j492971k292653k191816r85923p0L08097J467710
$$ plain form
12030 1428713 -1160089 142454 1212272 -2069321 -6151710 -6003453 -4475200 -7634728
12022 -7634728 -13267857 -12724257 -4252049 3787079 4994809 2779205 2646222 3376333 1378336
12013 1378336 -1072626 1071486 6409354 7848470 2933338 -2318615 -1732748 3298587
12005 3298587 7022472 6891690 4617972 1798083 -1761140 -5834671 -8977647 -10270198
11997 -10270198 -9775400 -7301782 -2959955 1071129 2070900 653471 334586 2250530
11989 2250530 3362897 1601056 -458456 162653 1738584 686786 -2446535 -4006078
11981 -4006078 -3076639 -1924556 -996938 1906265 6776300 9950755 9104156 6395926 4999920
11972 4999920 5199101 5437894 4864182 3371211 1078558 -1113258 -2099181 -2099251 -1791154 -323444
11962c23444L360494K748796j315514m387449l178366j207824k556598m031239
11954a0891144m71764N352766O199540J781012j602524j758902k137332k905327
11946f433675j5901N377311O007523R6904m622857k489148K075379K612536j95009
11937B413063k334393l260349l577581j371717L553145O295421L208789k074568
11929B851810l915677k379352r05330O8095J901964L164348J582121j402928k587525
11920a622474j774426p75737K66166J865866K650940J431682k05037m85770k26982
11911A124228j65923J277932M184169M645625L58720m498226m672306j432086
11903H22133K9455j543330l062970k705421j308959L20726J501708Q92275p61691
$$ plain form
11962 -323444 3037050 5785846 4470332 82883 -3095483 -4303307 -6859905 -10891144
11954 -10891144 -11362908 -6010142 189398 1970410 367886 -1391016 -3528348 -6433675
11946 -6433675 -6449576 -1072265 4935258 5032162 409305 -2079843 -4464 2608072 2413063
11937 2413063 78670 -3181679 -6759260 -8130977 -4577832 1717589 4926378 2851810
11929 2851810 -1063867 -3443219 -4348549 -4280454 -2378490 785858 2367979 965051 -1622474
11920 -1622474 -3396900 -4172637 -3906471 -2040605 610335 2042017 1836980 1351210 1124228
11911 1124228 958305 2236237 6420406 11066031 11424751 6926525 2254219 822133
11903 822133 851588 -691742 -3754712 -6460133 -7769092 -7448366 -5946658 -5054383 -5816074
11894e816074K20536M495832O318734J443159m873740m395979J836751N137298
11886D366517K079267j804765j722156J77142K02125j292457k345180k813756
11878c153263k818758j334748J436207L068043K077800k0697r37243j01493J526627
11869b57525K511627J843473J26163r23396j244399k596000m427298l081635J933661
11860f115329M985086K181642j800912p54573K835836K106120k317062l515610
11852b394802j74088K068875J373064K035184M372189K370773m800094q536794
11844c685693l738357K422432J758918k003782j34393O280456P974045K047374
11836A0921000l919603l035906K275499M806187J520644l952290n741459j828103
$$ plain form
11894 -5816074 -5595538 -1099706 5219028 6662187 1788447 -2607532 -770781 4366517
11886 4366517 6445784 4641019 2918863 3096005 3298130 2005673 -339507 -3153263
11878 -3153263 -5972021 -7306769 -5870562 -2802519 -724719 -745416 -1682659 -1784152 -257525
11869 -257525 2254102 4097575 4223738 3300342 2055943 -540057 -4967355 -8048990 -6115329
11860 -6115329 -1130243 1051399 -749513 -1504086 1331750 3437870 1120808 -2394802
11852 -2394802 -2568890 -500015 873049 2908233 7280422 9651195 4851101 -3685693
11844 -3685693 -7424050 -5001618 -3242700 -5246482 -5380875 899581 8873626 10921000
11836 10921000 7001397 3965491 6240990 11047177 12567821 8615531 2874072 1045969
11828A045969L545642M421743N44815k341678q37361J339718j81965l208535k952769
11819A375579k66515q9021l016689m379796j877545J295270K088382J621338J739477
11810a509520J572228j8745j575259j244678K04793Q83567P32943Q68838J211938
11801A126105Q28207j63294p99972p42693K943J882791M290809M161156r22607
11792I663445p954394j0103665m704800L022993O497514N528790M347790M106148
11784A0403821K222734j327017k662192m94388J011819j286695m360386l934882
11776d27186j103092J92419l74866r5947J540200K605339K468709J789470J40867
11767F735913k446801l347406j121733O40305j513666m091198j613421L284677
$$ plain form
11828 1045969 4591611 9013354 9558169 7216491 6379130 7718848 7536883 4328348 1375579
11819 1375579 1109064 1020043 -1996646 -6376442 -8253987 -6958717 -4870335 -3248997 -1509520
11810 -1509520 62708 43963 -1531296 -2775974 -2571181 -1687614 -954671 -85833 1126105
11801 1126105 1954312 1791018 991046 248353 251296 2134087 6424896 10586052 9663445
11792 9663445 1709051 -8394614 -13099414 -10076421 -3578907 1949883 6297673 10403821
11784 10403821 12626555 11299538 8637346 8142958 9154777 7868082 3507696 -427186
11776 -427186 -1530278 -1337859 -1712725 -1808672 -268472 2336867 4805576 6595046 6735913
11767 6735913 4289112 941706 -180027 460278 -1053388 -5144586 -6758007 -3473330
11759c473330K896782k528823m045027J583754O074421K781175k765012k117906
11751a593966K917791M382542J074522j080112L67691J332213j068308m189570
11743B142803m757382l383649k283569j614358o4526K391353L757801K089099
11735a722428j713406l826228j641500K559774M364306L064312J437766L06986
11727B829582j876055l855742k094044J998011K138041k557558m592071P8975
11719g930861M634739K307979k243272j045244L413928K831519k174575l263871
11711c469658J073152L511892J105236m20140K018948L415927M44436k381503
11703E298290j219486L68179j259970k797569n01979K305242J037118j778675
$$ plain form
11759 -3473330 -576548 -3105371 -7150398 -5566644 507777 3288952 523940 -1593966
11751 -1593966 1323825 5706367 6780889 5700777 6068468 7400681 6332373 2142803
11743 2142803 -2614579 -5998228 -8281797 -9896155 -9960681 -7569328 -3811527 -1722428
11735 -1722428 -3435834 -7262062 -8903562 -6343788 -1979482 1084830 2522596 2829582
11727 2829582 953527 -2902215 -4996259 -2998248 -860207 -3417765 -8009836 -7930861
11719 -7930861 -3296122 -988143 -3231415 -4276659 -862731 1968788 -205787 -3469658
11711 -3469658 -2396506 1115386 2220622 1800482 3819430 7235357 7679793 5298290
11703 5298290 4078804 4446983 3187013 389444 -112535 2192707 3229825 1451150
11695A451150j054130J770937J598343j115814j616715K28193o8254k915676l478059
11686e200025l94468J427585o57195k155676P72249M037074J939075k716669j877480
11677d825530N058762Q885186L217201o145560q759110k842577M043391N672495
11669D304258K861781j134420m859223o612672l805187K245451N316443K254835
11661E71266j651037l5971M821023N363315P3425m784938m544031j440220L79712
11652a247456J38099q05338j377906n28379K009730L742796J752740k255576l176211
11643a747501K15981L295003K307099r53436k956826l124322k626701j794335
11635g385038p34949J48756J414712L475843M043773P83969l349997k934455R51430
$$ plain form
11695 1451150 397020 2167957 3766300 2650486 1033771 1261964 1193710 -1721966 -5200025
11686 -5200025 -5594493 -4166908 -4824103 -6979779 -6207530 -2170456 -231381 -2948050 -4825530
11677 -4825530 233232 9118418 12335619 6190059 -2569051 -5411628 -1368237 4304258
11669 4304258 7166039 6031619 1172396 -5440276 -9245463 -7000012 -1683569 571266
11661 571266 -1079771 -1115742 3705281 9068596 9142021 4357083 -186948 -1627168 -1247456
11652 -1247456 -1109357 -1914695 -3292601 -3820980 -1811250 1931546 3684286 1428710 -1747501
11643 -1747501 -1531520 1763483 4070582 3117146 160320 -2964002 -5590703 -7385038
11635 -7385038 -8119987 -7971231 -6556519 -3080676 963097 1747066 -1602931 -4537386 -3585956
11626c585956J252492l482760n642762p29170M627002L008158k089937k705140
11618i348073O81496J640472l01549J26206L295725L760190L56259j531732N16293
11609h04713K085760K27107j456469L28602K567469J227927j925517k494435m51129
11600f95398N28265p81277j581750M42436L629048M150282O30220l611079l810469
11591a099722L11080L599375J974482k264494m330755l846155l698413l699387
11583a3053989q64468M092759O214602L576917J70181l42710P16234P64820J54463
11574A428809J01956J00247n8750R06500K511042J707732j858865l606170o10387
11565F22114L012895J711585l153008n396836k881673N35357J349801K22015q52818
$$ plain form
11626 -3585956 -2333464 -5816224 -11458986 -12188156 -7561154 -4552996 -6642933 -9348073
11618 -9348073 -8666577 -7026105 -7327654 -7201448 -3905723 -145533 210726 -1321006 -804713
11609 -804713 1281047 1508154 51685 380287 2947756 4175683 2250166 -244269 -695398
11600 -695398 -167133 -948410 -2530160 -2087724 1541324 5691606 6321826 2710747 -1099722
11591 -1099722 -788642 2810733 4785215 2520721 -1810034 -5656189 -9354602 -13053989
11583 -13053989 -13918457 -9825698 -3611096 -34179 136002 -206708 509526 1274346 1428809
11574 1428809 1530765 1631012 1572262 2478762 4989804 6697536 4838671 1232501 622114
11565 622114 3635009 5346594 2193586 -3203250 -6084923 -5549566 -4199765 -3977750 -4830568
11556d830568j352162j300934m29805Q01511J419511J611645K236885K581323
11548G37406R32627k155121l514378j325153K316196L890214K272071p87938k805866
11539d39942k336330K03817K396968J549627k046318m342399j848624L483536
11531c379665N900879L056505p94308o80142K150373K516265n91293k725281j446477
11522D006856j45568j785240l289226o22957L670050L577446j111717m332931
11514c3287k656251N67037J136915m37407j206049j60002J558886K394842J260307
11505B424991j048781j241629K555632O433573M477369k532941o968591m416285
11497c16662Q01651K398868k4374k705285l341595j931924O27144K027964j7662
$$ plain form
11556 -4830568 -6182730 -7483664 -7913469 -7111958 -5692447 -4080802 -1843917 737406
11548 737406 1670033 -485088 -3999466 -5324619 -3008423 881791 3153862 2365924 -439942
11539 -439942 -2776272 -2572455 -175487 1374140 -672178 -5014577 -6863201 -3379665
11531 -3379665 2521214 5577719 4783411 4103269 6253642 8769907 8178614 5453333 4006856
11522 4006856 3861288 2076048 -1213178 -1836135 1833915 5411361 4299644 -33287
11514 -33287 -2689538 -2122501 -985586 -1422993 -2629042 -2789044 -1230158 1164684 2424991
11505 2424991 1376210 134581 2690213 9123786 13601155 11068214 4099623 -316662
11497 -316662 484989 2883857 2859483 154198 -3187397 -5119321 -4492177 -2464213 -2481875
11488b481875l445733k958042J837119M244593L37848m039064j727591M380444
11480c852301N399898l02293n126823l399747J753133M018252J741201j685579
11472a454259k442825J04596L053705L069190N04051j009346J7610O96160j131074
11463A407808k935841j807357M97325P92699J1372J033200L136246L254245J202259
11454F591956o80967j671159k425603k276463p23419K51948p25188j381097O5363
11445b974629P87431j718192l967832j721065K294541K676057N26472Q23450L035232
11436b38535K612255L2516l86335O31815j109766l825738j958648K544846K247117
11427E49527j972037j372664M331150M477431m157462r939158m649428L267038
$$ plain form
11488 -2481875 -5927608 -8885650 -7048531 -2803938 -2466090 -6505154 -8232745 -3852301
11480 -3852301 1547597 1245304 -3881519 -7281266 -5528133 -1509881 231320 -1454259
11472 -1454259 -3897084 -3792488 -738783 2330407 2834458 1825112 1842722 2538882 1407808
11463 1407808 -1528033 -3335390 -2838065 -2045366 -2033994 -1000794 2135452 5389697 6591956
11454 6591956 5910989 4239830 1814227 -462236 -1185655 -933707 -1658895 -3039992 -2974629
11445 -2974629 -2187198 -3905390 -7873222 -9594287 -7299746 -4623689 -4097217 -3273767 -238535
11436 -238535 2373720 2406236 2019901 2651716 1541950 -2283788 -4242436 -1697590 549527
11427 549527 -1422510 -2795174 1535976 6013407 1855945 -8083213 -12732641 -9465603
11419i465603L237337p04102P60108N207369L993857j306457j641305L452943
11411C534147N345169R26615l731190m615216m293061l998054p74260M971277
11403b634573P161459K657963l795021o094271l593846N39761L494139L707767
11395A443378J375459o88006J52287K313131J988119j065003l408136l245040
11387a133811j913420l91892J493903K501594Q63183k071473l006535j596160
11379e254611m56153n61747n19540K7218L74904J475331M157626N452317J993547
11370F688892l360533m278695n28713J652788k69569j620661M96186J879763r06979
11361b47521l674731j406951K753021K065238k887446m807677p68785L647225
$$ plain form
11419 -9465603 -6228266 -6932368 -6172260 -964891 3028966 1722509 81204 3534147
11411 3534147 8879316 9805931 6074741 1459525 -2833536 -6831590 -7605850 -2634573
11403 -2634573 4526886 7184849 3389828 -2704443 -6298289 -5758528 -2264389 1443378
11395 1443378 2818837 2130831 2283118 4596249 6584368 5519365 2111229 -1133811
11387 -1133811 -3047231 -3439123 -1945220 556374 1419557 -651916 -3658451 -5254611
11379 -5254611 -5710764 -6272511 -6792051 -6764833 -6389929 -4914598 -756972 4695345 6688892
11370 6688892 3328359 -950336 -1479049 173739 -95830 -1716491 -1220305 659458 -247521
11361 -247521 -3922252 -5329203 -2576182 -510944 -3398390 -8206067 -8974852 -5327627
11353e327627K806307j378689l214986j335183O99116N96327J64897J135639J569538
11344d284661q41288l910976l225533J134301M219841L357808J519737J776717
11336b54054K597444J558404j56891o77590j355853l455190m175416r84339K886000
11327d017485K794432J21029o18057K10577q88440k531649k00127M478383M690447
11318D039110l34771l455809j106742J512856q4034k784018k618662j266328j044923
11309g143321k4477K600338K610120j755338m391807l61047M999488L930863j179984
11300g15165k053450J669772K755174m52916j428970K361915M230764o75371o732186
11291a040433o068490l04057K379243o73523l666406j457865L458255N067611
$$ plain form
11353 -5327627 -2521320 -3900009 -7114995 -8450178 -7751062 -7154735 -6989838 -5854199 -4284661
11344 -4284661 -5125949 -9036925 -12262458 -11128157 -6908316 -3550508 -2030771 -254054
11336 -254054 2343390 3901794 3744903 3067313 1711460 -1743730 -5919146 -6903485 -4017485
11327 -4017485 -1223053 -1102024 -1720081 -1509504 -2397944 -4929593 -5129720 -651337 4039110
11318 4039110 3704339 248530 -858212 654644 570610 -2213408 -4832070 -6098398 -7143321
11309 -7143321 -7167798 -4567460 -1957340 -3712678 -8104485 -8465532 -3466044 464819 -715165
11300 -715165 -2768615 -1098843 1656331 1203415 -225555 2136360 6367124 5691753 -1040433
11291 -1040433 -7108923 -7412980 -5033737 -5707260 -9373666 -10831531 -7373276 -2305665
11283b305665K024173j174705o64274J773869J638187j789342m444212l100430
11275h042399O35782L118864L111510J660693l64392k239127k520961q46506O29701
11266d856835J87010l77200J313616L398477J927505k357455l875674j73608M005438
11257h08726L259355q58501k316528P53048L678981J850449l313866o522431m985607
11248i263826p29095K734563M005173L758542K856797J646854K61239j368977
11240C901270l118443l679958j412764K587242M120251R28120l444216l959890
11232d078388j050442O88825q228J5434J583250J313020j396712j653242K679464
11223a907019N635707J757917m448420m735594J92752K232809j014130l200607
$$ plain form
11283 -2305665 -281492 -1456197 -2120471 -346602 1291585 -497757 -4941969 -8042399
11275 -8042399 -7406617 -4287753 -1176243 484450 120058 -2119069 -4640030 -5486536 -4856835
11266 -4856835 -4669825 -5047025 -3733409 -334932 1592573 -764882 -4640556 -4814164 -808726
11257 -808726 2450629 1592128 -724400 28648 3707629 5558078 2244212 -4278219 -9263826
11248 -9263826 -9992921 -7258358 -3253185 505357 3362154 5009008 5270247 3901270
11240 3901270 782827 -2897131 -4309895 -1722653 2397598 3325718 -118498 -4078388
11232 -4078388 -5128830 -4440005 -4448233 -4432799 -2849549 -1536529 -2933241 -4586483 -1907019
11223 -1907019 3728688 5486605 1038185 -3697409 -3504657 -1271848 -2285978 -5486585
11215e486585l54258L109770K623831P31032J470584K882894P03017l889460n816050
11206d025225l690313r77362k20787k12380R52146L056709M451169L771455J117125
11197D222537j427510j569569j02768k96762k525665k664071J335194M720036
11189A691422K350312k864182l752223L50888L130124J388554j291218k053286
11181a049609k744734l865553j772246L847610O394839J992007l092946j603697
11173a894329L014736K384688k881726m582045p50884J945671K48512j133227
11165c648604N41263R32219k358368m110619m36752L768332K692508j163114k377652
11156f160787j711322k298421j702017L413222Q232564N184206l193465o563730
$$ plain form
11215 -5486585 -5840843 -2731073 -107242 623790 2094374 4977268 5680285 1790825 -4025225
11206 -4025225 -7715538 -8692900 -8913687 -9126067 -8173921 -5117212 -666043 3105412 4222537
11197 4222537 2795027 1225458 1122690 825928 -1699737 -4363808 -3028614 1691422
11189 1691422 4041734 1177552 -2574671 -2223783 906341 2294895 1003677 -1049609
11181 -1049609 -3794343 -7659896 -9432142 -5584532 810307 2802314 -290632 -1894329
11173 -1894329 1120407 3505095 623369 -3958676 -4709560 -2763889 -2515377 -3648604
11165 -3648604 -3107341 -2175122 -4533490 -8644109 -9080861 -5312529 -2620021 -3783135 -6160787
11156 -6160787 -7872109 -10170530 -11872547 -8459325 -226761 4957445 1763980 -4799750
11148d799750k034602K452466J436895p56462O80740K973631J989160l20315m33473
11139A188290L8135j901938m156828k785581R97226K755701J950143J724106K623411
11130B432665J777286j592679m384124m138068j841770N57185K272567K409355
11122b507583k23864m231963n147662n37666N650497O781906J703370l450165
11114a963130k911328J530242L565939J155974j555369j247538P7548l84775j341400
11105c073837n63969L55973j022281k653212q85747K766142L382428O01842j055534
11096b148195m7060J60832j879089k690608k89570K129087J850051R17216J566297
11087d31039K168336J217797P64404K019191J977957j268213m034963k620095
$$ plain form
11148 -4799750 -6834352 -4381886 -2944991 -3701453 -3020713 -47082 1942078 1621763 1188290
11139 1188290 1226425 -675513 -4832341 -7617922 -6620696 -3864995 -1914852 -190746 2432665
11130 2432665 4209951 2617272 -1766852 -5904920 -7746690 -7189505 -4916938 -2507583
11122 -2507583 -2731447 -6963410 -12111072 -12648738 -6998241 -216335 1487035 -1963130
11114 -1963130 -4874458 -3344216 221723 1377697 -177672 -1425210 -1347662 -1732437 -3073837
11105 -3073837 -3637806 -3281833 -4304114 -6957326 -7843073 -5076931 -1694503 -1092661 -2148195
11096 -2148195 -2195255 -2034423 -3913512 -6604120 -6893690 -4764603 -2914552 -1997336 -431039
11087 -431039 1737297 2955094 3719498 5738689 7716646 6448433 2413470 -206625
11079b06625M16147O31608j124917j379936o57651j398906j948291P56045M315928
11070e96598L628069l66973j624524J324836L438257J694177j005814j998201
11062D493229k639715l657884k630784P97045K434524k419k443714o40359K937542
11053a352535L007183m49843k876079k295643j000294n94489J50377J838463K595804
11044i77056J246917k85032K66451J897123J576678j296076l527223j949705K291602
11035g56321M490891J660573l749172o203040l007281K777863N519412K730653
11027C463578k626977n441868l715913p2155J941327J858352J573921J808384
11019a211351J535815O25289L23468O00556p8204j237498J3903L704480M783594
$$ plain form
11079 -206625 209522 841130 -283787 -1663723 -2321374 -3720280 -5668571 -4912526 -596598
11070 -596598 3031471 2664498 1039974 2364810 5803067 7497244 6491430 4493229
11062 4493229 1853514 -1804370 -4435154 -3638109 -1203585 -1206004 -3649718 -4290077 -1352535
11053 -1352535 1654648 1204805 -1671274 -3966917 -4967211 -5561700 -5411323 -3572860 -977056
11044 -977056 269861 -15171 251280 2148403 3725081 2429005 -1098218 -3047923 -756321
11035 -756321 3734570 5395143 1645971 -4557069 -7564350 -4786487 732925 3463578
11027 3463578 836601 -4605267 -8321180 -8393335 -6452008 -4593656 -3019735 -1211351
11019 -1211351 324464 949753 1273221 1873777 1795573 558075 571978 4276458 9060052
11010I060052r3435o235007o310024p85605K605992J13807l153881j842222J469495
11001e170828J097596k207136k286705K603711O545137M279066j334933l490796
10993C5112p75210J727284L14683k489963k559748k01223J467609J845074K540477
10984A904095K878633M78880l267784l303807J409113M823522J942391l535737
10976C329306m262257L17644L672229J657718k627002m165045k101870J040365
10968c138912L146904L582298K413167L06868j647150k803820l036588k135762
10960c312995l22228J042503Q59881K0077l5916J66454n95101j058926J178525
10951b057726M858709N189836L25506n222350n841765j482598L053765L953218
$$ plain form
11010 9060052 8966617 2731610 -3578414 -4364019 -1758027 -1644220 -4798101 -6640323 -5170828
11001 -5170828 -4073232 -6280368 -8567073 -5963362 581775 4860841 3525908 35112
10993 35112 -740098 987186 1301869 -1188094 -3747842 -3949065 -2481456 -636382 1904095
10984 1904095 4782728 5261608 1993824 -1309983 99130 4922652 6865043 3329306
10976 3329306 -932951 -615307 3056922 4714640 2087638 -2077407 -4179277 -3138912
10968 -3138912 7992 3590290 6003457 6310325 4663175 1859355 -1177233 -3312995
10960 -3312995 -3635223 -2592720 -1732839 -1712762 -1748678 -1582224 -2177325 -3236251 -2057726
10951 -2057726 2800983 7990819 8316325 3093975 -2747790 -4230388 -1176623 2776595
10943B776595J474303j657405k968954j969443n50456j000641k774156k643622
10935i313779P35057M290462M588892K653090J879899K415922J279242k095194
10927F433591m379685l455787j378304l95340O03129K819706L653464J60483n088905
10918a027648o087098j333638M216024N778911L704819P68815j815232l719390
10910D85563l947630k438914r89165m71951N83662K605534K919198j42727l611498
10901e007928l681261j029600J106413K084321L167493L576870J741996q06528
10893A151776j425607j140584k493043l665915o90729M612249N489072M32748
10885B269967l777404j803304K993625M325466J411187j994054l370404k729566
$$ plain form
10943 2776595 4250898 2593493 -375461 -2344904 -2895360 -3896001 -6670157 -9313779
10935 -9313779 -8578722 -4288260 300632 2953722 4833621 7249543 8528785 6433591
10927 6433591 2053906 -1401881 -2780185 -3175525 -2572396 247310 3900774 4061257 -1027648
10918 -1027648 -7114746 -8448384 -4232360 1546551 5251370 6020185 4204953 485563
10910 485563 -3462067 -5900981 -6890146 -7362097 -6778435 -4172901 -1253703 -1396430 -5007928
10901 -5007928 -8689189 -9718789 -8612376 -6528055 -3360562 216308 1958304 1151776
10893 1151776 -273831 -1414415 -3907458 -7573373 -8264102 -3651853 1837219 2269967
10885 2269967 -1507437 -3310741 -317116 4008350 5419537 3425483 55079 -2674487
10877b674487r45711L01699o39346k552338k204545L25048R37648j740164l194496
10868a2386692J99303N084177N668262J498859k949282m166573j950626J983142
10860g019430M923549M626237J965475P4358k41412j047312k472325j996039R9400
10851a087499K23903j415428J95011N402799O724225L27003o478937n957614j506822
10842c573359m46506j381078J381420N415795L416700l364901o080845k363257
10834f996031J014291L30829k91518J700610K503148j43160k318412r10745J527296
10825c583692K303149K705589L408847J938594j813222l453506j171930O78572
10817A012401j009334k733676r66755J331418L50591j084507J694528O085113
$$ plain form
10877 -2674487 -3620198 -3318499 -3957845 -6510183 -8714728 -8389680 -7452032 -9192196 -12386692
10868 -12386692 -12187389 -7103212 -1434950 63909 -2885373 -7051946 -9002572 -7019430
10860 -7019430 -2095881 2530356 4495831 4570189 4328777 3281465 809140 -1186899 -1087499
10851 -1087499 -863596 -2279024 -2084013 3318786 10043011 10370014 3891077 -2066537 -3573359
10842 -3573359 -4019865 -5400943 -4019523 1396272 4812972 1448071 -4632774 -6996031
10834 -6996031 -5981740 -5650911 -5942429 -4241819 -1738671 -1881831 -4200243 -5110988 -3583692
10825 -3583692 -1280543 1425046 4833893 6772487 4959265 1505759 333829 1012401
10817 1012401 3067 -2730609 -3697364 -2365946 -2015355 -3099862 -1405334 4679779
10809D679779N143818j448429o209350m380015K50697K102933J475964J884464
10801C499861K984231J033850m127924p251973m636341N46417K918420K298989
10793b734470K225242K825097R17438k752961k957698J242542L670746P61028
10785C196964k106468N52376M737994L402768j738508l247902m41641J40418l565687
10776I30314n687112k339218K456315L654888K058976R79654N73717r24403l115950
10767a412819l579425j016111K994373M869595K299889k346735l815949q78299
10759b885481J528078k18590k646094j157538K149662K351070M6176o97493M7150
10750a483060m20044q39710J321423K867561o89680n306512k857857M880689P154981
$$ plain form
10809 4679779 9823597 8375168 2165818 -2214197 -1963500 139433 1615397 3499861
10801 3499861 6484092 7517942 3390018 -3861955 -8498296 -7951879 -5033459 -2734470
10793 -2734470 -509228 2315869 3233307 480346 -2477352 -1234810 2435936 3196964
10785 3196964 1090496 1642872 6380866 9783634 8045126 4797224 4355583 4496001 930314
10776 930314 -4756798 -7096016 -4639701 -984813 1074163 2053817 2627534 1703131 -1412819
10767 -1412819 -4992244 -6008355 -3013982 1855613 4155502 1808767 -2007182 -2885481
10759 -2885481 -1357403 -1575993 -4222087 -5379625 -3229963 -878893 -832717 -1530210 -1483060
10750 -1483060 -1903104 -2742814 -1421391 1446170 756490 -4550022 -7407879 -2527190 4627791
10741D627791N63663n778782m354578R47430L164441K042172Q31067K34545n9701
10732B218048M11959m46l752481p671724n087178K933890O673512J963905l122626
10723e433141j061021L733644L193443j410487k683314J146146N195205N952878
10715H633353M090942J056839k177446m221256m476250l817225k433395K25168
10707c119270K364178R87575k577634l375194o05099J053828k51092n76488J856362
10698d242834K968456P78833l07174K095563K842739j968124p119939n781096
10690a0733576K97679M523056M883026L528831J212950j740494k638259l00063
10682i66850J693670N73119q24536L00689J038753j563382l883608j343798L253747
$$ plain form
10741 4627791 5191454 -587328 -4941906 -3994476 -830035 1212137 2043204 2277749 2218048
10732 2218048 2630007 2629561 -1122920 -8794644 -13881822 -10947932 -4274420 -2310515 -5433141
10723 -5433141 -6494162 -2760518 432925 -977562 -3660876 -2514730 2680475 8633353
10715 8633353 12724295 13781134 11603688 7382432 2906182 -911043 -3344438 -3119270
10707 -3119270 -755092 232483 -2345151 -5720345 -6325444 -5271616 -5522708 -6099196 -4242834
10698 -4242834 -1274378 -495545 -802719 1292844 4135583 2167459 -4952480 -10733576
10690 -10733576 -10435897 -5912841 -1029815 2499016 3711966 1971472 -666787 -966850
10682 -966850 726820 1299939 475403 776092 1814845 251463 -3632145 -4975943 -1722196
10673a722196L768090P0818k960871l131157j746905N98924L421828M061978J291363
10664C651872j397952q98531L97646n05582j209908J333098L964334J906449k831076
10655D410350m395712k041578K77744R96708J338276Q56152j136037j852304R24196
10646f22205L359127Q43662l413797k499249K935436N397018K277323r68467l75297
10637F933551J038197m17266l214012l922640k191666R3555J539715J380352m35803
10628H03983j982698o96812K777533M329966J421356l243649m694155j653580
10620b938056K027512K294284j07449j394091q32749j443545l571715k711403
10612h677212K547966N443193K81599p168292o789097P80788N512033L438719
$$ plain form
10673 -1722196 2045894 2116712 -844159 -3975316 -5722221 -5123297 -1701469 2360509 3651872
10664 3651872 2253920 1355389 1753035 1247453 37545 1370643 5334977 7241426 4410350
10655 4410350 14638 -2026940 -1749196 -752488 585788 1441940 305903 -1546401 -622205
10646 -622205 2736922 3580584 166787 -2332462 602974 5999992 8277315 7308848 6933551
10637 6933551 7971748 7554482 4340470 417830 -1773836 -1680281 -140566 1239786 803983
10628 803983 -1178715 -1875527 902006 5231972 6653328 3409679 -1284476 -2938056
10620 -2938056 -910544 1383740 1276291 -117800 -950549 -2394094 -5965809 -8677212
10612 -8677212 -6129246 -686053 -404454 -7572746 -14361843 -13581055 -8069022 -4630303
10604d630303N20901N83840K57958j716427q21468L722719N585408J984264j397785
10595D089107p08927q898k145717k824994N30600K902104P65825j389991J99376
10586A408485J662364l80796k053695j15634J461689o20434k462696p78946P39460
10577a140203q21034j596352J139485L320984K074419O17433J73205k875002o850688
10568e957753l860788N122141P771358K50636n084747o26720L610351q83001n352984
10559e011507r21276M122818K17422m633055L12308P624232M582912l955865m907912
10550b569923J72011P43900k443073j558011J293100n28241l009521P00496M971954
10541b227308J576982l580694j334512K600481q99595m963151P54741Q306149
$$ plain form
10604 -4630303 -4109402 -3525562 -3267604 -4984031 -5805499 -2082780 3502628 5486892 4089107
10595 4089107 3380180 3371282 1225565 -1599429 -1068829 1833275 2599100 1209109 1408485
10586 1408485 3070849 2690053 636358 520724 1982413 1361979 -1100717 -1879663 -1140203
10577 -1140203 -1961237 -3557589 -2418104 902880 2977299 3594732 3767937 892935 -5957753
10568 -5957753 -9818541 -4696400 3074958 3325594 -1759153 -2385873 1224478 341477 -5011507
10559 -5011507 -5932783 -1809965 -1592543 -6225598 -5913290 1710942 6293854 2337989 -2569923
10550 -2569923 -2397912 -1654012 -4097085 -5655096 -4361996 -4890237 -7899758 -7199262 -2227308
10541 -2227308 -650326 -4231020 -5565532 -2965051 -3864646 -8827797 -8073056 233093
10533B33093M290828n056149m798565J678646Q07282m480785j580925N804238
10525c102337M468552k285667j495390L416419j3500p027420m160222L454656
10517f744909J697544l904914P34740P730328O05585j1062420o145635P657514
10509i432167O426414n334441m140486O261828L161085p798906k577296J0328529
10501c105440K714845j4892603p625633J4372363Q710256j7259812j4373251J3130806
10493a8328469R264623k2571871j4685256K6217672l665129j21436184j72727508
10486c17932122m2247148J46932619J84512918O2733256l6696918j7181548L1157233
10479A1278290J6760951j9625848j1496935J5191850P405979j6569162j1632581
$$ plain form
10533 233093 4523921 -532228 -5330793 -3652147 -2844865 -7325650 -8906575 -3102337
10525 -3102337 1366215 -919452 -2414842 1001577 988077 -6039343 -10199565 -6744909
10517 -6744909 -5047365 -8952279 -8217539 -487211 118374 -10944046 -17089681 -9432167
10509 -9432167 -3005753 -8340194 -12480680 -6218852 -3057767 -10856673 -13433969 -3105440
10501 -3105440 -390595 -15283198 -22908831 -8536468 173788 -17086024 -31459275 -18328469
10493 -18328469 -9063846 -31635717 -46320973 -20103301 -23768430 -145204614 -317932122
10486 -317932122 -360179270 -213246651 -28733733 33999523 -2697395 -19878943 11278290
10479 11278290 28039241 8413393 -3083542 12108308 19514287 2945125 -8687456
10472h687456J0107029R877919n787164n620051N974373L929851o895793m639463
10464a740755N752746M345167m625690l408954L895037J130129p444614o022376
10456h119310K512088L847274m41828R10087N053029J977637l768642j366249
10448F04086M688361K866604l534032l267318J694692J348714k974181k804413
10440a377487M66071J1727j475301K314095O857885M133250j752309j564584K349349
10431I962696J220499l849373n171554k976752k901552l708959o27039L434577
10423d617457K438067j041771j91072L761401M279132Q23579k056615k971182
10415D24082k768985j93057M076051M814299N67678k379981p51840j89839l512441
$$ plain form
10472 -8687456 1419573 11297492 5510328 -109723 5864650 9794501 2898708 -1740755
10464 -1740755 4011991 8357158 3731468 322514 4217551 5347680 -2096934 -8119310
10456 -8119310 -5607222 -1759948 -2201776 -1291689 3761340 5738977 1970335 604086
10448 604086 5292447 8159051 4625019 1357701 3052393 4401107 1426926 -1377487
10440 -1377487 -911416 -899689 -2374990 -60895 6796990 10930240 9177931 7613347 9962696
10431 9962696 11183195 7333822 2162268 -814484 -3716036 -7424995 -8052034 -4617457
10423 -4617457 -2179390 -3221161 -3412233 349168 4628300 5451879 3395264 424082
10415 424082 -2344903 -2537960 1538091 6352390 6920068 4540087 3788247 3598408 85967
10406H5967l722297K579057O199175M15823o109843l555090K556408K310110j189098
10397d29788J69770L162398L86013l974253j497812L828007K462057k666621j473324
10388c3553M198713L577130l525350o522159k297562J653163J976256K836204
10380A862842M356181J653311l650917m047254M68015J914330j469460k568416
10372a481368J289151L875969J365414k265979l464887l308854j794357K786725
10364b998186P273415N692138n66625l592473j253434M57004j403706k753913
10356H54220j498258r69472j968517o43327K916315L128810p98949k132213J899000
10347G87609M742842J571491k606788j787183J366329J399235m05665K94968K109085
$$ plain form
10406 85967 -3636330 -1057273 5141902 5557725 -552118 -4107208 -1550800 759310 -429788
10397 -429788 -260018 2902380 3288393 -685860 -2183672 1644335 4106392 1439771 -33553
10388 -33553 4165160 7742290 4216940 -2305219 -4602781 -2949618 -973362 1862842
10380 1862842 6219023 7872334 4221417 174163 642178 2556508 1087048 -1481368
10372 -1481368 -192217 3683752 5049166 2783187 -681700 -3990554 -5784911 -2998186
10364 -2998186 4275229 9967367 9400742 5808269 4554835 5011839 3608133 854220
10356 854220 -644038 -1613510 -3582027 -4225354 -1309039 1819771 1020822 -1111391 787609
10347 787609 5530451 7101942 4495154 2707971 4074300 5473535 5067870 5362838 7471923
10338G471923M04861l826563m748990p34643L330136L369222R72275m39420n35150
10329E263651q79402j223614Q345K118818J961670j577239n166386n105865k208868
10320f808890l3379M06728P85762J286513N32618n02388P19355L116122K708538
10311B210979l96379j291800J601076L485590J019558k494632l185114k380844
10303a431566k297752j235673K221505M825037L421705K90353p50719J4480M08330
10294E465700M32172M86731m53894j703622o01812J775326O31983l604851l758060
10285a330327K187397N882542J558031m123854l044488J378752J529247j031004
10277C006296r8539K820346J814149j889713k514201n05548l18699q30797J416611
$$ plain form
10338 7471923 7876784 4050221 -698769 -1433412 1896724 5265946 6238221 5798801 5263651
10329 5263651 4384249 3160635 3168980 5287798 7249468 5672229 505843 -4600022 -6808890
10320 -6808890 -6842269 -6435541 -5649779 -4363266 -3830648 -4333036 -3613681 -497559 2210979
10311 2210979 1814600 522800 2123876 5609466 6629024 4134392 949278 -1431566
10303 -1431566 -3729318 -4964991 -2743486 2081551 5503256 5793609 5042890 5057370 5465700
10294 5465700 5897872 6384603 5930709 4227087 3625275 5400601 6032584 2427733 -1330327
10285 -1330327 857070 6739612 8297643 4173789 1129301 2508053 4037300 3006296
10277 3006296 2907757 5728103 7542252 5652539 3138338 2632790 2314091 1483294 2899905
10268B899905K944875j126309n454020j260928P183239O809406l362338r633757
10260i99927m314902M179429O019391K877473P60129O5168j062003j397216k88891
10251E838651k94657j940309j935654J81082L20178k155287k075776K083580L978077
10242C999885l54056m993749l128627K067803K576856k051221m522074q56772
10234g261955M334704M580145j59880l944849k562944J254263J943975o25811
10226b442352r99470K740823N050008J771008k431505j354813K470175K082673
10218F886547k578963n556891m788296l091856j134076K219345M147355J347916
10210b548919k070074L07757N272230L821924l237324n337104N90591N113815
$$ plain form
10268 2899905 5844780 4718471 -735549 -1996477 5186762 11996168 8633830 -999927
10260 -999927 -5314829 -1135400 4883991 7761464 8521593 8586761 7524758 6127542 5838651
10251 5838651 5543994 3603685 1668031 1849113 2169291 14004 -2061772 21808 3999885
10242 3999885 3645829 -1347920 -4476547 -2408744 168112 -1883109 -6405183 -7261955
10234 -7261955 -2927251 1652894 1493014 -2451835 -5014779 -3760516 -1816541 -2442352
10226 -2442352 -3441822 -700999 4349009 6120017 3688512 2333699 4803874 6886547
10218 6886547 4307584 -1249307 -6037603 -9129459 -10263535 -8044190 -3896835 -2548919
10210 -2548919 -4618993 -4311236 960994 4782918 1545594 -3791510 -3200919 1912896
10202A912896K234597j534906K32184K854907l20779o035004o430827p07827N277713
10193b517046O931115L563447k736211p187255n683755o50972J560101M94983
10185f225593J693413N379955M407781k789377p133800k770669L199864K327285
10177a911141k027950j795786K274909L575456J277918j04304M66845K92908r23541
10168A125314j532359k069173l021114j644755L065040N908677K464116l014316
10160A281430l580025k41023P07977j644561k525123l04810J728529J848208J716728
10151a012670K022315J801064J652264K760565L622351K328088O49613J116607
10143A4940197J804602p73102n145078o568400l997843m13830K302765L799219
$$ plain form
10202 1912896 4147493 2612587 2844771 5699678 5378899 -656105 -7086932 -7794759 -2517046
10193 -2517046 4414069 7977516 5241305 -1945950 -7629705 -8280677 -6720576 -6225593
10185 -6225593 -4532180 847775 5255556 2466179 -4667621 -7438290 -4238426 -1911141
10177 -1911141 -3939091 -5734877 -3459968 115488 1393406 1289102 1755947 2048855 1125314
10168 1125314 -407045 -2476218 -5497332 -7142087 -4077047 1831630 4295746 1281430
10160 1281430 -2298595 -2539618 -1831641 -3476202 -6001325 -6306135 -4577606 -2729398 -1012670
10151 -1012670 1009645 2810709 4462973 7223538 10845889 13173977 13823590 14940197
10143 14940197 16744799 15971697 10826619 4258219 260376 -153454 2149311 5948530
10135E948530K432545k242556n640340k951726K928619M315325n47170n365721
10127a122494m732535l7986M080651M710886J697941k361354l221753K99097L499605
10118B812058J524824l428379n135754k199978J199378K313787K115065J222817
10110D23818q63671k611042j822717k4818l76330j766072o10401K133358K242336
10101c275539L30836J390344N362280N851180N71219m204763l126841P18655J924840
10092E542211P97291N42816R38385j85419k230934k984426k259902j089958M58345
10083d71591K020477K120288R53275Q65202J794186K10507m347318o108077r72003
10074c935054O058959O785899Q02612m853986n532182l008678m04811J473223
$$ plain form
10135 5948530 8381075 6138519 498179 -2453547 475072 4790397 4243227 -1122494
10127 -1122494 -5855029 -5893015 -1812364 2898522 4596463 2235109 -986644 -687547 2812058
10118 2812058 4336882 908503 -4227251 -6427229 -5227851 -2914064 -798999 423818
10110 423818 -439853 -3050895 -4873612 -4898430 -5274760 -7040832 -7651233 -5517875 -3275539
10101 -3275539 -2944703 -1554359 3807921 9659101 10230320 6025557 2898716 3617371 5542211
10092 5542211 6339502 6882318 7820703 7635284 5404350 2419924 160022 -929936 -471591
10083 -471591 1548886 3669174 4622449 5487651 7281837 7492344 3145026 -2963051 -3935054
10074 -3935054 2123905 8909804 9712416 4858430 -673752 -3682430 -4087241 -2614018
10066b614018K187084Q16639j551602k022060J01955K294383K711332K355842
10058D279555K280384J336802j542721m605458m677705q37227M131100N941965
10050F306695K922242j674106k772031O4473J457971k101510n946158l174568
10042d916992M397048P409682K189498l607339k224046K755592K137453m818476
10034C322420r119109m793944L292503O568241L297569j137507j966504K40898
10026b95433J915611J136374p30798j322638m83668l50741j973994l331958k142904
10017g580149O72304K437953K500074J982272R07580j060216j854744P21780M096815
10008B823669L294930r86679k259772J703429M562502R09493n263426o733448
$$ plain form
10066 -2614018 -426934 389705 -1161897 -3183957 -3082002 -787619 1923713 4279555
10058 4279555 6559939 7896741 6354020 1748562 -2929143 -3766370 364730 6306695
10050 6306695 9228937 7554831 4782800 4847273 6305244 4203734 -1742424 -4916992
10042 -4916992 -519944 6889738 9079236 5471897 3247851 6003443 8140896 3322420
10034 3322420 -5796689 -10590633 -7298130 -729889 2567680 1430173 -536331 -295433
10026 -295433 1620178 2756552 2025754 703116 219448 -131293 -2105287 -5437245 -7580149
10017 -7580149 -6907845 -4469892 -1969818 12454 920034 -140182 -1994926 -1273146 2823669
10008 2823669 6118599 5131920 2872148 4575577 9138079 10047572 4784146 -1949302
10000a949302l367480l34476O27445J502122J777512q77895m344314l336838K295992
9991h007234O379165M697258l65960m345567n288398l169523P26727L183569K124781
9982d065182M47507K164609N229207M106553o68613k629087K0368J710475m20565
9973E895272j862011K74679J565105j427709m491618l353183j187689j817728
9965f404882j829613K538300O320106L055857l083827k822742K881886M042210
9957D697295j829213n384081m06243O466724O028220m84198m593310k582505J306321
9948C219010J918957p92710k821725j220378K300345L272265M30167k159278r99452
9939C147201J297207K29863k897451k843068Q18416K796994O12725j767802o49582
$$ plain form
10000 -1949302 -5316782 -5651258 -5023813 -3521691 -1744179 -2622074 -6966388 -10303226 -8007234
9991 -8007234 -1628069 3069189 2703229 -1642338 -6930736 -10100259 -9373532 -6189963 -4065182
9982 -4065182 -3617675 -1453066 3776141 7882694 7214081 4584994 4605362 6315837 5895272
9973 5895272 4033261 4307940 5873045 4445336 -46282 -3399465 -4587154 -6404882
9965 -6404882 -8234495 -5696195 623911 3679768 595941 -2226801 655085 4697295
9957 4697295 2868082 -2515999 -2922242 3544482 9572702 9088504 4495194 1912689 3219010
9948 3219010 5137967 4345257 1523532 303154 2603499 5875764 6305931 4146653 3147201
9939 3147201 4444408 4674271 1776820 -1066248 -247832 2549162 3161887 1394085 744503
9930G44503K126336L101329K099540N69092j313609l203642l330020j180062J094691
9921G08158J793768J471738K49444l067201p086665o897039l15287P723404J0374081
9912D954401O537375O01169l344204m144644k388788J58462R68593p19938k495590
9903A26836j820697O06174K281706K287331J383596J98508o72874j47412J726771
9894E969939K861175J721457m08402j493052j674520k321877l491782m052394
9886b889456l141450m14373L340033N117081K320586k282296k445651K351949
9878A956423M757859P92022k484599K297880R012999N137948q534920j6412109
9870c476497q998394M525060R717343M793413j546407l844808l363666j673425
$$ plain form
9930 744503 2870839 5972168 8071708 8640800 7327191 4123549 793529 -386533 708158
9921 708158 2501926 3973664 4223108 1155907 -5930758 -12827797 -13143084 -5419680 4954401
9912 4954401 11491776 12092945 8748741 4604097 2215309 2373771 3342364 2622426 126836
9903 126836 -1693861 -1087687 1194019 3481350 4864946 5063454 4390580 4243168 5969939
9894 5969939 8831114 10552571 10144169 8651117 6976597 4654720 1162938 -2889456
9886 -2889456 -6030906 -6445279 -3105246 2011835 4332421 2050125 -395526 1956423
9878 1956423 6714282 7506304 5021705 7319585 16332584 21470532 12935612 -3476497
9870 -3476497 -12474891 -7949831 1767512 6560925 5014518 1169710 -2193956 -3867381
9862c867381R67322K258970o484k948025j913858J677694K198236n23887n24583
9853b681996L817224N872857R34952n777567o342328j087558L180579L141196
9845A057359J501542Q45922L84147q04591j635412j350628r90779j322616j399562
9836c714618j55591K030528L886063M229983K448520p62647l376570m028933l560050
9827c003315l287865k714045p65222J725232L094601L495325L796567K798150
9819E139428r73926n075924m901469l90272L033270J824873j062476j183546J058317
9810b531725K052209N59260j522885k458767j910435l7698K055993K050148p69005
9801b512905l236870j673032K796087N063139K525264j715730l055131q71585
$$ plain form
9862 -3867381 -2900059 -641089 -647573 -3595598 -5509456 -3831762 -1633526 -2157413 -2681996
9853 -2681996 1135228 7008085 7943037 2165470 -4176858 -5264416 -2083837 1057359
9845 1057359 2558901 3404823 3788970 2984379 1348967 -1661 -992440 -2315056 -3714618
9836 -3714618 -3870209 -1839681 2046382 6276365 8724885 7962238 4585668 556735 -3003315
9827 -3003315 -6291180 -9005225 -9770447 -8045215 -4950614 -1455289 2341278 5139428
9819 5139428 4165502 -910422 -5811891 -6202163 -3168893 -1344020 -2406496 -3590042 -2531725
9810 -2531725 -479516 79744 -1443141 -3901908 -5812343 -5850041 -3794048 -1743900 -2512905
9801 -2512905 -5749775 -7422807 -4626720 436419 2961683 1245953 -1809178 -2680763
9793b680763J613220J875884P28770K40583N04274M653j166027p98439J553891
9784A876046K564630k95072l945293l347739Q15228K802541N19277j655586m60637
9775a126605J209978J29326j339628J46410K255084O03302l393336m184618n13608
9766f213695L250472L851867K317880M96182r34439r41543R13144K018111k39499
9757D518480l203721k039233J850976J897318k869880n205631r86401L673336
9749b364756J796428l613270m723952r49435J552615M49107l03823J513637L010949
9740c632500K331154J894702K893093K049557k370687n802549l429582K030689
9732d036123L875727J082296j221974o65630q83486l947718n245103l29360O767434
$$ plain form
9793 -2680763 -1067543 808341 1537111 1777694 2281968 2286621 1120594 322155 1876046
9784 1876046 4440676 4145604 200311 -3147428 -2332200 470341 989618 -665968 -1126605
9775 -1126605 83373 212699 -1126929 -980519 1274565 1877867 -1515469 -5700087 -6213695
9766 -6213695 -2963223 888644 3206524 3702706 2768267 1826724 2739868 4757979 4518480
9757 4518480 1314759 -724474 1126502 3023820 153940 -5051691 -6038092 -2364756
9749 -2364756 -568328 -4181598 -8905550 -9854985 -8302370 -7853263 -8157086 -6643449 -3632500
9740 -3632500 -1301346 593356 3486449 5536006 3165319 -2637230 -6066812 -4036123
9732 -4036123 -160396 921900 -300074 -965704 -1849190 -5796908 -11042011 -11371371 -4603937
9723d603937P736827J365955m723104m355765o8544J883267m5761k273474j791280
9714f875816P72348K813117K357653k72554k178134n95428L083487M156361R47680
9705D208714k500463k450618j006865j836331l199907o59967M626375O463858
9697C644796K887787r89107j067345K54768n04020j838491o18221J952402K211425
9688E933994j09329j983729j903308j026916k54774N76205R13657j59100j822840
9679A63860k243140j339187o17619m68806M9116R23579J188608J178184K050410
9670H85005K830018J083077k454733l258201P61104N138538M165819j276967m803748
9661C069912l033397O08721J410135n37267j737845o03799J116914J278268m08828
$$ plain form
9723 -4603937 3132890 4498845 -224259 -4580024 -4648568 -2765301 -2811062 -5084536 -6875816
9714 -6875816 -6103468 -3290351 -932698 -1205252 -3383386 -3978814 -895327 3261034 4208714
9705 4208714 1708251 -742367 -1749232 -3585563 -6785470 -7445437 -2819062 3644796
9697 3644796 6532583 5543476 4476131 4730899 4226879 2388388 1770167 3722569 5933994
9688 5933994 5824665 3840936 1937628 910712 655938 1232143 2145800 1986700 163860
9679 163860 -2079280 -3418467 -4036086 -4504892 -4455776 -3532197 -2343589 -1165405 885005
9670 885005 3715023 4798100 2343367 -914834 -153730 4984808 9150627 7873660 3069912
9661 3069912 36515 645236 2055371 1518104 -219741 -823540 293374 1571642 1162814
9652A162814k707521l889924k842808m68825O96778k67560q41081J414449M511167
9643c232511M213951K70205k933784k438598q303J666917K508205L053592K374496
9634E474170L86893p73078k16781j43388j575996j799332M95829J415738j953998
9625A310057n167512k482664L356608M739343J099295r64878O95959J033344j692673
9616A926879k049176K034837L838288j003374n808861l152961K584419K359030
9608G29081k460455k861943K116772L804250j247700n629610l535727O86260J435723
9599f963349R96509L156696M553914O73912m183970k252673M504714O050444m69941
9590F066256o157262l769095K266795L942116J330932r5760O52362J28850j769902
$$ plain form
9652 1162814 -1544707 -5434631 -8277439 -8746264 -8049486 -8317046 -9158127 -7743678 -3232511
9643 -3232511 981440 1251645 -1682139 -4120737 -4129040 -2462123 46082 3099674 5474170
9634 5474170 5861063 5087985 4871204 4727816 3151820 1352488 1848317 3264055 1310057
9625 1310057 -3857455 -6340119 -2983511 1755832 2855127 1890249 2586208 3619552 1926879
9616 1926879 -122297 1912540 5750828 4747454 -1061407 -4214368 -1629949 729081
9608 729081 -1731374 -4593317 -2476545 1327705 80005 -5549605 -9085332 -8399072 -6963349
9599 -6963349 -5966840 -2810144 1743770 2417682 -1766288 -4018961 485753 6536197 6066256
9590 6066256 -91006 -3860101 -1593306 2348810 3679742 3583982 4236344 4365194 2595292
9581B595292j311061J842927L298004R86102j874150k463548j963920j513694
9573d04048L37109L330741L580491l23233l713395k730013o42831k021080m407645
9564f993904k466700K198799L044806n04808k022325J305950M564666L716047
9556B842531J438738J223793J663298M30067j155002j482128j997501l236727
9548b72931k115125K303371M816298J345138l613681l096092J582812L145820
9540D095610n4446k106269M26036L410153K244099j380666k924327j532959O2248
9531B239479O4474o51639m77473Q43900J836941P47731k080842l838325k414045
9522c729799Q00812K795807K753100K080032J489365L81628j235314k379198k488863
$$ plain form
9581 2595292 1284231 3127158 6425162 7411264 5537114 3073566 1109646 -404048
9573 -404048 -66939 3263802 6844293 6521060 2807665 77652 -565179 -2586259 -6993904
9564 -6993904 -9460604 -7261805 -4216999 -4721807 -6744132 -5438182 -873516 2842531
9556 2842531 4281269 5505062 7168360 7598427 6443425 4961297 2963796 -272931
9548 -272931 -2388056 -84685 4731613 6076751 2463070 -633022 949790 4095610
9540 4095610 4041164 1934895 2360931 5771084 8015183 6634517 3710190 2177231 2239479
9531 2239479 2303953 1652314 1174841 2018741 3855682 4603413 2522571 -1315754 -3729799
9522 -3729799 -2928987 -133180 2619920 4699952 6189317 6570945 5335631 2956433 467570
9513D67570j526929O73444L451186M722330L331270Q63452q82434k505662m552232
9504D041995m726613j375112K087560J032532k994313l893650k4367L623457L098824
9495H70313L00566j425340j845361j889105j210328m7287n1962j062974l31141
9486f692619K856801N013212L330368j47049j705104q76509R7688l74696k245452
9477g43360m196560l804416K53208N252772O599675L729898M56596j072482k314303
9468D161028l439890k164626O17278K59903l463658m110456J165059N677166L366611
9459B068415j327559j063853K318552J968530j735647k609910L8620J142911j52643
9450F47416L26375K737915K597284j67925o77443J171494j84748n012259o055708
$$ plain form
9513 467570 -1059359 -385915 3065271 7787601 11118871 11982323 11099889 8594227 4041995
9504 4041995 -684618 -2059730 27830 1060362 -1933951 -5827601 -5851968 -2228511 870313
9495 870313 1170879 -254461 -2099822 -3988927 -5199255 -5246542 -5298504 -6361478 -6692619
9486 -6692619 -3835818 1177394 4507762 4360713 2655609 1779100 1876788 1502092 -743360
9477 -743360 -4939920 -8744336 -8491128 -3238356 3361319 7091217 7547813 6475331 4161028
9468 4161028 721138 -1443488 -826210 -566307 -4029965 -8140421 -6975362 -1298196 2068415
9459 2068415 740856 -322997 1995555 3964085 2228438 -381472 -342852 800059 647416
9450 647416 973791 3711706 6308990 6141065 5463622 6635116 6450368 1438109 -4617599
9441d617599p81196L471273J362630k055503o31625L008814L473344J644523P12274
9432E586935p00580m089241n368637j502013K270156L29306k831538L74618O766300
9423H35306O495727n61388m020907M12305M516793J135777n184882o251786j817148
9414d440203K475726L676322K755904P82659j464412k381527j568877r85439j531890
9405b681737r44344K317173N590896N329539J953486j315436k866716l400165
9397C982696l444957k595277p58801J320653K470391J665666p48907k516060j956141
9388b580737p42332j576240l320991k176002J751473L574683J174710j049631
9380d945067P60518L385220J746886k478841l251262K66588K629992J008122o47306
$$ plain form
9441 -4617599 -5398795 -1927522 -564892 -2620395 -3252020 -243206 3230138 4874661 5586935
9432 5586935 4886355 797114 -4571523 -6073536 -3803380 -3474074 -6305612 -5930994 835306
9423 835306 7331033 6769645 2748738 3161043 7677836 8813613 3628731 -2623055 -4440203
9414 -4440203 -1964477 1711845 4467749 5250408 3785996 1404469 -164408 -1149847 -2681737
9405 -2681737 -3626081 -1308908 4281988 9611527 11565013 10249577 7382861 3982696
9397 3982696 537739 -2057538 -2816339 -1495686 974705 2640371 1891464 -624596 -2580737
9388 -2580737 -3323069 -4899309 -8220300 -10396302 -8644829 -5070146 -3895436 -4945067
9380 -4945067 -4184549 -799329 947557 -1531284 -4782546 -4515958 -1885966 -877844 -1525150
9371a525150J408137M312449L022198j799635m819973l862807k136075k103044
9363g503900j605277J452863M239288L002620k27329j74042L032929L639756j92640
9354E664268k925343p58743J912262J17331l030824j956625J365519J049031j855850
9345d18974j173718K834877L279421j252477l856793r33069K270651J191307j300394
9336F40831j876277k474033m097512k671376K994198O359877K945996j789752
9328C1952j568386M23719j281095l348886J66598N496656M263273k056082m242310
9319b114561o02571J340166j280970k362165J487234N128229M119629J072035
9311F787026p48430k270929l506315j290111L660133M646741j091177o622942
$$ plain form
9371 -1525150 -117013 4195436 7217634 5417999 598026 -3264781 -5400856 -7503900
9363 -7503900 -9109177 -7656314 -3417026 -414406 -641735 -815777 2217152 5856908 5664268
9354 5664268 2738925 1980182 3892444 4009775 978951 -977674 387845 1436876 -418974
9345 -418974 -1592692 1242185 4521606 3269129 -587664 -1520733 749918 1941225 640831
9336 640831 -1235446 -3709479 -7806991 -10478367 -7484169 -1124292 1821704 31952
9328 31952 -1536434 -1112715 -2393810 -5742696 -5576098 -79442 4183831 2127749 -2114561
9319 -2114561 -2717132 -1376966 -2657936 -5020101 -3532867 1595362 5714991 6787026
9311 6787026 6038596 3767667 261352 -1028759 2631374 7278115 6186938 -436004
9303d36004m803465J764374N580353M558130K092703M41768o53867j203591j232939
9294F107462j856467k894353k009395R00510J837128j274633m188733k260307
9286e638788K170820L146870j41999k855438j853763R17245K412950K208782J514980
9277A881659R24995J00334j276007k577473k349427j19495K253943K624805J511910
9268B975244Q24033L49274j304022k829660j485066J676468K554586O24835l39771
9259C045921P28785K95672k647537l767553r30019J464828j38796k364063j085225
9250e397987J511466J588982O54231J761499K864468O30360k467491j833387J052430
9241C64571J173291j171351j193353J753023L339151J862504K73246K96807K79492
$$ plain form
9303 -436004 -5239469 -3475095 2105258 6663388 8756091 9197859 8543992 7340401 6107462
9294 6107462 4250995 1356642 -652753 247757 2084885 810252 -3378481 -5638788
9286 -5638788 -3467968 -321098 -463097 -3318535 -5172298 -4255053 -1842103 366679 1881659
9277 1881659 2806654 2906988 1630981 -946492 -3295919 -3415414 -1161471 1463334 2975244
9268 2975244 3799277 4148551 2844529 14869 -1470197 206271 2760857 3385692 3045921
9259 3045921 3774706 4070378 1422841 -2344712 -3274731 -1809903 -1948699 -4312762 -5397987
9250 -5397987 -3886521 -2297539 -1643308 118191 2982659 3613019 1145528 -687859 364571
9241 364571 1537862 366511 -826842 926181 4265332 6127836 6401082 6697889 6977381
9232F977381n81013r53115p42253j180801j509402L8337K222653K156254J64260
9223F592301j023623r97240j150788r50667L84014N00012k088590l087062J439062
9214c82581O388504L818311l602202n449802J7062L362893j5005k979512k84427
9205H73241K085749j687324o081143l389514L105624M636223P16227j812564l35516
9196a888997J457884J239535L68489l94810j412473j554257j48947L31299j640474
9187c642751k669782O7065K719232O62842k768916j287212L086140K760679k318534
9178c391237l856691J423008O670465N839845J687737p95003j884236l543043
9170B150845m071594j345180K495585L829878K203274o39107l221133l695492
$$ plain form
9232 6977381 6396368 5443253 4701000 3520199 2010797 2049134 4271787 6428041 6592301
9223 6592301 5568678 4571438 3420650 2469983 2853997 3354009 1265419 -1821643 -382581
9214 -382581 6005923 9824234 6222032 772230 789292 4152185 4137180 1157668 873241
9205 873241 2958990 1271666 -4809477 -8198991 -5093367 -457144 259083 -1553481 -1888997
9196 -1888997 -431113 808422 1176911 782101 -630372 -2184629 -2333576 -2002277 -3642751
9187 -3642751 -6312533 -6245468 -3526236 -2863394 -5632310 -6919522 -3833382 -1072703 -3391237
9178 -3391237 -7247928 -5824920 845545 6685390 8373127 7578124 5693888 2150845
9170 2150845 -1920749 -3265929 -770344 3059534 5262808 4623701 1402568 -2292924
9162b292924o28215L355818L141555j168365l177685J0074K701146r717l575881
9153a644194j379664L848084M166184o76992l250782p55555J347928n75072k596869
9144a516932q18778J857054J035424j772475j922282J043585L301170K474935
9136C681701j31351k246222k801790j825150j54031J047478J565711K094828K356474
9127C587648J095024j088477j370927R68745K351366k06120m030291m147994m92949
9118c333975K209021J561227L38219J100980J830404m15967l986024m229889m6101
9109d972105M177477M005140L66398k017469p54048J534215J058332k098958m232527
9100b933545k780329Q19466L324773L307988J827823N60721K08974K04388n48485
$$ plain form
9162 -2292924 -2921139 434679 3576234 2407869 -769816 -759742 1941404 1931687 -1644194
9153 -1644194 -3023858 824226 4990410 4313418 1062636 307081 1655009 1079937 -1516932
9144 -1516932 -2335710 -478656 556768 -1215707 -3137989 -2094404 1206766 3681701
9136 3681701 3550350 1304128 -1497662 -3322812 -3476843 -2429365 -863654 1231174 3587648
9127 3587648 4682672 3594195 2223268 3192013 5543379 5337259 1306968 -2841026 -3333975
9118 -3333975 -1124954 436273 774492 1875472 3705876 3289909 -696115 -4926004 -4972105
9109 -4972105 -794628 3210512 3576910 1559441 805393 2339608 3397940 1298982 -2933545
9100 -2933545 -5713874 -4894408 -1569635 1738353 3566176 4126897 4335871 4540259 3991774
9091C991774k078631k543893m07234K461375K141603j790980m594438k423869
9083e244293K115948L556308J140581j010206o90403k12606j415751k223445m01095
9074d384962K340354K827402J059571m27626n69219l57259q2727J133354K798724
9065D337612K612529k53278l178183l029763k36870J776731J103110n01296p14645
9056A915947j43373p58201j850155n53545L111382M875811J863131k908520m461296
9047A091181k479313o40782n39121l02583Q36677Q38729j128568k642190j819452
9038f785422j46115N02588R14643K252301L169198K042402K00394j20732L14163
9029B343420q97791l274746l646789j009671J798089K019460J92003j476426j829177
$$ plain form
9091 3991774 1913143 -630750 -1037984 1423391 3564994 1774014 -2820424 -5244293
9083 -5244293 -3128345 427963 1568544 558338 -132065 -344671 -1760422 -3983867 -4384962
9074 -4384962 -2044608 782794 1842365 1414739 845520 488261 405534 1538888 4337612
9065 4337612 6950141 6696863 3518680 488917 252047 2028778 3131888 2630592 1915947
9056 1915947 1772574 1014373 -835782 -1389327 1722055 6597866 8460997 5552477 1091181
9047 1091181 -1388132 -2028914 -2568035 -2870618 -2033941 -1195212 -2323780 -4965970 -6785422
9038 -6785422 -6931537 -6428949 -5514306 -3262005 -92807 1949595 2149989 2029257 2343420
9029 2343420 1445629 -1829117 -5475906 -6485577 -4687488 -2668028 -2476025 -3952451 -5781628
9020e781628o84678K012543N199108O195722L388596j022633l032624j708539
9012D565867K3676Q3927J80053K016988K879745j040148p423318q713066k050845
9003i477121N776497O654485J373371k668908j960323J7280k26518j271254l32783
8994b115274K136684L604549K942133J080471l62899k88695Q10806J009521m10373
8985H406923j420126n27255j3046k387937n076624l457010J416848L669108J455659
8976B066540r29150p58736l13422p76471M94364L553731L599822o56527l051508
8967C228643K63578L601878R53464l560583k617860J787375K223145j034853j095519
8958C749268K553598K816895k208863n300808k015163K298648J787180r80769
$$ plain form
9020 -5781628 -6466306 -4453763 745345 6941067 10329663 9307030 6274406 4565867
9012 4565867 4589543 4673470 4853523 6870511 9750256 8710108 1286790 -7426276 -9477121
9003 -9477121 -3700624 2953861 4327232 1658324 -301999 -284719 -511237 -1782491 -2115274
8994 -2115274 21410 3625959 6568092 7648563 7285664 6996969 7807775 8817296 8406923
8985 8406923 6986797 6459542 6446496 4058559 -1018065 -4475075 -3058227 610881 2066540
8976 2066540 1137390 378654 65232 -711239 -216875 3336856 6936678 6280151 3228643
8967 3228643 3492221 7094099 8047563 4486980 1869120 3656495 5879640 4844787 3749268
8958 3749268 6302866 9119761 6910898 1610090 -405073 1893575 3680755 2699986
8950B699986p33997J589777J549351j021658k595890k098845j613667k023412
8942d248355j821104m198K381462L445979J963214j498457m244987l744721q52127
8933h623294J160817J224604J464566K785147K816528J64981k428450j963887
8925c398988J87980O83012n13528o87441P31037J476007P60169P82242K611003
8916B631493L490196Q03335l018892l019773R34985L113455j7369m213051l563868
8907b859489N11449J779160n34428q78829K251620K822430k126717n769870j811422
8898f616096M437840L670357k686283m919812n03802L000014J224336o91601J799430
8889a285617M874054L599667K67986l02939R57548k94565m073069n979547l660703
$$ plain form
8950 2699986 1965989 3555766 5105117 4083459 1487569 -611276 -2224943 -4248355
8942 -4248355 -6069459 -6073657 -3692195 -246216 1716998 218541 -4026446 -7771167 -8623294
8933 -8623294 -7462477 -6237873 -4773307 -1988160 828368 993349 -1435101 -3398988
8925 -3398988 -3211008 -2527996 -3041524 -3728965 -2997928 -1521921 -761752 20490 2631493
8916 2631493 6121689 6925024 3906132 886359 1821344 4934799 4917430 704379 -2859489
8907 -2859489 -2348040 -568880 -1103308 -1982137 269483 3091913 965196 -4804674 -6616096
8898 -6616096 -2178256 1492101 -1194182 -6113994 -6617796 -3617782 -2393446 -3085047 -1285617
8889 -1285617 3588437 7188104 7456090 7153151 8110699 7816134 3743065 -2236482 -5897185
8880e897185N36790K851867J708171j304663k837926j239111J248964J670284
8872c262809J005580K104471L649806J477297l518064m971483o81348L480840
8864g15710K606082j88530q4014J532551R44239o74990o7189J525501Q56378q82799
8854D851519l76426J189076K90455j721431m94679K860410K412540k683153n845474
8845D82837k856746K005903K836019K61424j078457K82393J946818J993874M93063
8836F367128j990044m412864m681802j770269K004482L144276J272690p42279
8828h08682q92014p8738L52811Q52388K069780K790888J542588o54554j388176
8819C786291l69030M84094L88017L48529J48135j792188m250148l042258K145758
$$ plain form
8880 -5897185 -5360395 -2508528 -800357 -2105020 -4942946 -6182057 -4933093 -3262809
8872 -3262809 -2257229 -152758 3497048 4974345 1456281 -3515202 -4196550 -715710
8864 -715710 1890372 1701842 1617828 3150379 4094618 3419628 3352439 4877940 5734318 4851519
8854 4851519 4475093 5664169 5954624 4233193 3738514 6598924 9011464 6328311 482837
8845 482837 -2373909 -368006 2468013 2729437 1650980 1933373 3880191 5874065 6367128
8836 6367128 4377084 -35780 -4717582 -6487851 -4483369 -1339093 -66403 -808682
8828 -808682 -1700696 -1779434 -1426623 -574235 1495545 4286433 5829021 5174467 3786291
8819 3786291 3417261 3901355 4289372 4637901 4786036 2993848 -1256300 -4298558 -2152800
8810b152800M922866P43113n163414m492123J710414M556260P29268l422005k559464
8801e127885N85210J859019K178590K878705J105629m138450o695798j316838
8793h671818O518374O806318n07647n256423j653868M397393N060359J210505
8785G903193j064041l38325o66193l845180o050575l549381J633099M402707L354596
8776A779900J791352K209199L081860K336087Q70311K39997l74677j678639j374471
8767H880919J905355L957192p5376p115383q811717l232488K430069K379348p17497
8758c99578j713356l44543P88847R28490L82210j145112k640594j880732N24380
8749e499988J410836Q44607K145982M554348K963538k232401l304595K100976
$$ plain form
8810 -2152800 2770066 3513179 -1650235 -6142358 -4431944 124316 853584 -2568421 -5127885
8801 -5127885 -4542675 -2683656 -505066 2373639 3479268 -659182 -7354980 -8671818
8793 -8671818 -2153444 4652874 4145227 -1111196 -2765064 1632329 6692688 7903193
8785 7903193 6839152 6500827 5834634 1989454 -4061121 -7610502 -5977403 -1574696 1779900
8776 1779900 3571252 5780451 8862311 11198398 12068709 12308706 11934029 10255390 8880919
8767 8880919 10786274 14743466 14668090 7552707 -1259010 -4491498 -2061429 317919 -399578
8758 -399578 -2112934 -2457477 -1668630 -740140 -357930 -1503042 -4143636 -6024368 -5499988
8749 -5499988 -4089152 -3244545 -1098563 3455785 6419323 4186922 882327 2983303
8741B983303N098236o76747p655382n745003J755359M287091R00795p13227J119813
8732A354238O49194k877285l225660J148733L983845K066318j23702O19205J160545
8723D755431p70037j993912k51697J418408L33812j511675j999277k327963k888446
8714e235356j077895L466087O326079M351786R1583k601341l312490k993539j456875
8705b441961M61732L27763j762835k323745L8114K228928J822993M70197O4660
8696a114154k00644p64867q4490J579955J186904j833847l752614k351594j7286
8687g352637J204039K457037L485877J243812l346463l703351K277960O559758
8679B826032K046994n786656o216517J225518O908579N155163J2371k996921l377723
$$ plain form
8741 2983303 8081539 7404792 -250590 -5995593 -4240234 46857 947652 234425 1354238
8732 1354238 2003432 -873853 -4099513 -2950780 1033065 3099383 2975681 3594886 4755431
8723 4755431 3985394 1991482 1739785 3158193 3492005 1980330 -18947 -2346910 -5235356
8714 -5235356 -6313251 -2847164 3478915 7830701 7922284 5320943 2008453 -985086 -2441961
8705 -2441961 -1980229 -1652466 -3415301 -5739046 -5700932 -3472004 -1649011 -1178814 -1114154
8696 -1114154 -1314798 -2079665 -2164155 -584200 602704 -1231143 -4983757 -7335351 -7352637
8687 -7352637 -6148598 -3691561 -205684 1038128 -2308335 -6011686 -3733726 2826032
8679 2826032 4873026 -913630 -7130147 -5904629 1003950 6159113 6171484 3174563 -203160
8670b03160k504450l49918K164471K322242k96631k321418j295906R72419J587273
8661G4922N52286k75774j83346L35344J108352K151191K759026K106010N46725
8652I174736m92873k3668J294634J547230n21866l832889n633355m155681l94461
8643c038193K750386K831393r5003l009973k378482J566878M031622J372445l345032
8634F86041l783401Q99164M780127L616890K65201o10194O81418Q34630n81746
8625F788130j304485q02246n98933q90428l25889J008308J408795M89166k75343
8616E497075j56843o8061o08645j287188j918927k784486l174263j977907k07861
8607f687106m61505k688441l004963R77427N526007M861565o53726m254463j794265
$$ plain form
8670 -203160 -2707610 -3057528 -893057 1429185 1132554 -1188864 -2484770 -1512351 74922
8661 74922 627208 351434 168088 503432 1611784 3762975 6522001 8628011 9174736
8652 9174736 8681863 8658195 9952829 11500059 10978193 7145304 1511949 -2643732 -3038193
8643 -3038193 -287807 2543586 2448583 -561390 -2939872 -1372994 2658628 4031073 686041
8634 686041 -3097360 -2198196 2581931 6198821 6464022 5853828 6535246 7369876 6788130
8625 6788130 5483645 4681399 4082466 3192038 2866149 3874457 5283252 5772418 5497075
8616 5497075 5340232 5272171 4663526 3376338 1457411 -1327075 -4501338 -6479245 -6687106
8607 -6687106 -7148611 -9837052 -12842015 -11864588 -6338581 -1477016 -2130742 -6385205 -8179470
8598h179470K746914L505622J186542P23452K482410J906870j784980l131635
8590e44275O50058M179083J882054l189537m125700m04789K772631L134273K759594
8581G113392K018909j064527n170674n806398k252618J155436J884997J944676
8573a76807K502737J520893j163876j949767N36559K536935J324258l74099M87425
8564E244258K025349J177212r48097j506478q01342q58495j436940r94714K30505
8555B131258J062336J491896J524123R4380k500095l481094j401110J253414J695562
8546A870670O97004M22485Q60288Q58387L71084n09562k187167l325745j316288
8537b258844K742209L502001r61167m929606k690071L125871N693201L517850
$$ plain form
8598 -8179470 -5432556 -1926934 -740392 -16940 2465470 4372340 2587360 -544275
8590 -544275 105783 4284866 6166920 2977383 -1148317 -1553106 1219525 4353798 7113392
8581 7113392 9132301 8067774 2897100 -2909298 -5161916 -4006480 -2121483 -176807
8573 -176807 2325930 3846823 2682947 733180 1269739 3806674 5130932 4756833 5244258
8564 5244258 7269607 8446819 7498722 5992244 5190902 4332407 2895467 1900753 2131258
8555 2131258 3193594 4685490 6209613 6303993 3803898 322804 -1078306 175108 1870670
8546 1870670 2567674 2990159 3850447 4708834 5079918 4570356 2383189 -942556 -2258844
8537 -2258844 483365 3985366 3024199 -1905407 -4595478 -1469607 4223594 7741444
8529G741444L67845k055529n149366p796544n941708Q72087P131571P607302L235008
8520F012110q78227j539108k26755m80469l229127n196517k921838K099502M715012
8511a645417K922149K55029J20144J216819Q77015l20263m39397j37108j227814
8502A621157k986761l109466j282283P72368J815039J680301O10781l60917J28645
8493a111136J636427K106156J126479M39443L65273q22545k686618j936079J939857
8484A057257M556983K902369k61469j228250o12241n00578k40540J243393K312645
8475I229569J313981n74549j903211k904865k827253P1393L688309L000151j462931
8466G630594k869486O76772K143146k165591n155011r55021M259510K718434j464454
$$ plain form
8529 7741444 8109289 6053760 904394 -6892150 -12833858 -11961771 -4830200 2777102 6012110
8520 6012110 5133883 3594775 3368020 2887551 -341576 -5538093 -8459931 -6360429 -1645417
8511 -1645417 1276732 1531761 1651905 2868724 3745739 3425476 2986079 2848971 1621157
8502 1621157 -1365604 -4475070 -5757353 -4984985 -3169946 -1489645 -878864 -1239781 -1111136
8493 -1111136 525291 2631447 3757926 4197369 4562642 3740097 1053479 -882600 1057257
8484 1057257 5614240 8516609 8255140 7026890 6414649 5914071 5673531 6916924 9229569
8475 9229569 10543550 9969001 8065790 5160925 2333672 2405065 6093374 9093525 7630594
8466 7630594 4761108 5437880 7581026 5415435 260424 -694597 3564913 6283347 4818893
8457D818893j87199L836492K441450k781522l645619l43685J0118k355483p03934
8448A089511L927027L186100l034267n161281l42525K835012m26066l579098j127934
8439b633521K685364K986183K019076K297659J194831k166419l184221k46759
8431B952193J256424j504345l409632p87885J992886R25759o44536O39731J597756
8422C018351m22520j449726J432348L429658J59058m088618l435717J63337J666178
8413D72349J414744J836312J282934j644165l062878m24237J305949k180186n620676
8404f619854k113814M708592N781677N60527l327094k209893M13495J391945R94451
8395d19968m53725k434278k214389J245306L806887K244826J56926J375300K140185
$$ plain form
8457 4818893 4631694 8468186 10909636 8128114 4482495 4138810 4148928 1793445 1089511
8448 1089511 5016538 8202638 5168371 7090 -335435 2499577 2073511 -1505587 -2633521
8439 -2633521 51843 3038026 5057102 7354761 8549592 6383173 3198952 2952193
8431 2952193 4208617 2704272 -705360 -1493245 499641 1425400 780864 1420595 3018351
8422 3018351 2595831 1146105 2578453 6008111 6167169 2078551 -1357166 -1193829 472349
8413 472349 1887093 3723405 5006339 3362174 299296 -124941 1181008 -999178 -6619854
8404 -6619854 -8733668 -4025076 1756601 2317128 -1009966 -3219859 -2806364 -1414419 -419968
8395 -419968 -873693 -3307971 -5522360 -4277054 -470167 1774659 1931585 3306885 5447070
8386E447070k032771o348009l588609K678641L127690j317071r70664N311711
8378B307988P340291N43574o463676n780322j092315R74883J179546K769848L758611
8369E538428J153487k492231l108866j572612r54854j237204j318906k182937
8361f175695l591357j933696L770813P898052N566821J75134k037320j322396
8353B350356j881375l124479j151445K589939K384367j634603k555175J950557
8345a071858N012973J442592l490094k277591K766987L364398j392283m124733
8337B30391j714219L97k853360m579398O71952P790315P203437m12269m672348
8328A664898n91178N096951M678367o59413n025526n985040m456478j175392K463296
$$ plain form
8386 5447070 3414299 -2933710 -6522319 -3843678 -715988 -2033059 -3003723 2307988
8378 2307988 9648279 10191853 3728177 -2052145 -3144460 -2169577 -990031 1779817 5538428
8369 5538428 6691915 4199684 1090818 -481794 -1436648 -2673852 -3992758 -6175695
8361 -6175695 -9767052 -11700748 -7929935 -31883 5534938 5710072 3672752 2350356
8353 2350356 468981 -2655498 -3806943 -1217004 1167363 -467240 -3022415 -1071858
8345 -1071858 3941115 5383707 1893613 -383978 2383009 5747407 4355124 230391
8337 230391 -1483828 -1483431 -4336791 -8916189 -8244237 -453922 6749515 6337246 1664898
8328 1664898 1073720 6170671 10849038 10189625 5164099 -820941 -5277419 -6452811 -3989515
8319c989515L707494K419384K281345M568955M812664o7059n414181n008786l49396
8310B960905K043571K11451k265897l133749l296989k763080n29568J838933J782960
8301c151463N75644J481869L515367K524428j415345l362520j138468J703677
8293G33189J930616Q11671M67265L15537p18931j836925k118919k023367j862659
8284d302523j105922J55073J247439K302712L211572K237471j034697k856638
8276a45513k206L903907K504136l160582n258765r72480L184716J517584k736263
8267a165466l455798n77807J811016K444432K851810K805427O49333k797460m474928
8258a909441l063039l52087J073026J33409j957332k370472M79251M151015M328516
$$ plain form
8319 -3989515 -282021 2137363 4418708 8987663 13800327 13733268 8319087 3310301 2960905
8310 2960905 5004476 5215927 2950030 -183719 -3480708 -6243788 -6773356 -4934423 -3151463
8301 -3151463 -2575819 -1093950 2421417 4945845 3530500 167980 -970488 733189
8293 733189 2663805 3475476 3942741 4258278 3539347 1702422 -416497 -2439864 -4302523
8284 -4302523 -5408445 -5253372 -4005933 -1703221 1508351 3745822 2711125 -145513
8276 -145513 -147719 3756188 6260324 3099742 -2159023 -3131503 53213 1570797 -1165466
8267 -1165466 -4621264 -5199071 -3388055 -943623 1908187 4713614 5362947 2565487 -1909441
8258 -1909441 -4972480 -5324567 -4251541 -4118132 -6075464 -8445936 -7966685 -3815670 512846
8249E12846O08955k332675p88847L105781M416276J560366k493516m125159k638317
8240b174290l08990N13741K65525J178581L023765K371873j810182m870719k623482
8231d434178J917087L032762J177257R64468K071632J31337l651804k865679K545126
8222H88008M447688l21290m166002j262689K819790R27790l901778m749724k570410
8213g888617k341886k395402K126631Q164640P775000J389433k171935L40152
8205D998016K330094o86635l882850k030382J755748J604101j860636l398960
8197a171504j276533J365017J730521J67223j570416k128021r47575J322394K989250
8188D80356K854607J250561p53305k330297k866814k017968k05405J575342K429690
$$ plain form
8249 512846 1121801 -1210874 -1999721 1106060 5522336 7082702 4589186 464027 -2174290
8240 -2174290 -2483280 -1969539 -1704014 -525433 2498332 4870205 3060023 -1810696 -4434178
8231 -4434178 -2517091 515671 1692928 2657396 4729028 4860365 1208561 -1657118 888008
8222 888008 5335696 5014406 848404 -414285 2405505 3333295 -568483 -5318207 -7888617
8213 -7888617 -10230503 -12625905 -10499274 -2334634 5440366 6829799 4657864 4998016
8205 4998016 7328110 6641475 2758625 728243 2483991 4088092 2227456 -1171504
8197 -1171504 -2448037 -1083020 647501 814724 -755692 -2883713 -3831288 -2508894 480356
8188 480356 3334963 4585524 3832219 1501922 -1364892 -3382860 -3588265 -2012923 416767
8179D16767J673000q20679l483416l637930q41631J695505J150258p68692m46215
8170e063033J879903K389032m19134l567751m105964k688471j291589P3705K362128
8161a0431174M737208M953716K333310r11272j839339q7815J563817O09069j745150
8152h17630k211378l61544P09688m99660j317257M49719K398098J395864r04905
8143a159005n57503K210657L412701J494311j119720k394685k481142j284676
8135a879062J371828K946734L17422m344830m779631M35385M957099L431391j261099
8126A195237l189973j933761j199932j601533m16666K285123K787025l7881k192594
8117d304955m39543K610377K202762j726236m572897l316046J31823K234676K081384
$$ plain form
8179 416767 2089767 1269088 -2214328 -5852258 -6693889 -4998384 -3848126 -4616818 -5063033
8170 -5063033 -3183130 -794098 -1213232 -4780983 -8886947 -11575418 -12867007 -12793302 -10431174
8161 -10431174 -5693966 -740250 1593060 681788 -1157551 -1245366 318451 927520 -817630
8152 -817630 -3029008 -3390552 -2680864 -3180524 -4497781 -4048062 -1649964 -254100 -1159005
8143 -1159005 -1716508 494149 3906850 5401161 4281441 1886756 -594386 -1879062
8135 -1879062 -507234 2439500 2756922 -1587908 -6367539 -5932154 -975055 2456336 1195237
8126 1195237 -1994736 -3928497 -5128429 -6729962 -7146628 -4861505 -2074480 -2112361 -4304955
8117 -4304955 -4744498 -2134121 68641 -1657595 -6230492 -9546538 -9414715 -7180039 -5098655
8108e098655J144073O11245O47098J149050J469471K84009k307026l428907p55087
8099f284729L325844M060252J031540j114529L13219K207356J018791j681999
8091B875745k226619n78919O37277P21012P55740N74393l82400o75449P85984
8082B486764J506340j090686m168440k641210K581194N097931K468208m54395
8074E785706M40757K389580R62307k584199l288967K53601M257679M677260J322540
8065A4216264k693683m158337k562715k63826M29821j59006m67375n88804j560053
8056B192286k585267j944505l64074j98028j180027n38564K151830L908283L043128
8047D485062J298586J51555j231037k838094k550667j97141Q12199j407997l686483
$$ plain form
8108 -5098655 -3954582 -3343337 -2696239 -1547189 -77718 206291 -2100735 -5529642 -6284729
8099 -6284729 -2958885 1101367 2132907 1018378 1331597 3538953 4557744 2875745
8091 2875745 649126 70207 707484 1428496 2184236 2758629 2376229 1700780 2486764
8082 2486764 3993104 2902418 -1266022 -3907232 -1326038 3771893 6240101 5785706
8074 5785706 6226463 8616043 9578350 6994151 3705184 3958785 8216464 12893724 14216264
8065 14216264 11522581 7364244 4801529 4537703 4967524 4808518 4341143 3752339 2192286
8056 2192286 -392981 -2337486 -2701560 -2899588 -4079615 -4618179 -2466349 1441934 4485062
8047 4485062 5783648 5935203 4704166 1866072 -684595 -881736 -69537 -1477534 -5164017
8038e164017k335887J437744L663452L001418J226150P8975L4701O72549N72395
8029C187480j278920k893569j066923K923416L486570r71871m444003j900841
8021b958661K810220K948671o45565j595483J287452K440053r22448m171395k312138
8012c119294L070108O542371N313923P87415l853093n582397l082532J595566
8004A672067M094811K072375k178045m382475k955871k22993O57286p58714k055668
7995d057227j234928P23270J502487Q50519M25541O20754K59355k21458J385035
7986B53348M657198N392371J289163m009872n413230k722532K95657J122947n6594
7977H08456k165343l610759k650007k4521Q47217j124652k269826J69682L226070
$$ plain form
8038 -5164017 -7499904 -6062160 -2398708 602710 1828860 1907835 1942536 2615085 3187480
8029 3187480 1908560 -985009 -2051932 871484 4358054 3386183 -1057820 -2958661
8021 -2958661 -148441 2800230 2154665 559182 1846634 4286687 3364239 -807156 -3119294
8012 -3119294 -49186 6493185 11807108 12594523 8741430 3159033 76501 1672067
8004 1672067 5766878 7839253 5661208 1278733 -1677138 -1900131 -1242845 -2001559 -4057227
7995 -4057227 -5292155 -4568885 -3066398 -2215879 -1790338 -1169584 -910229 -1131687 253348
7986 253348 4910546 10302917 11592080 7582208 2168978 -553554 -257897 865050 808456
7977 808456 -1356887 -4967646 -7617653 -7642174 -6794957 -7919609 -10189435 -10019753 -6793683
7968f793683L126306J619986K211145L199748Q83624k552994j655060K758204
7960B797276M183113P21754k624800k837763k524662k898561q00171M074148O088206
7951F178540K170376k584531k518470O49842K363887K648476L305241K140624
7943A4353985l204949q516133p215931l13729M295635K621839j038829j543026
7935e61138L55658R61220l26596r44026M67078K180596J936128M5531r35939K97062
7925C475574J643386K05442l477901n733001m310974n83674K957428M957490M589801
7916C723571J612915j932816k882582j114887O8316j023395j967491l80573K294346
7907a602596L119141J403468j474327l652334l203819J05467K804988J275132
$$ plain form
7968 -6793683 -3667377 -2047391 163754 3363502 4247126 1694132 39072 2797276
7960 2797276 6980389 7702143 5077343 2239580 -285082 -3183643 -3983814 90334 6178540
7951 6178540 8348916 5764385 3245915 3895757 6259644 8908120 12213361 14353985
7943 14353985 11149036 2632903 -4583028 -4896757 -601122 2020717 981888 -561138
7935 -561138 -205480 755740 429144 -514882 -47804 2132792 4068920 4114451 3178512 3475574
7925 3475574 5118960 5324402 1846501 -3886500 -8197474 -8781148 -5823720 -866230 3723571
7916 3723571 5336486 3403670 521088 -593799 -525483 -1548878 -3516369 -3896942 -1602596
7907 -1602596 1516545 2920013 1445686 -2206648 -5410467 -5305000 -2500012 -1224880
7899a224880k059618j175183L722026N289447O57017l326542j081811K714198
7891C514654J617222j788402j723102o6054j717241l616233N25733P130929O295790
7882A0173296j940504o661793k865651K184825K318256J086438K331064K348209
7874H974140j984409n620706l209706J838720L124225Q27957r60609j677108k677357
7865a364853k546633k49953J029239q06923j810410J357780M180266J037583m519342
$$ plain form
7899 -1224880 -3284498 -4459681 -737655 4551792 5208809 1882267 800456 3514654
7891 3514654 5131876 3343474 1620372 1554318 -162923 -3779156 -3253423 3877506 10173296
7882 10173296 8232792 1570999 -1294652 890173 3208429 4294867 6625931 8974140
7874 8974140 6989731 1369025 -1840681 -1961 3122264 3950221 2989612 1312504 -1364853
7865 -1364853 -3911486 -4161439 -3132200 -3939123 -5749533 -4391753 -211487 826096 -3693246
$$ [...]
##END NTUPLES=NMR SPECTRUM
##END=
