##TITLE=31Pdec_LR-747-V1-M2
 CDCl3, 24 sc
 18.3.2022
##JCAMPDX= 6.0         $$ Bruker NMR JCAMP-DX V2.0
##DATA TYPE= NMR SPECTRUM
##DATA CLASS= NTUPLES
##ORIGIN= UXNMR, Bruker Analytische Messtechnik GmbH
##OWNER= root
$$ XWIN-NMR		Version 3.5
$$ Fri Mar 18 13:38:45 2022 Russian Standard Time (UT+4h)  she@DPX200
##.OBSERVE FREQUENCY= 81.013821
##.OBSERVE NUCLEUS= ^31P
##.ACQUISITION MODE= SIMULTANEOUS
##.ACQUISITION SCHEME= undefined
##.AVERAGES= 24
##.DIGITISER RES= 16
##SPECTROMETER/DATA SYSTEM= spect
##.PULSE SEQUENCE= zgpg30
##.SOLVENT NAME= CDCl3
##.SHIFT REFERENCE= (INTERNAL, CDCl3, 0, 248.564)
##AUDIT TRAIL= $$ (NUMBER, WHEN, WHO, WHERE, WHAT)
$$ ##TITLE= Audit trail, XWIN-NMR		Version 3.5
$$ ##JCAMPDX= 5.01
$$ ##ORIGIN= Bruker BioSpin GmbH
$$ ##OWNER= she
$$ F:/spectra/data/she/nmr/P31/1/pdata/1/auditp.txt
$$ ##AUDIT TRAIL=  $$ (NUMBER, WHEN, WHO, WHERE, WHAT)
(   1,<2022-03-18 13:37:27.89 +0400>,<she>,<DPX200>,
      <created by zg, POWCHK disabled, PULCHK disabled
       configuration hash MD5:
       00 E9 B6 7A A2 85 ED C7 34 08 36 98 17 FE 4E 26
       data hash MD5: 32K
       D9 A9 21 31 2C 53 9B 41 34 48 F1 4A DB EB 79 66>)
(   2,<2022-03-18 13:37:31.34 +0400>,<she>,<DPX200>,
      <Start of raw data processing
       efp BC_mod = 2 LB = 1 FT_mod = 6 PKNL = 1 PHC0 = -9154.188 PHC1 = 54.2756 SI = 64K 
       data hash MD5: 64K
       18 43 ED EA A2 74 92 E9 B6 9F 36 D6 CB 26 7D D5>)
(   3,<2022-03-18 13:37:45.98 +0400>,<she>,<DPX200>,
      <pk PHC0 = -0.4751886 PHC1 = 0 
       data hash MD5: 64K
       F3 04 12 0A D8 9A 88 B9 B7 D6 4C FB DD 0B B3 7C>)
(   4,<2022-03-18 13:37:50.10 +0400>,<she>,<DPX200>,
      <abs ABSG = 5 
       data hash MD5: 64K
       87 DF 25 D0 A7 D5 9E 19 E1 F2 FE BB A3 99 0B B5>)
(   5,<2022-03-18 13:38:09.35 +0400>,<she>,<DPX200>,
      <pk PHC0 = 4.092096 PHC1 = -12 
       data hash MD5: 64K
       BF F1 D1 F0 AA 03 CD 3D D4 42 77 2B 74 21 D9 F7>)
$$ ##END=
$$ 
$$ hash MD5
$$ 25 80 37 A8 7E 86 35 9C 8F 0E 01 79 BA A5 C0 3F
##$RELAX= 
##$RELAX= 
##$RELAX= 
##$RELAX= 
##$RELAX= 
##$RELAX= 
##$RELAX= 
##$RELAX= 
$$ Bruker specific parameters
$$ --------------------------
##$DU= <F:/spectra>
##$EXPNO= 1
##$NAME= <P31>
##$PROCNO= 1
##$TYPE= <nmr>
##$USER= <she>
##$AMP= (0..31)
100 100 100 100 100 100 100 100 100 100 100 100 100 100 100 100 100 100 
100 100 100 100 100 100 100 100 100 100 100 100 100 100 
##$AQSEQ= 0
##$AQ_mod= 1
##$AUNM= <au_zg>
##$AUTOPOS= <>
##$BF1= 81.014009
##$BF2= 200.13
##$BF3= 200.13
##$BF4= 200.13
##$BF5= 200.13
##$BF6= 200.13
##$BF7= 200.13
##$BF8= 200.13
##$BYTORDA= 1
##$CFDGTYP= 0
##$CFRGTYP= 5
##$CHEMSTR= <none>
##$CNST= (0..31)
1 1 145 1 1 1 1 1 1 1 1 1 1 1 1 1 1 1 1 1 1 1 1 1 1 1 1 1 1 1 1 1 
##$CPDPRG= <waltz16>
##$CPDPRG1= <>
##$CPDPRG2= <waltz16>
##$CPDPRG3= <>
##$CPDPRG4= <mlev>
##$CPDPRG5= <mlev>
##$CPDPRG6= <mlev>
##$CPDPRG7= <mlev>
##$CPDPRG8= <mlev>
##$CPDPRGB= <>
##$CPDPRGT= <>
##$D= (0..31)
0 1 0 0 0 0 0 0 0 0 0 0.03 2e-05 3e-06 0 0 0 0 0 0 0 0 0 0 0 0 0 0 0 0 
$$ [...]
##$SUBNAM3= <"">
##$SUBNAM4= <"">
##$SUBNAM5= <"">
##$SUBNAM6= <"">
##$SUBNAM7= <"">
##$SUBNAM8= <"">
##$SUBNAM9= <"">
##$SW= 501.771253377433
##$SWIBOX= (0..15)
0 1 3 0 0 0 0 0 0 0 0 0 0 0 0 0 
##$SW_h= 40650.406504065
##$TD= 32768
##$TD0= 1
##$TE= 0
##$TE2= 300
##$TE3= 300
##$TEG= 300
##$TL= (0..7)
0 120 53 12 22 120 120 120 
##$TP= (0..7)
150 150 150 150 150 150 150 150 
##$TP07= 0
##$TPNAME0= <>
##$TPNAME1= <>
##$TPNAME2= <>
##$TPNAME3= <>
##$TPNAME4= <>
##$TPNAME5= <>
##$TPNAME6= <>
##$TPNAME7= <>
##$TPOAL= (0..7)
0.5 0.5 0.5 0.5 0.5 0.5 0.5 0.5 
##$TPOFFS= (0..7)
0 0 0 0 0 0 0 0 
##$TUNHIN= 0
##$TUNHOUT= 0
##$TUNXOUT= 0
##$USERA1= <user>
##$USERA2= <user>
##$USERA3= <user>
##$USERA4= <user>
##$USERA5= <user>
##$V9= 5
##$VALIST= <valist>
##$VCLIST= <CCCCCCCCCCCCCCC>
##$VD= 0
##$VDLIST= <DDDDDDDDDDDDDDD>
##$VPLIST= <PPPPPPPPPPPPPPP>
##$VTLIST= <TTTTTTTTTTTTTTT>
##$WBST= 1024
##$WBSW= 4
##$XGAIN= (0..3)
0 0 0 0 
##$XL= 0
##$YL= 0
##$YMAX_a= 7535
##$YMIN_a= -8891
##$ZGOPTNS= <>
##$ZL1= 120
##$ZL2= 120
##$ZL3= 120
##$ZL4= 120
##$ABSF1= 248.5645
##$ABSF2= -253.2056
##$ABSG= 5
##$ABSL= 3
##$ALPHA= 0
##$AQORDER= 0
##$ASSFAC= 0
##$ASSFACI= 0
##$ASSFACX= 0
##$ASSWID= 0
##$AUNMP= <proc_1d>
##$AZFE= 0.1
##$AZFW= 0.5
##$BCFW= 0
##$BC_mod= 2
##$BYTORDP= 0
##$COROFFS= 0
##$CY= -3
##$DATMOD= 1
##$DC= 0
##$DFILT= <>
##$DTYPP= 0
##$F1P= 0
##$F2P= 0
##$FCOR= 1
##$FTSIZE= 65536
##$FT_mod= 6
##$GAMMA= 0
##$GB= 0
##$INTBC= 1
##$INTSCL= 5.30512e-09
##$ISEN= 30
##$LB= 1
##$LEV0= 0
##$LPBIN= 0
##$MAXI= 10000
##$MC2= 0
##$MEAN= 0
##$ME_mod= 0
##$MI= 50
##$NCOEF= 0
##$NC_proc= -7
##$NLEV= 6
##$NOISF1= 182.463
##$NOISF2= 159.3651
##$NSP= 0
##$NTH_PI= 0
##$NZP= 0
##$OFFSET= 248.5645
##$PC= 4
##$PHC0= -9150.572
##$PHC1= 42.2756
##$PH_mod= 1
##$PKNL= yes
##$PPARMOD= 0
##$PSCAL= 0
##$PSIGN= 0
##$REVERSE= no
##$SF= 81.014009
##$SI= 65536
##$SIGF1= 159.3651
##$SIGF2= -187.1042
##$SINO= 113.3802
##$SIOLD= 16384
##$SREGLST= <1H.CDCl3>
##$SSB= 0
##$STSI= 65536
##$STSR= 0
##$SW_p= 40650.406504065
##$SYMM= 0
##$S_DEV= 0
##$TDeff= 32768
##$TDoff= 0
##$TI= <>
##$TILT= no
##$TM1= 0
##$TM2= 0
##$TOPLEV= 0
##$USERP1= <user>
##$USERP2= <user>
##$USERP3= <user>
##$USERP4= <user>
##$USERP5= <user>
##$WDW= 1
##$XDIM= 65536
##$YMAX_p= 329071831
##$YMIN_p= -58913355
$$ End of Bruker specific parameters
$$ ---------------------------------
##NTUPLES= NMR SPECTRUM
##VAR_NAME=  FREQUENCY,     SPECTRUM/REAL,   SPECTRUM/IMAG
##SYMBOL=    X,             R,               I
##VAR_TYPE=  INDEPENDENT,   DEPENDENT,       DEPENDENT
##VAR_FORM=  AFFN,          ASDF,            ASDF
##VAR_DIM=   65536,         65536,           65536
##UNITS=     HZ,            ARBITRARY UNITS, ARBITRARY UNITS
##FACTOR=    0.620285442955139, 1,           1
##FIRST=     20137.2065510759, 0,            0
##LAST=      -20513.1999529892, 0,           0
##MIN=       -20513.1999529892, -58913355,   0
##MAX=       20137.2065510759, 329071831,    0
$$ Real data points
##PAGE= N=1
##DATA TABLE= (X++(R..R)), XYDATA
$$ [...]
39329I71226k21353j781715j728360n38437M03151M20171L5287L36333J441763
39320f61934J838092M78479r61478j29203J931464J752971j083912k915089j679797
39311a430407n2797p57777k097851j126157J372605K405480J406054J24651o88742
39302h44941j409006j481220k28619J117103R22635q4891j26448M57092N2321
39293a625974j027192j058505l7767N69203P03210J383142J933922Q08150r09703
39284G38486l52282K260699L148198N76032k324253k171351j6082Q80044j21187
39275B618304r80581n78843N6748j75766r14253j014037R0677J661536K059962
39266B823747M71477j694330k200920r07627K01015J61002J36271O32622J65690
$$ y = [971226, 749873, -1031842, -2760202, -3298639, -2895488, -2475317, -2440030, -2103697, -661934, 1176158, 1654637, 693159, 563956, 2495420, 4248391, 3164479, 249390, -1430407, -1483204, -2240981, -4338832, -5464989, -4092384, -1686904, -280850, -156199, -844941, -2253947, -3735167, -3963786, -2846683, -1924048, -2008939, -2135387, -1678295, -1625974, -2653166, -3711671, -3749438, -3180235, -2477025, -1093883, 840039, 1648189, 738486, 386204, 2646903, 5795101, 6371133, 4046880, 1875529, 1859447, 2739491, 2618304, 1637723, 1058880, 1115628, 939862, 25609, -988428, -897751, 763785, 2823747, 3295224, 1600894, -600026, -1507653, -1306638, -1145636, -1009365, -376743, -211053]
39257b11053j586141j892074R62156L786148K392982j756344l130775l08398K026760
39248B83261N01986k040256j667091M70671Q33840l98439l09235J212750J469806
39239C57293N7511m10189R02753J590837L93966o71963j46678K88990q67721j942020
39229d47221q59600J326576K150827J226838j82088j444206k293025j879938k05442
39220b607279J010037P98524N11735J019705P11737j190852j994001L15466K700433
39211A275505J218137k304294k798837j15440R81246r79463j890684N50937K746506
39202a316387J242426j679225j937905J95658J510807J059756N09614P78201J217809
39193A580754J207916M57427j219205k802743k257374M76139K401233J336299
$$ y = [-211053, -1797194, -3689268, -2727112, 1059036, 3452018, 1695674, -1435101, -1743499, 283261, 785247, -1255009, -2922100, -2451429, -1617589, -2016028, -2325263, -1112513, 357293, 414804, 4615, 907368, 2498205, 2892171, 2220208, 2073530, 2362520, 1494799, -447221, -1306821, 19755, 2170582, 3397420, 3215332, 1771126, -521899, -2401837, -2607279, -1597242, -798718, -286983, 732722, 1444459, 253607, -1740394, -1424928, 1275505, 2493642, 189348, -2609489, -2724929, -1743683, -2723146, -4613830, -4062893, -1316387, -73961, -1753186, -3691091, -3495433, -1984626, -924870, -415256, 362945, 1580754, 2788670, 3246097, 2026892, -775851, -3033225, -2557086, -155853, 1180446]
39185A180446q67959j193762J39325P42151J73025K4084N98205M76358o04701
39176F67172j078490k40661N10911j14673j428380j926805j263518k93313K26042
39167d941715L53717N91108J127012J574947J519716J089416O02055n2237r70835
39158H93184j487584r02839K01299O06416L39673M82725J100630J084332L31208
39149B649044J72639R59436J099962m42686k294121k526408j151893L16056P78663
39140d39308J97419o90383p19684N63426J790331J168040p90623j680788o67885
39131a269455N38816P21650Q13342J554768J856158Q54915m77032j140536j497517
39122A955109j586029l52820J859577K449459K01740k311252k173417j51581R15442
$$ y = [1180446, 312487, -881275, -741950, 201, 173226, 197310, 795515, 1271873, 667172, -411318, -651979, -141068, -255741, -1684121, -3610926, -4874444, -5167757, -4941715, -4587998, -3996890, -2869878, -1294931, 224785, 1314201, 1916256, 1864019, 893184, -594400, -1497239, -1295940, -689524, -349851, 132874, 1233504, 2317836, 2649044, 2821683, 3781119, 4881081, 4438395, 2144274, -382134, -1534027, -1217971, -439308, -241889, -932272, -1651956, -1088530, 701801, 1869841, 1079218, -601570, -1269455, -730639, -8989, 804353, 2359121, 4215279, 5070194, 4593162, 3452626, 1955109, 369080, 16260, 1875837, 4325296, 4527036, 2215784, 42367, -109214, 806228]
39113H06228J22935j248275k006038j594883J37681J929668J598962o49555j506340
39104b409617P30846L043614J989431j049810k136594o31039O57721J22701j084345
39095g67092j562700j022685K83243J337222O67938j100783q80342K190675M068835
39086C214311J309355l035584l464610k77931J367395j59468j118682O33808K261195
39077G29789J173904r11179j382102o29220k23824m3261N52557Q72530K19574
39068C58768n77496n01117J24830M91646M16233p0938r37739j552741j172974
39059c421528j18454Q07691J638950K434610K042735j65080k255183k035487n06346
39050a578092q9685m39236M44959J836182J260276n87920o10951R40831N97735
$$ y = [806228, 929163, -319112, -2325150, -3920033, -3782352, -1852684, -253722, -903277, -2409617, -1678771, 1364843, 3354274, 2304464, 167870, -463169, 194552, 317253, -767092, -2329792, -3352477, -3069234, -1732012, -1064074, -2164857, -3045199, -854524, 3214311, 4523666, 1488082, -1976528, -2254459, -887064, -1046532, -2165214, -1531406, 729789, 1903693, 992514, -389588, -1018808, -1242632, -1285893, -733336, 139194, 358768, -218728, -719845, -595015, -103369, 312864, 241926, -695813, -2248554, -3421528, -3539982, -2732291, -1093341, 1341269, 3384004, 3218924, 963741, -1071746, -1578092, -1667777, -2107013, -1662054, 174128, 1434404, 846484, 235533, 1176364, 1774099]
39041A774099j766435k009963J029503K930385R26279j510200p50862J081201
39033A704007M30284j497653j466450J1681K86351m77503m27044o2252p95049
39024b293628j271154M52263K552268J793750q54211j545258J55031R55647k87724
39015c43016j023014M7182P73914l61973j616644j101052L30601R74277Q16045
39006a503680P16820Q59026J179222J825248K333708J760881J83390j301576k228618
38997C824421k799524k411745l82207J764259J422794j000933j901973L90548
38989a094360K961786K562704J04865j368796j221174j014437j138039o29077
38981h36528K38906J14037o60656j84913J563716K066812J69889j711747j058466
$$ y = [1774099, 7664, -2002299, -972796, 1957589, 2883868, 1373668, 622806, 1704007, 2134291, 636638, -829812, -818131, -531780, -1009283, -1436327, -1498579, -2293628, -3564782, -3112519, -560251, 1233499, 379288, -1165970, -1010939, -55292, -343016, -1366030, -1318848, -544934, -906907, -2523551, -3624603, -3294002, -2319725, -1503680, -786860, 72166, 1251388, 3076636, 5410344, 7171225, 7354615, 6053039, 3824421, 1024897, -1386848, -1769055, -4796, 1417998, 417065, -1484908, -1094360, 1867426, 4430130, 4534995, 3166199, 1945025, 930588, -207451, -836528, -597622, -483585, -1144241, -1329154, 234562, 2301374, 2471263, 759516, -298950]
38972b98950R43010J332170q5110p68538L54979J412338P72604o53737j287701
38963A721065j068774n70283K49899J005121M01727j427765j936934J84643K113527
38954F72226P06328k131724j791043J778812L587949J168280j820679j528157
38946F41992N39404Q85227k84946m12653N76772O72399k51767n48091j88787n98105
38936A031445j457315j054973K20434J40775j237706j131458J305052L058056
38928H74310J597377j466578k900619j922439Q4577K047567L312416K768746J96873
38919D592230k300439k321216k93242J127853N51117q27886j316905o66405K98716
38910a156177Q43400P53987K94414n5885j60691l36281n96887l87045L64367P27424
$$ y = [-298950, 644060, 1976230, 1891120, 1122582, 1477561, 2889899, 3662503, 3008766, 1721065, 652291, 82008, 331907, 1337028, 1738755, 310990, -1625944, -1441301, 672226, 1378554, -753170, -2544213, -765401, 2822548, 3990828, 2170149, 641992, 1181396, 2066623, 1781677, 1369024, 1945796, 2618195, 2366428, 1818337, 1629550, 1031445, -425870, -1480843, -1260409, -1119634, -2357340, -3488798, -2183746, 874310, 2471687, 1005109, -1895510, -3817949, -3733372, -1685805, 1626611, 4395357, 4592230, 2291791, -29425, -322667, 805186, 1356303, 528417, -788488, -1454893, -1156177, -312777, 441210, 735624, 679739, 519048, 182767, -414120, -801165, -436798, 290626]
38900B90626K32273k1059R22676J800963O62006j799554k603785n95736J840044
38891G28454K071164M54096r10446j113521o56729L1919O62875N51551l86020
38882A433343q51158M8477J023265M29472q64465o57004R28510J471537R2332
38873C054309j264619j032937j52317r785l90733o40413q74409q08469N37442
38864a581931K500877K358184p58468l578298k828894L9399J151828m9958o57903
38855c405164O96812K112412J927173Q57821j14240j253848k372635k015349J75023
38846c391995K094238J765947O7296n75907N68300J839153J393372o75275k366850
38837G18279j799104N78314K163625J211616r51076j775878q72579K2400k1064
$$ y = [290626, 522899, 501840, 1424516, 3225479, 3887485, 2087931, -515854, -1111590, 728454, 2799618, 3253714, 2343268, 1229747, 573018, 604937, 1267812, 1819363, 1433343, 582185, 630662, 1653927, 2083399, 1218934, 561930, 1490440, 2961977, 3054309, 1789690, 756753, 604436, 594651, 203918, -436495, -1310904, -2119373, -1581931, 918946, 3277130, 2518662, -1059636, -3888530, -3849131, -2697303, -2747261, -3405164, -2708352, -595940, 1331233, 2189054, 2074814, 820966, -1551669, -3567018, -3391995, -1297757, 468190, 535486, -40421, 527879, 2367032, 3760404, 3085129, 718279, -1080825, -502511, 1661114, 2872730, 1921654, 145776, -726803, -704403, -725467]
38828g25467j88300R5255K51571L2224J16834O43112P11959j4606o10726l63111
38818e1255K79329O62781O58286J83597p66813j481536j221293n35635m93325
38809b765864q25257n02935K00785K85862K56262J233713K109103P07231j987715
38800a288815k293044N74661K914714K046018o9661p00881m74394j013016j441672
38791a746090l87777Q82738N79608k38495L57205J399757O07648j421256j992931
38782a959593o54504M49618K93586Q0582N48711P67788J9851j094240j716125
38773c264326j458006k39454J292896J740230P16325j94517K95663J110541P63603
38764G62955n3K27698O09607n34060k330791k335491m56657J003411J064560R81821
$$ y = [-725467, -913767, -818512, -566941, -534717, -417883, 225229, 937188, 922582, 311856, -51255, 228074, 890855, 1549141, 1732738, 965925, -515611, -1736904, -2272539, -2765864, -3591121, -4094056, -3893271, -3607409, -3351147, -2117434, -8331, 698900, -1288815, -3581859, -3007198, -92484, 1953534, 1883873, 1182992, 708598, -304418, -1746090, -2133867, -1251129, -671521, -910016, -552811, 846946, 1454594, 33338, -1959593, -2614097, -2164479, -1870893, -1790311, -1241600, -473812, -453961, -1548201, -3264326, -4722332, -4961786, -3668890, -1928660, -1212335, -1406852, -1111189, -648, 762955, 762902, 990600, 1600207, 1066147, -1264644, -3600135, -4056792, -3053381, -1988821, -1007000]
38754a007000J369511J203131J32443o65791n22584j20961P8706L69750N53458
38745A390663J5852q56319j101874q70488q60084n45791Q58922K225739J838394
38736B095014M46510K08229R87705Q41799r2458J60185J167240J50046k878459
38727C085811m176942k013281N92071Q74586K83651Q57021J204129n74108k786658
38718b653720k600390n59356P93769J133201J737428K066073O34193j452601j448848
38709b350251O46341J858142O54967j184925j590934o79894L71467R38618Q58978
38700d77491L11882J06226P29726J217191M85124n88938l61887O43827M07494
38691B473154r76509j110124O10340J509475k74245k587513k246048M02922K187314
$$ y = [-1007000, 362511, 1565642, 1698085, 1032294, 509710, 388749, 467455, 837205, 1390663, 1406515, 550196, -551678, -1422166, -2282250, -2828041, -1969119, 256620, 2095014, 2541524, 2749753, 3737458, 4579257, 4486799, 4646984, 5814224, 5964270, 3085811, -1091131, -3104412, -2512341, -1637755, -1354104, -497083, 707046, 132938, -2653720, -5254110, -5813466, -5019697, -3886496, -2149068, -82995, 551198, -901403, -2350251, -1703910, 154232, 809199, -375726, -1966660, -2646554, -2275087, -1336469, -477491, -165609, -59383, 670343, 1887534, 2372658, 1783720, 1421833, 2065660, 2473154, 1496645, 386521, 996861, 2506336, 2232091, -355422, -2601470, -2198548, -11234]
38682a1234J503832j80905r74799p62043l90715o3989O42166J652721J947500
38673C362534N68273j820397k899670j151316J796792K632532N22089j715458
38665A295379j445706L65670J062840K58991k33068K84051N07085l67107j319281
38656D08854j189229j20172J084605J689381R82508r25740k226805j271952N78511
38647i90039L89178j647738j985331N97206K508915R40465j275677o867L374305
38638A904417L942389P37169k279682k534091j597125j111120k93826J184215
38630d7654J653694M95069n03065m35189p56884j897127j859609j89951L15945
38621c224771j513277k310882M40739L497586K602397o09686j402007K92458L97682
$$ y = [-11234, 1492598, 1311693, 336894, -425149, -815864, -879853, -237687, 1415034, 3362534, 3930807, 2110410, -789260, -1940576, -143784, 2488748, 3010837, 1295379, -150327, 215343, 1278183, 1537174, 1304106, 1588157, 2095242, 1728135, 408854, -780375, -900547, 184058, 1873439, 2855947, 1930207, -296598, -1568550, -990039, -600861, -2248599, -4233930, -3636724, -1127809, -187344, -1463021, -1469888, 1904417, 5846806, 6583975, 4304293, 1770202, 173077, -938043, -1231869, -47654, 1606040, 2101109, 1598044, 1162855, 405971, -1491156, -3350765, -3540716, -3224771, -4738048, -7048930, -6608191, -3110605, -508208, -1117894, -2519901, -2227443, -1829761]
38612a829761j782334k304593M60940K835973J658716j041108j585110J81543
38604c405734J674044J401951n1924j384719j393180K54217K046708J864210o3833
38595I41740j137012j01572J155621O14047r83816j633430q71753L42133J201361
38586d72681J200650J0858j517435j522439L59074J931262J328812l27868q65764
38577A24469m26229p25810j700344j426438M64148J659805M36376j691552k033573
38568e319148m12888Q86800N99390J57789J224975K869662K646321O0987k581412
38559A32476l050853j595669J12254J199601J737635J587320M65726j064266j734909
38550b210685q49648R98410K367116K034399J80193j411457j165138K25506P48998
$$ y = [-1829761, -3612095, -5916688, -5455748, -2619775, -961059, -2002167, -3587277, -3405734, -1731690, -329739, -381663, -1766382, -3159562, -2905345, -858637, 1005573, 941740, -195272, -296844, 858777, 1472824, 489008, -1144422, -2016175, -1674042, -472681, 727969, 738827, -778608, -2301047, -1941973, -10711, 1318101, 990233, 124469, -301760, -1027570, -2727914, -4154352, -3690204, -2030399, -1594023, -3285575, -5319148, -5732036, -4845236, -4245846, -4088057, -2863082, 6580, 2652901, 2713888, 132476, -2918377, -4514046, -4401792, -3202191, -1464556, 122764, 588490, -475776, -2210685, -3060333, -2061923, 305193, 2339592, 2519785, 1108328, -56810, 168696, 917694]
38541I17694J02852o5286O78932N69968j017423j808854k07532J683958J220566
38532B074875n35213p63718L89800M50449q75074j333267j34448Q85151M66657
38523F25212l68097k99392O51107J658667J689047M6288k094727j986686P58935
38514F80354K386262J16560k984708k295638R90203J850731k83964j135488N30504
38505a45184R30582j503719l040425j207490J057364Q31599j45307L73779Q56860
38496a991941l63937j173925N05054K365442J350815j183006j965732r82350k88333
38487c727913n117O70851O77985q32211j708186K3397K184785J638647m62491
38478a540253q18459L85374N02845l18645K88973J892836J636932n42366j655800
$$ y = [917694, 1020546, 955260, 1634192, 2204160, 1186737, -622117, -829649, 854309, 2074875, 1539662, 775944, 1165744, 1616193, 741119, -592148, -726596, 158555, 625212, 257115, -42277, 608830, 2267497, 3956544, 4002832, 1908105, -78581, 680354, 3066616, 3183176, 198468, -2097170, -1106967, 743764, 459800, -675688, -145184, 785398, -718321, -3758746, -4966236, -3908872, -3077273, -3222580, -2848801, -1991941, -2355878, -3529803, -3024749, -659307, 691508, -491498, -2457230, -3439580, -3727913, -3733030, -3062179, -2384194, -3216405, -4924591, -4901194, -2716409, -1077762, -1540253, -2358712, -1973338, -1470493, -1789138, -1500165, 392671, 2029603, 1487237, -168563]
38469a68563q32521l94674j188139j033200J020749K578949J597184o56037j786221
38460h62473j226887O3878J007672Q06719m31274j209123l62480R60544Q77476
38451c75948k00136l85709L59581L90765l91432l38935P91485J269790L79595
38442A499056n75380p26074p31398r31051o28928K64338Q38041P66872N06824
38433B82300m6526j150101j729088n44686J370584J813091P39525N1914L48072
38424A135085N59153N29206R88243J124801n78530l018249l349417j439160N2351
38415c996517L35433J277720K825882K096469j266896l149375r85858J992321
38407h70821J670097q63520j664324p4726J194563P78729j7231j00576N4521r2090
$$ y = [-168563, -1001084, -1395758, -2583897, -3617097, -2596348, -17399, 1579785, 923748, -862473, -2089360, -2025482, -1017810, -211091, -642365, -1851488, -2213968, -1253424, -375948, -576084, -961793, -602212, -211447, -602879, -941814, -150329, 1119461, 1499056, 923676, 197602, -533796, -1464847, -2093775, -1829437, -991396, -224524, 282300, 235774, -914327, -2643415, -3188101, -1817517, -4426, 735099, 787013, 1135085, 1694238, 2223444, 3211687, 4336488, 3757958, 739709, -2609708, -4048868, -3996517, -3661084, -2383364, 442518, 2538987, 1272091, -1877284, -2863142, -870821, 799276, -64244, -1728568, -1803294, -608731, 169998, 152767, 52191, 106712, 14622]
38397A4622l75035o77444r74539p76719L05572J670800K246933J607163J53811
38388C195164j217633j515782o72271r9273q85243j692050m34491K068970K746484
38379A493875R38234n57405m0214O04446m47848j806164j490001j55219O09585
38370h50711R44713J341874Q07507j068196k248833j126991O20920P62256J38585
38361f78876N58463J013007m18843k419193k159262k24675K99780p96357o84848
38352e510804J136951J733943J1745j071190N50695K475730J700688p30600j732015
38343a434857q17203J18754L32491O96546J240235Q93874k34904n89148K89125
38334D94913P80563l07155j650111j148248R80927K328848J493780k02335p47126
$$ y = [14622, -360413, -1037857, -2012396, -2789115, -2483543, -812743, 1434190, 3041353, 3195164, 1977531, 461749, -210522, -309795, -1195038, -2887088, -3321579, -1252609, 1493875, 2432109, 1874704, 1834490, 2438936, 1991088, 184924, -1305077, -1460296, -850711, 94002, 1435876, 2243383, 1175187, -1073646, -2200637, -1579717, -817461, -678876, -120413, 892594, 473751, -1945442, -4104704, -4329379, -4029599, -4825956, -5510804, -4373853, -2639910, -2628165, -3699355, -3148660, -672930, 1027758, 297158, -1434857, -2252060, -2133306, -1800815, -1104269, 135966, 1029840, 794936, 205788, 494913, 1275476, 968321, -681790, -1830038, -849111, 1479737, 2973517, 2771182, 2024056]
38325B024056o9202M10626Q9375m10352q52922j711162k602081k128548j08519
38316e358729J553510J397755N26631P59937J742942J629202m168j721420k411674
38307a886014k183145j178954O91188K530936K663672Q26814j053862j123148
38299g12513K09585J086785N66397n87884j116346o10693K68966N54711o1247
38290d02239r16319j082285l43386O24888R31052K22894r86624j614691r98061
38281d564771K22899P16684K37292N9817J033173J981734J168636j029425k244669
38272b418630j105766J024663J860888R48376j90927l03739J40837K8570n54849
38263e70577m36846O82820J402054M72525j211703j600512j80549J509931J995931
$$ y = [2024056, 1954854, 2365480, 2454855, 2044503, 1191581, -519581, -3121662, -5250210, -5358729, -3805219, -2407464, -1880833, -1120896, 622046, 2251248, 2247080, 525660, -1886014, -4069159, -5248113, -4556925, -2025989, 637683, 1464497, 410635, -712513, -502928, 583857, 1150254, 562370, -553976, -1164669, -895703, -340992, -402239, -1318558, -2400843, -2744229, -2119341, -1188289, -965395, -1952019, -3566710, -4564771, -4341872, -3625188, -3387896, -3328079, -2294906, -313172, 855464, -173961, -2418630, -3524396, -2499733, -638845, 309531, 118604, -185135, -44298, -15728, -570577, -1007423, -324603, 1077451, 1549976, 338273, -1262239, -1442788, 67143, 2063074]
38254B063074J253664m7379j267519j545083m10626Q93281M20023j490916k172005
38245b303486n94999Q12392l1093j466496r46870O31356O57852l98383K58256
38236c381471K489047K768888j13186k619675j569518J337365K452989J300801
38228B665240P9117k94205p22347j332701j128313j63209K39480l08759p34464
38219a700161m93721l53697p10988p29065J44715J136232J394168J148199Q52224
38210F87906K90645n25730o27881N17230J651487J164084n23535j416906o90426
38201E26874L59359K48132r66041k109791k025337j74762K674193M231697K705389
38192E469713m98636j850934l32620J014906k94312k165603j173805J718675K327647
$$ y = [2063074, 3316738, 3269359, 2001840, 456757, 46131, 939412, 1359435, -131481, -2303486, -2898485, -2086093, -2117186, -3583682, -4530552, -3899196, -3241344, -3639727, -3381471, -892424, 1876464, 1763278, -856397, -2425915, -1088550, 1364439, 2665240, 2744357, 2450152, 1727805, 395104, -733209, -896418, -656938, -965697, -1700161, -2193882, -2547579, -3258567, -3987632, -3842917, -2706685, -1312517, -164318, 687906, 978551, 452821, -175060, 342170, 1993657, 3157741, 2634206, 1217300, 526874, 886233, 1134365, 168324, -1941467, -3966804, -4141566, -1467373, 2764324, 5469713, 4971077, 3120143, 2787523, 3802429, 3508117, 1342514, 168709, 1887384, 4215031]
38183D215031k17324k083127q46414Q24547j61407k168469j712686N61883P99857
38174g88109j755133l344422j386067J764052K515286J058873L14031J271021
38166c50468K002666J083738l21844n16602J68226J04747j035987j713415o72888
38157a251827J202742J786621K19048j990810k551251q70092J333816J980682
38149a41071R25235j12853J18091Q64609P06148k32972n72711r706J19780q99517
38139G65033j757627j021062O57958J546742J243893O63213K54827j59068k25069
38130A968840M87159J056651J13033j731420k242604p22519J019437J376338Q09871
38121B134786L20855j08909o13158p05371m88934r17136j753715j153949J267145
$$ y = [4215031, 3997707, 1914580, 1068166, 1892713, 1731306, -437163, -2149849, -1587966, -788109, -2543242, -5887664, -7273731, -5509679, -2994393, -1935520, -1621489, -350468, 1652198, 2735936, 2414092, 1897490, 2065716, 2170463, 1134476, -578939, -1251827, -49085, 1737536, 1956584, -34226, -2585477, -3455569, -2121753, -141071, 784164, 671311, 789402, 1654011, 2360159, 2127187, 1554476, 1544770, 1664550, 765033, -992594, -2013656, -1355698, 191044, 1434937, 2098150, 2352977, 2193909, 1968840, 2455999, 3512650, 3625683, 1894263, -348341, -1070860, -51423, 1324915, 2134786, 2455641, 2346732, 1733574, 1028203, 539269, -377867, -2131582, -3285531, -2018386]
38112b018386K870505J462069j314357k338020j395287n80018l42097P54787K527387
38103c73417K588925N3729k702251l175039j720142j74077Q79031J917609K623362
38094h2270J938720j48766k061506k202907o34484J041606J397809O17580k1757
38085a55975J6435m6377p20794j077458j38141J277277J447622K26388p62723
38076F6254m68555L51848N59369J36274k77260m42865m67172k87574J52535N13955
38066a63191L18170m67297j272033j341738m21811Q71134J588090J467684J016882
38057A595890M95248l72177j277507j018405P00510K075179J256020r06291j771374
38048G77093m75531J012724P19660q73575j866871j414578l65082O4793l15447
$$ y = [-2018386, 852119, 2314188, 999831, -1338189, -2733476, -3313494, -3655591, -2900804, -373417, 2215508, 2269237, -433014, -3608053, -5328195, -5502272, -4623241, -2705632, -82270, 1856450, 1707684, -353822, -2556729, -3191213, -2149607, -751798, -134218, -155975, -139540, -185917, -906711, -1984169, -2122310, -845033, 602589, 828977, 66254, -402301, -50453, 508916, 645190, 367930, -74935, -542107, -829681, -677146, -163191, 154979, -312318, -1584351, -2926089, -3347900, -2476766, -888676, 579008, 1595890, 2091138, 1718961, 441454, -576951, 123559, 2198738, 3454758, 2548467, 777093, 301562, 1314286, 2033946, 1160371, -706500, -2121078, -2486160, -2421367, -2736814]
38039b736814m86523N46947K121336K095697m46962l207605k885665N54737L443960
38030a000892K847732J3625j676566j059614L9258n3234o34718q5593J535409
38021g4593K434028J450850m46553j459018j136492n37412n17205q09096q75423
38012a970914p08331m60087j52410j02736o59955j116648j68628J789607K295009
38003a255093O8122k638901k699145k03882K027648K353078J561236N92675n63094
37994g57356j479562j154800N6353M39321l24645m48670Q09908J421858k08206
37985a645799k088457j160732J948237L421452J582921q01387n78207J421705
37977B099733J885944j28428k043060j616379J2976L04544r24013j445222O885
$$ y = [-2736814, -3223337, -2676390, -555054, 1540643, 1093681, -2113924, -4999589, -4444852, -1000892, 1846840, 1860465, 183899, -875715, -836457, -889691, -1524409, -1610002, -74593, 2359435, 3810285, 3363732, 1904714, 768222, 230810, -286395, -1095491, -1970914, -2679245, -3139332, -3291742, -3394478, -4054433, -5171081, -5339709, -3550102, -1255093, -1186971, -3825872, -6525017, -6728899, -4701251, -2348173, -786937, -194262, -757356, -2236918, -3391718, -3335365, -2896044, -3220689, -3669359, -2859451, -1437593, -1645799, -3734256, -4894988, -2946751, 474701, 2057622, 1256235, 678028, 2099733, 3985677, 3857249, 1814189, 197810, 210786, 515330, -408683, -1853905, -1847020]
37968a847020J999769K374707O93728j720943l104940k242201O18373L280588
37960E2061L305527R06502j103851r36714J19847J57746o63791j287051j764391
37951a214115k197739j392129J052374K751932J421580j288755j821440J18289
37943b570003J580300J209261O78520J078406J219166K74288q78826j780237k958950
37934b148075l580319j685097J999979L711042J848139m89824k63251J119908
37926E12502Q12400o09206n10028J231672K249139J445003k0986r99936j333478
37917B777082j018316l24506j98654q61515q67842O35088J804423M96561k100061
37908C42260k744056o60488J644979K012864Q25972n37642j367950j395909o29126
$$ y = [-1847020, 152749, 2527456, 3221184, 1500241, -1604699, -3846900, -3228527, 52061, 3357588, 4264090, 3160239, 2223525, 2343372, 2501118, 1837327, 550276, -1214115, -3411854, -4803983, -3751609, -999677, 421903, -866852, -2688292, -2570003, -989703, 219558, 898078, 1976484, 3195650, 3469938, 2591112, 810875, -2148075, -5728394, -7413491, -5413512, -1702470, 145669, -344155, -607406, 512502, 1324902, 715696, 205668, 1437340, 3686479, 5131482, 5110496, 4110560, 2777082, 1758766, 1434260, 1235606, 374091, -493751, 141337, 1945760, 2442321, 342260, -2401796, -3062284, -1417305, 595559, 1421531, 883889, -484061, -1879970, -2509096]
37899b509096K24135M65545N03043R61659J161185J74718j072023q62705L71138
37890e82401N22409o59124j013989M52288J910435J706712P85072O28183O86050
37881D435635k70805j590938j588543k87272N38659p3171j142873j325267n31112
37872a835687L39212O14624M64372N02522R21924J164542P35971J35675K51130
37863C294285Q26718N62388q63919j962463j458548k38734n7155q56902q75630
37854a629960N57212J804374J142272q60098k122454j617519j84300R05920J158663
37845h45890O46864l30884j027795o19152O28679J350893R00107L10927N55260
37836A569009Q11826p9380j239213q91677L75260J9572k190182k981326k99880
$$ y = [-2509096, -2284961, -1819416, -1316373, -354714, 806471, 981189, -90834, -953539, -582401, -59992, -719116, -1733105, -1280817, 629618, 2336330, 3121402, 3749585, 4435635, 4164830, 2573892, 985349, 698077, 1236736, 1163565, 20692, -1304575, -1835687, -1496475, -881851, -417479, 85043, 1006967, 2171509, 2907480, 3043155, 3294285, 4121003, 4683391, 3819472, 1857009, 398461, 159727, 102572, -754330, -1629960, -1072748, 731626, 1873898, 1013800, -1108654, -2726173, -2910473, -2004553, -845890, -199026, -529910, -1557705, -2176857, -1548178, -197285, 702822, 1013749, 1569009, 2380835, 2301455, 1062242, 170565, 545825, 565397, -1624785, -4606111, -4905991]
37827d905991L019182K861201k61506j965335l58142J499654M26787k204073k604058
37818d492281M9016K654937K443936K64845j105677o75414R5758n426j78126O84764
37808b63668J715322J129467p57870j480301Q4082J909983J670575n0192j005031
37799B952367o94572n12020r34490p97050L06388R20192J1528j138488o98338
37790e84483R05359J437601j6048j675646j348459P07405K128562J540619K52271
37781C347181J96958J014810O18556j436061k910013k010652k6419O25113q3815
37772f64342j07443J263464K315494J529758l97623j830222k189258j845120j023994
37763b949286J59657J129479J246947O44864O8520l8448J11003J36438M830j5803
$$ y = [-4905991, -1886809, 974392, 712886, -1252449, -1610591, -110937, 315850, -1888223, -4492281, -4443265, -1788328, 655608, 920453, -185224, -860638, -764880, -770306, -948432, -263668, 1451654, 2581121, 1823251, 342950, 427032, 2337015, 4007590, 3957398, 2952367, 2257795, 1745775, 811285, 14235, 320623, 1240815, 1252343, 113855, -584483, 320876, 1758477, 1742429, 66783, -1281676, -574271, 1554291, 3094910, 3347181, 3544139, 4558949, 5177505, 3741444, 831431, -1179221, -1205640, -580527, -664342, -771785, 491679, 2807173, 4336931, 3939308, 2109086, -80172, -1925292, -2949286, -2789629, -1660150, -413203, 231661, 300181, 261733, 372736, 509174, 514004, 498201]
37753D98201J82405K49071k35129r86692j045541K2513J299635J517737O86068
37744B188268k5990K5723K77689J72046R2027M16545L88500r21474k648672k470848
37734b506186L14741K990737K216931j430766l505703j229435K608577L202095
37726B660991J96624k075722q79311J414756J413263m00230j264690p73665q04286
37717e12270j561018r70510J494902L181040J777793j388032l088610k054841
37709c121546K60755J950332K290514J493455J42807r02839q80726J27147J081897
37700B441796R75138l5841p07475j73975Q08496O25723j033715k456178j887681
37691a443712K56890J895699J723938M13962n63700o56136n78589j211242k260630
$$ y = [498201, 680606, 929677, 694548, -292144, -1337685, -1315172, -15537, 1502200, 2188268, 2162278, 2188001, 2465690, 2637736, 2729763, 3146308, 3534808, 2613334, -35338, -2506186, -2191445, 799292, 3016223, 1585457, -1920246, -3149681, -541104, 2660991, 2857615, 781893, -97418, 1317338, 2730601, 2330371, 1065681, 292016, -512270, -2073288, -3043798, -1548896, 1632144, 3409937, 2021905, -1066705, -3121546, -2860791, -910459, 1380055, 2873510, 3016317, 2113478, 1232752, 1359899, 2441796, 3416934, 3381093, 2673618, 2499643, 3308139, 3933862, 2900147, 443969, -1443712, -1186822, 708877, 2432815, 2846777, 2283077, 1626941, 1048352, -162890, -2423520]
37682b423520k272818n10060J446189J237519q31354j569622P58722L509042L076800
37673B420898J34182j241321M74554K078262M81017k710420l524483j200331J016302
37664b071340N91176r79223o68315J617296K933462J532794p40240j299189m61654
37655D54767k99064q29271j08885J840588K300654K44938j424176j51463K127906
37646D155994J885585o69130k279388j653573n80403l99143m12532K6534M94252
37637E68196Q36111J237078R39817p27293k206975j363490P77777J123421m00410
37628G84232n10029J751951K925656O95290k084338j798293L92864Q59883o93550
37619B323666j466974n52983J4654p76119j126775M51543K486829K407085m3410
$$ y = [-2423520, -4696338, -5206398, -3760209, -2522690, -3354044, -4923666, -4164944, -655902, 2420898, 2555080, 1313759, 1788313, 3866575, 4347592, 1637172, -1887311, -3087642, -2071340, -1480164, -2459387, -3127702, -1510406, 1423056, 2955850, 2215610, 916421, 454767, 155703, -673568, -782453, 1058135, 3358789, 3603727, 2179551, 2028088, 4155994, 6041579, 5372449, 3093061, 1439488, 859085, 459942, 47410, 73944, 568196, 1404307, 2641385, 3581202, 2853909, 646934, -716556, 61221, 1184642, 784232, 274203, 2026154, 4951810, 5647100, 3562762, 1764469, 2157333, 3017216, 2323666, 856692, 303709, 318363, -457756, -1584531, -1132988, 1353841, 3760926, 3717516]
37610C717516k469073k727738j401050q14104j700905k010710k4226K547963K702885
37601b179442P41275j36747J028451J518771k93111k103476j603236k11679k12767
37592c451961p26505K64389J818054J463018m95010j488147p75854J20020M92712
37583b779284Q87678R29050j41798j049964J02626K061463J560079j363952k837601
37574b631703r71301J363901J322471L58602J162311K888395K614294J68479j631526
37565D643923j215814o5507P3637l67826j12796N89556L50705r54094j560528
37556A381256k55454J442335R41570j677406l322682k031075L25042R71668K52965
37547a971781M06477J424578J122624q00506j836323n70139J137343J141596K5372
$$ y = [3717516, 1248443, -1479295, -2880345, -3694449, -5395354, -7406064, -7430290, -4882327, -2179442, -1438167, -1574914, -546463, 972308, 679197, -1424279, -3027515, -3239194, -3451961, -4178466, -3914077, -2096023, -633005, -1128015, -2616162, -3392016, -3271996, -2779284, -1891606, -962556, -1104354, -2154318, -2051692, 9771, 1569850, 205898, -2631703, -3603004, -2239103, -916632, -558030, 604281, 3492676, 6106970, 6275449, 4643923, 3428109, 3362602, 3436239, 3068413, 2955617, 3545173, 3895878, 2941784, 1381256, 1125802, 2568137, 3509707, 1832301, -1490381, -3521456, -3196414, -2224746, -1971781, -1565304, -140726, 981898, 181392, -1654931, -2225070, -1087727, 53869, 79241]
37538G9241l82611K10925Q12875Q63194L25537p83608j751327j299749L96802
37529a528721J193919l6680j304626l15712J773898J836709n25597k365021j719391
37520b991222j43708M4631q96009j040757J75768J510355J987123J883567J612047
37511B141795R52598j03545p44469l72569L54167M05408o6510p7734M34269M55504
37501C378914k64734n62707K16978Q68101P3086j376629j546643j12910J235198
37492A908654J018367n56901k217882k662582j212675J384902K975159K048042
37484B685084l00812j610119j034739J85517Q74144Q77164Q7458j490864k529188
37475b256355j342544J324304K481398P64642j675850k177162p64850P76072J404141
$$ y = [79241, -303370, -92445, 720430, 1583624, 1909161, 1125553, -625774, -1925523, -1528721, -334802, -371482, -1676108, -1991820, -217922, 1618787, 1093190, -1271831, -2991222, -3134930, -3090299, -3986308, -5027065, -4851297, -3340942, -1353819, 529748, 2141795, 3094393, 2990848, 2246379, 1873810, 2227977, 2633385, 2566875, 2489141, 2923410, 3378914, 3114180, 2551473, 2768451, 3636552, 3709638, 2333009, 786366, 673456, 1908654, 2927021, 2370120, 152238, -2510344, -3723019, -2338117, 637042, 2685084, 2384272, 774153, -260586, -75069, 799075, 1676239, 1763697, 272833, -2256355, -3598899, -2274595, 206803, 971445, -704405, -2881567, -3646417, -2870345, -1466204]
37466a466204J076327m9989j240260j219671O9768R04673K35601n92324j2642
37457b294721J207231J329913M15458k29166m72095j118027j784641j171932N94953
37448c523027J753347J266910k570o60232k04885R19861J752410J432694J74373
37439B908881p94508r28534j091685j684486j428947L95973J900263J026688r56212
37430f52567j068147Q03355J817915O56251q74850j208967j105829j371497j158498
37421d162834K5514Q98915O34198N08213J521297K168121P48019j443450j666024
37412g68031J47306J183880k29567k357204k509594n20378J236051R37745m65397
37403c345189o35447Q86126J954048R73649n24117j12014J607386J727985l83466
$$ y = [-1466204, -389877, -439866, -1680126, -2899797, -2830029, -1925356, -1689755, -2282079, -2294721, -1087490, 242423, 657881, 428715, -43380, -1161407, -2946048, -4117980, -3523027, -1769680, -502770, -505340, -1165572, -1370457, -450596, 1301814, 2734508, 2908881, 2114373, 1185839, 94154, -1590332, -3019279, -2623306, -723043, 303645, -652567, -1720714, -917359, 900556, 1556807, 681957, -527010, -1632839, -3004336, -4162834, -4137320, -3238405, -2604207, -2095994, -574697, 1593424, 2341443, 897993, -768031, -620725, 563155, 333588, -2023616, -4533210, -5053588, -3817537, -2879792, -3345189, -3980636, -3094510, -1140462, -166813, -690930, -802944, 804442, 2532427, 2148961]
37394B148961j958521j044859P44677J104564L61149P1984K01550j77554p92061
37385F59890q85675q77043j303765j243703J19585J441243J026169j96872J6367
37376a243804J539756K033270N48576j377573k164218j614616j02800J574454
37368h06955J869915K27636j308015o57975P92706K82295j374792q20472J819425
37359B3768K448142l34327k632763j465644O94752N66746n92038l4360J232258
37350i3466N82959j101678r58829O75456J022454j34877n15363J60876M8611o67993
37340i81850J15988J979263K091069L70051o1839J327414J081793j888377l423239
37331F10273o95256K661209K075157q00440j243796P06218R45106j293532k209339
$$ y = [2148961, 190440, -854419, -109742, 994822, 1355971, 1427955, 1629505, 1451951, 659890, -225785, -1102828, -2406593, -3650296, -3530711, -2089468, -1063299, -1260171, -1243804, 295952, 2329222, 2877798, 1500225, -663993, -2278609, -2381409, -806955, 1062960, 1290596, -17419, -675394, 117312, 399607, -975185, -1795657, 23768, 2471910, 2137583, -495180, -1960824, -1266072, -699326, -1291364, -1325724, -93466, 489493, -612185, -1571014, -895558, 126896, -7981, -523344, -362468, -313857, -981850, -865862, 1113401, 3204470, 3574521, 3512682, 4840096, 5921889, 4033512, 610273, -84983, 2576226, 4651383, 3850943, 2607147, 3313365, 4258471, 2964939, 755600]
37322G55600l0514K019348R33012j702689k664482j622388m21822J60292N90271
37313a983372P22281j1659j024076r92765J47990J009767P83360L85455J005143
37304D2124K199398K333228Q36769r40976j641314j749359k393770k964436j783529
37295f061865Q34804K366301J641286M49277L50357J77028j315952k464314j130942
37286e154020J432046K309909J465033J171516J611815Q34614r80332j280948
37278A409633K00432O46474p52841j120705O81110J243586j584955l948220j466833
37269d692319L265290L897102j91100l007960r03439K573526K573094k35195j612770
37260A666229j75018J304021L93228j735517k239055n03354J112696N15335j195037
$$ y = [755600, 725086, 2744434, 3677446, 1974757, -689725, -2312113, -2733935, -2573643, -1983372, -1261091, -1272750, -2296826, -3289591, -3141601, -2131834, -1348474, -963019, 42124, 2241522, 4574750, 5411519, 4470543, 2829229, 1079870, -1313900, -4278336, -6061865, -5227061, -2860760, -1219474, -770197, -419840, -242812, -1558764, -4023078, -5154020, -3721974, -1412065, 52968, 1224484, 2836299, 3670913, 2690581, 1409633, 1610065, 2256539, 1503698, 382993, 1064103, 2307689, 722734, -3225486, -4692319, -1427029, 2470073, 2278973, -728987, -1632426, 941100, 3514194, 3278999, 1666229, 1491211, 2795232, 3188460, 1452943, -786112, -1289466, -176770, 338565, -856472]
37251h56472j265218O20621J787984P06872n93019J10575J521200J049425p11141
37242B370827r21594O72126J215408o05578k456950j924805K55867J798923J821825
37233B226049R77848M7793n44301p65048j063531j600746j506898j18343J486892
37224h60285J840581J361127J208917P34367j077656k440098q79749J761448J115875
37215B764527k343290l084936N51255K991059L67780k800711r96712K974640K672694
37206C096306j163646k051972J228255K792558m24211l920285l122056J12362
37198c452689J590870R41831L21058K96241K59470N17811J154205P61479j238276
37189A152000k736988j646038R91564K530921K043224M74848j105283j857796
$$ y = [-856472, -2121690, -1501069, 286915, 993787, 400768, 511343, 2032543, 3081968, 2370827, 1449233, 2121359, 3336767, 2731189, 274239, -1650566, -1394699, 404224, 2226049, 3203897, 3251690, 2707389, 1942341, 878810, -721936, -2228834, -2347177, -860285, 980296, 2341423, 3550340, 4284707, 3207051, 766953, -112796, 1648652, 2764527, 421237, -2663699, -2112444, 878615, 1246395, -1554316, -2551028, 423612, 3096306, 1932660, -119312, 1108943, 3901501, 3477290, -442995, -3565051, -3452689, -1861819, -919988, -598930, -302689, -43219, 474592, 1628797, 2390276, 1152000, -1584988, -3231026, -2239462, 291459, 2334683, 2809531, 1704248, -153548]
37181a53548j134954M47137J146565M35000k63219r4749r1898p88386p64243P35615
37171e26680J846199P99030j178393j783368r31474j02062J82779K50552j2829
37162a456246n17296m02866K82310Q4015j052734p93154J605982K936112O67798
37153A353921k457737k193396P21776J993467M63733r75878n77878M29514J111087
37144a31391J857154J980610K16058k037956j837691N04434J630283O30858J41514
37135B953873J163679J318811l08697j148527j0947M34597j371633k655626j174589
37126g99059O54677J43774p93769N96718K427767J293812j476496j847273J65589
37117C65740R92534l1181k1909J573960J687458p12556k354223r05079J370988
$$ y = [-153548, -1288502, -841365, 305200, 740200, 476981, 382232, 290334, -498052, -1262295, -526680, 1319519, 2118549, 940156, -843212, -1774686, -1876748, -1693969, -1443417, -1456246, -1973542, -2376408, -2094098, -2010083, -3062817, -3855971, -2249989, 686123, 1353921, -1103816, -3297212, -2575436, -581969, -118236, -1094114, -1671992, -1242478, -131391, 1725763, 3706373, 3922431, 1884475, 46784, 551218, 2181501, 2812359, 2953873, 4117552, 5436363, 5127666, 3979139, 3968192, 4402789, 3031156, 375530, -799059, -144382, -608, -794377, -197659, 2230108, 3523920, 2047424, 200151, 365740, 1358274, 1327093, 1305184, 2879144, 4566602, 3854046, 1499823, 594744, 1965732]
37108A965732J362672n50963k044467k184922j242808N45107K095317J516252
37100A461920r86403k281011m77075K079323K330080J027612P65214J149845k68992
37091D800513k881592k984693L88201L335261K536717k04186j245105m67198k85647
37082B992271r42417m84947R47755O29589k050055l749046j941390J133932J841337
37073a622971N03677K72482J725528K118405J83778j635128j004510P84260R54712
37064B280233p22697j977969j323979L72583J380504R86098j53995q58636n21113
37055e38971M43427J273155J690522J627451O95641j034547k184778j469309K09603
37046G12194O98490l47080j123560n87616K69465M86907M14341L02701k48659
$$ y = [1965732, 3328404, 2777441, 732974, -1451948, -2694756, -2149649, -54332, 1461920, 475517, -1805494, -2282569, -203246, 2126834, 3154446, 3919660, 5069505, 4800513, 1918921, -1065772, -677571, 2657690, 5194407, 4990221, 3745116, 3277918, 2992271, 2049854, 1564907, 2512662, 3142251, 1092196, -2656850, -4598240, -3464308, -1622971, -1119294, -846812, 878716, 2997121, 3180899, 1545771, 541261, 1325521, 2280233, 1557536, -420433, -1744412, -1371829, 8675, 994773, 840778, -17858, -538971, -95544, 1177611, 2868133, 4495584, 5191225, 4156678, 1971900, 502591, 712194, 1410684, 1063604, -59956, -647572, -378107, 108800, 523141, 825842, 577183]
37037E77183o91665K85841K024870J967989j84180j273267L58774J650559n53468
37028D162636m127231m474101j124605K099267K595421J236159l20829j277791
37020a231074q77661J000418K457522J538463n78148j078581J20715N37691n41524
37011A347821j256315r05028r73913j725245j227290R63515K343078J324938k07503
37002c15942l9639J092330J310509O51720K87538K74316J5595j96511K22607Q77408
36992D179931R95472N27968k37561j249077k170406k293601j545774o03928K15573
36983b181403R53945R77135k81767j524749p08054J733914L108234K359850J213640
36974E650745Q05541N4359j497191k167130j093273l2956l88841r42253m44540
$$ y = [577183, -114482, 171359, 2196229, 4164218, 3980038, 2706771, 3065545, 4716104, 4162636, 35405, -4438696, -5563301, -3464034, -868613, 367546, 46717, -1231074, -2108735, -1108317, 1349205, 2887668, 2309520, 1230939, 1351654, 1889345, 1347821, 91506, -813522, -1787435, -3512680, -4739970, -3776455, -1433377, -108439, -315942, -355581, 736749, 2047258, 2698978, 2986516, 3260832, 3276427, 3079916, 3302523, 4179931, 5175403, 5703371, 5465810, 4216733, 2046327, -247274, -1793048, -2396976, -2181403, -1227458, -250323, -532090, -2056839, -2764893, -1030979, 2077255, 4437105, 5650745, 6456286, 6510645, 5013454, 2846324, 1753051, 1720095, 1331254, 389001, -55539]
36965e5539M9396m65690p36588K84770J146933N48171n8688Q10132J676777Q17417
36955D017091l04354L12616J230928L2920k047745k114233q10949j012107k225815
36946b921648j228021J839971L061391J218254j53984J232450K793573J756879
36938G598865l47470p57956n6024n05518j896614k155955q67484N10753J169092
36929B691689J406460J152204R7325j023589j100620m51595l56765q41884n24241
36920A048984R87944J969040P71255j613434k372824l73768K133514K152326k08456
36911D494581j871290r48434Q65838J034641k41780r31221n38022k78742l62365
36902A223206L61406J765518J919868J49997j448335r22331P06096J126024J29528
$$ y = [-55539, -6143, -471833, -1208421, -923651, 223282, 771453, 712765, 1522897, 3199674, 4017091, 3712737, 4025353, 5256281, 5289201, 3241456, 1127223, 316274, -695833, -2921648, -4149669, -2309698, 751693, 1969947, 1815963, 3048413, 5841986, 7598865, 7251395, 6493439, 6437415, 5931897, 4035283, 1879328, 1011844, 1522597, 2691689, 4098149, 5250353, 5347678, 4324089, 3223469, 2771874, 2415109, 1573225, 1048984, 2036928, 4005968, 4777223, 3163789, 790965, 417197, 2550711, 4703037, 4494581, 2623291, 1674857, 2540695, 3575336, 3333556, 2402335, 1864313, 1585571, 1223206, 1584612, 3350130, 5269998, 5419995, 3971660, 3049329, 3755425, 4881449, 5010977]
36893E010977m69458K00824R60153O49554q1945J11783J079985J208587k17059
36884H453401j681392j322386M52254J521617J026166J62966j90327o61216j410878
36875F350205j166658K97473Q71585n72737j595157K56699K966005K633406m30394
36866I610427k101657p51577Q34823M12303o98765p31656j32270M03719J340052
36857H185399K132930R02968j805830k291326P69888L301766J574449j910223
36849A0860021k245762L44326J375029n87242k221377j191212P16333J205024
36841H255140O31846J22322m92590j197255p64750R41301J724653J33619j887234
36832G467052j598912N04939J607839P99376p7453K09154M98573l55780j287452
$$ y = [5010977, 4541519, 4742343, 5702496, 6352050, 6270105, 6381888, 7461873, 8670460, 8453401, 6772009, 5449623, 5901877, 7423494, 8449660, 8612626, 8422299, 7761083, 6350205, 5183547, 5481020, 6352605, 5779868, 4184711, 4441410, 7407415, 10040821, 9610427, 7508770, 6757193, 7592016, 8004319, 7305554, 6573898, 6441628, 6845347, 8185399, 10318329, 11221297, 9415467, 7124141, 7894029, 11195795, 12770244, 10860021, 8614259, 8958585, 10333614, 9746372, 7524995, 6333783, 7050116, 8255140, 8886986, 9009308, 8516718, 7319463, 6554713, 7496014, 9220667, 9354286, 7467052, 5868140, 6373079, 7980918, 8780294, 8702841, 8911995, 9410568, 9054788, 7767336]
36823G767336p28895P03279J012089j73957j165598q93450l55174p01337j269600
36814D194693p01289Q53008J956340J908966J347719R55543O26089J1468q19507
36805A0333030j357588j003907J67327Q34391k85416k034275j422479J971975
36797G203058M188277J998733j789372j741448K232751M591610K322719j042192
36789A7964136j322291M52317Q82034l39725j201998j276459j300494n24818J923712
36780A5256414M081791L115582j93669k207461j546634l48424l04872n60929j74742
36771A7117056J87181N7649K82652J135727J331994K07401p91874j61730J369878
36762B0735934J895133Q16500p64294j539618j094055L1970Q53898Q41366M18030
$$ y = [7767336, 7038441, 7741720, 8753809, 8579852, 7414254, 6520804, 6165630, 5464293, 4194693, 3493404, 4346412, 6302752, 8211718, 9559437, 10514980, 11141069, 11152537, 10333030, 8975442, 7971535, 8138862, 8973253, 8687837, 6653562, 5231083, 7203058, 11391335, 13390068, 11600696, 9859248, 12091999, 16683609, 19006328, 17964136, 16641845, 17094162, 17976196, 17636471, 16434473, 15158014, 13857520, 13332702, 15256414, 19338205, 22453787, 22260118, 20052657, 18506023, 18157599, 17852727, 17291798, 17117056, 17304237, 17361886, 17644538, 18780265, 20112259, 20319660, 19527786, 19366056, 20735934, 22631067, 23447567, 22683273, 21143655, 20049600, 20081570, 20935468, 21776834, 22194864]
36753B2194864J57886j87440r89783j480636n82098J032746J274110n40585k530069
36744A8348995k533493n25746J790558K920923K634227J818592J602395K053919
36736B8110370J895440L28327j342026j318021j38889Q8174p36163l45519J982937
36727B8524630L719491K802928Q65264O38076J836607K131674J128906O23128
36719D2270704J242432J548874Q01794J74728M18526M81949k97949n10914J067555
36710D7197699K911505K632125P67553K56711J954871L142255J689584l77669
36702F0174634L56452L531396N304017L811183J668129J948203L924474M764879
36694H5483367L981617L674329M772888N590175M739332L480770L876929N798463
$$ y = [22194864, 22352750, 22165310, 21175527, 19694891, 19112793, 20145539, 21419649, 20879064, 18348995, 15815502, 15289756, 17080314, 20001237, 22635464, 24454056, 26056451, 28110370, 30005810, 30334137, 28992111, 27674090, 27535201, 27623375, 26887212, 26541693, 28524630, 32244121, 35047049, 35912313, 36550389, 38386996, 40518670, 41647576, 42270704, 43513136, 45062010, 45863804, 46038532, 46457058, 46939007, 46641058, 46130144, 47197699, 50109204, 52741329, 53508882, 53765593, 55720464, 58862719, 60552303, 60174634, 60531086, 64062482, 69366499, 73177682, 74845811, 76794014, 80718488, 85483367, 89464984, 93139313, 97912201, 103502376, 108241708, 111722478, 115599407, 121397870]
36686A21397870P199878O935859O089814O410740Q211196J0131543J0650175R555696
36678A86582771Q003329P326094P924935R222066J0364141J0815213J0570289
36671B50808838J0119734J0082901J0617932J1224804J1183603J0034696P726026
36664C21798534M736344K060556M76397l12996j222900k466405l554790m642430
36656C16872310o535421q891860r946000r071224q261383r636377j2508119j4426630
36648B37595296j4238274j2565289j0260089q275364q106374r953536j1031544
36641A63164826q516436m166024k946194o285368r710957q835280n103576l187792
36633A14413199m470520o039860n495596l860758l191889l522278l509482k919696
$$ y = [121397870, 128597748, 135533607, 141623421, 148034161, 156245357, 166376900, 177027075, 186582771, 194586100, 201912194, 209837129, 219059195, 229423336, 240238549, 250808838, 260928572, 271011473, 281629405, 292854209, 304037812, 314072508, 321798534, 326534878, 328595434, 329071831, 328758835, 327535935, 325069530, 321514740, 316872310, 310336889, 301445029, 291499029, 282427805, 274166422, 264530045, 252021926, 237595296, 223357022, 210791733, 200531644, 192256280, 184149906, 174196370, 163164826, 154648390, 150482366, 147536172, 141250804, 131539847, 122704567, 117600991, 114413199, 109942679, 103902819, 98407223, 94546465, 91354576, 87832298, 84322816, 81403120]
36625H1403120k888032l864093m622647l943229k471738j840285k203756k020273
36617E7549067o47100K80634q71294l147990m133734l099711j604751j207009
36609D3118112j841303k394399j915868m22020Q05827K95878j540301k475862
36601C3630064j602121q48542j752679k538505j009158J189045O49429k214374
36593B5503159l466596j542873Q97763J512719R85620L41621p60510j807787j120783
36584B0542333O98901O03449j832345k916763o51823J811737J416709J13865Q52153
36575B0638216K048390N29976k537638l417424j768998k26026O21599K045710
36567A7933805K917937P20604l224538m398510j592582J566573K365774J996130
$$ y = [81403120, 78515088, 74650995, 70028348, 66085119, 63613381, 61773096, 59569340, 57549067, 56901967, 57182601, 56311307, 53163317, 49029583, 45929872, 44325121, 43118112, 41276809, 38882410, 36966542, 36544522, 37350349, 37646227, 36105926, 33630064, 32027943, 31179401, 29426722, 26888217, 25879059, 27068104, 27717533, 25503159, 22036563, 20493690, 21391453, 22904172, 23889792, 24231413, 23470903, 21663116, 20542333, 21241234, 21844683, 20012338, 17095575, 16443752, 18255489, 19672198, 19786063, 20638216, 22686606, 23216582, 20678944, 17261520, 15492522, 15266496, 15888095, 17933805, 20851742, 21572346, 18347808, 13949298, 12356716, 13923289, 16289063, 18285193]
36559A8285193J708119L73738k161691l172360j079512J570065J712454j9383
36551A7216623j106614j081455j126520j332040q64136R3351O59208Q10911R32052
36542A4201380N66857p11718j810127j192432P47536J839426Q27632j085843j732834
36533A1649877m98130J077549J239158J53420o01636n53708q92317j890390j665356
36524H018467P76499K956221J973707r62574k098182o81288L70460o18955j955353
36515G779002j998306j403859q87921J58907J551307J743992P29676N51114J527431
36506I751343J209206j145816k542165j079382O40928l1335j223498j60191J542422
36497F961512O74569j600380j492760Q85769J737350J2302j215077k78588O88864
$$ y = [18285193, 19993312, 20367050, 18205359, 15032999, 13953487, 15523552, 17236006, 17216623, 16110009, 15028554, 13902034, 12569994, 11705858, 11799209, 12458417, 13269328, 14201380, 14768237, 14056519, 12246392, 11053960, 11801496, 13640922, 14468554, 13382711, 11649877, 11151747, 12229296, 13468454, 13621874, 13020238, 12466530, 11574213, 9683823, 8018467, 8794966, 11751187, 13724894, 12762320, 10664138, 9982850, 10353310, 9734355, 7779002, 5780696, 4376837, 3488916, 3647823, 5199130, 6943122, 7672798, 8223912, 9751343, 10960549, 9814733, 7272568, 6193186, 6834114, 6802779, 5579281, 5419090, 6961512, 7636081, 6035701, 4542941, 5428710, 7166060, 7178362, 5963285, 5684697, 6373561]
36488F373561N4817o23839J18651J010634N54728m61644p23078m36165j12586
36479E755079N96946J427718R37006j054735k377689j468853L04390Q55511K77288
36470E252661j34724k52370o86715j150699r89430m65241p3815M59331J157207
36461C116205R52634n32620j535791l98414J628842J905830J50318j455574j576444
36452B254986r37043k68739O10301J224527L15174j662378k074510J67017K164929
36443A794264O79256k782345l418919J22161L415637K245835j419444k186494
36435a550049J189625M361446L796593J234880Q1781K67926m01692j673900j259310
36426F047300P71401J624406K17907j285935j280750r21779j176899q03080O79054
$$ y = [6373561, 6428378, 5804539, 5923190, 6933824, 7488552, 7026908, 6303830, 5867665, 5755079, 6352025, 7779743, 8716749, 7662014, 5284325, 3815472, 4119862, 4975373, 5252661, 5117937, 4865567, 4178852, 3028153, 2038723, 1573482, 1499667, 1958998, 3116205, 4068839, 3536219, 2000428, 1602014, 3230856, 5136686, 5287004, 3831430, 2254986, 1317943, 1049204, 1659505, 2884032, 3199206, 1536828, -537682, -370665, 1794264, 2473520, -308825, -3727744, -3605583, -189946, 2055889, 636445, -1550049, -360424, 4001022, 7797615, 9032495, 9114276, 9382202, 8980510, 7306610, 6047300, 6818701, 8443107, 8661014, 7375079, 6094329, 5172550, 3995651, 3192571, 3871625]
36417C871625R28661j468704l630012k186680J292879K506958R10490j95659L44774
36408B374332R8783j662339j898171Q38400K995013J185354k195323k322933Q75109
36399B88225K899366J445509q24546q22113Q27851J578752P47321k12751k11553
36390E716061J31631m47470k031085k962549j522052J583340L297678J728998
36382E494552j251571k292067p30335J222160J864689J399243J87040j778455
36374D115256l237056k200735P68606K296553P59806j165672m87418J660422K092095
36365D601857M93133o96122m60832k32302q49559j264039o64676L50420J130928
36356B408808J553332J081858o33781k075957j208429J097107J679914j06854
$$ y = [3871625, 4800286, 3331582, -298430, -2485110, -1192231, 1314727, 2225217, 2029558, 2374332, 2473115, 810776, -1087395, -248995, 2746018, 3931372, 1736049, -586884, 288225, 3187591, 4633100, 3808554, 2986441, 3814292, 5393044, 6140365, 5927614, 5716061, 5847692, 5400222, 3369137, 406588, -1115464, 467876, 3765554, 5494552, 4242981, 1950914, 1220579, 2442739, 4307428, 5706671, 5893711, 4115256, 878200, -1322535, -553929, 1742624, 2502430, 1336758, 849340, 2509762, 4601857, 5094990, 4398868, 3938036, 3705734, 2856175, 1592136, 927460, 1277880, 2408808, 3962140, 5043998, 4410217, 2334260, 1125831, 2222938, 3902852, 3795998]
36348C795998j206588J47726J440369K09036j590333r20635Q96020L00227k088707
36339I83113j922556J691577M095140J933422j810909k470272m39737L24840j166826
36330A217792j933918l03988J565193J469727M49217M79452J065913M60987r98861
36321C471514j296269j15253N43354m88849j760098j422470K54097J633328J847604
36312B666958J128347k5276q78919n25514Q30460J390013l7365j941117j802816
36303H04771M53475K354340K131188M55870j120531j774403j204955M52148J949183
36294D501086J698973r2832j361029p98790P29202J783458J891021J102543k88533
36285I165099j091333j91507J241020P74518j258135j543218R37024K526728L19404
$$ y = [3795998, 2589410, 2737136, 4177505, 4386541, 2796208, 1875573, 2771593, 3071820, 983113, -939443, 752134, 4847274, 6780696, 4969787, 2499515, 2059778, 2384618, 1217792, -716126, -1020114, 545079, 2014806, 2464023, 2943475, 4009388, 4470375, 3471514, 2175245, 2059992, 2603346, 2114497, 354399, -1068071, -813974, 819354, 2666958, 3795305, 3770029, 2891110, 2365596, 3196056, 4586069, 4548704, 2607587, 804771, 1258246, 3612586, 5743774, 6199644, 5079113, 3304710, 2099755, 2551903, 4501086, 6200059, 6107227, 4746198, 3947408, 4676610, 6460068, 8351089, 9453632, 9165099, 8073766, 7882259, 9123279, 9897797, 8639662, 7096444, 8033468, 10560196, 10879600]
36276A0879600k913051k738041J29851J229314n75206j857625m50596J606781
36268E311027J776795L33324j079086j502218n22471J403773K075440j89802l107899
36259D498883k605894R38369K572015K51401j841162r747K985881K451689q65148
36250H376287k432096j077456J66652l78107j003895l34425O46926R65307J020943
36241E950136Q79960j26097j390033j141461O18218J639893P69444m64885n59119
36232F176056j04461o698J60019N46981j47621k354385l811836k258359J152240
36223f48064L236453K831300J460482N68925K46099M50178J251825J600295j6026
36214A0981467k937402m218373k253176R69232K506535K056779J318541Q38712
$$ y = [10879600, 7966549, 5228508, 5358359, 6587673, 6012467, 4154842, 3704246, 5311027, 7087822, 7421146, 6342060, 4839842, 4317371, 5721144, 7796584, 7606782, 4498883, 1892989, 2831358, 5403373, 5654774, 3813612, 3803865, 6789746, 9241435, 8376287, 5944191, 4866735, 5033387, 4655280, 3651385, 3316960, 3963886, 4929193, 5950136, 6830096, 6703999, 5313966, 4172505, 4790723, 6430616, 7200060, 6735175, 6176056, 6071595, 6064897, 6224916, 6771897, 6624276, 4269891, 458055, -1800304, -648064, 2588389, 5419689, 6880171, 7449096, 7695195, 8145373, 9397198, 10997493, 10981467, 8044065, 3825692, 1572516, 2541748, 5048283, 7105062, 8423603, 9262315]
36206I262315k86172j796119j761851M28596K395493J577753j286297l055301
36198E478417k136909o3625Q98132L80759l09278j35350O16615R09170K25467
36189E863398o81001m86585R85450K212318J789579L16220n23551l37854j31086
36180I006888k47844N4022P27991N14868q26160j611318p10410O14624P36705
36171H259366J33368K04966Q42977J026990Q59701J023642J043649K41585l12288
36162A3323956P07021J908398O09728k656232m138046k172318M61800Q69663l8620
36153H875350Q5858J119739J389112P75773L19521n9080r03743j257874L1424
36144A0376080J729746J631994J51794l00898O41064R50114J84883N03901K604480
$$ y = [9262315, 8976143, 7180024, 5418173, 5846769, 8242262, 9820015, 8533718, 5478417, 3341508, 3277883, 4176015, 4556774, 4247496, 4112146, 4728761, 5637931, 5863398, 5182397, 4695812, 5681262, 7893580, 9683159, 9999379, 9475828, 9137974, 9006888, 8759044, 8813066, 9541057, 10055925, 9229765, 7618447, 6908037, 7522661, 8259366, 8392734, 8597700, 9440677, 10467667, 11327368, 12351010, 13394659, 13636244, 13323956, 14030977, 15939375, 16549103, 13892871, 9754825, 7582507, 8044307, 8913970, 8875350, 8961208, 10080947, 11470059, 12245832, 12565353, 12506273, 11602530, 10344656, 10376080, 12105826, 13737820, 13889614, 13588716, 14229780, 15179894, 15364777, 15868678, 18473158]
36135A8473158L832479K237432j57387m95474O51929Q47975l559K1505J234746
36126B6642804J933114J387598P16335P58469J246313K084252L372630M184875
36118D2326390L420454J879232J382121J932344K086210J967336L040135M752397
36110F2786619M730917L015798K566668M342616N629689N073910N329172P885625
36102A01361014R247714O257454J921467J144114L116806L231155Q99345k63364
36094A26915705N90712K29379k558651m947632n220133n034985n342580m804632
36086I9827183l665124m336701o454914o357874l529464k266751m314967n479572
36078F3421816l139131j345467l578790n884761l488931K89488q74010n454616
$$ y = [18473158, 22305637, 24543069, 24385682, 23890208, 24542137, 25390112, 25386553, 25408058, 26642804, 28575918, 29963516, 30679851, 31438320, 32684633, 34768885, 38141515, 42326390, 45746844, 47626076, 49008197, 50940541, 53026751, 54994087, 58034222, 62786619, 67517536, 70533334, 73100002, 77442618, 83072307, 88146217, 93475389, 101361014, 110608728, 116866182, 118787649, 119931763, 123048569, 126279724, 127179069, 126915705, 127506417, 127735796, 125177145, 120229513, 115009380, 109974395, 104631815, 99827183, 96162059, 91825358, 85370444, 79012570, 75483106, 73216355, 68901388, 63421816, 60282685, 58937218, 55358428, 49473667, 45984736, 46274224, 45400214, 39945598]
36070C9945598o302048k140952J157053N93957l81417O53345J177525o21796k352604
36061C1728661k060815j286049j208078m51273J146594J217939n39293j085603
36053B7462083M65346R44513q25233j311375J203959K690486J16319k832785j795452
36044B6117861Q87218O02934j367085o12782K044182J943205q36638j254519K088366
36035B9612742M504479K771696k62912o91528J096825K294024J740760K26848
36027D1292934q98446k70199K141636L822168K474266O3900P39343M350005O050642
36018E9766249L566394O83572J288185L720578M177575K753772K370125L458696
36010H1785146L440130R76104k231147m015669m087830l586926l586897m119845
$$ y = [39945598, 33643550, 31502598, 32659651, 33253608, 32872191, 33525536, 34703061, 34081265, 31728661, 29667846, 28381797, 27173719, 26722446, 27869040, 29086979, 28547686, 27462083, 27927429, 28871942, 28046709, 26735334, 27939293, 30629779, 30746098, 27913313, 26117861, 27005079, 27608013, 26240928, 25628146, 27672328, 29615533, 28778895, 27524376, 29612742, 34117221, 36888917, 36626005, 35934477, 37031302, 39325326, 41066086, 41292934, 40394488, 40124289, 42265925, 46088093, 48562359, 48626259, 49365602, 53715607, 59766249, 63332643, 64016215, 65304400, 69024978, 73202553, 75956325, 78326450, 81785146, 85225276, 86201380, 83970233, 79954564, 75866734, 72279808, 68692911, 64573066]
36002F4573066m120057k855415j616084k539163n145670o036934l425743k6354
35994C8807646N73440j239464k369463j885915j654105k492361k731563j200372
35986B5807843P62159J317935M67742o26714j374339j827516j949495j710949
35978B0866666j363982j027573m86557K05472M92583J10531l95853m07844j12944
35969A7880499k11031r32763j670743j571702m72187O84140O09601p80688j850309
35960A1684817r58276J317030K493044J075092j576780k903156k152043q22656
35952H157072k66223j3679R36880K114783K118031R49918L69586J332073K298834
35943A7997275J311341r45855j711029K11748K815755L420674J725289m14508
$$ y = [64573066, 60453009, 57597594, 55981510, 53442347, 48296677, 42259743, 38834000, 38807646, 39381086, 38141622, 35772159, 33886244, 32232139, 29739778, 27008215, 25807843, 26570002, 27887937, 28355679, 27728965, 26354626, 24527110, 22577615, 20866666, 19502684, 18475111, 17988554, 18194026, 18686609, 18797140, 18401287, 17993443, 17880499, 17669468, 16736705, 15065962, 13494260, 13022073, 13706213, 14315814, 13535126, 11684817, 10726541, 12043571, 14536615, 15611707, 14034927, 11131771, 8979728, 8157072, 7890849, 7877170, 8814050, 10928833, 13046864, 13996782, 14366368, 15698441, 17997275, 19308616, 18362761, 16651732, 16863480, 19679235, 23099909, 24825198, 24410690]
35935B4410690j393649j077449j26378Q00057J136386N51948o32133j564576j749593
35926B0355303j630916j917694k333892j631342N84431K495444J766343j181853
35918A6505824l030567j631236J103472J879434M72026o26402l50270j86107r87021
35909A3149153j406604m82263O20255P96380P88815J198462P98756j144039k737141
35900A1581774k083576n16737m80515j397892q02983J119910J643194J81318p11090
35891H533403J74490O73749p37856k036026j011750R87926J377460M61170K62664
35882H685230O16166k39627j809030j617989M03933J271989k22100j255437M42226
35873F275361K514756J448957j718365k742404n54049J446537R18761k74542K6527
$$ y = [24410690, 23017041, 21939592, 21813214, 22613271, 23749657, 24301605, 23669472, 22104896, 20355303, 18724387, 16806693, 14472801, 12841459, 13425890, 15921334, 17687677, 16505824, 13475257, 11844021, 12947493, 14826927, 15298953, 14672551, 14322281, 14136174, 13149153, 11742549, 11260286, 11880541, 12676921, 13465736, 14664198, 15462954, 14318915, 11581774, 9498198, 8981461, 8500946, 7103054, 6300071, 7419981, 9063175, 9244493, 8533403, 8707893, 9381642, 8643786, 6607760, 5596010, 6583936, 7961396, 8422566, 8685230, 9301396, 9061769, 7252739, 5634750, 6038683, 7310672, 7088572, 5833135, 6275361, 8790117, 10239074, 8520709, 5778305, 5224256, 6670793, 7589554, 7315012, 7341539]
35864G341539O13622k26842r22885P45471K984502K132371j208811k621608p91436
35855H045923O18676n74297j398344P03308K828387J269535j930379k052186N58086
35846H068709J188819j431707l424959k387939o29705l07017M739J567657K354520
35837E003117O33110j487369j233492N62263J391405J144582J185511J164316
35829H363443m2160j537127j618105p62802n87522q63185l86888K40383k91929
35820B514108j101899m68722P84336O36360j97234N43381K053478J287753j534744
35811D516817k711425j048552M24523l4255k67221R64846J195413q79877k039097
35802A21172K96717L152586K434904o38177j976814j133270o87403r27452j12853
$$ y = [7341539, 7955161, 7728319, 6805434, 7550905, 10535407, 12667778, 11458967, 8837359, 8045923, 8664599, 8090302, 6691958, 7395266, 10223653, 11493188, 9562809, 7510623, 8068709, 9257528, 7825821, 4400862, 2012923, 1383218, 1076201, 1080940, 2648597, 5003117, 5636227, 4148858, 2915366, 3477629, 4869034, 6013616, 7199127, 8363443, 8321283, 6784156, 5166051, 4403249, 3815727, 2952542, 2565654, 2806037, 2514108, 1412209, 943487, 1727823, 2364183, 2166949, 2710330, 4763808, 6051561, 4516817, 1805392, 756840, 1181363, 1147108, 879887, 1844733, 3040146, 2160269, 121172, 417889, 3570475, 6005379, 5367202, 3390388, 2257118, 1569715, 642263, 529410]
35793E29410J066884L63538j179494l18920K390985K853129L60869r89840O74750
35784E751311J798047k53560k442839j235519J390173J322865j094965k225023
35776C010490j060194J92334L49973J96054j41633j106245j426421M70773K865607
35767C350738K247641j185775l169649j485274J030567J168994j23726j74223
35759A659293R69099J274408L67674k79432n5933K18568R3890q4120l58627j038253
35749B766567j473934o04718J184257K250550J914216J056696L03259p68422k038632
35740D589839k140338n12559J128125Q94124n14549q75038J28156N14924o40790
35731B571894j467855j05510K226776K781122J201300j47741J56843O40960m36737
$$ y = [529410, 1596294, 1959832, 780338, 461418, 2852403, 5705532, 6066401, 5076561, 5751311, 7549358, 7295798, 4852959, 3617440, 5007613, 6330478, 5235513, 3010490, 1950296, 2142630, 2492603, 2688657, 2547024, 1440779, 14358, 485131, 3350738, 5598379, 4412604, 1242955, -242319, 788248, 1957242, 1833516, 1659293, 2628392, 3902800, 4270474, 3991042, 3935109, 4153677, 4247567, 4163447, 3804820, 2766567, 1292633, 687915, 1872172, 4122722, 6036938, 7093634, 7396893, 6628471, 4589839, 2449501, 1936942, 3065067, 3959191, 3444642, 2569604, 2697760, 3212684, 2571894, 1104039, 998529, 3225305, 6006427, 7207727, 7059986, 7216829, 7857789, 7421052]
35722G421052k133477k112481q1242J781631J749431M25733o08122q02672o64782
35713D975071o03801n08071j17470O47833J469396J562801L62021j421968k082177
35704D283635q60580Q80492J197520n793r71757n36229L38072J1946j403767j980342
35694I53197n43569J397423J227874j213311k827307j067015K217978K669523
35686B814793o09180l210889j110214L551930N006522J574057k217169j944751
35678C855099J095378K469646P91504j264040j257622L12539J675259J970378
35670I648141J205942k43111j328240q89853O50910J307274P7311j551157j595248
35661G281969j96344Q50208N98837j20426o5459R67024K021686J897144L75927
$$ y = [7421052, 5287575, 3175094, 3093852, 4875483, 6624914, 7050647, 6442525, 5639853, 4975071, 4371270, 3863199, 3745729, 4393562, 5862958, 7425759, 7787780, 6365812, 4283635, 3423055, 4303547, 5501067, 5495274, 4523517, 3987288, 4325360, 4337306, 2933539, 953197, 409628, 1807051, 3034925, 1821614, -1005693, -2072708, 145270, 2814793, 2205613, -1005276, -2115490, 1436440, 6442962, 8017019, 5799850, 3855099, 4950477, 7420123, 8211627, 6947587, 5689965, 6002504, 7677763, 9648141, 10854083, 10610972, 9282732, 8392879, 9043789, 10351063, 10428374, 8877217, 7281969, 7085625, 7935833, 8534670, 8414244, 8348785, 9315809, 11337495, 13234639, 13610566]
35652A3610566j281796j543356l90176Q18745J228839J050169K29604j565221
35644A2157374l082983j964824J453685L165285O51393k987135l089926r2653
35636F210216J553003K75456j014287m14341J99402p62868j632478p14541O11697
35627D311259M59519l65572j83066N88195O43182J88846j13268q27301k083911
35618B617883k073831K33103K521160K041307l30293j729139j583806j247614
35610D48770p20073P93477K014085J004286j025707j055451P76791J360178r0966
35601C505390r19501J22740R03112O1522o11401L00768J275819Q03365o6610j76751
35591E198453m74442j588506j865737k85478J068812J37103j557583j273549O80363
$$ y = [13610566, 12328770, 10785414, 10395238, 11213983, 12442822, 13492991, 13722595, 12157374, 9074391, 7109567, 8563252, 11728537, 12379930, 9392795, 6302869, 6210216, 7763219, 8038675, 7024388, 6610047, 6809449, 6046581, 4414103, 3699562, 4311259, 4770778, 4405206, 4222140, 4810335, 5453517, 5642363, 5529095, 4701794, 2617883, 544052, 777155, 3298315, 5339622, 5009329, 3280190, 1696384, 448770, -271303, 522174, 2536259, 3540545, 2514838, 1459387, 2236178, 3596356, 3505390, 2585889, 2708629, 3611741, 3673263, 3061862, 3362630, 4638449, 5441814, 5375204, 5198453, 4724011, 3135505, 1269768, 984290, 2053102, 2190205, 632622, -640927, 39436]
35582C9436J837445J433583O64161R1637o09288j029872m87600M36348P69109
35573C144959Q22950J169477R51153o73881k310304j838766M20003K135084K052811
35564E873486P91118p57266j871164j570293K30943J751032J419310J80399j46010
35555E901555K35428J5546n14317k32130K80118k73068j152987p05746M77032
35546D031431N77821O5564P73638J939097J017353j510231k212041k17037J386117
35537E851712P57064r3716M61796P12289q29079k276479j473112M42397J201192
35528D754064Q65182O30109K52316q14427j498857p45673M35501O59998L87974
35519D926187N54360O66453J67262q0117M47536O08527j18519k64092P18302Q21668
$$ y = [39436, 1876881, 3310464, 3974625, 4066262, 3456974, 2427102, 1939502, 2375850, 3144959, 3967909, 5137386, 6088539, 5414658, 3104354, 1265588, 1685591, 3820675, 5873486, 6664604, 5907338, 4036174, 2465881, 2696824, 4447856, 5867166, 6047565, 5901555, 6136983, 6152529, 5638212, 5406082, 5686200, 5413132, 4260145, 3554399, 4031431, 4609252, 4674816, 5448454, 7387551, 8404904, 6894673, 4682632, 4465595, 5851712, 6608776, 6515060, 6976856, 7689145, 6860066, 4583587, 3110475, 3552872, 4754064, 5619246, 6249355, 6501671, 5687244, 4188387, 3442714, 3878215, 4538213, 4926187, 5480547, 6147000, 6314262, 6234145, 6681681, 7290208, 7171689, 6907597, 7625899, 8447567]
35509H447567q01750j508656L16102J601898m31288k679325q12538K827731K335820
35500I295561j872704l284155J34206K664951L20725k930884k119651R12299J391295
35491D511643n49295j108372L71341Q90982o95159j983815j095997P57348J439816
35482B538492N08787q51549j216640j45177J177217R93805o71723j762907j081297
35473e10992O7767K65142K16612R09201J338813L50394p68975j93315J086409
35464B761056P17707r57534j429213l04205K31327m87897m12655J285175K221944
35455C625705N39010j877188k128529m66347O26857L21673k7735K88096L61020
35446A262562k22239k94727R20783K031851R93381j919053l855398k618511N33802
$$ y = [8447567, 7645817, 6137161, 6453263, 8055161, 7623873, 4944548, 4132010, 6959741, 9295561, 7422857, 4138702, 4272908, 6937859, 7258584, 4327700, 2208049, 3120348, 4511643, 3962348, 2853976, 3225317, 4116299, 3421140, 1437325, 341328, 1098676, 2538492, 3047279, 2195730, 979090, 833913, 2011130, 3004935, 2333212, 570305, -510992, -443225, -178083, 38529, 947730, 2286543, 2636937, 1867962, 1674647, 2761056, 3478763, 2521229, 1092016, 787811, 1019138, 531241, 118586, 1403761, 3625705, 4164715, 2287527, 158998, -307349, 319508, 641181, 613446, 901542, 1262562, 1040323, 745596, 1666379, 3698230, 4691611, 2772558, -1082840, -3701351, -3167549]
35437c167549K292558J399586L4653M50865J641504J063705j141136k100299o44658
35428a70771P29948l26921k298299k034687M96394K232404J557275L05409M93285
35419I84037J186249K98856j690786k022193K51418K390089J431020j574470k686091
35410a431871m19664K127205J657667o31461j066110P77395J589592n0073j124086
35401A428594P28572K658838O82786l537214m413910o82031K665534J912778k47825
35392A196122K27010K181620J745529r18556k009118m98605M85750p36671j703814
35383c0733l76972J268681P30472p86248o24111Q46739J253761M69484M67270
35374C218343J427859J301732m86070j886392j561311p84990r18460j222468n45644
$$ y = [-3167549, -874991, 524595, 559248, 1010113, 2651617, 3715322, 2574186, 473887, -170771, 559177, 232256, -2066043, -4100730, -3604336, -1371932, 185343, 490752, 984037, 2170286, 2469142, 778356, -1243837, -992419, 1397670, 2828690, 1254220, -1431871, -1851535, 275670, 1933337, 1301876, 235766, 1013161, 2602753, 2552680, 1428594, 2157166, 4816004, 5498790, 1961576, -2452334, -3134365, -468831, 1443947, 1196122, 1423132, 3604752, 5350281, 4431725, 2422607, 1924002, 2409752, 1673081, -30733, -407705, 860976, 1591448, 805200, 181089, 1027828, 2281589, 2751073, 3218343, 4646202, 5947934, 5461864, 3575472, 2014161, 1229171, 310711, -911757, -1457401]
35365a457401O33290J287504J486340J605013J235166K19999m97533m04944m96643
35356C610791j372773j675053k50640J410255J138160m48139r31281j6669K36444
35347A701095r11170j721641j040537O4471O66339J522544K849485K808775K33757
35338F173118k758431l126837r08971J229247J728175J252443N02006o69956j681618
35329A739176j081190J029663K252294R70267j122097j223039O21725J660527
35321D847326M66564j095720p44552Q85825J318523p3290j303123q89286M1650
35312C453917k09996j139593r60788L53016R01884j47396j262733r68693L1143
35303E0761L16747L7886J90596N04074r8057j274528j438404l21402M99826K22444
$$ y = [-1457401, -824111, 463393, 1949733, 3554746, 4789912, 5009911, 4512378, 4107434, 3610791, 2238018, 562965, 312325, 1722580, 2860740, 2412601, 1481320, 1464651, 1701095, 789925, -931716, -1972253, -1907782, -1241443, 281101, 3130586, 5939361, 6173118, 3414687, 287850, -621121, 608126, 2336301, 3588744, 4090750, 3420794, 1739176, 657986, 1687649, 3939943, 4910210, 3788113, 2565074, 3186799, 4847326, 5313890, 4218170, 3473618, 4359443, 5677966, 5604676, 4301553, 3412267, 3453917, 3243921, 2104328, 1143540, 1496556, 2398440, 2251044, 988311, 19618, 50761, 367508, 405394, 595990, 1100064, 1002007, -272521, -1710925, -2032327, -1532501, -1310057]
35293a310057J24728J157440J938299R15753p02356m72500J352523J949194K39226
35284E192250j462260j132821n842q7086p18590r6656J153812Q91471o50953j050156
35274B033169J42118O82882j86278k76751J259566J608758j095535l825254k926634
35265b583959j29041O3579k225591k373355J067062L787721K448420l47031n14041
35256h06236J386744J830168n324j688299j589375m30829Q10128J934929K439852
35247C881758J551728l17391j676838j773636j219296q25197p57987p03472j43714
35238a984045J093218J992323J069662j191386k047152j58439J909547J072945
35230A756673j535078k091479J08278J649419L74752j412311p68652J336329J701897
$$ y = [-1310057, -1185329, -27889, 1910410, 2826163, 2123807, 1651307, 3003830, 4953024, 5192250, 3729990, 2597169, 2591327, 2504241, 1785651, 1688995, 2842807, 3734278, 3083325, 2033169, 2175287, 2858169, 2671891, 2395140, 3654706, 5263464, 4167929, 342675, -2583959, -2713000, -2649421, -4875012, -7248367, -6181305, -2393584, 54836, -292195, -806236, 580508, 2410676, 2405352, 717053, -872322, -1303151, -493023, 1441906, 3881758, 5433486, 5116095, 3439257, 1665621, 446325, -378872, -1136859, -1840331, -1984045, -890827, 1101496, 2171158, 979772, -1067380, -1225819, 683728, 1756673, 221595, -1869884, -1761606, -112187, 262565, -1149746, -1918398, -582069, 1119828]
35221A119828j94443j553413m31750J579954J771487J40270p51649L16147J172905
35212C169336n25492l143139k694957J161182L772310J793103j908575k496632
35204h72864j70152R29465l65114r92351M96453J494788K51418r57217n2577R54505
35194G16354m75646k628104k051460P62521K045393M74210j315466j070952L16853
35185c226297J085339J109931J094644J069135P28545Q9561p95292j740924j869393
35176b454751n01639J207121J209934l50420q77481Q26649K313418Q92055k089905
35167A74981k802730l31321K081567J733599l430l50809N52368L76745j193713
35158B37257j773336j70501J560525J253395j95643o50974k31602n92574j512979
$$ y = [1119828, 925385, -628028, -1059778, 520176, 2291663, 2431933, 1680284, 1996431, 3169336, 2643844, -499295, -3194252, -2033070, 1739240, 3532343, 1623768, -872864, -1043016, -113551, -478665, -1471016, -974563, 520225, 771643, -185574, -238151, 716354, 240708, -2387396, -4438856, -3676335, -1630942, -1156732, -2472198, -3543150, -3226297, -2140958, -1031027, 63617, 1132752, 1861297, 1950858, 1155566, -585358, -2454751, -2956390, -1749269, -539335, -889755, -1767236, -940587, 1372831, 2264886, 174981, -2627749, -2959070, -877503, 856096, 852666, 501857, 1054225, 1430970, 237257, -1536079, -1706580, -146055, 1107340, 911697, 260723, 29121, -563453, -2076432]
35149b076432r56202J253597K399882O53571j999389k223691K58125K329770J444004
35140A083235j211961k099326K79732L089785K300661j910464m712121k705415
35132e885874J465718K861824J034870k52679O37022J236200r3868j317269n68883
35123h82939O44960M69453o473P74893J545308M65776j254969j240177m1727p9328
35113C94777j401913j753232m82767O01129L17065m73019o77487j53407Q93739
35104b735115J919860J797528K45375j180618j228949r18609j335897j153228
35096d589653P77949K126245L03399k285617j048127L077393M127059K70127l043754
35087b84979j400695K139468K405979j92389j650431j110444q92279j368264m59788
$$ y = [-2076432, -3032634, -1779037, 620845, 1274416, -724973, -2948664, -2690539, -360769, 1083235, -128726, -2228052, -1948320, 1141465, 3442126, 1531662, -3180459, -5885874, -4420156, -1558332, -523462, -776141, -139119, 1097081, 1003213, -314056, -882939, -237979, 231474, 225001, 999894, 2545202, 3010978, 1756009, 515832, 474105, 394777, -1007136, -2760368, -3243135, -2642006, -2324941, -2797960, -3475447, -3628854, -2735115, -815255, 982273, 1227648, 47030, -1181919, -2100528, -3436425, -4589653, -3811704, -1685459, -1382060, -3667677, -4715804, -1638411, 2488648, 2758775, -284979, -1685674, 453794, 2859773, 2667384, 1016953, -93491, -985770, -2354034, -2813822]
35078b813822J979405L187646J550027j163450k358756j417574N81639K279492
35070A824607K681472J668317K77836l44638l02745n28838j269567j829986j592782
35061E83676n72550P40322J524633J120648r7610r88404j188459j413373j751937
35052b043054j091199Q14755K203216J656063L49353K99913J347342J665092O17705
35043E819186o32488r96251m51185M92318J051355L79761j267992k201731j345058
35034H47915J73129P72743O92879Q42801N89303j006038k593365j927020L56817
35025a250836J145891n84430k207155j299151J141313K456047J598351m28724
35017E71306k013236j892603O6079K200151K304005K80355j520938j184143O70844
$$ y = [-2813822, -834417, 2353229, 3903256, 2739806, 381050, -1036524, -454885, 1824607, 4506079, 6174396, 6452232, 6107594, 5804849, 5276011, 4006444, 2176458, 583676, 11126, 751448, 2276081, 3396729, 3299119, 2310715, 1122256, -291117, -2043054, -3134253, -2319498, -116282, 1539781, 1889134, 2189047, 3536389, 5201481, 5819186, 5186698, 4190447, 3739262, 4231580, 5282935, 5662696, 4394704, 2192973, 847915, 1021044, 1793787, 2486666, 3329467, 3918770, 2912732, 319367, -1607653, -1250836, -104945, -689375, -2896530, -4195681, -3054368, -598321, 1000030, 571306, -1441930, -3334533, -3268454, -1068303, 1235702, 1516057, -4881, -1189024, -518180]
35008e18180K136400K100292N90449j550077k707986j681904M46800J134130j44407
34999a94483r79231K78801J823251J186454q71318j595706m11071O31506K99374
34990A67577l01037K9694P95939R40150L08362o65848j576321j813133q49861
34981b964478O40046J017523k43938j618157j447047p430J205704J542944J469166
34972d05667J242823N94682k89433o35512k68385J4888k32726k58498O15588J492279
34962A870039Q26873j215106k495626j497516O52594J553638M99198q21830n95098
34953a222834R50329K030059J503195N0160q02727m42116K77141J39123j017896
34944A464434k111970j909686j93955J945874K788927J335736j438280k957685
$$ y = [-518180, 1618220, 3718512, 4308961, 2758884, 50898, -1631006, -1184206, -50076, -194483, -1173714, -894913, 928338, 2114792, 1243474, -352232, -763303, -131797, 167577, -133460, -103766, 692173, 1632323, 1940685, 1274837, -301484, -2114617, -2964478, -2324432, -1306909, -1550847, -3169004, -4616051, -4623481, -3417777, -1874833, -405667, 837156, 1431838, 1142405, 506893, 238508, 253396, 20670, -237828, 377760, 1870039, 2696912, 1481806, -1013820, -2511336, -1858742, -305104, 194094, -627736, -1222834, -272505, 1757554, 3260749, 3310909, 2508182, 2066066, 2343207, 2482330, 1464434, -647536, -2557222, -2751177, -805303, 1983624, 3319360, 1881080, -1076605]
34936a076605j572885J266677K399256P93520j176032r60889Q66516J719716M89156
34927B748430j509412k537315j942173k9449K095455K770678J345246o35475j245758
34918A060227q13833r31998j306813k25507J726254J621291j012199k561550n59644
34909c003772K326009K329461K04137o20119L18396O76933Q0945M34095J584015
34900D330100R97678j507740k771936j344294K55037L8417l91751M51384P79428
34891H36323q95298k172705m31939K356250K487285M03352m66939M65664O49328
34882C231321o09000j181369l08757K79589n1443P5196O97172k6079k057728k839812
34872b790910j547639l79188l57105L15609K128922K592730Q72369l4089J447489
$$ y = [-1076605, -2649490, -1382813, 1016443, 1809963, 633931, -326958, 539558, 2259274, 2748430, 1239018, -1298297, -3240470, -3269919, -1174464, 1596214, 2941460, 2305985, 1060227, 246394, -685604, -1992417, -2217924, -491670, 1129621, 117422, -2444128, -3003772, -677763, 1651698, 1855835, 1235716, 1554112, 2231045, 2311990, 2746085, 4330100, 5327778, 3820038, 1048102, -296192, -41155, -2738, -394489, 56895, 836323, -58975, -2231680, -2663619, -307369, 2179916, 2583268, 2116329, 2581993, 3231321, 2622321, 1440952, 1132195, 1411784, 1360341, 1435537, 2132709, 2106630, 48902, -2790910, -4338549, -4717737, -5074842, -4759233, -2630311, -37581, 834788, 800699, 2248188]
34863B248188K151517l20736k697246j113810K182469K332468l89880j781178
34855B611792r39256o04786j224950m90077J301276J098553j063641j485196Q04331
34846H046K218942P81530p98013k71387N42799j96020r27377j40310N38204l18558
34836A437856r66567P3772Q90531k31680j189594L44198K413502J776664p32429
34827C816253j774818q00484l391k75217p30988j147902j594563q41713J590218
34818a762605L157587J573002j011129r73843Q42352N66103k033442l072252r11124
34809c625351J603371K061089J419500Q57729k91159j872722j815656L38495J885297
34800E60593R28741p71545q43335K76153R17496R44656R37393N18788n79336j378362
$$ y = [2248188, 4399705, 4078969, 1381723, 267913, 2450382, 4782850, 4392970, 2611792, 1672536, 1067750, -157200, -647277, 653999, 1752552, 688911, -796285, 8046, 2226988, 3008518, 2210505, 1939118, 2481917, 2285897, 1358520, 1218210, 1756414, 1437856, 471289, 545061, 1435592, 1203912, 14318, 358516, 2772018, 4548682, 3816253, 2041435, 1240951, 1237560, 962343, 231355, -916547, -2511110, -3352823, -1762605, 1394982, 2967984, 1956855, 983012, 1825364, 2391467, 358025, -2714227, -3625351, -2021980, 39109, 1458609, 2316338, 2025179, 152457, -1663199, -1324704, 560593, 1489334, 717789, -125546, 150607, 1068103, 2012759, 2950152, 3468940, 2889604, 1511242]
34790A511242j193628p55165m99289L62673J694316J563416o39717k327908j196491
34781a480551J205843J783695K78486j162352j569154j639122j456022m03660
34773d442837R45420J243633O26883N04791J116362J217523K75587p94461j199782
34764e06881r64458l8027J583823K715203J758717q76541k688358k066602j20333
34755a203457J060016Q07024p7634o25524l36139O71410J511938J225421Q8431
34746C121486n20158k7175M53763j63527j210277j260683k81480M06437J43794
34737F62180k85899j37085R8655l44948j047862q72889K84214J189753R89745
34728E35864L87038M38217Q00775K59551j138861j762498p15283O36809N14538
$$ y = [1511242, 317614, -437551, -936840, -574167, 1120149, 2683565, 2043848, -284060, -1480551, -274708, 1508987, 1787473, 625121, -944033, -2583155, -4039177, -4442837, -3497417, -2253784, -1626901, -1122110, -5748, 1211775, 1487362, 692901, -506881, -1471339, -1509366, 74457, 2789660, 4548377, 3671836, 983478, -1083124, -1203457, -143441, 663583, 585949, -39575, -375714, 295696, 1807634, 3033055, 3121486, 2601328, 2574153, 3027916, 2864389, 1654112, 393429, 111949, 518386, 662180, 376281, 239196, 337851, -7097, -1054959, -1927848, -1643634, -453881, 535864, 922902, 1361119, 2161894, 2421445, 1282584, -479914, -1195197, -558388, -43850]
34719d3850o25981p38280O73624J679365P54982r28811j221141m6233P57186K40874
34709E01735o03337o73724j30211M67213J000597J177739M39321p27985p87064
34700F64284N14428J293973L86923n63374J73656J143420j07582k566508k757596
34691a818376n8212K300839K021022L75239p16998j107003q22386P29472K493232
34682C396829J929089p60824j907400m7088J304151n42687k639114j399685J013976
34673C47247M23366j844012j134325K205750L053511M6223k322339j269784L59829
34664a34534k53057j490358j196396n51274r80816r46123Q79309K322433J020146
34655a330670j403303j787691j96252Q87030O55867L61081O18521Q73946Q43677
$$ y = [-43850, -669831, -1408111, -734487, 944878, 1699860, 771049, -450092, -496325, 260861, 501735, -101602, -775326, -905537, -438324, 562273, 1740012, 2179333, 1451348, 664284, 1178712, 2472685, 2859608, 2296234, 2469890, 3613310, 3505728, 939220, -1818376, -1876588, 424251, 2445273, 2820512, 2103514, 996511, 174125, 903597, 3396829, 5325918, 4565094, 2657694, 2610606, 3914757, 3372070, 732956, -666729, 347247, 770613, -1073399, -2207724, -1974, 3051537, 3097760, 775421, -494363, -134534, -387591, -1877949, -3074345, -3625619, -4606435, -5552558, -4673249, -2350816, -1330670, -2733973, -4521664, -4717916, -3830886, -3175019, -2813938, -2195417, -1321471, -477794]
34646d77794N53837k27818j093999p57452Q34576J680844O19649o73648l99846
34637E8349M67381J49036p90157p31825l3251j43278p23984k56190J137082J836779
34627I69942J260527K53998n46436r81597o92867J28339J90572r84445j688532
34618b090499m68023J267412J270962n0823o19866j63421m1818l46186K8500Q33779
34608c79983P52058M841k9103L48862m51074j982387j828259M03330J999975J130116
34598c1624n69213p41791M07957J109394P13580j85343j208096k229372k509319
34589e243827j128147J585546L724723L342014N40651k153224k256139k75861
34581a864264R56960K55017m13645N42709J450526K24249j683945j287543R61697
$$ y = [-477794, 76043, -151775, -1245774, -2003226, -1168650, 512194, 1131843, 458195, 58349, 525730, 674766, -115391, -847216, -880467, -1023745, -1747729, -2003919, -866837, 969942, 2230469, 2484467, 1938031, 956434, 263567, 391906, 582478, -401967, -2090499, -2558522, -1291110, -20148, -70971, -690837, -854258, -896076, -1242262, -1213762, -379983, 372075, 376916, 347813, 696675, 245601, -1736786, -3565045, -3161715, -1161740, -31624, -600837, -1342628, -934671, 174723, 888303, 702960, -505136, -2734508, -5243827, -6371974, -4786428, -1061705, 2280309, 2820960, 667736, -1588403, -1864264, -907304, -652287, -1065932, -523223, 927303, 1151552, -532393, -1819936, -858239]
34572h58239J708167P3202j114920k24342N23571r74081k915541k248918O41508
34563e389593K493684J691040k8306m13711N23688J228053R96375N79914N81789
34554B262933L98308n06553j121724k13072J148285M87856k132713l452036j633795
34545d762511P92591P49898p28922n27510J430956K452310J624373O22669K17114
34536A870968n72870j592511j180335N90909J358692J57989j055506o22376O01377
34527d43663J268954J311255O66510j155024l039831k521618L79444K227232R81207
34518c25534q45826k12190J639865J422242q06371j881294n27336J086089J011017
34509E60662Q3463P066Q12630J311170Q96856j00871j183735j923869j754540
$$ y = [-858239, 849928, 923130, -191790, -416132, 107439, -866642, -3782183, -6031101, -5389593, -2895909, -1204869, -1233175, -1646886, -1123198, 104855, 1101230, 1681144, 2262933, 2661241, 2154688, 1032964, 819892, 1968177, 2456033, 323320, -3128716, -4762511, -3969920, -3220022, -3948944, -4476454, -3045498, -593188, 1031185, 1653854, 1870968, 1298098, -294413, -1474748, -883839, 474853, 632842, -422664, -1045040, -443663, 825291, 2136546, 2803056, 1648032, -1391799, -3913417, -3533973, -1306741, -325534, -1171360, -1383550, 256315, 1678557, 872186, -1009108, -1536444, -450355, 560662, 644125, 651191, 1463821, 2774991, 3671847, 3570976, 2387241, 463372, -1291168]
34500a291168l94690J319448J733421K33629j523629j343399M75312J289313j05287
34491C92950j574540q86845Q64876J214842L19096K33759J018665P36368p67622
34482A551549j344756l37191K20037p77243j520289l46106J627652K425439J749387
34473C248479L15806j334778k209284j227021N48634M03350j856995k792196k99081
34464e203086K856980K983283P12224o53937l35951k65663j013063r58854M23150
34455a454917J410905Q82890J30783P94850K356736K735243Q75344j885533l113453
34446B732848j920817J7822O14553R017j46058M17550L46523o20101r91640j75412
34436B84285N32427M82470P57512J545458J062946j189656k676969j515491M50087
$$ y = [-1291168, -1685858, -366410, 1367011, 1600640, 77011, -1266388, -791076, 498237, 392950, -1181590, -2068435, -1203559, 11283, 330379, 564138, 1582803, 2319171, 1551549, 206793, -130398, 89639, -687604, -2207893, -2553999, -926347, 1499092, 3248479, 3564285, 2229507, 20223, -1206798, -658164, -254814, -2111809, -4904005, -5203086, -2346106, 637177, 1349401, 695464, 359513, 93850, -919213, -1878067, -1454917, -44012, 838878, 969661, 1764511, 4121247, 6856490, 7731834, 5846301, 2732848, 812031, 829853, 1444406, 1453423, 1307365, 1724915, 2071438, 1451337, 459697, 284285, 816712, 1299182, 2056694, 3602152, 4665098, 3475442, 798473, -717018, -266931]
34427b66931P46951J91382P40376J412563o6797k727587l167545o02919K148889
34418a591618K821317J966276Q02586n24562j841734k229808j302315R3551R14981
34409h91326P87014o0774q62687p70369l7120R3729n37339m77329O84333J042675
34399a029193n20838k019750j442011r6939o2975l28180J005234K446894J311190
34390g36568r94218o78385J821359K093472q22975k553365o18573J461016J35426
34381h92811k337071j755914J354163L000939J857700K79270o770J97948n1780
34372A645674l28313j96119j13470l52609l65117K06222P64132N17677m18378
34363A359699j033630n02796Q12285J644158J266209K47336o30806j514045k645284
$$ y = [-266931, 480020, 671402, 1411778, 2824341, 2757544, 29957, -3137588, -3740507, -1591618, 1229699, 3195975, 3998561, 3473999, 1632265, -597543, -1899858, -1806307, -891326, -104312, -165086, -1027773, -1798142, -1835262, -1741533, -2278872, -2756201, -2071868, -1029193, -1550031, -3569781, -5011792, -5108731, -5171706, -5499886, -4494652, -2047758, -736568, -1730786, -2409171, -587812, 1505660, 682685, -1870680, -2489253, -1028237, -892811, -3229882, -4985796, -3631633, -630694, 1227006, 1506276, 1499506, 1697454, 1645674, 1317361, 1121242, 1007772, 655163, 290046, 496268, 1260400, 1778077, 1359699, 326069, -176727, 635558, 2279716, 3545925, 3793261, 3162455, 1648410, -996874]
34354i96874l083763j664384J012407K956505L120325K135577R28867j8269k41216
34345D149175L39623P46072J44307n89785k54268K10692j007131l029526k864227
34336b155068r6699J895436O90166j742802k059214N135K036233K307951J019184
34327A900322p11888j606504q90717O32483J075737j08236j324335j239331n73306
34318b845775m87313o41572j30986Q51078J523279J675053J324090L28527p79656
34309H16725q54070R2895N92694N4476k91533K22473L81146m71055q27228K57897
34299b5580R73704k76750j625354m84982J858975J889725n56603k011782q73365
34290a132012M12847k35807j173015j17531J728735J347727j316879k849148q57233
$$ y = [-996874, -4080637, -5745021, -4732614, -1776109, 1344216, 3479793, 4408660, 4390391, 4149175, 4488798, 5234870, 5379177, 4789392, 4535124, 4745816, 3738685, 709159, -2155068, -2251767, -356331, 333835, -1408967, -3468181, -3463046, -1426813, 881138, 1900322, 1188434, -418070, -1308787, -676304, 399433, 291197, -1033138, -2272469, -2845775, -3333088, -3974660, -4105646, -3254568, -1731289, -56236, 1267854, 1596381, 816725, -37345, 55550, 648244, 702720, 411187, 633660, 1014806, 543751, -283477, -25580, 948124, 671374, -953980, -1438962, 420013, 2309738, 1753135, -258647, -1132012, -719165, -954972, -2127987, -2245518, -516783, 830944, -485935, -3335083, -4192316]
34281d192316K875414M602226K922554k00709k233712k536125j820428n86673
34273a169769P78189J287639L30924j001173j120420k46273J57317m745M69159
34264e19152J376002J042653n01968j070820p8775K08944j171144j617881O03794
34255a728347K598261J013045k230839k520439L88829K263639J063073n73222
34247B74000j81917J023479R59556n1270n64427l80745l0173M78787J089650J159797
34237C776737M25401n83404j512450k285589k162316m73009J497849J446339o10461
34228d80903k019891j198963M61971J187393J057575O25345l74829j531609j219226
34219c493137P10160J762791L20129j568460j172745P88941J568636O65715r6565
$$ y = [-4192316, -1316902, 3285324, 6207878, 6007169, 3773457, 1237332, -583096, -1169769, -391580, 896059, 1226983, 225810, -894610, -1140883, -983566, -988311, -519152, 856850, 1899503, 1397535, 326715, 247940, 456884, -714260, -2332141, -1728347, 869914, 1882959, -347880, -2868319, -2479490, -215851, 847222, 274000, 92083, 1115562, 2075118, 2023848, 1459421, 1078676, 1048503, 1527290, 2616940, 3776737, 4202138, 3618734, 2106284, -179305, -2341621, -2814630, -1316781, 129558, -480903, -2500794, -3699757, -3237786, -2050393, -992818, -367473, -742302, -2273911, -3493137, -2782977, -1020186, -700057, -2268517, -3441262, -2652321, -1083685, -417970, -514535]
34210e14535N410n0239m71948j70137Q73146J129830N0403q98318m90781N26045
34200a1124P32077j38642j281252j757079j020822M98546J253854K46959j116295
34191b593778m43237K048195L236955J329557j411736j718314K42661J438530
34183B128833L36129j364112j476517o4735J229406J370445N70858n28378j424944
34174G76985j761191j444930p82852j68465K90923O29805P54361O78358Q04027
34165b22979J415293J906374J147165j054408l248677l541392j438724J640190
34157c397158L518301K909744M09990j834221j876575J19028J982303J917893
34149C749305L66032r57214j206000p24406J51584J265643J837307J007354o20101
$$ y = [-514535, -509125, -559364, -1031312, -1201449, -328303, 801527, 851930, -46388, -537169, -11124, 720953, 582311, -698941, -2456020, -3476842, -2978296, -1724442, -1477483, -2593778, -3037015, -988820, 2248135, 3577692, 2165956, 447642, 690303, 2128833, 2464962, 1100850, -375667, -440402, 789004, 2159449, 2730307, 2201929, 776985, -984206, -2429136, -3211988, -3380453, -3089530, -2459725, -1705364, -1027006, -222979, 1192314, 3098688, 4245853, 3191445, -57232, -3598624, -5037348, -3397158, 121143, 3030887, 3440877, 1606656, -269919, -150891, 1831412, 3749305, 4115337, 3158123, 1952123, 1227717, 1379301, 2644944, 4482251, 5489605, 4869504]
34140D869504j433112j157632j168285j852498j518660P42646K763981J903054
34132C148998r96915k476173j035187J248695J884609Q24108m70229j163233j249082
34123b84409p75747M9L16391k65049j022816p88371N78806J859513J688491Q7831
34113A394689j207159l94624K007706L094962R36522k487053l315132q17156J542409
34104G55164Q47731j334012j459412Q05499K251415Q50689j469195j729266N3735
34095d27652J336747Q08458k27432m06562l39216r16527j124335L22567J933664
34086I59712Q68533k266724l189482m7787L270990K647264p2482k53309J952091
34077C868806K104760q76014k899278j586832J47371m04106j379601n78212K35019
$$ y = [4869504, 3436392, 2278760, 1110475, -742023, -2260683, -1518037, 1245944, 3148998, 2152083, -324090, -1359277, -110582, 1774027, 2598135, 2127906, 964673, -284409, -1060156, -1060107, -743716, -1008765, -2031581, -2819952, -2241146, -381633, 1306858, 1394689, 187530, -207094, 1800612, 4895574, 5832096, 3345043, 29911, -787245, 755164, 1602895, 268883, -1190529, -385030, 1866385, 2717074, 1247879, -481387, -427652, 909095, 1717553, 1490121, 1083559, 744343, -172184, -1296519, -973952, 959712, 1828245, -438479, -3627961, -3675748, -404758, 2242506, 2170024, 1916715, 3868806, 5973566, 5097552, 2198274, 611442, 758813, 354707, -1024894, -1603106, -1368087]
34068a368087q07110j274810J313533L910268K157252j928667k607351K96564
34060c08408J299878j327081k799357k68408K296771R80626j634469j239045R95956
34051b003537R21570j420129k130911J24202K469003K534299J241726L73981J04961
34042B215165k50713q33778j265677j116331k66832O02399M83638l48698l08664
34033a089491R97506J697488M76423j049042o68632R90139J540169L92322j011551
34024B275331j797642k168403j794113j04235J887003K253620Q32544o23947j020624
34015b60466q34563m78056K72744R84619O39066n17357r10296p712P84105K61688
34005f6228q83155j267217o49531J80616N81946M86937J27073k06447k97251l0769
$$ y = [-1368087, -2175197, -3450007, -2136474, 1773794, 3931046, 2002379, -604972, -308408, 991470, -335611, -3134968, -3403376, -1106605, -125979, -1760448, -2999493, -2003537, -1081967, -2502096, -4633007, -4508805, -2039802, 494497, 1736223, 2110204, 2215165, 1964452, 1130674, -135003, -1251334, -1518166, -915767, -432129, -780827, -1089491, -91985, 1605503, 2081926, 1032884, 364252, 1354391, 2894560, 3286882, 2275331, 477689, -1690714, -3484827, -3589062, -1702059, 551561, 1384105, 760158, -260466, -1095029, -1573085, -1300341, -315722, 323344, -194013, -1104309, -1112021, -327916, -66228, -949383, -2216600, -2866131, -2685515, -2103569, -1616632, -1489559, -1696006, -1993257, -2024026]
$$ [...]
##END NTUPLES=NMR SPECTRUM
##END=
