##TITLE=31Pdec_LR-747-V1-M1
 CDCl3, 24 sc
 10.3.2022
##JCAMPDX= 6.0         $$ Bruker NMR JCAMP-DX V2.0
##DATA TYPE= NMR SPECTRUM
##DATA CLASS= NTUPLES
##ORIGIN= UXNMR, Bruker Analytische Messtechnik GmbH
##OWNER= root
$$ XWIN-NMR		Version 3.5
$$ Thu Mar 10 11:47:02 2022 Russian Standard Time (UT+4h)  she@DPX200
##.OBSERVE FREQUENCY= 81.013821
##.OBSERVE NUCLEUS= ^31P
##.ACQUISITION MODE= SIMULTANEOUS
##.ACQUISITION SCHEME= undefined
##.AVERAGES= 24
##.DIGITISER RES= 16
##SPECTROMETER/DATA SYSTEM= spect
##.PULSE SEQUENCE= zgpg30
##.SOLVENT NAME= CDCl3
##.SHIFT REFERENCE= (INTERNAL, CDCl3, 0, 248.564)
##AUDIT TRAIL= $$ (NUMBER, WHEN, WHO, WHERE, WHAT)
$$ ##TITLE= Audit trail, XWIN-NMR		Version 3.5
$$ ##JCAMPDX= 5.01
$$ ##ORIGIN= Bruker BioSpin GmbH
$$ ##OWNER= she
$$ F:/spectra/data/she/nmr/P31/1/pdata/1/auditp.txt
$$ ##AUDIT TRAIL=  $$ (NUMBER, WHEN, WHO, WHERE, WHAT)
(   1,<2022-03-10 11:43:03.14 +0400>,<she>,<DPX200>,
      <created by zg, POWCHK disabled, PULCHK disabled
       configuration hash MD5:
       00 E9 B6 7A A2 85 ED C7 34 08 36 98 17 FE 4E 26
       data hash MD5: 32K
       B4 7D 78 CF EB 55 65 60 1F 96 90 FE C1 0E 5A A9>)
(   2,<2022-03-10 11:46:06.39 +0400>,<she>,<DPX200>,
      <Start of raw data processing
       efp BC_mod = 2 LB = 1 FT_mod = 6 PKNL = 1 PHC0 = -9230.272 PHC1 = 210.0745 SI = 64K 
       data hash MD5: 64K
       0E FF 29 63 53 6E BE C9 94 E4 4D 85 8E 8C BD 76>)
(   3,<2022-03-10 11:46:30.85 +0400>,<she>,<DPX200>,
      <pk PHC0 = 56.46408 PHC1 = -121.2 
       data hash MD5: 64K
       1D B6 65 A4 BE 8F 5C 1D 78 15 E0 2F CB F6 F7 26>)
(   4,<2022-03-10 11:46:33.87 +0400>,<she>,<DPX200>,
      <abs ABSG = 5 
       data hash MD5: 64K
       61 BC 08 44 B1 E7 C2 C0 69 A4 AE 7D AD 21 81 C6>)
$$ ##END=
$$ 
$$ hash MD5
$$ FF D2 9D 29 18 04 B0 75 AC 36 19 7B 27 81 C7 73
##$RELAX= 
##$RELAX= 
##$RELAX= 
##$RELAX= 
##$RELAX= 
##$RELAX= 
##$RELAX= 
##$RELAX= 
$$ Bruker specific parameters
$$ --------------------------
##$DU= <F:/spectra>
##$EXPNO= 1
##$NAME= <P31>
##$PROCNO= 1
##$TYPE= <nmr>
##$USER= <she>
##$AMP= (0..31)
100 100 100 100 100 100 100 100 100 100 100 100 100 100 100 100 100 100 
100 100 100 100 100 100 100 100 100 100 100 100 100 100 
##$AQSEQ= 0
##$AQ_mod= 1
##$AUNM= <au_zg>
##$AUTOPOS= <>
##$BF1= 81.014009
##$BF2= 200.13
##$BF3= 200.13
##$BF4= 200.13
##$BF5= 200.13
##$BF6= 200.13
##$BF7= 200.13
##$BF8= 200.13
##$BYTORDA= 1
##$CFDGTYP= 0
##$CFRGTYP= 5
##$CHEMSTR= <none>
##$CNST= (0..31)
1 1 145 1 1 1 1 1 1 1 1 1 1 1 1 1 1 1 1 1 1 1 1 1 1 1 1 1 1 1 1 1 
##$CPDPRG= <waltz16>
##$CPDPRG1= <>
##$CPDPRG2= <waltz16>
##$CPDPRG3= <>
##$CPDPRG4= <mlev>
##$CPDPRG5= <mlev>
##$CPDPRG6= <mlev>
##$CPDPRG7= <mlev>
##$CPDPRG8= <mlev>
##$CPDPRGB= <>
##$CPDPRGT= <>
##$D= (0..31)
0 1 0 0 0 0 0 0 0 0 0 0.03 2e-05 3e-06 0 0 0 0 0 0 0 0 0 0 0 0 0 0 0 0 
0 0 
##$DATE= 1646898182
##$DBL= (0..7)
120 120 120 11 120 120 24 19 
##$DBP= (0..7)
150 150 150 150 150 150 150 150 
##$DBP07= 0
##$DBPNAM0= <>
##$DBPNAM1= <>
$$ [...]
##$SUBNAM3= <"">
##$SUBNAM4= <"">
##$SUBNAM5= <"">
##$SUBNAM6= <"">
##$SUBNAM7= <"">
##$SUBNAM8= <"">
##$SUBNAM9= <"">
##$SW= 501.771253377433
##$SWIBOX= (0..15)
0 1 3 0 0 0 0 0 0 0 0 0 0 0 0 0 
##$SW_h= 40650.406504065
##$TD= 32768
##$TD0= 1
##$TE= 0
##$TE2= 300
##$TE3= 300
##$TEG= 300
##$TL= (0..7)
0 120 53 12 22 120 120 120 
##$TP= (0..7)
150 150 150 150 150 150 150 150 
##$TP07= 0
##$TPNAME0= <>
##$TPNAME1= <>
##$TPNAME2= <>
##$TPNAME3= <>
##$TPNAME4= <>
##$TPNAME5= <>
##$TPNAME6= <>
##$TPNAME7= <>
##$TPOAL= (0..7)
0.5 0.5 0.5 0.5 0.5 0.5 0.5 0.5 
##$TPOFFS= (0..7)
0 0 0 0 0 0 0 0 
##$TUNHIN= 0
##$TUNHOUT= 0
##$TUNXOUT= 0
##$USERA1= <user>
##$USERA2= <user>
##$USERA3= <user>
##$USERA4= <user>
##$USERA5= <user>
##$V9= 5
##$VALIST= <valist>
##$VCLIST= <CCCCCCCCCCCCCCC>
##$VD= 0
##$VDLIST= <DDDDDDDDDDDDDDD>
##$VPLIST= <PPPPPPPPPPPPPPP>
##$VTLIST= <TTTTTTTTTTTTTTT>
##$WBST= 1024
##$WBSW= 4
##$XGAIN= (0..3)
0 0 0 0 
##$XL= 0
##$YL= 0
##$YMAX_a= 3372
##$YMIN_a= -3671
##$ZGOPTNS= <>
##$ZL1= 120
##$ZL2= 120
##$ZL3= 120
##$ZL4= 120
##$ABSF1= 248.5645
##$ABSF2= -253.2056
##$ABSG= 5
##$ABSL= 3
##$ALPHA= 0
##$AQORDER= 0
##$ASSFAC= 0
##$ASSFACI= 0
##$ASSFACX= 0
##$ASSWID= 0
##$AUNMP= <proc_1d>
##$AZFE= 0.1
##$AZFW= 0.5
##$BCFW= 0
##$BC_mod= 2
##$BYTORDP= 0
##$COROFFS= 0
##$CY= -3
##$DATMOD= 1
##$DC= 0
##$DFILT= <>
##$DTYPP= 0
##$F1P= 0
##$F2P= 0
##$FCOR= 1
##$FTSIZE= 65536
##$FT_mod= 6
##$GAMMA= 0
##$GB= 0
##$INTBC= 1
##$INTSCL= 5.30512e-09
##$ISEN= 30
##$LB= 1
##$LEV0= 0
##$LPBIN= 0
##$MAXI= 10000
##$MC2= 0
##$MEAN= 0
##$ME_mod= 0
##$MI= 50
##$NCOEF= 0
##$NC_proc= -7
##$NLEV= 6
##$NOISF1= 182.463
##$NOISF2= 159.3651
##$NSP= 0
##$NTH_PI= 0
##$NZP= 0
##$OFFSET= 248.5645
##$PC= 4
##$PHC0= -9173.809
##$PHC1= 88.8745
##$PH_mod= 1
##$PKNL= yes
##$PPARMOD= 0
##$PSCAL= 0
##$PSIGN= 0
##$REVERSE= no
##$SF= 81.014009
##$SI= 65536
##$SIGF1= 159.3651
##$SIGF2= -187.1042
##$SINO= 113.3802
##$SIOLD= 16384
##$SREGLST= <1H.CDCl3>
##$SSB= 0
##$STSI= 65536
##$STSR= 0
##$SW_p= 40650.406504065
##$SYMM= 0
##$S_DEV= 0
##$TDeff= 32768
##$TDoff= 0
##$TI= <>
##$TILT= no
##$TM1= 0
##$TM2= 0
##$TOPLEV= 0
##$USERP1= <user>
##$USERP2= <user>
##$USERP3= <user>
##$USERP4= <user>
##$USERP5= <user>
##$WDW= 1
##$XDIM= 65536
##$YMAX_p= 399144010
##$YMIN_p= -11170306
$$ End of Bruker specific parameters
$$ ---------------------------------
##NTUPLES= NMR SPECTRUM
##VAR_NAME=  FREQUENCY,     SPECTRUM/REAL,   SPECTRUM/IMAG
##SYMBOL=    X,             R,               I
##VAR_TYPE=  INDEPENDENT,   DEPENDENT,       DEPENDENT
##VAR_FORM=  AFFN,          ASDF,            ASDF
##VAR_DIM=   65536,         65536,           65536
##UNITS=     HZ,            ARBITRARY UNITS, ARBITRARY UNITS
##FACTOR=    0.620285442955139, 1,           1
##FIRST=     20137.2065510759, 0,            0
##LAST=      -20513.1999529892, 0,           0
##MIN=       -20513.1999529892, -11170306,   0
##MAX=       20137.2065510759, 399144010,    0
$$ Real data points
##PAGE= N=1
##DATA TABLE= (X++(R..R)), XYDATA
$$ [...]
$$ plain form
39331 2156790 1453166 -1931034 -5405822 -6779235 -5694942 -3436501 -1548513 -314588
39323 -314588 1109598 2708446 2776356 291991 -2761434 -3345070 -1382376 148587 -696030
39314 -696030 -2621947 -3509301 -3088605 -2227980 -1215790 -83869 515912 75247 -884887
39305 -884887 -1719034 -2685490 -4064105 -5005835 -4461807 -2822297 -1470187 -838831 40150
39296 40150 1828610 3491151 3295376 1223668 -269238 1187673 4614485 6360112 4745785
39287 4745785 2385261 2295866 3367274 2428285 -216195 -944657 1349141 3391799 2718224
39278 2718224 1157753 1059801 1167646 -900224 -4324306 -6250585 -5753970 -3953955 -1593751
39269 -1593751 804980 1717235 440968 -916566 -172833 1241062 493927 -1614709 -1510689
$$ packed form
39331B156790p03624l384200l474788j373413J084293K258441J887988J233925
39323c14588J424186J598848O7910k484365l053425n83636J962694J530963q44617
39314f96030j925917q87354M20696Q60625J012190J131921N99781m40665r60134
39305h84887q34147r66456j378615r41730N44028J639510J352110O31356Q78981
39296D0150J788460J662541j95775k071708j492906J456911L426812J745627j614327
39287D745785k360524q9395J071408r38989k644480p28462K293798K042658o73575
39278B718224j560471r7952J07845k067870l424082j926279M96615J800015K360204
39269a593751K398731R12255j276267j357534P43733J413895p47135k108636J04020
$$ plain form
39260 -1510689 1451829 3891997 3523607 1893651 1051942 730413 233461 247613 989748
39251 989748 889985 -986999 -2989381 -3078493 -1579060 -299362 -201347 -1183610 -2868786
39242 -2868786 -4366448 -4427901 -2981830 -1522212 -1174028 -1504600 -1766346 -1748483 -822056
39233 -822056 1822319 4954476 5503059 2568308 -671020 -911671 1087897 2292670 1841995
39224 1841995 1358840 1831862 2581236 2876709 2583692 1495608 -314222 -1805288 -2036424
39215 -2036424 -1431481 -774126 196888 1811783 3138697 3260478 2854962 2803429 2425885
39206 2425885 1057917 29376 653235 1518180 625226 -895250 -477524 1351267 1909887
39197 1909887 1356907 2434534 4972482 5315364 2461376 162430 825904 1745413 328834
$$ packed form
39260a510689K962518K440168l68390j629956q41709l21529m96952J4152P42135
39251I89748r9763j876984k002382q9112J499433J279698R8015r82263j685176
39242b868786j497662o1453J446071J459618L48184l30572k61746J7863R26427
39233h22056K644375L132157N48583k934751l239328k40651J999568J204773m50675
39224A841995m83155M73022P49374K95473k93017j088084j809830j491066k31136
39215b036424O04943O57355R71014J614895J326914J21781m05516n1533l77544
39206B425885j367968j028541O23859Q64945q92954j520476M17726J828791N58620
39197A909887n52980J077627K537948L42882k853988k298946O63474R19509j416579
$$ plain form
39188 328834 -1034165 762361 3709462 3666327 929239 -839122 -767486 -1119234 -2218315
39179 -2218315 -1838517 127140 794772 -1066787 -3364542 -4661266 -6113698 -8023596
39171 -8023596 -8020383 -4810367 -938323 465310 -394887 -1255956 -1068726 -126695 1301729
39162 1301729 2601811 2573982 1185820 107896 224515 451037 281823 1053994 2844177
39153 2844177 2855331 -420168 -3926701 -4194003 -2562572 -2481115 -3494780 -2479076 284889
39144 284889 1333104 147432 -97654 1405111 1512898 -735847 -1496870 1577062 4843834
39135 4843834 4115815 1050077 8341 1248707 1673864 558718 -35068 265992 -383860
39126 -383860 -2094354 -2639274 -1380223 -413243 -885282 -1125831 290460 2057916 2212087
$$ packed form
39188C28834j362999J796526K947101m3135k737088j768361P1636l51748j099081
39179b218315L79798J965657O67632j861559k297755j296724j452432j909898
39171h023596L213L210016L872044J403633q60197q61069J87230R42031J428424
39162A301729J300082k7829j388162j077924J16619K26522j69214P72171J790183
39153B844177J1154l275499l506533k67302J631431Q1457j013665J015704K763965
39144B84889J048215j185672k45086J502765J07787k248745p61023L073932L266772
39135D843834p28019l065738j041736J240366M25157j115146n93786L01060o49852
39126c83860j710494n44920J259051R66980m72039k40549J416291J767456J54171
$$ plain form
39117 2212087 941396 -47413 202487 1241955 1902664 1100459 -1071320 -2795665 -2255105
39108 -2255105 -78100 1289222 816906 -108642 -259632 -335100 -1376481 -3041015 -4472310
39099 -4472310 -5520254 -6004344 -4997609 -2151529 1059819 2587807 1861699 -83970
39091 -83970 -1851659 -2388233 -1251560 974173 3027447 4278105 5098062 5649563 5384745
39082 5384745 4359028 3835291 4547380 5318562 4583065 2576538 868398 312656 601350
39073 601350 1288938 1984507 1911484 655097 -716257 -554918 1140582 2444629 1763535
39064 1763535 -413701 -2284643 -2549272 -1202020 772960 2028232 1664341 22198
39056 22198 -1382347 -1083699 1002015 3478417 4747004 4444161 3619997 3518648 4377920
$$ packed form
39117B212087j270691r88809K49900J039468O60709q02205k171779j724345N40560
39108b255105K177005J367322m72316r25548j50990p5468j041381j664534j431295
39099d472310j047944m84090J006735K846080L211348J527988p26108j945669
39091h3970j767689n36574J136673K225733K053274J250658Q19957N51501k64818
39082E384745j025717n23737P12089P71182p35497k006527j708140n55742K88694
39073F01350O87588O95569p3023j256387j371354J61339J695500J304047o81094
39064A763535k177236j870942k64629J347252J974980J255272l63891j642143
39056B2198j404545K98648K085714K476402J268587l02843q24164j01349Q59272
$$ plain form
39047 4377920 5539910 6345282 6442437 5550064 3729715 1872444 1060677 1267881 1487816
39038 1487816 1320620 1425944 2009941 2036397 821221 -550698 -602093 346229 688692
39029 688692 -6547 -431112 367025 1532564 1663374 714548 -166763 -387820 -696719
39020 -696719 -1997052 -3781088 -4273847 -2398541 605924 2025153 362058 -3063766
39012 -3063766 -5458775 -5310405 -3528949 -2027850 -1686789 -1968414 -2161762 -2258671 -2326382
39003 -2326382 -1771270 -220790 1161533 666579 -1308427 -2120058 -328924 2157111 2817822
38994 2817822 2006629 1632081 1486400 -266418 -3275967 -4854606 -4165383 -3448013 -3926819
38985 -3926819 -3644039 -1338090 443975 -976525 -3742037 -3853916 -1024045 1292059
$$ packed form
39047D377920J161990Q05372R7155q92373j820349j857271q11767K07204K19935
39038A487816j67196J05324N83997K6456j215176j371919n1395R48322L42463
39029F88692o95239m24565P98137J165539J30810r48826q81311k21057l08899
39020f96719j300333j784036m92759J875306L004465J419229j663095l425824
39012c063766k395009J48370J781456J501099L41061k81625j93348r6909o7711
39003b326382N55112J550480J382323m94954j975006q11631J791134K486035O60711
38994B817822q11193l74548j45681j752818l009549j578639O89223P17370m78806
38985c926819K82780K305949J782065j420500k765512j11879K829871K316104
$$ plain form
38977 1292059 1186956 238946 34509 -11186 -572548 -962818 -936472 -1558003 -2898961 -2986025
38967 -2986025 -738955 1739009 1714386 -504329 -2326698 -2487344 -1956332 -1634142 -1099740
38958 -1099740 71541 1291817 1895905 2068063 2186101 1987606 1118527 62717 -257642
38949 -257642 277537 803353 646580 96868 -318964 -757836 -1554623 -2099780 -1212206 1138821
38939 1138821 3303519 3603918 1946442 -530703 -2632744 -3435527 -2443803 -447642 553999
38930 553999 -371959 -1374562 29811 3186640 4525501 2142598 -1537413 -2921438
38922 -2921438 -1797737 -936504 -1714225 -2352104 -1158326 392472 -381553 -3176119 -4702881
38913 -4702881 -3200448 -836109 -374718 -1241521 -977763 579941 1321447 713208 545951
$$ packed form
38977A292059j05103r48010k04437m5695n61362l90270K6346o21531j340958q7064
38967b986025K247070K477964k4623k218715j822369j60646N31012L22190N34402
38958a099740J171281J220276O04088J72158J18038j98495q69079j055810l20359
38949b57642N35179N25816j56773n49712m15832m38872p96787n45157Q87574K351027
38939A138821K164698L00399j657476k477145k102041q02783R91724J996161J001641
38930E53999r25958j002603J404373L156829J338861k382903l680011j384025
38922b921438J123701Q61233p77721o37879J193778J550798p74025k794566j526762
38913d702881J502433K364339M61391q66803K63758J557704P41506o08239j67257
$$ plain form
38904 545951 1285621 858688 -1438360 -2867642 -1517018 -5021 -1583561 -4423549 -3915261
38895 -3915261 -5085 2167080 -276617 -3796081 -3628758 -170356 2337139 1671023
38887 1671023 -365912 -1066930 115908 1667932 1988381 1036227 254851 667994 1341362
38878 1341362 667458 -1057092 -1822708 -818202 513208 794023 370517 -86990 -902581
38869 -902581 -2230020 -3118345 -3005616 -2811945 -3250333 -3332778 -2033515 -342705 -24069
38860 -24069 -1025731 -1617733 -698131 1153122 2500190 2185900 363800 -1026692 10090
38851 10090 2618722 3495547 1261381 -1404059 -1544124 105614 1067349 1168825 1780489
38842 1780489 2385734 1303946 -719339 -1048576 626921 1764262 1056586 33259 -89682
$$ packed form
38904E45951P39670m26933k297048j429282J350624J511997j578540k839988N08288
38895c915261L910176K172165k443697l519464J67323L458402K507495o66116
38887A671023k036935p01018J182838J552024L20449r52154p81376M13143O73368
38878A341362o73904j724550p65616J004506J331410K80815m23506m57507q15591
38869i02581j327439q88325J12729J93671m38388q2445J299263J690810L18636
38860b4069j001662n92002R19602J851253J347068l14290j822100j390492J036782
38851A0090K608632Q76825k234166k665440j40065J649738R61735J01476O11664
38842A780489O05245j081788k023285l29237J675497J137341p07676j023327j22941
$$ plain form
38833 -89682 -159033 -620415 -144853 1819126 3613117 4093474 4473725 5647380 5892984
38824 5892984 3534693 208160 -1004090 303457 1789529 1724763 477280 -847647
38816 -847647 -1513085 -1231035 -543694 -731330 -2179895 -3450595 -3087242 -1532417 -85821
38807 -85821 979883 1873777 2090574 1529522 1605044 3091337 3949812 1938410 -1317246
38798 -1317246 -1868366 1004283 3787249 3718891 1856162 313745 -657866 -1360995 -984415
38789 -984415 713547 1897869 936190 -1048714 -1743043 -746202 567618 1367022 1841922
38780 1841922 2043382 1821817 1458939 1122580 327535 -920003 -1392130 -471443 333088
38771 333088 -469430 -1595879 -648558 1930318 3106644 1658204 -131032 12965 1277198
$$ packed form
38833h9682o9351m61382M75562J963979J793991M80357L80251J173655K45604
38824E892984k358291l326533j212250J307547J486072o4766j247483j324927
38816h47647o65438K82050O87341j87636j448565j270700L63353J554825J446596
38807h5821J065704Q93894K16797n61052P5522J486293Q58475k011402l255656
38798a317246n51120K872649K782966o8358j862729j542417r71611p03129L76580
38789i84415J697962J184322r61679j984904o94329R96841J313820P99404M74900
38780A841922K01460k21565l62878l36359p95045j247538m72127R20687Q04531
38771C33088q02518j126449R47321K578876J176326j448440j789236J43997J264233
$$ plain form
38762 1277198 1475313 228633 -1067985 -1446357 -1094784 -440611 254436 581778 209845
38753 209845 -576771 -1129124 -1166758 -868645 -381018 343712 1203275 1735979 1496210 758350
38743 758350 647876 2032534 4195313 5378778 5018413 4442863 4601161 4314644 2263738
38734 2263738 -278143 -777129 914283 2503954 2823811 2954640 3340300 2533447 134746
38725 134746 -1510721 -574405 1185313 934443 -997338 -1883946 -840845 232871 -149912
38716 -149912 -1128585 -1127942 176790 1920246 2930544 2387385 511665 -1469140 -2722304
38707 -2722304 -3564006 -4000014 -2802549 272412 2603856 1551290 -1511622 -2846410
38699 -2846410 -1727407 -901358 -1416173 -798093 2143185 4312686 2750237 -683940 -2075014
$$ packed form
38762A277198J98115j246680j296618l78372L51573O54173O95047L27342l71933
38753B09845p86616n52353l7634K98113M87627P24730Q59563N32704k39769p37860
38743G58350j10474J384658K162779J183465l60365n75550J58298k86517k050906
38734B263738k541881m98986J691412J589671L19857J30829L85660q06853k398701
38725A34746j645467R36316J759718k50870j931781q86608J043101J073716l82783
38716a49912r78673O43J304732J743456J010298n43159j875720j980805j253164
38707b722304q41702m36008J197465L074961K331444j052566l062912j334788
38699b846410J119003Q26049n14815O18080K941278K169501j562449l434177j391074
$$ plain form
38690 -2075014 -867034 692566 1893485 3692338 5350657 4789035 2420242 1162597
38682 1162597 2032034 2894102 2431991 2112117 2842565 2919463 1428800 756063 2789961
38673 2789961 4939019 3515424 -278769 -1643080 874276 3560485 3279328 1430812
38665 1430812 643857 620795 -287660 -1508973 -1143468 542395 1223863 16761 -1361500
38656 -1361500 -1335394 -619225 -831319 -2100680 -2976852 -2289284 -482449 869891 703876
38647 703876 -485138 -1447682 -1857284 -2393076 -3026429 -2502888 -375113 1669201 1912076
38638 1912076 1088631 1000984 1362181 315870 -1946149 -2605732 -135927 3243558 4350265
38629 4350265 2816443 729896 -361669 -663162 -1069924 -2143471 -3734726 -4819949
$$ packed form
38690b075014J207980J559600J200919J798853J658319n61622k368793j257645
38682A162597Q69437Q62068m62111l19874P30448P6898j490663o72737K033898
38673B789961K149058j423595l794193j364311K517356K686209k81157j848516
38665A430812p86955k3062r08455j221313L65505J685863O81468j207102j378261
38656a361500K6106P16169k12094j269361q76172O87568J806835J352340j66015
38647G03876j189014r62544m09602n35792o33353N23541K127775K044314K42875
38638A912076q23445q7647L61197j046311k262019o59583K469805L379485J106707
38629D350265j533822k086547j091565l01493m06762j073547j591255j085223
$$ plain form
38621 -4819949 -4302635 -2627394 -1694840 -2358640 -3067706 -2092062 -42464 1211503 1210801
38612 1210801 881646 596203 119435 32014 1142586 2500816 2088111 -62637 -1372114
38603 -1372114 -158032 2130918 3241463 3161741 3262192 3451630 2258055 -314043 -1948660
38594 -1948660 -976410 1007899 898565 -1843114 -4347841 -4101955 -2245825 -1765953 -3156567
38585 -3156567 -3890155 -2424108 -619404 -928809 -2784728 -3635331 -2691575 -1615335 -1678400
38576 -1678400 -2143884 -1874006 -1090430 -841610 -1562461 -2677380 -3167876 -2421348 -959842
38567 -959842 -124834 -456840 -816053 47239 1581798 2272557 1931079 1655832 1731072 1307739
38557 1307739 363007 228971 1590814 3463202 4839411 5934245 6951349 6985624 5327469
$$ packed form
38621d819949N17314J675241R32554o63800p09066R75644K049598J253967p02
38612A210801l29155k85443m76768q7421J110572J358230m12705k150748j309477
38603a372114J214082K288950J110545p9722J00451J89438j193575k572098j634617
38594a948660R72250J984309j09334k741679k504727K45886J856130M79872j390614
38585c156567p33588J466047J804704l09405j855919q50603R43756J076240o3065
38576a678400m65484K69878P83576K48820p20851j114919m90496P46528J461506
38567i59842Q35008l32006l59213Q63292J534559O90759l41478k75247P5240m23333
38557A307739r44732j34036J361843J872388J376209J094834J017104L4275j658155
$$ plain form
38548 5327469 2915559 1346435 1052484 1363220 1768715 2228124 2669001 2936370 2920565
38539 2920565 2318046 859814 -807727 -1336092 -475345 186570 -737393 -2332227 -2549243
38530 -2549243 -1192085 -420771 -1961111 -4769619 -6196666 -5135966 -3251555 -2798426
38522 -2798426 -3790506 -4192380 -2867339 -1122742 -673407 -1242776 -1441095 -1116089 -1159642
38513 -1159642 -1555447 -1568666 -1628329 -2831937 -4434394 -4192753 -1851827 40766 -163459
38504 -163459 -950886 -510841 289905 -237028 -1462056 -1395858 276393 2145420 3233844
38495 3233844 3381030 2344577 446365 -592175 586714 2877945 4147435 4152727 4148087
38486 4148087 4209552 3164467 965571 -976170 -1856548 -2074563 -1912179 -1440164 -1455709
$$ packed form
38548E327469k411910j569124k93951L10736M05495M59409M40877K67369j5805
38539B920565o02519j458232j667541n28365Q60747O61915r23963j594834k17016
38530b549243J357158P71314j540340k808508j427047J060700J884411M53129
38522b798426r92080m01874J325041J744597M49335n69369j98319L25006m3553
38513a159642l95805j3219n9663j203608j602457K41641K340926J892593k04225
38504a63459p87427M40045Q00746n26933j225028O6198J672251J869027J088424
38495C233844J47186j036453j898212j038540J178889K291231J269490N292m640
38486D148087O1465j045085k198896j941741q80378k18015J62384M72015j5545
$$ plain form
38477 -1455709 -2485361 -3143292 -1766308 528272 1015139 -428171 -1222273 -515991 -382199
38468 -382199 -1617808 -1879394 124760 1870240 1071313 -299994 730636 3049572 3330569
38459 3330569 1650528 1291320 3297975 4968716 4242171 2408849 1537513 1788429 2317486
38450 2317486 2734102 2733412 2120728 1828625 2901463 3954685 2181962 -2080840 -4557179
38441 -4557179 -2582061 1076666 2323314 1384893 1213928 1884188 532874 -3283043 -5924773
38432 -5924773 -4449879 -350041 2793953 3339180 1991289 -19140 -1665483 -2237856
38424 -2237856 -2032549 -2072231 -2305708 -1262379 1518149 3998410 3931450 1659940 -722259
38415 -722259 -2115250 -2836195 -3049913 -2513643 -1645211 -1318941 -1567900 -1624064 -1113037 -152646
$$ packed form
38477a455709j029652o57931J376984K294580M86867j443310p94102P06282J33792
38468c82199j235609k61586K004154J745480p98927j371307J030630K318936K80997
38459C330569j680041l59208K006655J670741p26545j833322q71336K50916N29057
38450B317486M16616o90o12684k92103J072838J053222j772723m262802k476339
38441d557179J975118L658727J246648r38421j70965O70260j351314l815917k641730
38432e924773J474894M099838L143994N45227j347891k010429j646343n72373
38424b237856K05307l9682k33477J043329K780528K480261o6960k271510k382199
38415g22259j392991p20945k13718N36270Q68432L26270k48959n6164N11027R60391
$$ plain form
38405 -152646 1377785 3368330 4611567 3992669 2512671 2437781 4115723 5281102 4186285
38396 4186285 1939261 738791 942595 1093169 159092 -1431146 -2698778 -3053978 -2308719
38387 -2308719 -520134 1825751 3716681 4051228 2479011 -88838 -2129048 -2970841
38379 -2970841 -3319150 -3986854 -4594079 -4164855 -2612541 -831443 421285 937728 661924
38370 661924 -177357 -745577 -395691 357310 603501 547701 1140527 2368578 3133346 2788137
38360 2788137 1603246 -178471 -2360746 -3887627 -3478080 -1457736 385977 975024
38352 975024 642151 -266634 -1685554 -2540529 -1267827 1679137 3778414 3771025 3160951
38343 3160951 3388625 3552972 2482535 1283415 1798402 3581569 4321708 2841465 323755
$$ packed form
38405a52646J530431J990545J243237o18898j479998p4890J677942J165379j094817
38396D186285k247024j200470K03804J50574r34077j590238j267632l55200P45259
38387b308719J788585K345885J890930L34547j572217k567849k040210q41793
38379b970841l48309o67704o07225M29224J552314J781098J252728N16443k75804
38370F61924q39281n68220L49886P53001K46191n5800N92826J228051P64768l45209
38360B788137j184891j781717k182275j526881M09547K020344J843713N89047
38352I75024l32873r08785j418920q54975J272702K946964K099277p389o10074
38343C160951K27674J64347j070437j199120N14987J783167P40139j480243k517710
$$ plain form
38334 323755 -1136707 -396635 1787096 3190213 2325555 420141 -96820 882571 1175283
38325 1175283 175269 -95444 1088500 1291476 -937261 -3001150 -2254019 -535838 -1118225
38316 -1118225 -3023617 -2553034 474959 2296380 1036507 -913043 -977391 516127 2231943
38307 2231943 3819398 4916381 4735352 3775782 3725236 4671873 4566899 2422952 -87175
38298 -87175 -1253000 -1447613 -1510396 -1145004 -366549 -597361 -2536005 -4363837 -3837802
38289 -3837802 -1194344 1484585 2885234 3063835 2298042 878980 -346303 -557669 -81857
38280 -81857 -72610 -1002644 -1971998 -1669919 7315 1421987 876855 -891781 -1024389 1633811
38270 1633811 4292903 3701774 870151 -345866 992594 1724383 -261938 -2865629
$$ packed form
38334C23755j460462P40072K183731J403117q64658j905414n16961R79391K92712
38325A175283j000014k70713J183944K02976k228737k063889P47131J718181n82387
38316a118225j905392M70583L027993J821421j259873j949550o4348J493518J715816
38307B231943J587455J096983j81029r59570n0546R46637j04974k143947k510127
38298h7175j165825j94613o2783L65392P78455k30812j938644j827832N26035
38289c837802K643458K678929J400649J78601p65793j419062j225283k11366M75812
38280h1857R247r30034r69354L02079J677234J414672n45132j768636j32608K658200
38270A633811K659092n91129k831623j216017J338460P31789j986321k603691
$$ plain form
38262 -2865629 -3241300 -1750439 -465243 159499 892856 1554542 1470995 1069776 1040351
38253 1040351 749100 -673176 -2399251 -2864695 -2133231 -1645165 -1981040 -2345141 -1978989
38244 -1978989 -870641 545957 1372864 646666 -1083955 -1498601 687327 3520247 4169602
38235 4169602 2748607 1707752 1883669 1600362 -49146 -1401650 -709038 1277210 2397453
38226 2397453 1670351 -215656 -2156382 -3424018 -3750215 -3453285 -3290884 -3768284 -4771419
38217 -4771419 -5914928 -6758877 -6700738 -5440798 -3719875 -2709134 -2351423 -1319654 792669
38208 792669 2355375 1887600 511624 630351 2390864 3228731 1425612 -1457993 -2807829
38199 -2807829 -2464186 -2463500 -3800585 -5136661 -4892297 -3225514 -1463150 -666222 -1227747
$$ packed form
38262b865629l75671J490861J285196O24742P33357O61686q3547m01219k9425
38253A040351k91251j422276j726075m65444P31464M88066l35875l64101L66152
38244a978989J108348J416598Q26907p26198j730621m14646K185928K832920O49355
38235D169602j420995j040855J75917k83307j649508j352504O92612J986248J120243
38226B397453p27102j886007j940726j267636l26197K96930J62401m77400j003135
38217d771419j143509q43949N8139J259940J720923J010741L57711J031769K112323
38208G92669J562706m67775j375976J18727J760513Q37867j803119k883605j349836
38199b807829L43643O86j337085j336076K44364J666783J762364P96928n61525
$$ plain form
38190 -1227747 -2812277 -4115520 -3748729 -2042815 -893268 -1074447 -1035815 492237 2105995
38181 2105995 1719535 -47623 -595298 973284 2966825 3783254 3420876 2216299 245401
38172 245401 -1449767 -1094053 1287090 3138850 2391727 64056 -1308671 -978033 -493178
38163 -493178 -1242665 -2465442 -2018954 919666 4152187 4335635 1094748 -1939694 -1523826
38154 -1523826 966309 1778947 311976 -511647 788458 2219229 2050505 1422324 1652303
38145 1652303 1673216 244991 -1431459 -1623679 -1018058 -1482141 -2981356 -3850647 -3444046
38136 -3444046 -2740363 -2779069 -3750363 -5006489 -5081315 -2785032 753646 2485819 1014808
38127 1014808 -1647576 -2994224 -2921967 -2373858 -1204283 598874 1487387 540265 -516416
$$ packed form
38190a227747j584530j303243L66791J705914J149547j81179L8632J528052J613758
38181B105995l86460j767158n47675J568582J993541Q16429l62378j204577j970898
38172B45401j695168L55714K381143J851760p47123k327671j372727L30638M84855
38163d93178p49487j222777M46488K938620L232521J83448l240887l034442M15868
38154a523826K490135Q12638j466971q23623J300105J430771j68724o28181K29979
38145A652303K0913j428225j676450j92220O05621m64083j499215q69291M06601
38136c444046P03683l8706r71294j256126p4826K296283L538678J732173j471011
38127A014808k662384j346648P2257N48109J169575J803157Q88513r47122j056681
$$ plain form
38118 -516416 78749 1052097 306551 -1301658 -1436113 -289606 179121 74693 1084911
38109 1084911 2712998 2680430 1019275 116663 447341 -45567 -1738538 -2297513 -997752
38100 -997752 -409465 -2049605 -3630556 -2775467 -692895 176004 -158915 -313100 -360878
38091 -360878 -1127879 -2047338 -1951052 -961210 168943 1419222 2583641 2428698 655017
38082 655017 -676004 228036 2046714 2374306 1504332 1640306 3035411 3698262 2864860
38073 2864860 2076699 2299200 2354633 1246691 198807 1020072 3489439 5538492 5557071
38064 5557071 3803899 1854662 1057361 1293702 1191065 -133816 -1785358 -2185235 -1211356
38055 -1211356 -270270 -212967 -287057 406764 1373058 1412833 336379 -812151 -1121791 -805809
$$ packed form
38118e16416N95165R73348p45546j608209j34455J146507M68727j04428J010218
38109A084911J628087l2568j661155r02612L30678m92908j692971n58975J299761
38100i97752N88287j640140j580951Q55089K082572Q68899l34919j54185m7778
38091c60878p67001r19459R6286R89842J130153J250279J164419j54943j773681
38082F55017j331021R04040J818678L27592q69974J35974J395105O62851q33402
38073B864860p88161K22501N5433j107942j047884Q21265K469367K049053J8579
38064E557071j753172j949237p97301K36341j02637j324881j651542l99877R73879
38055a211356R41086N7303p4090O93821R66294L9775j076454j148530l09640L15982
$$ plain form
38045 -805809 -726206 -1311657 -2191405 -2764837 -2821381 -2470729 -1765873 -816904 -116867 -100032
38035 -100032 -308019 189209 1187027 1113782 -747316 -2600910 -2044122 636919 2518028
38026 2518028 1611960 -911516 -2598513 -2577438 -1672882 -689295 125252 418044 -119263
38017 -119263 -1000838 -1447012 -1626765 -2295695 -3166192 -3003943 -1749850 -1100330 -2096977
38008 -2096977 -3426322 -3354651 -2264407 -1699705 -1747031 -1319186 -624208 -1137985 -2939248
37999 -2939248 -4209219 -3955035 -3194223 -2635370 -1378337 733611 1635062 -8074 -2020670
37990 -2020670 -1398673 1256048 2615793 1456541 -65569 -42202 800385 898220 -107562
37981 -107562 -1828113 -3731136 -4584904 -3214458 -713192 -10819 -2066395 -4264608 -3999410
$$ packed form
38045h05809P9603n85451q79748n73432n6544L50652P04856R48969P00037J6835
38035a00032k07987M97228R97818p3245j861098j853594N56788K681041J881109
38026B518028r06068k523476j686997K1075R04556R83587Q14547K92792n37307
38017a19263q81575m46174j79753o68930q70497J62249J254093O49520r96647
38008b096977j329345P1671J090244N64702m7326M27845O94978n13777j801263
37999b939248j269971K54184P60812N58853J257033K111948R01451j643136k012596
37990b020670O21997K654721J359745j159252j522110K3367Q42587R7835j005782
37981a07562j720551j903023q53768J370446K501266P02373k055576k198213K65198
$$ plain form
37972 -3999410 -2136689 -1135151 -1266901 -1024823 -320931 -637907 -2110193 -2908262 -2087453
37963 -2087453 -1061907 -1350658 -2420312 -2848189 -2428374 -1890907 -1356121 -433210 461481
37954 461481 181013 -1509189 -3181057 -3075227 -926687 1679821 2669981 1373288 -664931
37945 -664931 -1027336 966931 3275399 3414612 1464365 -241431 -409346 -304987 -1296311
37936 -1296311 -2402181 -1880829 -335411 -145095 -1895701 -3454298 -3139261 -1925688 -1467232
37927 -1467232 -1554387 -1047211 -191748 -217696 -1092502 -1312686 9536 2020110 3239656
37918 3239656 3025472 1883184 893838 760459 1122142 1215735 1344985 2621386 4722243
37909 4722243 5410222 3529952 1040619 276675 487495 -534140 -2389495 -2672379 -1345593
$$ packed form
37972c999410J862721J001538j31750K42078P03892l16976j472286p98069Q20809
37963b087453J025546k88751j069654m27877M19815N37467N34786R22911Q94691
37954D61481k80468j690202j671868J05830K148540K606508R90160j296693k038219
37945f64931l62405J994267K308468J39213j950247j705796j67915J04359r91324
37936a296311j105870N21352J545418J90316j750606j558597L15037J213573M58456
37927a467232q7155N07176Q55463k5948q74806k20184J322222K010574J219546
37918C239656k14184j142288r89346j33379L61683R3593J29250J276401K100857
37909D722243O87979j880270k489333p63944K10820j021635j855355k82884J326786
$$ plain form
37900 -1345593 -1123184 -2809906 -3601120 -1637346 671426 256618 -1844112 -2130204 256145
37891 256145 2876405 3825108 3500612 2553299 615499 -2170953 -4283712 -4592065 -3831895
37882 -3831895 -3340140 -3147102 -2283173 -504958 1196252 1752695 1077901 -110681 -1078332
37873 -1078332 -1475931 -1308445 -931904 -936302 -1435644 -1433010 234464 2868375 3888280 1939791
37863 1939791 -863654 -1470115 -121873 130425 -1796747 -3337035 -2398913 -661397 -738053
37854 -738053 -1963239 -1706853 100303 701230 -1179886 -3374368 -3412129 -1679652 -361009
37845 -361009 -584907 -1744989 -2807843 -3295944 -3341399 -3325546 -3258528 -2554381 -1046240 -4971
37835 -4971 -924706 -3125855 -4018180 -2419765 -250639 121106 -993720 -1568199 -1051148
$$ packed form
37900a345593K22409j686722p91214J963774K308772m14808k100730k86092K386349
37891B56145K620260R48703l24496r47313j937800k786452k112759l08353P60170
37882c831895M91755J93038Q63929J778215J701210N56443o74794j188582r67651
37873a078332l97599J67486L76541m398m99342K634J667474K633911J019905j948489
37863A939791k803445o06461J348242K52298j927172j540288R38122J737516p6656
37854g38053j225186K56386J807156O00927j881116k194482l7761J732477J318643
37845c61009k23898j160082j062854m88101m5455J5853O7018P04147J508141J041269
37835d971r19735k201149q92325J598415K169126L71745j114826n74479N17051
$$ plain form
37826 -1051148 -773192 -1412353 -1897548 -1284634 -312022 -314414 -1469104 -2819889 -3431533
37817 -3431533 -2970256 -1719000 -600645 -713948 -2239146 -4088984 -5073893 -5061150 -4582482
37808 -4582482 -3787412 -2430336 -613333 1095339 2199934 2559286 2379842 2280636 2930054
37799 2930054 4083485 4435019 3146068 1180584 307112 946279 1760941 1282374 -680616
37790 -680616 -3055549 -4332015 -3694011 -1935906 -784168 -710326 -255208 1586023 3480750
37781 3480750 3744358 3023920 2921325 2970468 1694851 19756 330845 2127338 2196766
37772 2196766 -253418 -2398134 -2866226 -3861675 -6124430 -6072572 -1472312 3581523 3720971
37763 3720971 -125847 -2722865 -2196710 -947375 -223512 965327 1815236 -113869 -3877251
$$ packed form
37826a051148K77956o39161m85195O12914R72612k392j154690j350785o11644
37817c431533M61277J251256J118355j13303j525198j849838r84909J2743M78668
37808d582482P95070J357076J817003J708672J104595L59352j79444r9206O49418
37799B930054J153431L51534j288951j965484q73472O39167Q14662m78567j962990
37790f80616k374933j276466O38004J758105J151738P3842M55118J841231J894727
37781C480750K63608p20438j02595M9143j275617j675095L11089J796493O9428
37772B196766k450184k144716m68092r95449k262755N1858M600260N053835J39448
37763C720971l846818k597018N26155J249335P23863J188839Q49909j929105l763382
$$ plain form
37754 -3877251 -4985978 -1781777 1980732 2609154 1032175 62856 247743 500509 349658
37745 349658 -328056 -1725399 -2843986 -1979327 353974 1367522 46553 -1345661 -1109564
37736 -1109564 -621108 -1344388 -2195619 -1957144 -1668131 -2311347 -2586770 -1493950 -879363
37727 -879363 -2706929 -5658712 -7039562 -6343312 -4526164 -1718725 1604723 3112326
37719 3112326 1407523 -1150319 -1466298 -137323 244509 -303853 114287 1061482 322281
37710 322281 -1674410 -1935000 299361 2368642 2380186 1368448 595388 -206956 -959896
37701 -959896 -502106 1051828 1732100 758055 -108582 436066 1006701 -172181 -2468633
37692 -2468633 -3923990 -3832095 -2813328 -1343807 431719 2035653 2873137 2861173 2369247
$$ packed form
37754c877251j108727L204201L762509O28422j576979r69319J84887K52766j50851
37745C49658o77714j397343j118587Q64659K333301J013548j320969j392214K36097
37736a109564M88456p23280q51231K38475K89013o43216k75423J092820O14587
37727h79363j827566k951783j380850O96250J817148K807439L323448J507603
37719C112326j704803k557842l15979J328975L81832n48362M18140R47195p39201
37710C22281j996691k60590K234361K069281J1544j011738p73060q02344p52940
37701i59896M57790J553934O80272r74045q66637N44648N70635j178882k296452
37692b468633j455357R1895J018767J469521J775526J603934Q37484j1964m91926
$$ plain form
37683 2369247 1844204 1571369 1360829 694253 -265203 -488251 147189 -61959 -2094851
37674 -2094851 -3697103 -1899774 2267763 4385642 2402348 -890796 -2107467 -1515597
37666 -1515597 -1535437 -2959102 -4500882 -4936301 -4126394 -2627938 -1345781 -899896 -686210
37657 -686210 505425 2416982 3133911 1721633 -286180 -1036770 -731409 -605038 -635096
37648 -635096 125666 1439429 1709239 164740 -1753777 -1783901 514665 2879444 2608356
37639 2608356 -205597 -2566652 -2306229 -779270 -502051 -1235417 -672795 1462236 2762988
37630 2762988 2022826 1146436 2035301 3731014 4159708 3069205 1672748 600341 -332502
37621 -332502 -1174147 -1797923 -2119930 -1715526 -233893 1325193 1206928 -511962 -1565129
$$ packed form
37683B369247n25043k72835k10540o66576r59456k23048O35440k09148k032892
37674b094851j602252J797329M167537K117879j983294l293144j216671N91870
37666a515597j9840j423665j541780m35419Q09907J498456J282157M45885K13686
37657f86210J191635J911557P16929j412278k007813p50590L05361J26371l0058
37648f35096P60762J313763K69810j544499j918517l0124K298566K364779k71088
37639B608356k813953k361055K60423J526959K77219p33366N62622K135031J300752
37630B762988p40162q76390Q88865J695713M28694j090503j396457j072407r32843
37621c32502q41645o23776l22007M04404J481633J559086j18265j718890j053167
$$ plain form
37612 -1565129 -685297 577170 480714 -201891 237989 1620014 2474329 2356111 1791607
37603 1791607 897695 -175965 -322222 1143804 2826812 2750969 1064096 -315562 -279854
37594 -279854 682854 1707371 2090014 1185787 -766314 -2280056 -2438806 -2284319 -2901687
37585 -2901687 -3135574 -1198687 2171224 4317891 4068101 2591929 1296717 831847 1664486
37576 1664486 3426458 4108468 2288070 -195670 -401362 1204559 1486543 -107111 -688742
37567 -688742 844817 1609187 -342631 -2435927 -1762503 -32044 -810230 -3614411 -4567255
37558 -4567255 -2286857 396237 823899 -335655 -1044839 -647406 377291 1665571 2821173
37549 2821173 3133727 2435839 1576982 1377530 1611545 1481946 694411 -261693 -610630
$$ packed form
37612a565129Q79832J262467r6456o82605M39880J382025Q54315j18218n64504
37603A791607q93912j073660j46257J466026J683008p5843j686873j379658L5708
37594b79854R62708J024517L82643r04227j952101j513742j58750J54487o17368
37585b901687k33887J936887L369911K146667k49790j476172j295212m64870Q32639
37576A664486J761972O82010j820398k483740k05692J605921K81984j593654n81631
37567f88742J533559P64370j951818k093296O73424J730459p78186k804181r52844
37558d567255K280398K683094M27662j159554p09184L97433J024697J288280J155602
37549B821173L12554o97888q58857j99452K34015j29599p87535r56104l48937
$$ plain form
37540 -610630 64309 1420342 2609559 3127604 3215912 3256915 3229124 3053752 2849657 2414694
37530 2414694 1254031 -267714 -798046 46642 662109 -307149 -1760882 -1866985 -1026067
37521 -1026067 -919401 -1288796 -413062 1282658 1171446 -1287980 -3218723 -2677815 -1489897
37512 -1489897 -1708926 -1930655 -49213 2313132 1754659 -1361068 -2949072 -1015347 1749592
37503 1749592 2064458 122013 -1714712 -2242711 -1953382 -1597730 -1569821 -1910796 -2077458
37494 -2077458 -1465127 -592972 -674012 -1583434 -1661745 -241100 1116717 898814 -271579
37485 -271579 -1072518 -1658338 -2811200 -3984464 -4007100 -3083489 -2299962 -1572216 60366
37476 60366 2236568 3241742 2387363 724688 -946052 -2966592 -4980469 -5043051 -2130659
$$ packed form
37540f10630O74939J356033J189217N18045Q8308M1003k7791j75372k04095m34963
37530B414694j160663j521745n30332Q44688O15467r69258j453733j06103Q40918
37521a026067J06666l69395Q75734J695720j11212k459426j930743N40908J187918
37512a489897k19029k21729J881442K362345n58473l115727j588004J933725K764939
37503A749592L14866j942445j836725n27999K89329L55652K7909l40975j66662
37494b077458O12331Q72155q1040r09422p8311J420645J357817k17903j170393
37485b71579q00939n85820j152862j173264k2636R23611P83527P27746J632582
37476F0366K176202J005174q54379j662675j670740k020540k013877o2582K912392
$$ plain form
37467 -2130659 1555623 2616105 548021 -1684970 -1335981 1148180 3320633 3835970
37459 3835970 3460859 3584580 4752429 6511994 7717290 6888428 3330793 -1583072 -5081078
37450 -5081078 -5599958 -4062033 -2055952 75983 2231245 2999774 1332050 -813446
37442 -813446 -171918 3045381 4617473 1737361 -3179030 -5696972 -4601585 -2077048
37434 -2077048 -131874 935399 1393631 1615984 2371434 3745085 4226955 2729761 960631
37425 960631 1524296 3869757 4645227 2462839 -179519 -667703 300671 522081 -285867
37416 -285867 -721458 -243734 384570 657815 708126 399117 -432177 -821356 717328 3910422
37406 3910422 6239638 5636708 2998862 1077280 1235027 2378342 3018065 3014503 2693509
$$ packed form
37467b130659L686282J060482k068084k232991L48989K484161K172453N15337
37459C835970l75111J23721J167849J759565J205296q28862l557635m913865l498006
37450e081078n18880J537925K006081K131935K155262P68529j667724k145496
37442h13446O41528L217299J572092k880112m916391k517942J095387K524537
37434b077048J945174J067273M58232K22353P55450J373651M81870j497194j769130
37425I60631N63665K345461P75470k182388k642358m88184R68374K21410q07948
37416b85867m35591M77724O28304K73245N0311l09009q31294l89179J538684L193094
37406C910422K329216o02930k637846j921582J57747J143315O39723l562l20994
$$ plain form
37397 2693509 1610368 -410101 -1886058 -1197736 779126 1578470 842805 870345 2725410
37388 2725410 4194328 3203923 1215559 977902 2329932 2741819 1236384 -677670 -1638590
37379 -1638590 -1757533 -1429182 -830899 -538241 -798335 -463955 1319601 2755643 1289553
37370 1289553 -2120944 -3527827 -1520641 558649 -679001 -4098420 -5984901 -4843856
37362 -4843856 -2387401 -877527 -1162897 -2601798 -3585892 -2745348 -659934 330794 -1044747
37353 -1044747 -3150387 -3472178 -1802908 -241527 -342441 -1300619 -1097286 1040082 3567088
37344 3567088 4203838 2642627 979819 906137 1542831 1353188 1047408 2373150 4631562
37335 4631562 5127900 3220885 1217846 744782 981123 1253063 2322722 3734121 3023042
$$ packed form
37397B693509j083141k020469j475957O88322J976862P99344p35665K7540J855065
37388B725410J468918r90405j988364k37657J352030M11887j505435j914054r60920
37379a638590j18943L28351N98283K92658k60094L34380J783556J436042j466090
37370A289553l410497j406883K007186K079290j237650l419419j886481J141045
37362d843856K456455J509874k85370j438901r84094Q40544K085414R90728j375541
37353a044747k105640l21791J669270J561381j00914r58178K03333K137368K527006
37344C567088O36750j561211j662808p3682O36694j89643l05780J325742K258412
37335D631562M96338j907015k003039m73064K36341K71940J069659J411399p11079
$$ plain form
37326 3023042 -266800 -2589394 -1156873 1656510 1864848 -25245 -187089 2195026
37318 2195026 3697820 2016639 -845938 -1831877 -780647 198258 -362956 -2230301 -4253796
37309 -4253796 -5237090 -4648363 -3111809 -1892056 -1719025 -2389701 -3289389 -3793843 -3467125
37300 -3467125 -2504662 -1753119 -1775624 -2224903 -2542626 -2699971 -2773890 -2557076 -2209737 -2435449
37290 -2435449 -3239897 -3437315 -2339709 -1032778 -858155 -1450908 -1541432 -1021270 -815892
37281 -815892 -1084417 -895148 289041 1709708 2003818 478045 -2051571 -3695391 -3498651
37272 -3498651 -2857656 -3596795 -4751370 -3427490 559362 3417759 2221477 -1142462
37264 -1142462 -2688495 -1150651 1771883 4135879 4671347 2829487 217005 200137 3584750
$$ packed form
37326C023042l289842k322594J432521K813383K08338j890093j61844K382115
37318B195026J502794j681181k862577r85939J051230R78905n61214j867345k023495
37309d253796r83294N88727J536554J219753J73031o70676q99688n04454L26718
37300c467125R62463P51543k2505m49279l17723j57345p3919K16814L47339k25712
37290b435449q04448j97418J097606J306931J74623n92753r0524N20162K05378
37281h15892k68525J89269J184189J420667K94110j525773k529616j643820J96740
37272c498651O40995p39139j154575J323880L986852K858397j196282l363939
37264a142462j546033J537844K922534K363996N35468j841860k612482j6868L384613
$$ plain form
37255 3584750 6503436 5381146 2088577 810480 1581047 1024560 -1637502 -3811023
37247 -3811023 -4347681 -4652181 -4859616 -3419628 -1149439 -1203321 -3747207 -4985821 -3248867
37238 -3248867 -1870314 -3630225 -6177389 -6042978 -4063003 -3350829 -4150371 -4166826 -2546201
37229 -2546201 -444018 1307961 2402711 1904854 -459988 -2579154 -2080447 173497
37221 173497 1042929 -559632 -2431939 -2357568 -769367 418993 374272 11451 551218
37212 551218 1803828 2119827 451384 -1871635 -2543842 -1396798 -539947 -1093065 -1660275
37203 -1660275 -868418 494212 1123207 1210656 1297750 758375 -781809 -1936103 -1453618
37194 -1453618 -471019 -798140 -1897710 -1770309 -228059 914244 637802 -294779 -1020238
$$ packed form
37255C584750K918686j122290l292569j278097P70567n56487k662062k173521
37247c811023n36658l04500k07435J439988K270189n3882k543886j238614J736954
37238c248867J378553j759911k547164J34411J979975P12174p99542j6455J620625
37229b546201K102183J751979J094750m97857k364842k119166M98707K253944
37221A73497Q69432j602561j872307P4371J588201J188360m4721l62821N39767
37212E51218J252610L15999j668443k323019o72207J147044Q56851n53118n67210
37203a660275P91857J362630O28995Q7449Q7094n39375j540184j154294M82485
37194a453618R82599l27121j099570J27401J542250J142303k76442r32581p25459
$$ plain form
37185 -1020238 -1377945 -1074133 152856 1385076 1162518 -472012 -1918521 -2167317 -1717667
37176 -1717667 -1235762 -590846 512135 1990880 3630405 4984393 5161941 3744477 1726812
37167 1726812 424915 -272258 -1243069 -2062248 -1362694 614459 1701758 715838 -843795
37158 -843795 -916099 488215 1775340 2043247 1872040 2283884 3611631 5100343 5279578
37149 5279578 3236104 -103305 -2492701 -2626633 -1488776 -1101797 -2335693 -4279720
37141 -4279720 -5377575 -4787692 -2870033 -672759 1079609 2476863 3784252 4607193
37133 4607193 4224588 2676633 956040 61128 277142 1293577 2500821 3287878 3635116
37124 3635116 4210625 5151395 5114036 2785871 -684996 -2326682 -974637 1185383 1657594
$$ packed form
37185a020238l57707L03812J226989J232220k22558j634530j446509k48796M49650
37176a717667M81905O44916J102981J478745J639525J353988J77548j417464k017665
37167A726812j301897o97173r70811q19179O99554J977153J087299r85920j559633
37158h43795p2304J404314J287125K67907j71207M11844J327747J488712J79235
37149E279578k043474l339409k389396j33932J137857L86979j233896j944027
37141d279720j097855N89883J917659K197274J752368J397254J307389Q22941
37133D607193l82605j547955j720593q94912K16014J016435J207244P87057L47238
37124C635116N75509R40770l7359k328165l470867j641686J352045K160020M72211
$$ plain form
37115 1657594 846288 761278 1614898 1797813 932162 665908 1826340 2772056 1874099
37106 1874099 181515 -108859 1028398 1650233 1161931 1332357 3381216 5823380 6418736
37097 6418736 5068843 3421786 2467791 2047218 2182401 3147796 4249273 4196397 3027995
37088 3027995 2193646 2239302 1931014 512766 -631923 76829 1836805 2423175 1238653
37079 1238653 -144140 -395751 60943 249873 156552 417863 1193171 1949450 2117486
37070 2117486 1705364 1437160 2224506 4123047 5925377 6346714 5580080 5002993 5240680
37061 5240680 5274171 3826213 1013924 -1828349 -3465523 -3450788 -2095671 -492254 -125197
37052 -125197 -1419945 -2674946 -1493950 2271616 5813069 6264950 3797311 1116765
$$ packed form
37115A657594q11306q5010Q53620J82915q65651k66254J160432R45716q97957
37106A874099j692584k90374J137257O21835m88302J70426K048859K442164N95356
37097F418736j349893j647057r53995m20573J35183R65395J101477n2876j168402
37088C027995q34349M5656l08288j418248j144689P08752J759976N86370j184522
37079A238653j382793k51611M56694J88930r3321K61311P75308P56279J68036
37070B117486m12122k68204P87346J898541J802330M21337p66634n77087K37687
37061E240680L3491j447958k812289k842273j637174J4735J355117J603417L67057
37052a25197j294748j255001J180996L765566L541453M51881k467639k680546
$$ plain form
37044 1116765 303418 994205 1498240 766893 -835908 -1940142 -1255672 972938 2605179
37035 2605179 1733989 -712936 -1830907 -607589 674396 -124064 -1826241 -1913410 -364567
37026 -364567 759461 888289 1488647 2917360 3292619 1450015 -999508 -1869099 -1185121
37017 -1185121 -430890 -108857 522511 1884336 3434469 4330499 4063772 2837600 1746509
37008 1746509 1909470 2975482 3326664 2282765 1094629 1039685 1647961 1854649 1881612
36999 1881612 2579071 3540259 3341862 1471114 -1128705 -3257492 -4201346 -3572471 -1618625
36990 -1618625 303319 709038 -237221 -752682 353666 2063293 2267425 411268 -1422116
36981 -1422116 -611251 2656340 4967791 3620227 331085 -735930 1450401 3481996
$$ packed form
37044A116765q13347O90787N04035p31347j602801j104234O84470K228610J632241
37035B605179q71190k446925j117971J223318J281985p98460j702177q7169J548843
37026c64567J124028J28828O00358J428713L75259j842604k449523q69591O83978
37017a185121P54231L22033O31368J361825J550133Q96030k66727j226172j091091
37008A746509J62961J066012L51182j043899j188136n4944O08276K06688K6963
36999A881612O97459R61188j98397j870748k599819k128787r43854O28875J953846
36990a618625J921944M05719r46259n15461J106348J709627K04132j856157j833384
36981a422116Q10865L267591K311451j347564l289142j067015K186331K031595
$$ plain form
36973 3481996 2506549 30931 -964020 -446410 -271641 -314570 1084422 3395847 3921269
36964 3921269 1858108 -508370 -1337746 -1323843 -1341834 -669004 926608 1653299 277313
36955 277313 -1507344 -1469744 -287006 -279480 -1604755 -2216206 -1311634 -343113 -283311 -117715
36945 -117715 1138304 2747432 3645202 4081320 4665955 4936017 4204971 2974331 2119979
36936 2119979 1371109 104214 -909559 -351963 1252828 1988002 1579374 1821126 3300546
36927 3300546 4055127 2905586 1824744 2744434 3966448 2819055 565248 850688 3523993
36918 3523993 4165866 779763 -2988573 -3352866 -1652820 -1243806 -1949930 -1300894 510808
36909 510808 1014672 201297 902561 3929694 6174882 4794103 913004 -2046456 -1993878
$$ packed form
36973C481996r75447k475618r94951N17610J74769m2929J398992K311425N25422
36964C921269k063161k366478q29376J3903j7991O72830J595612P26691j375986
36955B77313j784657L7600J182738P526j325275o11451R04572R68521N9802J65596
36945a17715J256019J609128Q97770M36118N84635K70062p31046j230640q54352
36936B119979p48870j266895j013773N57596J604791P35174m08628K41752J479420
36927C300546P54581j149541j080842R19690J222014j147393k253807K85440K673305
36918C523993O41873l386103l768336l64293J700046M09014p06124O49036J811702
36909E10808N03864q13375P01264L027133K245188j380779l881099k959460N2578
$$ plain form
36900 -1993878 730079 4199183 5985467 4884013 2360857 1060421 1494971 1749877
36892 1749877 762248 -191979 -98514 -113860 -1411821 -2892256 -2802495 -1374439 -133793
36883 -133793 407078 724168 857478 704804 996979 2250865 3339724 2906141 1781364
36874 1781364 2057628 3824991 4788453 3493272 1203821 -51956 162067 1048990 1967965
36865 1967965 2434240 1736012 -181557 -1885657 -1645692 535133 2843532 3724206 3457705
36856 3457705 3459265 4418793 5550532 5646850 4524083 3194850 2778197 3533774 4821837
36847 4821837 5543493 4705494 2301034 -143626 -696115 835535 2629748 3277023 3537884
36838 3537884 4748139 6435975 6980701 6009308 4444395 2594335 259795 -1310425
$$ packed form
36900a993878K723957L469104J786284j101454k523156j300436M34550K54906
36892A749877r87629r54227R3465j5346j297961j480435Q9761J428056J240646
36883a33793N40871L17090J33310j52674K92175J253886J088859m33583j124777
36874A781364K76264J767363R63462j295181k289451j255777K14023Q86923R18975
36865A967965M66275o98228j917569j704100K39965K180825K308399Q80674k66501
36856C457705J560R59528J131739R6318j122767j329233m16653P55577J288063
36847D821837P21656q37999k404460k444660n52489J531650J794213O47275K60861
36838C537884J210255J687836N44726r71393j564913j850060k334540j570220
$$ plain form
36830 -1310425 -76658 3390127 5558795 4446843 2402805 2495348 4009218 4082429 2473992
36821 2473992 1596124 2247112 2502919 1297503 242018 833836 2210284 2953149 3132549
36812 3132549 3187914 2590274 1176206 259983 773195 1631653 1594635 1440225 2445284
36803 2445284 3852839 3926196 2727144 1804832 1704871 1737075 1688868 1825380 1711371 1036485
36793 1036485 1032021 2846139 5071132 5431178 4517331 4923191 6760887 7331834 5723837
36784 5723837 4283400 4435582 4470494 3160113 2277720 3232247 4165520 3177535 1868190
36775 1868190 2455049 3466627 1975767 -1200134 -2330149 -343901 1886878 1946272 566365
36766 566365 -439500 -353482 820054 2712898 4127500 4042780 3257797 3338392 4186174
$$ packed form
36830a310425J233767L466785K168668j111952k044038R2543J513870P3211j608437
36821B473992q77868O50988K55807j205416j055485N91818J376448P42865J79400
36812C132549N5365n97640j414068r16223N13212Q58458l7018j54410J005059
36803B445284J407555P3357j199052r22312r9961L2204m8207J36512j14009o74886
36793A036485m464J814118K224993L60046r13847M05860J837696N70947j607997
36784E723837j440437J52182L4912j310381q82393R54527R33273r87985j309345
36775A868190N86859J011578j490860l175901j130015J986248K230779N9394j379907
36766E66365j005865Q6018J173536J892844J414602q4720p84983Q0595Q47782
$$ plain form
36757 4186174 4645716 5030552 6446625 7874529 7059417 4650580 4153574 6755650 9380724
36748 9380724 9416906 8351108 8610936 9507178 9023038 7625564 7335152 8211668 8523736
36739 8523736 7709967 6761088 6207033 5954634 6588219 8501919 10083601 9225337 6696718
36730 6696718 5627889 7240374 9331117 9646368 8596882 7636387 6994255 6486751 6914359
36721 6914359 8798748 10753441 10962479 9763991 9111651 9778723 10766554 11499017 12887975
36712 12887975 15591780 18473026 19704626 18803828 16949528 15734451 16018869 17521338
36704 17521338 19116953 19932419 20384583 21602768 23677655 25364389 25952311 26436202 28066073
36695 28066073 30647891 33268643 35843704 38669804 41143134 42514126 43674730 46693473
$$ packed form
36757D186174M59542L84836J416073J427904q15112k408837m97006K602076K625074
36748I380724L6182j065798K59828Q96242m84140j397474k90412Q76516L12068
36739H523736q13769r48879n54055k52399O33585J913700J581682q58264k528619
36730F696718j068829J612485K090743L15251j049486r60495o42132n07504M27608
36721F914359J884389J954693K09038j198488o52340O67072R87831P32463J388958
36712A2887975K703805K881246J231600r00798j854300j215077K84418J502469
36704A7521338J595615Q15466M52164J218185K074887J686734N87922M83891J629871
36695B8066073K581818K620752K575061K826100K473330J370992J160604L018743
$$ plain form
36687 46693473 52529213 60358563 68961869 77534943 85554668 93494645 103428280 117123432
36679 117123432 133766670 151626362 171656268 196672889 226737342 258541878 290200727
36672 290200727 322969232 356138290 383562328 398400552 399144010 388152997 366731271
36665 366731271 335596602 298739039 262349752 229714138 200296050 173690368 151109242
36658 151109242 132686433 116657728 102222965 90645839 82566371 76417316 70343407
36651 70343407 63785108 56657729 49069130 42462360 38872533 38117671 37479575 34928537
36643 34928537 31075935 27484097 24864852 23470067 23362341 23588241 22741642 20889778
36635 20889778 19386375 18625344 17848939 17137262 17178814 16950045 14521237 10741734 8986400
$$ packed form
36687D6693473N835740P829350Q603306Q573074Q019725P939977R933635J3695152
36679A17123432J6643238J7859692K0029906K5016621L0064453L1804536L1658849
36672B90200727L2768505L3169058K7424038J4838224P43458j0991013k1421726
36665C66731271l1134669l6857563l6389287l2635614k9418088k6605682k2581126
36658A51109242j8422809j6028705j4434763j1577126q079468o149055o073909
36651G0343407o558299p127379p588599o606770l589827p54862o38096k551038
36643C4928537l852602l591838k619245j394785j07726K25900q46599j851864
36635B0889778j503403p61031p76405p11677M1552k28769k428808l779503j755334
$$ plain form
36626 8986400 10142820 11036154 9417099 7314108 7207554 7833948 6707170 4555305 4042800
36617 4042800 5471461 6702163 6506863 5517541 4544197 4096082 4859461 6702622 7969915
36608 7969915 7553480 6722947 7071966 7774921 7039425 5337675 4820118 6032147 7406338
36599 7406338 7712216 7072930 5860756 4419450 3619873 3993470 4544231 3880004 2131675
36590 2131675 443349 -714709 -1272432 -550480 1682465 3935984 4609797 4141596 3831936
36581 3831936 3597321 2944811 2956360 4641283 6236125 5228629 2660369 2146619 4428006
36572 4428006 6090927 4463115 969309 -1386959 -1394447 621638 4125130 8011797 10586398
36563 10586398 11105812 10217098 8498620 6192497 4547824 5124577 7081553 7515240 5500918
$$ packed form
36626H986400J156420Q93334j619055k102991j06554O26394j126778k151865n12505
36617D042800J428661J230702j95300r89322r73344m48115P63379J843161J267293
36608G969915m16435q30533L49019P02955p35496j701750n17557J212029J374191
36599G406338L05878o39286j212174j441306p99577L73597N50761o64227j748329
36590B131675j688326j158058n57723P21952K232945K253519O73813m68201l09660
36581C831936k34615o52510J1549J684923J594842j007496k568260n13750K281387
36572D428006J662921j627812l493806k356268p488K016085L503492L886667K574601
36563A0586398N19414q88714j718478k306123j644673N76753J956976M33687k014322
$$ plain form
36554 5500918 3464550 3324604 3742102 2905856 1659113 1577079 1918900 1154855 53490
36545 53490 371036 1432546 1065489 -424602 -316285 2153978 4419442 4606152 4313011
36536 4313011 5649344 7519112 7181828 4436607 1797778 748439 219700 -673937 -685244
36527 -685244 1243435 3344653 2963971 495564 -1032840 -477784 -201887 -2101501 -4264953
36518 -4264953 -3628474 -496069 2073135 2741734 3152337 4564236 5703046 4925811 2703647
36509 2703647 726631 -198560 -211613 587334 1949357 3017920 3230131 3211991 3776472
36500 3776472 4515287 4490989 3915583 3745451 3642325 1981250 -1359530 -3620707 -2140657
36491 -2140657 1832365 4112822 2651307 -92857 -825954 172098 234736 -1106925 -1419412
$$ packed form
36554E500918k036368j39946M17498q36246j246743q2034L41821p64045j101365
36545E3490L17546J061510l67057j490091J08317K470263K265464J86710k93141
36536D313011J336333J869768l37284k745221k638829j049339n28739q93637j1307
36527f85244J928679K101218l80682k468407j528404N55056K75897j899614k163452
36518d264953O36479L132405K569204O68599M10603J411899J138810p77235k222164
36509B703647j977016r25191j3053P98947J362023J068563K12211j8140N64481
36500C776472P38815k4298n75406j70132j03126j661075l340780k261177J480050
36491b140657L973022K280457j461515k744164p33097R98052O2638j341661l12487
$$ plain form
36482 -1419412 546998 2695143 2689757 1160349 220042 459917 1241766 2560943 4439399
36473 4439399 5449114 4198487 1802931 643054 981559 1084192 483340 522740 1406920
36464 1406920 1457204 211341 -289692 1252179 3052820 2974926 1822678 1775904 2798454
36455 2798454 2965642 1768790 768107 904233 1187412 596097 -312465 -491391 31976
36446 31976 562662 942719 1457622 1975736 1999572 1401393 474739 -586259 -1616182 -2038311
36436 -2038311 -1325453 35186 959598 1410543 2521516 4441295 5287454 3531020 496252
36427 496252 -1177999 -971578 -483848 -417598 72519 917234 704191 -468699 -405268 1428429
36417 1428429 2092711 -672083 -4516847 -5360636 -2815096 -10281 1066607 1234069 1477824
$$ packed form
36482a419412J966410K148145n386j529408r40307K39875P81849J319177J878456
36473D439399J009715j250627k395556j159877L38505J02633o00852L9400Q84180
36464A406920N0284j245863n01033J541871J800641p7894j152248m6774J022550
36455B798454J67188j196852j000683J36126K83179n91315r08562j78926N23367
36446C1976N30686L80057N14903N18114K3836n98179r26654j060998j029923m22129
36436b038311P12858J360639R24412M50945J110973J919779Q46159j756434l034768
36427D96252j674251K06421M87730O6250M90117Q44715k13043j172890O3431J833697
36417A428429O64282k764794l844764q43789K545540K804815J076888J67462K43755
$$ plain form
36408 1477824 1355688 364613 -1041867 -2075990 -1945970 13966 3025111 4439450 2644817
36399 2644817 -201888 -566484 1745100 3568400 2821765 613993 -951711 -730982 1559294
36390 1559294 4883826 6388712 4060994 68475 -1302787 664077 2419174 1635267
36382 1635267 166216 373439 1548595 1704470 481389 -1404532 -3462242 -4657064
36374 -4657064 -3509746 -612812 943637 -671589 -3659118 -5463008 -6013457 -6380907
36366 -6380907 -6194696 -4566388 -2165871 -378231 553048 1021820 949937 581844 929529
36357 929529 1934357 1752192 -442187 -2476830 -1920161 488586 2043918 1590625 36870
36348 36870 -1531566 -2376107 -1725622 198890 1467069 492732 -1686059 -2615609 -1451544
$$ packed form
36408A477824j22136r91075j406480j034123J30020J959936L011145J414339j794633
36399B644817k846705l64596K311584J823300p46635k207772j565704K20729K290276
36390A559294L324532J504886k327718l992519j371262J966864J755097p83907
36382A635267j469051K07223J175156J55875j223081j885921k057710j194822
36374d657064J147318K896934J556449j615226k987529j803890n50449l67450
36366f380907J86211J628308K400517J787640R31279M68772p1883l68093L47685
36357I29529J004828j82165k194379k034643N56669K408747J555332m53293j553755
36348C6870j568436q44541O50485J924512J268179r74337k178791r29550J164065
$$ plain form
36339 -1451544 355422 876400 -584384 -2879895 -3684549 -1882530 533327 663226 -1117563
36330 -1117563 -1719791 -460090 -168964 -1896976 -2478373 33223 2254024 534795 -2845694
36321 -2845694 -2962976 307669 2740966 2459232 1566511 1452838 813257 -1156405 -3066479
36312 -3066479 -3528833 -2507344 -338384 2323452 3939811 3753404 3245166 3581343 3108098
36303 3108098 538392 -1154329 1563488 6268861 6877854 2415866 -1694442 -1838308
36295 -1838308 -457823 -456220 -402077 1883033 4933064 6004396 5018608 3478310 1912001
36286 1912001 744371 1301769 3594494 5261568 4925557 4494675 5970928 8074720 8368116
36277 8368116 6889815 5386675 4550624 4133649 4201564 4245099 2770452 -46515 -1063179
$$ packed form
36339a451544J806966N20978j460784k295511q04654J802019K415857J29899j780789
36330a117563o02228J259701K91126j728012n81397K511596K220801j719229l380489
36321b845694j17282L270645K433297k81734q92721j13673o39581j969662j910074
36312c066479m62354J021489K168960K661836J616359j86407n08238L36177m73245
36303C108098k569706j692721K717817M705373O08993m461988m110308j43866
36295a838308J380485J603N4143K285110L050031J071332r85788j540298j566309
36286A912001j167630N57398K292725J667074l36011m30882J476253K103792K93396
36277H368116j478301j503140q36051m16975O7915M3535j474647k816967j016664
$$ plain form
36268 -1063179 1902651 6208187 7152446 3821802 -228941 -1605847 -268879 1528707
36260 1528707 1649012 -382570 -2877461 -3356157 -1340682 971823 1589056 1016982 738181
36251 738181 1029203 1615182 2766714 4074029 3834639 1632599 -73680 851858 2908376
36242 2908376 3248108 1909971 1032644 946145 139190 -1396629 -1916275 -1096823 -627882
36233 -627882 -1157434 -1142226 448103 2245448 2237854 200108 -2095958 -2285061 648139
36224 648139 4707923 5945990 2857368 -1110951 -1616035 765080 1562188 -1022049 -3839387
36215 -3839387 -3700879 -1361872 812579 2393377 4033264 5070860 4316448 2212923
36207 2212923 398737 -190270 504556 2407499 4770017 5788129 4464305 2397492
$$ packed form
36268a063179K965830M305536R44259l330644m050743j376906J336968J797586
36260A528707J20305k031582k494891m78696K015475K312505O17233n72074k78801
36251G38181K91022N85979J151532J307315k39390k202040j706279R25538K056518
36242B908376L39732j338137q77327q6499q06955j535819n19646Q19452M68941
36233f27882n29552J5208J590329J797345p594k037746k296066j89103K933200
36224F48139M059784J238067l088622l968319n05084K381115P97108k584237k817338
36215c839387J38508K339007K174451J580798J639887J037596p54412k103525
36207B212923j814186n89007O94826J902943K362518J018112j323824k066813
$$ plain form
36199 2397492 2108722 3733761 4874571 3888772 1955253 1260023 2064190 2546699 1437128
36190 1437128 -25826 540820 3401111 5759418 4956066 2036056 660782 2340337
36182 2340337 4421058 3738378 812347 -1244869 -1156737 -704874 -1457233 -2398267 -1907300
36173 -1907300 -558728 -215411 -1024400 -1258630 -279749 210985 -1222194 -3381200 -4091714
36164 -4091714 -3200425 -2123983 -989627 1495659 4989805 6589578 4316390 104094
36156 104094 -2244363 -1310994 1045553 2432938 2212561 1371744 1330659 2785514 4857110
36147 4857110 5635434 4378380 2693453 2501137 3331201 3028197 943202 -1124306 -1451101
36138 -1451101 -518754 -8055 -604456 -1526378 -1792263 -1428677 -1442267 -2570584 -4058933
$$ packed form
36199B397492k88770J625039J140810r85799j933519o95230Q04167M82509j109571
36190A437128j462954N66646K860291K358307q03352k920010j375274J679555
36182B340337K080721o82680k926031k057216Q8132M51863p52359r41034M90967
36173a907300J348572L43317q08989k34230R78881M90734j433179k159006p10514
36164d091714Q91289J076442J134356K485286L494146J599773k273188m212296
36156A04094k348457R33369K356547J387385k20377q40817m1085J454855K071596
36147D857110P78324j257054j684927j92316Q30064l03004k084995k067508l26795
36138a451101R32347N10699n96401r21922k65885L63586j3590j128317j488349
$$ plain form
36129 -4058933 -4284851 -2998677 -2017431 -2697465 -3647774 -2614688 -101887 1058952 -33280
36120 -33280 -766800 1250892 4692992 6354978 5359436 3738609 3304714 3685895 3660760
36111 3660760 3034053 2483278 2360464 2513420 3019270 4226387 5816043 6518846 5529248
36102 5529248 3988325 4110860 6540692 9347740 10114260 8322300 5198269 2136189
36094 2136189 191572 275215 2439279 5224898 6891189 7157246 6794585 5949747 4183710
36085 4183710 1928242 473191 481178 1712451 3998825 6993834 9131203 8734715 6506724
36076 6506724 5147857 5953528 7414794 7764798 7202889 6847419 7217837 8708973 11840325
36067 11840325 15801655 18331798 18497887 18328420 20336303 24656233 29905287 35362339
$$ packed form
36129d058933k25918J286174R81246o80034r50309J033086K512801J160839j092232
36120c3280p33520K017692L442100J661986r95542j620827m33895L81181k5135
36111C660760o26707n50775j22814J52956N05850J207117J589656P02803r89598
36102E529248j540923J22535K429832K807048P66520j791960l124031l062080
36094B136189j944617Q3643K164064K785619J666291K66057l62661q44838j766037
36085D183710k255468j455051P987J231273K286374K995009K137369l96488k227991
36076F506724j358867Q05671J461266L50004n61909l55470L70418J491136L131352
36067A1840325L961330K530143J66089j69467K007883M319930N249054N457052
$$ plain form
36059 35362339 40615111 44491338 46454384 48037748 50715479 53104712 52527731 48904070
36051 48904070 44921305 42580459 41584993 40883832 39696770 37168477 33186550 29500423
36043 29500423 27814696 26864331 23970874 19653384 17633391 19363809 21626872 21204644
36035 21204644 19158382 18258419 18578044 18481498 18281504 19663472 22146231 23157958 21796184
36026 21796184 20160003 20596081 23475783 27901438 32792138 36942588 39689807 41942132
36018 41942132 45092524 48697018 50860462 51139156 51048766 51021906 49016711 43559308 36478177
36009 36478177 30866931 27477216 24844110 22038545 19385497 17010761 14656509 12847640
36001 12847640 12447603 12924128 12743209 11775630 11587435 12733616 13484765 12367740 10584385
$$ packed form
36059C5362339N252772L876227J963046J583364K677731K389233n76981l623661
36051D8904070l982765k340846r95466p01161j187062k528293l981927l686127
36043B9500423j685727r50365k893457m317490k019993J730418K263063m22228
36035B1204644k046262q99963L19625r6546j99994J381968K482759J011727j361774
36026B1796184j636181M36078K879702M425655M890700M150450K747219K252325
36018D1942132L150392L604494K163444K78694r0390k6860k005195n457403p081131
36009C6478177n611246l389715k633106k805565k653048k374736k354252j808869
36001A2847640m00037M76525j80919r67579j88195J146181P51149j117025j783355
$$ plain form
35992 10584385 10380667 11813812 12729939 11715364 9687061 8395477 8364723 8624787 7855431
35983 7855431 5603609 2799540 1079803 1223090 2410445 3398123 3967240 4553636 5036950
35974 5036950 5066379 5254073 6536612 8240744 8379266 6389050 4031543 2779439 1933823
35965 1933823 599998 -83203 1315068 3630172 4365874 3445218 3204807 4502052 5387846
35956 5387846 4425165 2879869 2253428 1861078 799206 460591 2542038 5658149 6692173
35947 6692173 5158226 3631539 3802846 4656435 4986294 5106927 5055062 3580565 634370
35938 634370 -1095089 759624 4887728 7977695 8761474 8370606 7542358 5949669 4147971
35929 4147971 3712863 4834565 5723510 5292481 4926162 6575437 10137480 13623396 15209140
$$ packed form
35992A0584385k03718J433145R16127j014575k028303j291584l0754K60064p69356
35983G855431k251822k804069j719737J43287J187355R87678N69117N86396M83314
35974E036950K9429J87694J282539J704132J38522j990216k357507j252104q45616
35965A933823j333825o83201J398271K315104P35702r20656k40411J297245Q85794
35956E387846r62681j545296o26441l92350j061872l38615K081447L116111J034024
35947F692173j533947j526687J71307Q53589L29859J20633n1865j474497k946195
35938F34370j729459J854713M128104L089967P83779l90868q28248j592689j801698
35929D147971m35108J121702Q88945m31029l66319J649275L562043L485916J585744
$$ plain form
35920 15209140 14538909 12740867 11612907 11993759 12559050 11162317 7744661 4733001
35912 4733001 3910727 4166002 3383793 1472995 149613 409547 1622561 2794641 3458998
35903 3458998 3444148 2860839 2334789 2430169 2939091 3413334 3988892 4760363 4831211 3340505
35893 3340505 1288216 810958 2297342 3609581 2904125 1139272 759149 2506499 4660364
35884 4660364 5395305 4965464 5000096 5965493 6196397 4111074 981102 160239 2971068
35875 2971068 6551788 7081722 4429234 1968569 2025100 3377566 3731789 2929093 2559332
35866 2559332 3485061 5028132 6104078 6121441 5031600 3375242 2210992 2326404 3441302
35857 3441302 4491878 4581703 3478166 1587709 -135555 -625648 328664 1621598 1835959
$$ packed form
35920A5209140o70231j798042j127960L80852N65291j396733l417656l011660
35912D733001q22274K55275p82209j910798j323382K59934J213014J172080O64357
35903C458998j4850n83309n26050R5380N08922M74243N75558P71471P0848j490706
35893C340505k052289m77258J486384J312239p05456j764853l80123J747350K153865
35884D660364P34941m29841L4632R65397K30904k085323l129972q20863K810829
35875B971068L580720N29934k652488k460665N6531J352466L54223q02696l69761
35866B559332R25729J543071J075946J7363j089841j656358j164250J15412J114898
35857C441302J050576Q9825j103537j890457j723264m90093R54312J292934K14361
$$ plain form
35848 1835959 801637 -170503 245900 1882180 3269979 3371490 2759137 2614929 2816664
35839 2816664 2046560 98615 -1218629 -526285 923934 1148055 688627 1700191 3980505
35830 3980505 4592732 2188241 -795814 -1641894 -852191 -328430 -91074 690952 918514
35821 918514 -1074476 -3917284 -4137600 -1122685 1582659 887595 -2191293 -4672574 -5369269
35812 -5369269 -4864290 -3324665 -499346 2667570 4308618 3690835 1901284 428878
35804 428878 -55982 429968 1497902 2260500 1708227 -145303 -1769065 -1340947 1338379
35795 1338379 4342453 5306583 3716383 1311600 49143 -6279 -293089 -1496408 -2503560
35786 -2503560 -1897242 144296 2004993 2429128 1655424 800854 550682 687110 747929
$$ packed form
35848A835959j034322r72140M16403J636280J387799J01511o12353j44208K01735
35839B816664p70104j947945j317244O92344J450219K24121m59428J011564K280314
35830C980505O12227k404491k984055q46080P89703N23761K37356P82026K27562
35821I18514j992990k842808k20316L014915K705344o95064l078888k481281o96695
35812e369269N04979J539625K825319L166916J641048o17783j789551j472406
35804D28878m84860M85950J067934P62598n52273j853530j623762M28118K679326
35795A338379L004074R64130j590200k404783j262457n5422k86810j203319j007152
35786b503560O06318K041538J860697M24135p73704q54570k50172J36428O0819
$$ plain form
35777 747929 752533 961816 1133775 712350 -14836 252691 2110003 4164591 4541708 3362049
35767 3362049 2442207 2537282 2393434 1062531 -357463 -452214 158692 -216904 -1537105
35758 -1537105 -1878827 -249459 1940767 2857544 2556682 2320327 2365464 1524768 -666877
35749 -666877 -2628141 -2226937 700135 3971365 5208005 3907786 1418573 -477838
35741 -477838 -706622 606781 2095707 2136441 734710 9561 1690715 4425457 5100176
35732 5100176 2997738 831076 811857 1558201 639536 -1229555 -1062299 1773675 4519302
35723 4519302 5161848 5113720 6382624 8090297 7889727 5676805 3637641 3057091 3236536
35714 3236536 3572703 4533190 5989961 6542041 5536667 4198277 3604400 3063582 1967804
$$ packed form
35777G47929M604K09283J71959m21425p27186K67527J857312K054588L77117j179659
35767C362049r19842R5075j43848j330903j419994r4751O10906l75596j320201
35758a537105l41722J629368K190226R16777l00862k36355M5137q40696k191645
35749f66877j961264M01204K927072L271230J236640j300219k489213j896411
35741d77838k28784J313403J488926M0734j401731p25149J681154K734742O74719
35732E100176k102438k166662j9219P46344r18665j869091J67256K835974K745627
35723D519302O42546m8128J268904J707673k00570k212922k039164n80550J79445
35714C236536L36167R60487J456771N52080j005374j338390n93877n40818j095778
$$ plain form
35705 1967804 1739998 3797298 6581959 7190712 5634037 4759093 5675896 6151312 4627138
35696 4627138 3034681 3590744 4982553 4367968 1818794 17272 244638 1408855 2798220
35687 2798220 4950579 7374594 8107517 6645097 5172514 5517045 6550650 6092474 4096070
35678 4096070 2392950 2121302 2861195 3839500 4738994 5440850 5791586 5661981 5073269
35669 5073269 4594092 5349737 7585297 9369828 8385938 5303548 3396799 4020630 4676657
35660 4676657 3032298 669895 595315 2730297 4580613 5227195 5718055 6145414 5476532
35651 5476532 4300063 4654046 6500845 7189273 5488121 3671626 4184712 6297514 7652004
35642 7652004 7454046 6478221 5245371 3908165 3027276 2882368 2589961 1199067 -775733
$$ packed form
35705A967804k27806K057300K784661O08753j556675q74944R16803M75416j524174
35696D627138j592457N56063J391809o14585k549174j801522K27366J164217J389365
35687B798220K152359K424015P32923j462420j472583L44531J033605m58176j996404
35678D096070j703120k71648P39893R78305Q99494P01856L50736j29605n88712
35669E073269m79177P55645K235560J784531r83890l082390j906749O23831O56027
35660D676657j644359k362403p4580K134982J850316O46582M90860M27359o68882
35651E476532j176469L53983J846799O88428j701152j816495N13086K112802J354490
35642G652004j97958r75825j232850j337206q80889j44908k92407j390894j974800
$$ plain form
35633 -775733 -1941476 -1723085 -668822 424858 956226 593731 -446401 -1582374 -2532073
35624 -2532073 -3109455 -2494708 -143231 2426980 2704197 758865 -339241 1120629 2906064
35615 2906064 2415519 721683 525876 1711668 1942297 727933 -261113 -591814 -1649951
35606 -1649951 -3611698 -4738584 -4316888 -3722161 -3779355 -3465824 -2141130 -745817 269810
35597 269810 1891551 4097751 4775693 2902276 873237 1490982 3999267 5307753 4225132
35588 4225132 2333591 1206431 802680 527768 204906 -159167 -410127 -71453 934604
35579 934604 1663505 1219558 128797 -341150 98192 654978 665536 -44661 -1472713
35570 -1472713 -3012284 -3271651 -1604110 612771 1557957 1390637 1591810 2280551 2069722
$$ packed form
35633g75733j165743K18391J054263J093680N31368l62495j040132j135973r49699
35624b532073n77382O14747K351477K570211K77217j945332j098106J459870J785435
35615B906064m90545j693836j95807J185792K30629j214364r89046l30701j058137
35606a649951j961747j126886M21696N94727n7194L13531J324694J395313J015627
35597B69810J621741K206200O77942j873417k029039O17745K508285J308486j082621
35588D225132j891541j127160m03751k74912l22862l64073k50960L38674J006057
35579I34604P28901m43947j090761m69947M39342N56786J0558p10197j428052
35570a472713j539571k59367J667541K216881R45186j67320K01173O88741k10829
$$ plain form
35561 2069722 672144 -290135 282201 1286429 1033765 -569591 -2211270 -2646390 -1410467
35552 -1410467 1013782 3142169 3481654 2233881 1278566 1914444 3393523 4266196 4317824
35543 4317824 4355999 4756384 5200600 5555789 6132679 7025352 7739300 7652095 6699232 5537784
35533 5537784 4917191 4807140 4474315 3687004 3297420 4026249 5245572 5843795 5724967
35524 5724967 5334289 4349494 2431613 812368 1130496 2746869 3360597 2459904 1740811
35515 1740811 1638772 347763 -2450624 -3868488 -2015339 621552 812547 -393817
35507 -393817 433675 3505192 5654196 5294783 4100134 3592050 3238171 2576450 2396560
35498 2396560 2816971 2563428 1248534 368108 997824 2253431 2940664 3080942 3032169
$$ packed form
35561B069722j397578r62279N72336J004228k52664j603356j641679m35120J235923
35552a410467K424249K128387L39485j247773r55315O35878J479079Q72673N1628
35543D317824L8175M00385M44216L55189N76890Q92673P13948q7205r52863j161448
35533E537784o20593j10051l32825p87311l89584P28829J219323N98223j18828
35524E724967l90678r84795j917881j619245L18128J616373O13728r00693p19093
35515A740811j02039j291009k798387j417864J853149K636891J90995j206364
35507c93817Q27492L071517K149004l59413j194649n08084l53879o61721j79890
35498B396560M20411k53543j314894q80426O29716J255607O87233J40278m8773
$$ plain form
35489 3032169 2780046 2796484 3814227 5081709 4833080 3257909 2752655 4150585 5127188
35480 5127188 3900909 2137817 2123086 3140533 3088676 2019397 1484225 1646722 1649550
35471 1649550 1848283 3037435 4132249 3179865 312515 -2490070 -4030516 -4184797 -2550823
35462 -2550823 514148 2374083 864336 -1832737 -1556480 1557624 2987948 696996
35454 696996 -1909398 -1489994 520684 1111492 390505 123553 152042 -425342 -427409 1525143
35444 1525143 3583521 2768784 -113876 -1279846 294270 1520975 368614 -1029003
35436 -1029003 -170292 1600840 1146877 -1724901 -4090437 -3964987 -2386630 -1288982 -1010551
35427 -1010551 -640765 245113 1187781 1758938 1940549 1541717 91833 -2140002 -3596707
$$ packed form
35489C032169k52123J6438J017743J267482k48629j575171n05254J397930R76603
35480E127188j226279j763092j4731J017447n1857j069279n35172J62497K828
35471A649550J98733J189152J094814r52384k867350k802585j540446j54281J633974
35462b550823L064971J859935j509747k697073K76257L114104J430324k290952
35454F96996k606394M19404K010678N90808p20987k66952K8489n77384k067J952552
35444A525143K058378q14737k882660j165970J574116J226705j152361j397617
35436a029003Q58711J771132m53963k871778k365536J25450J578357J097648K78431
35427a010551L69786Q85878R42668N71157J81611l98832j449884k231835j456705
$$ plain form
35418 -3596707 -2864802 -652731 578643 -648019 -3134064 -4528464 -3960259 -2513482
35410 -2513482 -1470838 -854521 225977 2188426 4132358 4497121 2783255 413673
35402 413673 -671435 -143215 749541 1195288 1611544 2216164 2218720 1177230 -42982
35393 -42982 -599460 -876790 -1299693 -1025246 766868 3018170 3719177 2346350 180523
35384 180523 -1410947 -1893287 -1256217 -519 928540 1201219 1511573 1968191 1181831
35375 1181831 -1487623 -3903153 -3556762 -1282710 -97293 -714337 -994481 27097 587492
35366 587492 -434937 -1370772 -486600 1342976 2354247 2463401 2401708 1896511 661742
35357 661742 23022 1504527 4320686 5914738 4780583 1714698 -1277128 -2476181
$$ packed form
35418c596707P31905K212071J231374j226662k486045j394400N68205J446777
35410b513482J042644O16317J080498J962449J943932L64763j713866k369582
35402D13673j085108N28220Q92756M45747M16256O04620K556j041490j220212
35393d2982n56478k77330m22903K74447J792114K251302P01007j372827k165827
35384A80523j591470m82340O37070J255698R29059K72679L10354M56618p86360
35375A181831k669454k415530L46391K274052J185417o17044k80144J021578N60395
35366E87492j022429r35835Q84172J829576J011271J09154o1693n05197j234769
35357F61742o38720J481505K816159J594052j134155l065885k991826j199053
$$ plain form
35349 -2476181 -1566832 -143215 -342712 -2175143 -3182317 -1642927 1041021 2302461
35341 2302461 1628176 506506 202300 1003552 2701647 4274707 3954774 1203237 -2110696
35332 -2110696 -3909254 -4243304 -3849874 -1885263 2313979 6216945 6126095 2323388 -806693
35323 -806693 -424828 1746591 2989347 3333894 3939995 4043075 2085705 -1193555 -3233462
35314 -3233462 -3020944 -2074774 -1826283 -1628679 -226388 1750975 2085576 -70926 -2572463
35305 -2572463 -2619357 -334120 1428177 1065776 259227 944436 2030324 1204156 -1129977
35296 -1129977 -2313035 -1486471 -558711 -902610 -1645745 -1920718 -2352819 -3167164 -3028573
35287 -3028573 -1288487 404506 343207 -903962 -1969955 -2970738 -4415949 -5143194 -3631011
$$ packed form
35349b476181R09349J423617j99497j832431j007174J539390K683948J261440
35341B302461o74285j121670l04206Q01252J698095J573060l19933k751537l313933
35332b110696j798558l34050L93430J964611M199242L902966r0850l802707l130081
35323h06693L81865K171419J242756L44547O06101J03080j957370l279260k039907
35314c233462K12518R46170K48491J97604J402291J977363L34601k156502k501537
35305b572463m6894K285237J762297l62401q06549O85209J085888q26168k334133
35296a129977j183058Q26564R27760l43899p43135k74973m32101q14345J38591
35287c028573J740086J692993o1299j247169j065993j000783j445211p27245J512183
$$ plain form
35278 -3631011 -710487 1250900 1648153 2047909 3191858 3625144 2068213 -337832 -1270980
35269 -1270980 -38482 1724323 1952136 223588 -2021880 -3006862 -2181629 -358396 1332346
35260 1332346 2275234 2436912 2182939 1977197 1836014 1367896 866953 1640875 4111598
35251 4111598 6295494 5912159 3599904 1926166 1426149 347691 -1378206 -1277954 1181195
35242 1181195 2609427 625236 -2094908 -1791653 689509 1803548 1113408 1046079 1838798
35233 1838798 1211332 -910423 -1745230 -599119 -360681 -2474579 -4128353 -2747235 -242700
35224 -242700 14686 -1755309 -2682498 -1864077 -1199044 -2172031 -4140231 -5692907 -5960480
35215 -5960480 -4667465 -2345276 -492492 -390325 -1727535 -3105660 -3615092 -3258839 -2348790
$$ packed form
35278c631011K920524J961387L97253L99756J143949M33286j556931k406045r33148
35269a270980J232498J762805K27813j728548k245468r84982Q25233J823233J690742
35260A332346R42888J61678k53973k05742j41183m68118n00943P73922K470723
35251D111598K183896l83335k312255j673738n00017j078458j725897J00252K459149
35242A181195J428232j984191k720144L03255K481162J114039o90140o7329P92719
35233A838798o27466k121755q34807J146111K38438k113898j653774J381118K504535
35224b42700K57386j769995r27189Q18421O65033r72987j968200j552676k67573
35215e960480J293015K322189J852784J02167j337210j378125n09432L56253R10049
$$ plain form
35206 -2348790 -1333445 -823484 -1003245 -1333826 -1400051 -1549453 -2132099 -2729913 -2769449 -2265811
35196 -2265811 -1387592 -120091 924377 399837 -1890779 -3804378 -3037259 -209635 1648096
35187 1648096 830148 -995535 -976941 1377825 3545039 2914728 -27782 -2077290 -1109381
35178 -1109381 1374146 2544216 2310523 3124082 5721286 7470551 6069495 2892604
35170 2892604 972870 1115150 1909369 2496716 3118909 3377218 2155195 -355616 -2092982
35161 -2092982 -1283162 1453461 3466781 2487266 -934872 -3399150 -2082211 1598435
35153 1598435 3291495 1256746 -1451512 -1614101 -306659 -405048 -1658355 -1520544 209016
35144 209016 1173308 696389 771482 2337662 3753279 3936614 4164010 5396805 6265296
$$ packed form
35206b348790J015345N09961j79761l30581o6225j49402n82646n97814l9536N03638
35196b265811Q78219J267501J044468n24540k290616j913599P67119K827624J857731
35187A648096q17948j825683J8594K354766K167214o30311k942510k049508R67909
35178a109381K483527J170070k33693Q13559K597204J749265j401056l176891
35170B892604j919734J42280P94219N87347O22193K58309j222023k510811j737366
35161b092982Q09820K736623K013320r79515l422138k464278J316939L680646
35153A598435J693060k034749k708258j62589J307442r8389j253307J37811J729560
35144B09016R64292m76919P5093J566180J415617J83335K27396J232795Q68491
$$ plain form
35135 6265296 5313026 3343676 2009366 1600649 1550957 1730264 2054569 2099222 2056175 2709672
35125 2709672 3694154 3467894 1913224 1011904 1710208 2168155 806750 -812689 -243155
35116 -243155 2204207 4208536 4571457 3449523 724264 -3263312 -6117931 -5305685 -1657262
35107 -1657262 1309708 1653145 561320 -337282 -922074 -1354626 -1055717 60222 840140
35098 840140 418983 -553071 -1024409 -996324 -1128216 -1614552 -2131969 -2360827 -1994161 -688068
35088 -688068 1397226 3192330 3364736 1584805 -910881 -2297707 -2014584 -1400713 -1911876
35079 -1911876 -3036170 -3107993 -2064372 -1691945 -2666974 -3278184 -2207547 -709427 -383084
35070 -383084 -496805 338857 1272646 554976 -1186513 -1760569 -969482 -573715 -935052
$$ packed form
35135F265296r52270j969350j334310m08717m9692J79307L24305M4653m3047O53497
35125B709672R84482k26260j554670r01320O98304M57947j361405j619439N69534
35116b43155K447362K004329L62921j121934k725259l987576k854619Q12246L648423
35107a657262K966970L43437j091825q98602n84792m32552K98909J115939P79918
35098H40140m21157r72054m71338K8085j31892m86336n17417k28858L66666J306093
35088f88068K085294J795104J72406j779931k495686j386826K83123O13871n11163
35079a911876j124294p1823J043621L72427r75029o11210J070637J498120L26343
35070c83084j13721Q35662R33789p17670j741489n74056P91087L95767l61337
$$ plain form
35061 -935052 -573445 751022 1327147 383207 -871127 -1618615 -2277923 -2444976 -855234
35052 -855234 1697653 2362127 467836 -1123736 -533687 210836 -1075707 -2862589 -2548599
35043 -2548599 -691469 491895 1034620 2306987 3491872 2469357 -341547 -2228721
35035 -2228721 -2079531 -1169308 -268715 1082217 2360143 2133025 821662 566937 1645960
35026 1645960 1760438 -147107 -2082653 -2362785 -2204002 -3063346 -3600146 -1730027 1699922
35017 1699922 3812141 3605166 2672731 2248585 1743571 647842 13437 931373 2570535
35008 2570535 3000004 1723386 349605 473000 1694303 2460518 2347785 2313481 2652845
34999 2652845 2197982 367906 -1273384 -880054 1086650 2621870 2891073 2539716 1834111
$$ packed form
35061i35052L61607J324467N76125r43940j254334p47488o59308j67053J589742
35052h55234K552887O64474j894291j591572N90049P44523j286543j786882L13990
35043b548599J857130J183364N42725J272367J184885j022515k810904j887174
35035b228721J49190R10223R00593J350932J277926k27118j311363k54725J079023
35026A645960J14478j907545j935546k80132J58783q59344n36800J870119L429949
35017A699922K112219k06975r32435m24146n05014j095729o34405R17936J639162
35008B570535M29469j276618j373781J23395J221303P66215j12733l4304L39364
34999B652845m54863j830076j641290L93330J966704J535220K69203l51357p05605
$$ plain form
34990 1834111 507401 -672121 -358263 988999 1222528 -374200 -2027200 -2261778 -1712930
34981 -1712930 -1130827 229899 2559533 3750263 1982177 -1128025 -2323918 -1081435
34973 -1081435 47205 -661954 -1961535 -1846594 -284910 1074771 1017019 -112110 -1015406
34964 -1015406 -795764 277301 1343957 2041386 2430633 2100295 634250 -830442 -233162
34955 -233162 2341335 3966660 2720970 655189 931626 3253359 4582392 3690774 2330716
34946 2330716 1955524 1870184 1148011 181878 -443290 -878849 -1174141 -1098137 -1244090 -2554937
34936 -2554937 -4241153 -4148226 -2028073 -437049 -1161594 -2606135 -2296356 -409978 1006399
34927 1006399 1173271 1005624 1112258 1199727 1197363 1454878 1851572 1813561 1172868 289724
$$ packed form
34990A834111j326710j179522L13858J347262K33529j596728j653000k34578N48848
34981a712930N82103J360726K329634J190730j768086l110202j195893J242483
34973a081435J128640p09159j299581J14941J561684J359681n7752j129129r03296
34964a015406K19642J073065J066656O97429L89247l30338j466045j464692N97280
34955b33162K574497J625325j245690k065781K76437K321733J329033q91618j360058
34946B330716l75192q5340p22173r66133o25168m35559k95292P6004j45953j310847
34936b554937j686216R2927K120153J591024p24545j444541L09779J886378J416377
34927A006399J66872j67647J06634Q7469k364K57515L96694l8011o40693q83144
$$ plain form
34917 289724 -356060 -130133 1485518 3831930 5148438 4666623 3727633 3719039 3943824
34908 3943824 3007668 1363290 597084 755109 406458 -754486 -1287537 -204014 1789228
34899 1789228 3435464 3920654 2722928 44230 -2504777 -3250085 -2632018 -2432580 -2831177
34890 -2831177 -2268991 -529733 426640 -384541 -1250219 -539610 802133 1146488 745517
34881 745517 553419 145596 -1012798 -1605134 -257020 1657218 1629590 -85155 -860650
34872 -860650 184082 1240909 1313321 1865972 3956305 6087787 6354049 4954684 3220710
34863 3220710 1701895 606240 658955 1909962 2859883 2414916 1733322 2458906 4008593
34854 4008593 4499426 3763132 3407874 4086394 4699571 4474520 3970729 3555994 2547177
$$ packed form
34917B89724o45784K25927J615651K346412J316508m81815r38990q594K24785
34908C943824r36156j644378p66206J58025l48651j160944n33051J083523J993242
34899A789228J646236M85190j197726k678698k549007p45308O18067J99438l98597
34890b831177N62186J739258R56373q11181q65678P10609J341743L44355m00971
34881G45517j92098m07823j158394n92336J348114J914238k7628j714745p75495
34872h60650J044732J056827P2412N52651K090333K131482K66262j399365j733974
34863C220710j518815j095655N2715J251007R49921m44967o81594P25584J549687
34854D008593M90833p36294l55258O78520O13177k25051n03791m14735j008817
$$ plain form
34845 2547177 614042 -1245135 -1892547 -1271384 58196 1622617 2855586 3264090 3189698
34836 3189698 3338430 3311476 2069977 265727 160652 2158021 3407366 1643266 -1259545
34827 -1259545 -1865705 -97687 1132645 611363 178326 1180986 2398310 2445678 1896481
34818 1896481 1690244 1334222 233901 -648285 -119420 1235947 1920705 1780510 2027152
34809 2027152 3311694 4809732 5107107 3499553 799949 -952174 -435234 1099451
34801 1099451 1182241 -347673 -984607 435672 1561630 126671 -2220120 -2220542 121449
34792 121449 1823525 1490773 702103 797045 1027766 567866 123149 635936 1994791
34783 1994791 3655170 5144539 5649980 4590866 2772955 1460629 445846 -1093979
$$ packed form
34845B547177j933135j859177o47412O21163J329580J564421J232969M08504p4392
34836C189698J48732k6954j241499j804250j05075J997369J249345j764100k902811
34827a259545o06160J768018J230332n21282m33037J002660J217324M7368n49197
34818A896481k06237l56022j100321q82186N28865J355367O84758j40195K46642
34809B027152J284542J498038K97375j607554k699604j752123N16940J534685
34801A099451Q2790j529914o36934J420279J125958j434959k346791m22K341991
34792A21449J702076l32752p88670R4942K30721m59900m44717N12787J358855
34783A994791J660379J489369N05441j059114j817911j312326j014783j539825
$$ plain form
34775 -1093979 -2186063 -1145755 917012 867765 -1451913 -2378679 -33050 2587988 2297354
34766 2297354 369207 -329013 -99674 -823346 -1726813 -721957 1259986 1351372 -247016
34757 -247016 -284248 2198376 4174024 3265025 996908 -9223 291782 147173 -1119284
34748 -1119284 -2495389 -2766762 -1802357 -781175 -1100901 -2459440 -2749102 -978992 874019
34739 874019 819161 372629 2318005 5811008 7217082 5691210 4105541 3867916 2868048
34730 2868048 24988 -2044101 -1192790 774887 1426055 1467435 2225099 2225714 -44471
34721 -44471 -2204805 -944120 2432470 3610025 1800227 536226 1824481 3458070
34713 3458070 3090035 1606059 973434 1302384 1576765 1409719 809003 -246421 -1068428
$$ packed form
34775a093979j092084J040308K062767m9247k319678r26766K345629K621038k90634
34766B297354j928147o98220K29339p23672r03467J004856J981943R1386j598388
34757b47016l7232K482624J975648r08999k268117j006131L01005j44609j266457
34748a119284j376105k71373R64405J021182l19726j358539k89662J770110J853011
34739H74019n4858m46532J945376L493003J406074j525872j585669k37625r99868
34730B868048k843060k069089Q51311J967677O51168M1380P57664O15k270185
34721d4471k160334J260685L376590J177555j809798j264001J288255J633589
34713C458070l68035j483976o32625L28950K74381j67046o00716j055424q22007
$$ plain form
34704 -1068428 -648641 464820 405648 -1024651 -1461438 650607 3406076 3778468 1526672
34695 1526672 -824437 -1253267 -94000 1023409 926638 -295824 -1457119 -1305964 166033
34686 166033 1664462 2062370 1492114 782333 426995 415732 499235 333262 -136458 -389189
34676 -389189 -105764 -44818 -984934 -1870181 -711258 2181335 3755294 2186772 -370465
34667 -370465 -702829 1077307 2158846 1285883 6623 -315052 -419105 -1334323 -2470865
34658 -2470865 -2681052 -1984469 -1050622 86875 1477368 2085590 799783 -1402279 -1880875
34649 -1880875 342404 2786072 2197870 -1375685 -4402258 -3892138 -628110 2124170
34641 2124170 2348192 861131 -453932 -904094 -1112521 -1558363 -1740679 -939419 545167
$$ packed form
34704a068428M19787J113461n9172j430299m36787K112045K755469L72392k251796
34695A526672k351109m28830J159267J117409r6771j222462j161295J51155J471997
34686A66033J498429L97908n70256p09781l55338j1263Q3503j65973m69720k52731
34676c89189K83425O0946r40116q85247J158923K892593J573959j568522k557237
34667c70465l32364J780136J081539q72963j279260l21675j04053r15218j136542
34658b470865k10187O96583R33847J137497J390493O08222j285807k202062m78596
34649a880875K223279K443668n88202l573555l026573N10120L264028K752280
34641B124170K24022j487061j315063m50162k08427m45842j82316Q01260J484586
$$ plain form
34632 545167 1430570 1016134 325747 923887 2595579 3249079 1669628 -649547 -1457930
34623 -1457930 -724571 -230528 -663876 -956775 -646284 -880310 -2116084 -2539133 -449117
34614 -449117 2774925 4030096 2572856 884005 1060720 2027634 1440346 -765268 -2288905
34605 -2288905 -1597594 425720 2241407 3536334 4396832 3904963 1337580 -1700080 -2358003
34596 -2358003 -136845 2327950 2746842 1708113 694586 -536675 -2707712 -4597886
34588 -4597886 -4368436 -2692624 -2056992 -3029120 -3661851 -2893000 -2068118 -2294563 -2599068
34579 -2599068 -2004320 -1491667 -2252293 -3370195 -2941893 -696031 1833814 3105268 2528334
34570 2528334 378178 -2277016 -4172358 -5027007 -5378188 -4958669 -2697661 1003819 3747711
$$ packed form
34632E45167Q85403m14436o90387N98140J671692O53500j579451k319175q08383
34623a457930P33359M94043m33348k92899L10491k34026j235774m23049K090016
34614d49117L224042J255171j457240j688851J76715R66914n87288k205614j523637
34605b288905O91311K023314J815687J294927Q60498m91869k567383l037660o57923
34596b358003K221158K464795M18892j038729j013527j231261k171037j890174
34588d597886K29450J675812O35632r72128o32731P68851Q24882k26445l04505
34579b599068N94748N12653p60626j117902M28302K245862K529845J271454n76934
34570B528334k150156k655194j895342q54649l51181M19519K261008L701480K743892
$$ plain form
34561 3747711 4027627 2967785 1893924 125455 -2926278 -5360548 -5087089 -3227664
34553 -3227664 -2463832 -2895181 -2418638 -642003 654476 865976 1351762 2588996 3394626
34544 3394626 3462818 3848658 4262651 2818293 -483091 -2900689 -2948580 -2412343 -2706325
34535 -2706325 -2151552 736819 3859488 4417302 3211376 2854818 3227779 2276618 437470
34526 437470 400446 2401028 3381714 1670883 -662814 -1374206 -1169003 -1606495 -2201605
34517 -2201605 -1625614 -109111 1332943 2747431 4354402 4951766 3380189 861029
34509 861029 -354581 -314047 -1044650 -2877230 -3559305 -1835119 301547 421088 -851772
34500 -851772 -958274 904948 3046426 3851263 3370313 2283358 820648 -817849 -2138905
$$ packed form
34561C747711K79916j059842j073861j768469l051733k434270K73459J859425
34553c227664P63832m31349M76543J776635J296479K11500M85786J237234Q05630
34544C394626O8192L85840M13993j444358l301384k417598m7891N36237k93982
34535b706325N54773K888371L122669N57814j205926l56558L72961r51161j839148
34526D37470l7024K000582R80686j710831k333697p11392K05203m37492n95110
34517b201605N75991J516503J442054J414488J606971N97364j571577k519160
34509H61029j215610M0534p30603j832580o82075J724186K136666J19541j272860
34500h51772j06502J863222K141478Q04837m80950j086955j462710j638497j321056
$$ plain form
34491 -2138905 -3065830 -4152394 -5533705 -6333419 -5704537 -4043694 -2712681 -2751044 -3938153
34482 -3938153 -4795263 -3723747 -829618 1657657 1850774 822147 1146844 2840518 3080896
34473 3080896 871642 -629425 1404551 4733354 4878819 1596826 -950356 -409720
34465 -409720 920302 464260 -608773 205734 2494369 3532447 2143933 -72711 -979166
34456 -979166 84886 2219879 3810524 3726558 2427043 1412157 1070352 14207 -2609703
34447 -2609703 -5232549 -5619385 -3858311 -2259480 -2607580 -4582009 -6516371 -6719675 -4530954
34438 -4530954 -1170420 903666 606688 -316553 293798 1750941 1425276 -1255878 -3666416
34429 -3666416 -3362977 -1017767 861762 936187 -213597 -1462072 -2139740 -1971761 -956847
$$ packed form
34491b138905r26925j086564j381311p99714O28882J660843J331013l8363j187109
34482c938153q57110J071516K894129K487275J93117j028627L24697J693674K40378
34473C080896k209254j501067K033976L328803J45465l281993k547182N40636
34465d09720J330022m56042j073033Q14507K288635J038078j388514k216644r06455
34456i79166J064052K134993J590645q3966j299515j014886l41805j056145k623910
34447b609703k622846l86836J761074J598831l48100j974429j934362k03304K188721
34438d530954L360534K074086k96978r23241O10351J457143l25665k681154k410538
34429c666416L03439K345210J879529P4425j149784j248475o77668J67979J014914
$$ plain form
34420 -956847 508519 1757868 2288540 2085466 1546880 1015839 370024 -675637 -1823233
34411 -1823233 -2245249 -1620210 -570654 215857 592333 326414 -1055427 -2973352 -3474779
34402 -3474779 -1570767 946352 1641310 797363 767947 2240391 3272253 2380172 586154
34393 586154 -427047 -549178 -575686 -594970 -237984 288448 509478 559189 912203 1481774
34383 1481774 1540154 509400 -1206597 -2088166 -767901 1963296 3299710 1873866 211973
34374 211973 1682066 5410005 6873298 3934023 -427702 -2403335 -1746330 -315759
34366 -315759 1242996 2980191 3586151 1598031 -2030536 -4652614 -4755540 -2646274 643199
34357 643199 3450478 3682031 1075771 -1521863 -1204745 1389176 3519061 4393327 5263349
$$ packed form
34420i56847J465366J249349N30672k03074n38586n31041o45815j045661j147596
34411a823233m22016O25039J049556P86511L76476k65919j381841j917925n01427
34402c474779J904012K517119O94958q43947k9416J472444J031862q92081j794018
34393E86154j013201j22131k6508j9284L56986N26432K21030M9711L53014N69571
34383A481774N8380j030754j715997q81569J320265K731197J336414j425844j661893
34374B11973J470093L727939J463293k939275m361725j975633O57005J430571
34366c15759J558755J737195O05960j988120l628567k622078j02926K109266L289473
34357F43199K807279K31553k606260k597634L17118K593921K129885Q74266Q70022
$$ plain form
34348 5263349 6219747 5875310 4173288 2642733 1552917 -443870 -3268294 -4688070
34340 -4688070 -3555804 -1419905 53769 1013964 1783766 1644296 607794 248315 1202419
34331 1202419 1765468 612032 -936526 -1206608 -1012264 -2010783 -3517758 -3337728 -1107626
34322 -1107626 1289848 2309565 1978970 837670 -713393 -2058811 -2660411 -2687313 -2513601
34313 -2513601 -1987246 -1014484 -201724 33485 220094 686253 584460 -721974 -2262762
34304 -2262762 -2825312 -2707044 -2549653 -1576613 916480 3175595 2589409 -541539 -3183867
34295 -3183867 -3607088 -3030870 -2965360 -3094797 -2477889 -1058813 709066 2287725 2745373
34286 2745373 1635656 460140 1363621 3902834 5158494 3784440 1766269 1054130
$$ packed form
34348E263349R56398l44437j702022j530555j089816j996787k824424j419776
34340d688070J132266K135899J473674R60195P69802j39470j036502l59479R54104
34331A202419N63049j153436j548558k70082J94344r98519j506975J80030K230102
34322a107626K397474J019717l30595j141300j551063j345418o01600k6902J73712
34313b513601N26355R72762Q12760K35209J86609M66159j01793j306434j540788
34304b262762n62550J18268J57391R73040K493093K259115n86186l130948k642328
34295c183867m23221N76218O5510j29437O16908J419076J767879J578659M57648
34286B745373j109717j175516R03481K539213J255660j374054k018171p12139
$$ plain form
34278 1054130 702433 -925678 -3055907 -3806315 -3219130 -2659154 -2146244 -817455 395160
34269 395160 -676145 -3690411 -5066166 -2384027 2063870 3836952 1723325 -1135676
34261 -1135676 -1439528 565784 2259568 2207952 1099911 -262137 -1972504 -3675837 -4084466
34252 -4084466 -2941589 -1921060 -2091067 -1928205 139036 2492566 2347331 307715 -279726
34243 -279726 1450622 2719380 1927772 1135178 2059594 2886961 1576809 -323081 -164113
34234 -164113 1493523 2218943 1880525 2206764 3188344 3254460 2492690 2386673 2547571 1090251
34224 1090251 -1464222 -2046340 324962 2804610 2834877 1262208 -65790 -1169873 -2496613
34215 -2496613 -2845414 -1087079 1491557 2777470 2792633 3050453 3677942 3227127 1200010
$$ packed form
34278A054130l51697j628111k130229p50408N87185N59976N12910J328789J212615
34269C95160j071305l014266j375755K682139M447897J773082k113627k859001
34261a135676l03852K005312J693784n1616j108041j362048j710367j703333m08629
34252d084466J142877J020529j70007J62862K067241K353530j45235k039616n87441
34243b79726J730348J268758p91608p92594R24416Q27367j310152j899890J58968
34234a64113J657636P25420l38418L26239R81580O6116p61770j06017J60898j457320
34224A090251k554473n82118K371302K479648L0267j572669j327998j104083j326740
34215b496613l48801J758335K578636J285913J5163K57820O27489m50815k027117
$$ plain form
34206 1200010 -934774 -1523419 -528658 609255 385906 -1319608 -2857157 -2351058 22776
34197 22776 2046846 2189273 1375820 1379891 2450272 3462190 3588311 2852211 1711599
34188 1711599 888926 789322 388995 -2008692 -5777342 -7237238 -3885974 1580362 3744537
34179 3744537 694735 -4284800 -7128355 -6847109 -4635020 -1553116 1448930 2733341
34171 2733341 1086658 -2534115 -5445572 -5686472 -3800090 -2170481 -2521756 -4037218
34163 -4037218 -4412087 -2933474 -1468585 -1596204 -2080729 -937789 1009840 1212713 -193257
34154 -193257 -66826 2775250 5139510 3896679 674400 -375010 1763686 4127685
34146 4127685 4130313 2346667 756484 221197 401921 808475 1113878 1154079 1116752 1295789
$$ packed form
34206A200010k134784n88645R94761J137913k23349j705514j537549N06099K373834
34197B2776K024070J42427q13453M071J070381J011918J26121p36100j140612
34188A711599q22673r9604m00327k397687l768650j459896L351264N466336K164175
34179C744537l049802m979535k843555K81246K212089L081904L002046J284411
34171B733341j646683l620773k911457k40900J886382J629609l51275j515462
34163d037218l74869J478613J464889j27619m84525J142940J947629K02873j405970
34154a93257J26431K842076K364260j242831l222279j049410K138696K363999
34146D127685K628j783646j590183n35287J80724M06554L05403M0201l7327J79037
$$ plain form
34136 1295789 1566253 1612442 1580356 1852376 2300648 2485971 2420560 2288225 1630489 -44802
34126 -44802 -1831864 -1928946 -21917 1999031 2406158 1713129 1449349 1696653 1233943
34117 1233943 -56920 -417693 1455005 4180916 4917008 2719424 -350351 -1907682
34109 -1907682 -2078463 -2615900 -3825962 -4063019 -2498193 -638809 -137308 -541539 -589579
34100 -589579 -506371 -1192166 -1964565 -1272744 594360 1675831 1351861 1063897 1571243
34091 1571243 1655576 500146 -637294 -528072 -159375 -1178181 -3252265 -4618352 -4575674
34082 -4575674 -4002187 -3851322 -4300963 -4934399 -4768511 -2721630 814340 3394279 2728562
34073 2728562 -714454 -4138549 -5151973 -3513558 -827666 792186 469398 -398671
$$ packed form
34136A295789K70464M6189l2086K72020M48272J85323o5411j32335o57736j675291
34126d4802j787062r7082J907029K020948M07127o93029k63780K47304m62710
34117A233943j290863l60773J872698K725911P36092k197584l069775j557331
34109a907682j70781n37437j210062k37057J564826J859384N01501m04231m8040
34100e89579Q3208o85795p72399O91821J867104J081471l23970k87964N07346
34091A571243Q4333j155430j137440J09222L68697j018806k074084j366087M2678
34082d575674N73487J50865m49641o33436J65888K046881L535970K579939o65717
34073B728562l443016l424095j013424J638415K685892J619852l22788q68069
$$ plain form
34065 -398671 233589 1935211 1912268 -799153 -3331632 -3055803 -1685667 -2554790 -5168068
34056 -5168068 -5830138 -3258109 -195341 865698 488734 108487 -156569 -462083 -435056
34047 -435056 -529477 -1973614 -4235663 -4729268 -2388774 458192 1220885 191412 -942330
34038 -942330 -1916886 -3408360 -5108124 -6078203 -6096238 -5317657 -3649211 -1588074 -362116
34029 -362116 -22524 1094607 3597552 5395508 4645549 2801545 2492620 3513004 3396177
34020 3396177 1406834 -439459 -369025 1012616 1816563 857988 -1476689 -3497433 -3681108
34011 -3681108 -2505367 -1998480 -2831719 -3231082 -1770720 426469 1676794 2091018 2155613
34002 2155613 986467 -1564920 -2980937 -1350861 904596 63206 -3167343 -4675067
$$ packed form
34065c98671O32260J701622k2943k711421k532479K75829J370136q69123k613278
34056e168068o62070K572029L062768J061039l76964l80247k65056l05514K7027
34047d35056r4421j444137k262049m93605K340494K846966P62693j029473j133742
34038i42330r74556j491474j699764r70079j8035P78581J668446K061137J225958
34029c62116L39592J117131K502945J797956p49959j844004l08925J020384j16827
34020C396177j989343j846293P0434J381641Q03947r58575k334677k020744j83675
34011c681108J175741N06887q33239l99363J460362K197189J250325M14224O4595
34002B155613j169146k551387j416017J630076K255457q41390l230549j507724
$$ [...]
##END NTUPLES=NMR SPECTRUM
##END=
