##TITLE=31Pdec_LR-746-R3a-CHL
 CDCl3, 24 sc
 8.4.2022
##JCAMPDX= 6.0         $$ Bruker NMR JCAMP-DX V2.0
##DATA TYPE= NMR SPECTRUM
##DATA CLASS= NTUPLES
##ORIGIN= UXNMR, Bruker Analytische Messtechnik GmbH
##OWNER= root
$$ XWIN-NMR		Version 3.5
$$ Fri Apr  8 11:40:06 2022 Russian Standard Time (UT+4h)  she@DPX200
##.OBSERVE FREQUENCY= 81.013821
##.OBSERVE NUCLEUS= ^31P
##.ACQUISITION MODE= SIMULTANEOUS
##.ACQUISITION SCHEME= undefined
##.AVERAGES= 24
##.DIGITISER RES= 16
##SPECTROMETER/DATA SYSTEM= spect
##.PULSE SEQUENCE= zgpg30
##.SOLVENT NAME= CDCl3
##.SHIFT REFERENCE= (INTERNAL, CDCl3, 0, 248.564)
##AUDIT TRAIL= $$ (NUMBER, WHEN, WHO, WHERE, WHAT)
$$ ##TITLE= Audit trail, XWIN-NMR		Version 3.5
$$ ##JCAMPDX= 5.01
$$ ##ORIGIN= Bruker BioSpin GmbH
$$ ##OWNER= she
$$ F:/spectra/data/she/nmr/P31/1/pdata/1/auditp.txt
$$ ##AUDIT TRAIL=  $$ (NUMBER, WHEN, WHO, WHERE, WHAT)
(   1,<2022-04-08 11:39:04.84 +0400>,<she>,<DPX200>,
      <created by zg, POWCHK disabled, PULCHK disabled
       configuration hash MD5:
       00 E9 B6 7A A2 85 ED C7 34 08 36 98 17 FE 4E 26
       data hash MD5: 32K
       29 9D DD ED 62 A5 CE BB A0 3F 86 C9 29 37 6F 47>)
(   2,<2022-04-08 11:39:10.79 +0400>,<she>,<DPX200>,
      <Start of raw data processing
       efp BC_mod = 2 LB = 1 FT_mod = 6 PKNL = 1 PHC0 = -9699.927 PHC1 = 473.8757 SI = 64K 
       data hash MD5: 64K
       8D 1F A3 61 0D D2 EA 5D 5F 55 FE 81 F2 C8 CC 19>)
(   3,<2022-04-08 11:39:27.79 +0400>,<she>,<DPX200>,
      <pk PHC0 = -8.037775 PHC1 = 0 
       data hash MD5: 64K
       BF C4 5E 00 5E F1 74 FA 14 F7 DF A4 E2 55 4C FA>)
$$ ##END=
$$ 
$$ hash MD5
$$ 5B 88 B0 1E 5D 70 6F 48 17 D4 89 23 20 13 67 7C
##$RELAX= 
##$RELAX= 
##$RELAX= 
##$RELAX= 
##$RELAX= 
##$RELAX= 
##$RELAX= 
##$RELAX= 
$$ Bruker specific parameters
$$ --------------------------
##$DU= <F:/spectra>
##$EXPNO= 1
##$NAME= <P31>
##$PROCNO= 1
##$TYPE= <nmr>
##$USER= <she>
##$AMP= (0..31)
100 100 100 100 100 100 100 100 100 100 100 100 100 100 100 100 100 100 
100 100 100 100 100 100 100 100 100 100 100 100 100 100 
##$AQSEQ= 0
##$AQ_mod= 1
##$AUNM= <au_zg>
##$AUTOPOS= <>
##$BF1= 81.014009
##$BF2= 200.13
##$BF3= 200.13
##$BF4= 200.13
##$BF5= 200.13
##$BF6= 200.13
##$BF7= 200.13
##$BF8= 200.13
##$BYTORDA= 1
##$CFDGTYP= 0
##$CFRGTYP= 5
##$CHEMSTR= <none>
##$CNST= (0..31)
1 1 145 1 1 1 1 1 1 1 1 1 1 1 1 1 1 1 1 1 1 1 1 1 1 1 1 1 1 1 1 1 
##$CPDPRG= <waltz16>
##$CPDPRG1= <>
##$CPDPRG2= <waltz16>
##$CPDPRG3= <>
##$CPDPRG4= <mlev>
##$CPDPRG5= <mlev>
##$CPDPRG6= <mlev>
##$CPDPRG7= <mlev>
##$CPDPRG8= <mlev>
##$CPDPRGB= <>
##$CPDPRGT= <>
##$D= (0..31)
0 1 0 0 0 0 0 0 0 0 0 0.03 2e-05 3e-06 0 0 0 0 0 0 0 0 0 0 0 0 0 0 0 0 
0 0 
##$DATE= 1649403544
##$DBL= (0..7)
120 120 120 11 120 120 24 19 
##$DBP= (0..7)
150 150 150 150 150 150 150 150 
##$DBP07= 0
##$DBPNAM0= <>
##$DBPNAM1= <>
##$DBPNAM2= <>
##$DBPNAM3= <>
##$DBPNAM4= <>
##$DBPNAM5= <>
##$DBPNAM6= <>
##$DBPNAM7= <>
##$DBPOAL= (0..7)
0.5 0.5 0.5 0.5 0.5 0.5 0.5 0.5 
##$DBPOFFS= (0..7)
$$ [...]
##$SUBNAM2= <"">
##$SUBNAM3= <"">
##$SUBNAM4= <"">
##$SUBNAM5= <"">
##$SUBNAM6= <"">
##$SUBNAM7= <"">
##$SUBNAM8= <"">
##$SUBNAM9= <"">
##$SW= 501.771253377433
##$SWIBOX= (0..15)
0 1 3 0 0 0 0 0 0 0 0 0 0 0 0 0 
##$SW_h= 40650.406504065
##$TD= 32768
##$TD0= 1
##$TE= 0
##$TE2= 300
##$TE3= 300
##$TEG= 300
##$TL= (0..7)
0 120 53 12 22 120 120 120 
##$TP= (0..7)
150 150 150 150 150 150 150 150 
##$TP07= 0
##$TPNAME0= <>
##$TPNAME1= <>
##$TPNAME2= <>
##$TPNAME3= <>
##$TPNAME4= <>
##$TPNAME5= <>
##$TPNAME6= <>
##$TPNAME7= <>
##$TPOAL= (0..7)
0.5 0.5 0.5 0.5 0.5 0.5 0.5 0.5 
##$TPOFFS= (0..7)
0 0 0 0 0 0 0 0 
##$TUNHIN= 0
##$TUNHOUT= 0
##$TUNXOUT= 0
##$USERA1= <user>
##$USERA2= <user>
##$USERA3= <user>
##$USERA4= <user>
##$USERA5= <user>
##$V9= 5
##$VALIST= <valist>
##$VCLIST= <CCCCCCCCCCCCCCC>
##$VD= 0
##$VDLIST= <DDDDDDDDDDDDDDD>
##$VPLIST= <PPPPPPPPPPPPPPP>
##$VTLIST= <TTTTTTTTTTTTTTT>
##$WBST= 1024
##$WBSW= 4
##$XGAIN= (0..3)
0 0 0 0 
##$XL= 0
##$YL= 0
##$YMAX_a= 10271
##$YMIN_a= -11908
##$ZGOPTNS= <>
##$ZL1= 120
##$ZL2= 120
##$ZL3= 120
##$ZL4= 120
##$ABSF1= 0
##$ABSF2= 0
##$ABSG= 0
##$ABSL= 0
##$ALPHA= 0
##$AQORDER= 0
##$ASSFAC= 0
##$ASSFACI= 0
##$ASSFACX= 0
##$ASSWID= 0
##$AUNMP= <proc_1d>
##$AZFE= 0.1
##$AZFW= 0.5
##$BCFW= 0
##$BC_mod= 2
##$BYTORDP= 0
##$COROFFS= 0
##$CY= -3
##$DATMOD= 1
##$DC= 0
##$DFILT= <>
##$DTYPP= 0
##$F1P= 0
##$F2P= 0
##$FCOR= 1
##$FTSIZE= 65536
##$FT_mod= 6
##$GAMMA= 0
##$GB= 0
##$INTBC= 1
##$INTSCL= 5.30512e-09
##$ISEN= 30
##$LB= 1
##$LEV0= 0
##$LPBIN= 0
##$MAXI= 10000
##$MC2= 0
##$MEAN= 0
##$ME_mod= 0
##$MI= 50
##$NCOEF= 0
##$NC_proc= -4
##$NLEV= 6
##$NOISF1= 182.463
##$NOISF2= 159.3651
##$NSP= 0
##$NTH_PI= 0
##$NZP= 0
##$OFFSET= 248.5645
##$PC= 4
##$PHC0= -9707.965
##$PHC1= 473.8757
##$PH_mod= 1
##$PKNL= yes
##$PPARMOD= 0
##$PSCAL= 0
##$PSIGN= 0
##$REVERSE= no
##$SF= 81.014009
##$SI= 65536
##$SIGF1= 159.3651
##$SIGF2= -187.1042
##$SINO= 113.3802
##$SIOLD= 16384
##$SREGLST= <1H.CDCl3>
##$SSB= 0
##$STSI= 65536
##$STSR= 0
##$SW_p= 40650.406504065
##$SYMM= 0
##$S_DEV= 0
##$TDeff= 32768
##$TDoff= 0
##$TI= <>
##$TILT= no
##$TM1= 0
##$TM2= 0
##$TOPLEV= 0
##$USERP1= <user>
##$USERP2= <user>
##$USERP3= <user>
##$USERP4= <user>
##$USERP5= <user>
##$WDW= 1
##$XDIM= 65536
##$YMAX_p= 300451251
##$YMIN_p= -5985151
$$ End of Bruker specific parameters
$$ ---------------------------------
##NTUPLES= NMR SPECTRUM
##VAR_NAME=  FREQUENCY,     SPECTRUM/REAL,   SPECTRUM/IMAG
##SYMBOL=    X,             R,               I
##VAR_TYPE=  INDEPENDENT,   DEPENDENT,       DEPENDENT
##VAR_FORM=  AFFN,          ASDF,            ASDF
##VAR_DIM=   65536,         65536,           65536
##UNITS=     HZ,            ARBITRARY UNITS, ARBITRARY UNITS
##FACTOR=    0.620285442955139, 1,           1
##FIRST=     20137.2065510759, 0,            0
##LAST=      -20513.1999529892, 0,           0
##MIN=       -20513.1999529892, -5985151,    0
##MAX=       20137.2065510759, 300451251,    0
$$ Real data points
##PAGE= N=1
##DATA TABLE= (X++(R..R)), XYDATA
$$ [...]
38769B31618L45150j47204m72852k53662J42932K42766Q7543k3311j9621k049
38759A31310K2663Q3640J17588Q6464M6226j1958j60748k95313j95742N9543J03585
38748a2742j29171k25747M3569L10446K12041M54P1984K35663M9747l37752l62533
38737a44041Q353J95325l8478k21091l086K54049J16747j77803j28283J92598
38727E4290K65831k9845k40768o5614J90015R7182k50678l66251m6811L42858
38717d9791L42149j0938k37471n5262K50258K30785j08230l49352k66358p6677
38707c30887k6801l3891P6801K20772J93378J2778j25582j46465j16186l8220
38697c14303J31003K90244K51469J1415k18504k74010j78504l1316Q1148P6044
$$ plain form
38769 231618 576768 429564 -43288 -296950 -154018 88748 176291 152980 133359 131310
38759 131310 153973 237613 355201 441665 487891 475933 315185 19872 -175870 -116327 -12742
38748 -12742 -141913 -367660 -324091 -13645 198396 198850 270834 506497 556244 218492 -144041
38737 -144041 -135688 59637 21159 -199932 -203018 51031 167778 -10025 -138308 54290
38727 54290 320121 290276 49508 -16106 173909 271091 20413 -345838 -392649 -49791
38717 -49791 292358 281420 43949 -11313 238945 469730 361500 12148 -254210 -330887
38707 -330887 -357688 -391579 -314778 -94006 99372 112150 -13432 -159897 -276083 -314303
38697 -314303 -183300 106944 358413 369828 151324 -122686 -301190 -332506 -251358 -175314
38687a75314m8238j32143l1258J42813J59637L2906R32J24504J83414O0321m7901
38676B69673M2975J95095J57036p8388k96331l19025j21468J70759L01687R3130
38666D15143k50591k80536Q6721L63208J49295k56499k68363J41578M34934K87344
38656H22234m7776k07172j71668j17733j06338q7162k5308R5915K49087K79988
38646F84067L5108l57759n29489k94323J19552L55923L07227J23166j9502n8446
38636C65524m9408r2174j90746k01587k8959J77214J89700L0043q5979r7988j32391
38625a16751j80932n9781K30903M09381L06320Q8555m8257j39402k43678k55351
38615h993j28506l1576m9919J4297K79665M65165K63159j44915l05296j23569
$$ plain form
38687 -175314 -223552 -355695 -386953 -244140 -84503 -51597 -50665 73839 257253 317574 269673
38676 269673 312648 507743 664779 586391 290060 -28965 -150433 20326 322013 415143
38666 415143 164552 -115984 -29263 333945 483240 226741 -41622 99956 534890 822234
38656 822234 774458 567286 395618 277885 171547 84385 59077 154992 404079 684067
38646 684067 719175 361416 -168073 -462396 -342844 13079 320306 443472 423970 365524
38636 365524 316116 223942 33196 -168391 -197350 -20136 169564 199607 113628 15640 -116751
38625 -116751 -297683 -357464 -126561 282820 589140 677695 629438 490036 246358 -8993
38615 -8993 -137499 -169075 -218994 -204697 74968 540133 803292 658377 353081 229512
38605B29512O8678L6290r9500j42170q2332j8816j2567o0498q3696L1865K49806
38594A16572L19535P9885k53294l18796p4024J90914K53403J42266l6828k04812
38584B14821k43938q4874J10110Q5803j34799k33510j6451L35172N00165L51227
38574H83726J5036k54959k52670k3349J15366o0304l22717k52411J40770L71810
38564C60298J55906j90064k28084j3963O5755r0457j91733m3475J70698J97670
38554A92551P7991K5874P1720L6539j43830k68756j48602J05287K26461J56205
38544C31440O6231L9756l4794j90066k43686r1142O4733o616j89956j75990P9121
38533c50969K92147K55874Q9688K2702P7620P5549r0421k70582k12719Q0782K66672
$$ plain form
38605 229512 298190 334480 234980 92810 10478 -8338 -20905 -81403 -165099 -133234 116572
38594 116572 436107 515992 262698 -56098 -130122 60792 314195 456461 419633 214821
38584 214821 -29117 -113991 -3881 81922 -52877 -286387 -302838 32334 532499 883726
38574 883726 898762 643803 391133 367784 483150 422846 100129 -152282 -11512 360298
38564 360298 516204 326140 98056 84093 149848 59391 -132342 -175817 -5119 192551
38554 192551 270542 296416 368136 404675 260845 -7911 -156513 -51226 175235 331440
38544 331440 397671 437427 402633 212567 -31119 -122261 -57528 -64144 -254100 -430090 -350969
38533 -350969 -58822 197052 286740 309442 387062 462611 372190 101608 -111111 -30329 236343
38522B36343Q2596k43030k70467J355J33134m7885j81466j0467J77123P9918o8228
38511a11074O1081K60580J52357q8813o516L05452L15119m3463k51686o9681J17471
38500F40827r298k31510k46475j14876j4809M2935M5355r0156k36100j09131K23155
38489a00083L17684L4784k04510p8331J64847J81720N6491J8486J8698o2486j14835
38478B32465l9217J5489l9435o641K10768L32613J39361j42302k24580j91617
38468B86904k03005j29119J20035K57658N8184j87117j15539J06899J09728m9893
38458B54735q8076n0701j28462j70686M0642K56281J07802j99092j77885J02599
38448e2843J50030p8328j40623O6397J56883o144j01106K743L2040r4901q1214
$$ plain form
38522 236343 318939 75909 -194558 -193203 -60069 -107954 -289420 -299887 -122764 -42846 -111074
38511 -111074 -49993 210587 362944 274131 267615 573067 888186 844723 593037 523356 640827
38500 640827 631529 400019 153544 38668 23859 66794 112149 21993 -214107 -323238 -100083
38489 -100083 217601 252385 47875 -30456 134391 316111 372602 391088 409786 347300 232465
38478 232465 193248 208737 169302 162661 373429 706042 845403 703101 478521 286904
38468 286904 83899 -45220 74815 332473 390657 203540 88001 194900 304628 254735
38458 254735 166659 115958 -12504 -183190 -142548 113733 221535 22443 -155442 -52843
38448 -52843 97187 18859 -121764 -55367 101516 95372 -5734 -2991 29049 -65852 -147066
38437a47066J39568K04045k8226j80475N391K47835K32111P3377j3666p1520j47157
38426C14217j06202K9513j2462k41005k52030R4227L24780P4425k95682k66103
38416c36322M3089J64544O4254O3719J78199J04783j86476l47785j78362J19568
38406c10789K61239J84642J2710q6146j6390J19185R9291q5216j59730K004J12812
38395A33612r0049l63162k69920J60451M59434L54274M4444j48507j20792L8503
38385A98288J76624J62830J6315p8405k4797J7874j02457k40697j75363L257K7420
38374a9111r7153j02488Q2967K09540J10789m4434l1882R6493J12631o0126k46162
38363A1064k25182J4784K49960K61201P5487j00994j53397j27874o4299L2521
$$ plain form
38437 -147066 -7498 196547 168321 -12154 -6763 241072 473183 546560 532894 461374 314217
38426 314217 208015 237528 225066 -15939 -267969 -173742 151038 225463 -70219 -336322
38416 -336322 -293233 -128689 -64435 -716 177483 282266 95790 -251995 -430357 -310789
38406 -310789 -49550 135092 147802 61656 45266 164451 263742 178526 18796 20800 133612
38395 133612 43563 -319599 -589519 -429068 30366 384640 429084 280577 159785 198288
38385 198288 374912 537742 554057 475652 450855 468729 366272 125575 -49788 -46531 -19111
38374 -19111 -116264 -218752 -135785 73755 184544 140110 108228 204721 317352 257226 11064
38363 11064 -214118 -199334 50626 311827 387314 286320 132923 5049 -59250 -26729
38353b6729N4757j07255k83486j65567J75539K89977L5909j58383R046K05444
38343B9252N7976j68582l5227K68753K37468n7815j01328J33815J37698j97369
38333C04641l39125k5771K72164J36556j37054q7599J65758K00045j6650j74400
38323B98565j56790j06797q7007l7336N010n0753j29369o3163J38630K83785K38511
38312C33286M6949j40385j67175J0002K21325K15214l3128k72087k91562j31231
38302b08792P7144K62092L30936J84235o6671j46548k1061J5191j76829l16694
38292f6997j69167L7205p224j53143m8098K39893L03655L7140k31043k53077j26156
38281d37012O121J51621K68750J96258o3139k45793j69597L2700J56868J98358
$$ plain form
38353 -26729 28028 -79227 -362713 -528280 -352741 -62764 -26855 -185238 -176192 29252
38343 29252 87228 -81354 -116581 152172 389640 331825 230497 364312 502010 304641
38333 304641 -34484 -60255 211909 348465 211411 123812 289570 489615 472965 298565
38323 298565 141775 34978 -52029 -89365 -84355 -135108 -264477 -327640 -189010 94775 333286
38312 333286 380235 239850 72675 82677 304002 519216 486088 214001 -77561 -208792
38302 -208792 -131648 130444 461380 645615 578944 432396 411335 426526 249697 -66997
38292 -66997 -236164 -198959 -206183 -359326 -407424 -167531 136124 173264 -57779 -310856 -437012
38281 -437012 -430891 -279270 -10520 185738 122599 -123194 -292791 -260091 -103223 95135
38271I5135K24530J70193k9096k23005j90777L5948J79658O4401j75128k73409
38261a21550j37775Q0082J74365R3489m6026j18790j18236j08545r3726o149J58067
38250b44794K58769J46796j17100k63398j09064J93498L16140J56783o5916j53454
38240A18260j65135j95520j35088J05440L04358J95428o7536r5137J11870J57207
38230C34147o3787j56410R0381K91274Q4956k40007k05289O9641Q5120j94624
38220I5402k93458j3199K72907K40185O1220K6756R2294O6827j7980j2979M2435
38209E60410j0420j55954k13601j24523l6855o1813q9638M0689K48158K45282
38199D01735o3727l60052k74404R1129K71081R1418j01624n368J77748J10610
$$ plain form
38271 95135 319665 489858 460762 237757 46980 82928 262586 326987 151859 -121550
38261 -121550 -259325 -179243 -4878 88611 42585 -76205 -194441 -302986 -396712 -402861 -244794
38250 -244794 13975 160771 43671 -219727 -328791 -135293 180847 337630 271714 118260
38240 118260 -46875 -242395 -377483 -272043 32315 227743 160207 65070 176940 334147
38230 334147 270360 113950 204331 495605 580561 340554 135265 204906 290026 95402
38220 95402 -198056 -211255 61652 301837 363057 389813 482107 548934 530954 517975 560410
38209 560410 549990 394036 180435 55912 19057 -42756 -132394 -91705 156453 401735
38199 401735 338008 -22044 -296448 -205319 65762 157180 55556 50188 227936 338546
38189C38546j20604j77237j7966J02997Q0385K5991l8211j78006k74812j38342
38179c97259J10651J51570j8744o9300J07646K23022R0971p5248l7192J15740
38169B01857J67204P4687p2836j74163j11837J26111K88192J28076j54723j31724
38159C40844J57690K07594j29826l58708j34302J81002J30510j25723j64935L075
38149A07221Q2162M4847N0529L3326j39634k68856o7734L00334L86709J01028
38139F29932k12844k92182j78596J2186J84892J86166k7174k02754r7349J22428
38129A24705J17587r1364j92898r0619L2079P2755P2403J1185r8751n1479K28334
38118A33937L78120Q9155k80396j64316K79353L69564j3479k79663j25829P2610
$$ plain form
38189 338546 217942 40705 22739 125736 206121 232112 193901 15895 -258917 -397259
38179 -397259 -286608 -135038 -153782 -223082 -115436 107586 198557 123309 86117 201857
38169 201857 369061 443748 370912 196749 84912 211023 499215 627291 472568 340844
38159 340844 498534 706128 576302 217594 83292 264294 394804 269081 104146 107221
38149 107221 189383 234230 284759 318085 178451 -90405 -158139 142195 528904 629932
38139 629932 417088 124906 -53690 -41504 143388 329554 302380 99626 2277 124705
38129 124705 242292 150928 -41970 -132589 -100510 -27755 44648 55833 -42918 -94397 133937
38118 133937 512057 601212 320816 156500 435853 805417 791938 512275 386446 459056
38108D59056L3421j4959N6640j9589k61767k10666K31854M36395L6514l78534
38098C68365j88891K40036K06792j60688k26522K1420N4503j69205j52203J91643
38088A85250L65678J64818l1397o775n0057l02282m00519j11140K09976J70040
38078A93592o7889j27746j7320O515q0474r6737n490P6949J13800J35854R7943
38067B28997l4455j49690j31748m2656N131M4280J40326K00511J06049m5387m8939
38056B72419R3165J73695R2765k3584m6759j7488k9287p2943q5898o8896n8831
38045B28358l6473L9907J21715Q9451q0533k41867k32722o2160J18602J88912
38035A33190J30804j5719j56675j51721K5954J63688L9593k20990k63654k5496
$$ plain form
38108 459056 492477 477518 534158 514569 252802 42136 273990 710385 746899 368365
38098 368365 179474 419510 626302 465614 239092 260512 315015 145810 -6393 185250
38088 185250 550928 715746 684349 677574 627517 325235 -75284 -186424 23552 193592
38078 193592 125703 -2043 -19363 -12848 -93322 -190059 -195549 -118600 -4800 131054 228997
38067 228997 194542 44852 -86896 -129552 -124421 -80141 60185 260696 366745 321358 272419
38056 272419 365584 539279 632044 608460 561701 544213 514926 441983 356085 287189 228358
38045 228358 191885 231792 353507 442958 362425 120558 -112164 -174324 -55722 133190
38035 133190 263994 248275 91600 -60121 -34167 129521 169114 -51876 -315530 -341026
38025c41026J56951Q1952m832J37651L00782J79292q3508j26239K4050M0110j03193
38014B61990j10023O2114J16881j8004m7056J19607J42100j53665m02038k41374
38004b69468J36003L26364K94681K44514J79940n47j75777j67858q4962j22423
37994C60467j70746k1193J71090Q2755j86823k04179R5597K74607P7914j88984
37984B90505j70723K5444R4608K6578L0154J36075J61587R227k03347k94545j86629
37973h1066M3048K14743K04568P4276l6800j23237k59554l60255k41818K7870
37963e38225J25657m9346j73298J7669K92357K66857L024q6567J30229L12429
37953C00786J37642k74511n33108m06416j845L66678M34851K01815p3576j44177
$$ plain form
38025 -341026 -184075 -102123 -106955 30696 331478 510770 427262 301023 325073 365183 261990
38014 261990 151967 214081 330962 312958 265902 385509 527609 373944 -28094 -269468
38004 -269468 -133465 192899 487580 732094 912034 911487 735710 567852 482890 360467
37994 360467 189721 168528 339618 422373 235550 31371 126968 401575 479489 290505
37984 290505 119782 145226 239834 266412 296566 432641 594228 603455 400108 105563 -81066
37973 -81066 -38018 176725 381293 455569 418769 295532 35978 -324277 -566095 -538225
37963 -538225 -412568 -461914 -635212 -617543 -325186 -58329 -55305 -141872 -11643 300786
37953 300786 438428 163917 -369191 -775607 -777452 -410774 24077 225892 152316 8139
37943H139k5594Q7018Q6477J8155o2736j35580j37632j3732J42157J49368j9816
37932I6224j86427j78698K128K26493L34782K19824m1421j68706K3178L19356
37922F46733L18024k9119l32491k88567l8417J14247J00467L2206l8503j02331
37912C82249r4840j2088J8598l6705K284K06553K88770j0240m30265m71869j18884
37901b76437J34148L2246q6323J19208M13984L35578q5942l37585j30852K22713
37891C40738K54298n5706l00465j98968P5495J77277M3445r7662j04483p9289
37881E4680j06846q1700N6508J33499J3841j11480K88K10719J89921k9428r1992
37870B38010O7930R9336j40469k75377l782L61846L26535o0053l17496k37531
$$ plain form
37943 8139 -17455 69563 156040 174195 111459 -24121 -161753 -175485 -33328 116040 96224
37932 96224 -90203 -268901 -266773 -40280 294502 514326 472905 304199 327377 646733
37922 646733 964757 935638 603147 314580 276163 390410 490877 523083 484580 382249
37912 382249 287409 275321 293919 257214 259498 466051 754821 744581 314316 -157553 -276437
37901 -276437 -142289 -110043 -196366 -77158 336826 672404 586462 248877 118025 340738
37891 340738 595036 539330 238865 39897 115392 292669 336114 238452 133969 54680
37881 54680 -52166 -133866 -77358 56141 69982 -41498 -41210 169509 359430 330002 238010
37870 238010 305940 405276 264807 -10570 -14352 347494 674029 613976 296480 58949
37860E8949o2274l902J6858R5084J41030Q2083J9000M1264O5478j0433j23682
37849C19455j37950l1456R7164J49086R5536j0769n9731J4567J35787J62064O7077
37838H00830m9643j35857k36711l32100k75589l213L05725M11808K98663J41903
37828I25816M1399n3491j49492j28683M1507J65266M9411j96938k77116j01698
37818C15981J22453K14026K08828J58090j4130k84328l96385k13614j5233j14783
37808a9095l21872j87465K66740N17982L01197n1288j73609j31436j00190o058
37798I4906J89873K21570p0759l49433k23619J38837K72575J00206q6237j66810
37788A21109k37519k29878J631K65028K18989l7518r0144O7867K7748k33022j97969
$$ plain form
37860 58949 -3325 -7227 9631 104715 245745 327828 346828 388092 453570 443137 319455
37849 319455 181505 150049 247213 396299 491835 481066 421335 435902 571689 733753 800830
37838 800830 751187 615330 378619 46519 -229070 -232283 73442 485250 783913 925816
37828 925816 967215 913724 764232 635549 677056 842322 891733 694795 417679 315981
37818 315981 438434 652460 861288 1019378 1005248 720920 324535 110921 95688 -19095
37808 -19095 -340967 -528432 -261692 256290 557487 506199 332590 201154 100964 94906
37798 94906 284779 506349 435590 86157 -137462 1375 273950 374156 287919 121109
37788 121109 -116410 -346288 -344657 -79629 139360 101842 11698 79565 107313 -125709 -323678
37777c23678K90171O12506K71636l12661m19484n5963J89287P6041p7058k2937
37767B27860Q5891M1118j24885k55355k32496j5004K81476L89536J89374p2717
37757E14798r7787K8619q041k32006l38639j75009N3284J17209M3572k5487l5211
37746a54698J0938J08478J94111J66230K9514q6035q4821O022J04944J35699M7659
37735D78041j13522j97775j26307j0004K6318K9689P3125O8269n1406j07209O4365
37724A33584K46873J10498k20232k90862k0718J78023Q3375j2935J27429K55658
37714E90693Q9709j75365j96423l5179K2585k0977L2684J33626O6503j10195j37309
37703B60352l2412o6898k43338k24233J08978M12133L68956J08910o6691j10031
$$ plain form
37777 -323678 -33507 578999 850635 537974 118490 62527 251814 327855 250797 227860
37767 227860 313751 354869 229984 -25371 -257867 -272871 8605 398141 587515 514798
37757 514798 417011 445630 437589 205583 -133056 -308065 -254781 -137572 -94000 -119487 -154698
37746 -154698 -143760 -35282 158829 325059 354573 268538 183717 189739 294683 430382 478041
37735 478041 364519 166744 40437 30433 56751 86440 159565 227834 176428 69219 133584
37724 133584 380457 490955 270723 -20139 -40857 137166 220541 207606 335035 590693
37714 590693 680402 505037 308614 273435 296020 275043 307727 441353 507856 397661 260352
37703 260352 227940 161042 -82296 -306529 -197551 214582 583538 692448 625757 515726
37693E15726j47672j81324j20685J340O8193P4578J05070J51916J03291q0402
37683D90031k72504k89938q3416J78585K55618J15767m006P6871K02704J22187
37673G91899q2624r9117J02521K00525L5610j54776j54682p8046o1648R662K05655
37662G14979K97396J29553l5852P5893K53431J36278j53596k03224M095J12772
37652A331725M1065O1208K23987K56804J29439J78991M99955P23817O42021N73069
37642D662081Q20262J186614J335550J233592R11378K09242q12428j571588j577987
37633F396716j113018q24861q46217q05483n61088l80532m04422m20897k61334
37624G78864n6852j732j10159k48670k32517M5215L94393L98360l8616m20514
$$ plain form
37693 515726 368054 186730 66045 67385 135578 210156 315226 467142 570433 490031
37683 490031 217527 -72411 -155827 22758 278376 394143 390137 467008 669712 791899
37673 791899 709275 610158 712679 913204 948814 794038 639356 561310 499662 509324 714979
37662 714979 1012375 1141928 1106076 1181969 1435400 1571678 1418082 1214858 1218953 1331725
37652 1331725 1372790 1433998 1657985 1914789 2044228 2223219 2723174 3446991 4089012 4662081
37642 4662081 5482343 6668957 8004507 9238099 10149477 10358719 9546291 7974703 6396716
37633 6396716 5283698 4458837 3612620 2807137 2246049 1865517 1461095 1040198 778864
37624 778864 722012 720280 610121 361451 128934 174149 568542 966902 928286 507772
37614E07772k83476J21894K14255l8954j71100m0882J2317j40296j95012k1479
37604c4961R1076j635l0890J31718J69180j06455l36636j60338J99281K94492
37594B14832J03270o8876r7369p6919l7082M4203Q5098K9793j0594L8791N9785
37583B84932j9462o6531k3448n1367j70281j04122K15584L70087P1672l03236
37573B03828k79483m3853o1576k15198k6888M01616M38057m3462m02330k06984
37563b36273J68850K23422N3997K3759J23337R3795p9260j85104j47394o1239
37553b2110J1050M4527k6758j81862k27712m5036J89085K21021O8157m8278m2997
37542f0913l5228j00601j38374k8789J81891L07835K15725j9658j73162j18368
$$ plain form
37614 507772 224296 346190 560445 521491 350391 309509 321826 181530 -13482 -34961
37604 -34961 56115 54480 23590 155308 324488 218033 -118603 -278941 -79660 214832
37594 214832 318102 249226 151857 74938 37856 82059 167157 196950 186356 225147 284932
37583 284932 265470 198939 175491 124124 -46157 -150279 65305 435392 507064 203828
37573 203828 -75655 -119508 -181084 -396282 -423170 -21554 416503 373041 -29289 -236273
37563 -236273 -67423 155999 209996 233755 357092 450887 371627 186523 39129 -22110
37553 -22110 -11060 33467 6709 -175153 -402865 -447901 -258816 -37795 30362 -17916 -60913
37542 -60913 -96141 -196742 -335116 -363905 -182014 125821 341546 321888 148726 30358
37532C0358K1337M7041m3942q8793k1072O6312J04820J06408L5591j49303k96313
37521a87556j67777J56626K65607j9559l27687k36685J23886K89608J40712j1740
37511B5435J3083K0816j31499k24202l6702K28028K04835o2696j64159M8299K21062
37500A42300N0433k19643j50168K09025L65329J06004k03358j77550N5987J24440
37490C02799l0422j63808j56632j07101m9092R9341K79736K73059K5196k28325
37480B44751k61680j09250O0242J48516J26804K278j16921p9898Q2653J47397
37470B44892K1589r0786J696J61350J28122o0548j15722M6619J55724q193k63069
37459B21674k67350j0606J67163O2382j09958n5952J48087J85647P341r2636L7397
$$ plain form
37532 30358 51695 98736 54794 -33999 -55071 11241 116061 222469 258060 108757 -187556
37521 -187556 -355333 -198707 66900 47341 -280346 -517031 -393145 -103537 37175 25435
37511 25435 38518 59334 -72165 -296367 -333069 -105041 99794 37098 -127061 -78762 142300
37500 142300 192733 -26910 -177078 31947 397276 503280 299922 122372 178359 302799
37490 302799 272377 108569 -48063 -155164 -204256 -104915 174821 447880 473076 244751
37480 244751 -16929 -126179 -65937 82579 209383 211661 94740 14842 97495 244892
37470 244892 266481 175695 177391 338741 466863 406315 290593 337212 492936 484743 221674
37459 221674 -45676 -56282 110881 173263 63305 7353 155440 341087 348428 255792 293189
37448B93189J49428N449k11573j75982N6691J33685m9691k16679j44585N6957
37438a03111J78325J75644J04661p056j12341j30174p0910l5337k9983N0853J92435
37427B13006J97257l4176l19292m12585k82728o7146J21357K31677K36561J75829
37417E9760J47900J66493J21972l0099j50717r3424Q3539J80383Q2530j30547
37407D37790k55069j38001J34455K55388M5661k57620k73271j6996J15512m9859
37397b010k17492j17733Q4747J15270K9829K9246O7700o776r1513J8769K20365
37386A30402K14831m376j37621n5986N1706N1324M6456R5801O0250j20506k57211
37375G5070j87408k1564M7242P919m3896q3555j05900m6605Q3231J25320J0866
$$ plain form
37448 293189 442617 448066 236493 60511 117202 250887 201196 -15483 -160068 -103111
37438 -103111 75214 250858 355519 348463 236122 105948 35038 -299 -30282 20571 213006
37427 213006 410263 376087 56795 -355790 -638518 -705664 -584307 -352630 -116069 59760
37417 59760 207660 374153 496125 466026 315309 221885 305424 485807 568337 437790
37407 437790 182721 44720 179175 434563 480224 222604 -50667 -67663 47849 -2010
37397 -2010 -219502 -337235 -252488 -137218 -107389 -78143 -10443 -17219 -108732 -89963 130402
37386 130402 345233 340857 203236 147250 198956 250280 296736 392537 452787 332281 75070
37375 75070 -112338 -133902 -86660 -78741 -122637 -206192 -312092 -358697 -275466 -150146 -139280
37364a39280p0305N5324K25279J57353q6239j57097M1481J96543Q8675m6683R2178
37353C57229L38180K57642j75029m75340l17913Q011K9132k44683l75057j22558
37343g20386K78168M78392L87219J20437j79569l49728k36563J03839L66542L22497
37333E70848Q4089r2745j45463j63603j37210j761J25092M0695j85609k34899
37323a40566p597J94946J08952j10047j56361k6885O7134R7598J95219K84226
37313E06619J19137k46693l96724j38172J63646J10087j30063j09482J70967K67176
37303C16498J2379k11476o1852K71178L81863J84879j09482l37041m31649l05961
37293b90664L0532L32356L60465J99961J07421J22239P8797o5243j87055k44513
$$ plain form
37364 -139280 -209585 -154261 71018 228371 142132 -14965 26516 223059 311734 265051 357229
37353 357229 695409 953051 778022 302682 -15231 -7220 21912 -222771 -597828 -720386
37343 -720386 -442218 36174 423393 543830 364261 14533 -222030 -118191 248351 570848
37333 570848 654937 562192 416729 253126 115916 114155 239247 279942 94333 -140566
37323 -140566 -148163 46783 155735 45688 -110673 -137558 -70424 27174 222393 506619
37313 506619 625756 379063 -17661 -155833 7813 117900 -12163 -121645 49322 316498
37303 316498 328877 117401 55549 326727 708590 893469 783987 446946 15297 -290664
37293 -290664 -260132 72224 432689 632650 740071 862310 941107 875864 688809 444296
37283D44296k87333k50717l5589K08322K01909k0727j19941K0860J20995p885
37273B74190j52623r7864r840j18345k68644j55324J44476K49971N0603j44182
37263b27582p9227J08815J47866K1362n8886K4873J54922J65284O9734K2829P1816
37252D21806O5814j04368k78871k12165N6831K25962J40599l0144q5954m3497
37242A56013N666O3886J13169L9612j52268k37223q3732R8001N3362j15272j08706
37231a67492J03966K58868J98383L9395o0380p2875j4779R9674J81965J25036
37221F91761j9110p0766K7950J29812Q3036j01766l01988l87599k78085k2010
37211b48765J84911J95321J08808J17606J78294O3043k22487l33571n2140L45984
$$ plain form
37283 444296 156963 -93754 -129343 78979 280888 260161 140220 161080 282075 274190
37273 274190 121567 23703 13863 -104482 -373126 -528450 -383974 -134003 -83400 -227582
37263 -227582 -306809 -197994 -50128 -28766 -87652 -62779 92143 257427 327161 349990 421806
37252 421806 487620 383252 104381 -107784 -50953 175009 315608 285464 199510 156013
37242 156013 161679 225565 338734 378346 226078 -11145 -94877 3124 56486 -58786 -167492
37231 -167492 -63526 195342 393725 433120 372740 299865 285086 384760 566725 691761
37221 691761 672651 601885 629835 759647 842683 740917 438929 51330 -226755 -248765
37211 -248765 -63854 131467 240275 357881 536175 599218 376731 43160 -8980 337004
37201C37004M13621J09172j87837j98447l6953N6842M3320Q935n2792j79851k54687
37190E8327j15883J47653K44855Q3143r8318j01014m7838j14738j89810o1544
37180a95167J91108K93022J83889M2059n0016j46549j73262J2179K59122K14642
37170F31027j12634k70964l5263K18922Q5395k52522l16398j6801L16460M37214
37160F84436L67555J68644j35390m08620m49788k37467K9241J50785R5962j0729
37150B54629q613J15140J48672p3813l30168k28563J74374L57375J04428j40605
37140C72856J0989K55985J25979k09773k34040N6673J89488J2068j46248j08232
37130C25745p6956j48509j11748J12893K65016J51546p4329j82044j27324L1524
$$ plain form
37201 337004 750625 859797 671960 473513 436560 493402 536722 545657 492865 313014 58327
37190 58327 -57556 90097 334952 418095 319777 218763 170925 56187 -133623 -195167
37180 -195167 -4059 288963 472852 514911 464895 318346 145084 157263 416385 631027
37170 631027 518393 247429 212166 431088 516483 263961 -52437 -69238 247222 684436
37160 684436 1051991 1220635 1085245 676625 226837 -10630 18611 169396 265358 254629
37150 254629 246016 361156 509828 436015 105847 -122716 51658 409033 513461 372856
37140 372856 383845 639830 765809 556036 321996 378669 568157 580225 433977 325745
37130 325745 248789 100280 -11468 101425 366441 517987 443658 261614 134290 165814
37120A65814J96868J82048q4799l05011j28643K63038L26461m1109l41193k35533
37110b059K1270J04954R7314J59848J60270l0719k07786j46086J5943K7069p5425
37099A24593j08223o7743l4348L8806J69141J84385m816j67995o9839J58126K33017
37088D55104J31871J6727p3050j69234j82902n6369M6855r676o3836O1523J85657
37077C42670M8302j92720j69017Q0814J61750j7064j08629N4851J75357K2010
37067C98324j53773l9574J99349J68645j31157l01794j35139J26939J85724O6629
37057C84173l4402p9497j51561j98115o3748K11530L50582J89711r3118k17285
37047B98270j32443J5400J19665J53404Q4082o6470j56089r2955J0184K4112K2653
$$ plain form
37120 165814 362682 544730 459931 154920 26277 289315 615776 574667 233474 -2059
37110 -2059 19211 124165 221479 381327 541597 510878 303092 157006 172949 200018 124593
37099 124593 16370 -51373 -85721 -46915 122226 306611 301795 133800 63961 222087 455104
37088 455104 586975 603702 530652 361418 178516 122147 169002 159326 95490 157013 342670
37077 342670 390972 198252 29235 110049 271799 254735 146106 200957 376314 398324
37067 398324 244551 204977 404326 572971 441814 140020 4881 131820 317544 384173
37057 384173 349771 270274 118713 -79402 -143150 68380 418962 608673 515555 298270
37047 298270 165827 181227 300892 454296 538378 471908 315819 222864 233048 257160 279813
37036B79813R9355J17498n9683k28031j10891J24160O6067k45067l28120l6404
37026c21303K06632J21178n686J06955K24041M3115k42257k64760p7446P701m1454
37015b43284j1471J40472K69308L12474K77246J17470j03324j37715O6217J67852
37005H55245n3259k86282j93946k885p2318j80628R7572N09875L95587j99789
36995H69172m81679j13808K98797K12346q0814r8296K3670q4679k81340j62441
36985A00928J97271L28710Q7617j95361k52026j55517n3055K8227O1832m028r3418
36974E1180n5632Q2708J31562M9076K4382J67209L08081K35882j391j77543j92955
36963F22559j54472j66913j71865n0025J70283K81982J13229k35413m24209k17715
$$ plain form
37036 279813 379168 496666 436983 208952 98061 222221 288288 43221 -284899 -321303
37026 -321303 -114671 6507 821 107776 331817 374932 132675 -132085 -209531 -201830 -243284
37015 -243284 -254755 -114283 155025 467499 744745 862215 758891 621176 687393 855245
37005 855245 801986 515704 321758 318873 246555 65927 163499 673374 1068961 869172
36995 869172 387493 273685 572482 784828 704014 605718 629388 544709 263369 100928
36985 100928 298199 626909 714526 519165 267139 111622 58567 86794 148626 144598 51180
36974 51180 -4452 78256 209818 258894 283276 450485 758566 994448 993057 815514 622559
36963 622559 468087 301174 129309 79284 249567 531549 644778 409365 -14844 -232559
36953b32559K04933L87537J22958k50173k36703J67709M53483K87165m6836j02090
36943G55424P1679P4754j66335k97334j27843J01711J68491J83450K55924K13539
36933A233460n7157l00633k54748p5127n1090j13269k939K35713L32082K46489
36923A192781J61490R9823n6874k25811k01097m9503k7688j08426r132K70208
36913A045771L75156J70062k9826L4345J88820J58844k3615j45556j05737P9284
36903A747548L31973M46075K13031k41248m89639l18252K3483K09526K16097J76377
36893B314971J30123R3899J36722K14387J61531j722j7022K02598M04928M24744
36883D065159M51318O30192P43794O20308N46076Q50071J307353J423795J186957
$$ plain form
36953 -232559 -27626 359911 482869 232696 -4007 163702 617185 904350 857514 755424
36943 755424 827103 901857 735522 438188 310345 412056 580547 763997 1019921 1233460
36933 1233460 1176303 875670 620922 545795 494705 381436 378497 614210 946292 1192781
36923 1192781 1354271 1454094 1397220 1171409 970312 920809 893121 784695 775563 1045771
36913 1045771 1420927 1590989 1561163 1595508 1784328 1943172 1919557 1774001 1668264 1747548
36903 1747548 2079521 2525596 2738627 2497379 2007740 1689488 1712971 1922497 2138594 2314971
36893 2314971 2445094 2538993 2675715 2890102 3051633 3049911 3032889 3235487 3640415 4065159
36883 4065159 4516477 5146669 5890463 6510771 7056847 7906918 9214271 10638066 11825023
36874A1825023J059021J244572J406843J187295O45920N6546m63876r66514j469206
36865A4525624j864187j977443j724018j262074r08161p95535p32218n30240l10230
36856D421518k66514k91683j35124J56291K86955J85348J03188J89564K58188
36847D907731R5681k13788m04968l47204j58472q0348k53121n41028o31233m11473
36837A961777j49154j31470k54041k18368l7766j1674k08721l34897k01013M133
36827D18806M9015j5396m2268n5357j16179j17791N0125K49190K34503Q3k01106
36816D53625j73435J4256J43172Q8562n7830r1706N3368J90651J07893j19457
36806F09099j98194j5627K08508K26895N0740j51617k73690k79459j50862L9102
$$ plain form
36874 11825023 12884044 14128616 15535459 16722754 17368674 17425220 16961344 15994830 14525624
36865 14525624 12661437 10683994 8959976 7697902 6789741 5994206 5261988 4731748 4421518
36856 4421518 4155004 3863321 3728197 3884488 4171443 4356791 4459979 4649543 4907731
36847 4907731 5003412 4789624 4384656 4037452 3878980 3798632 3545511 3004483 2373250 1961777
36837 1961777 1812623 1681153 1427112 1208744 1170978 1159304 950583 615686 414673 418806
36827 418806 467821 452425 410157 354800 238621 120830 170955 420145 654648 654731 453625
36816 453625 280190 294446 437618 526180 468350 376644 430012 620663 728556 609099
36806 609099 410905 395278 603786 830681 881421 729804 456114 176655 25793 64895
36796F4895J31130Q7424O6000J56020J92858K3339j81460j30115J32943K45506
36786G88540L4952k30078k07305O4050K33093R7785j57396k18223l6122J38431
36776E07727J06950k4899l5437Q0242J33748M9834n8983j27765k12883k72124
36766A46410j32631J84087L55037J80340r6290j37799O24K8751q3775j12897k147
36755C29710P7633P3769J06728J57941N9004j39958j53256O5411J85470J7377
36745G79829j72049j05200N8025L1408r4595l8703J47420J47312q5273k42580
36735D25594j44455K6082N2899k0116m6334k0167k6735p4659q8099k815J67269
36724B48464L03802K54638K8119j40711o2806J24722J38537l6653j45765o7162
$$ plain form
36796 64895 196025 283449 349449 505469 698327 721666 540206 410091 543034 788540
36786 788540 823492 593414 386109 450159 683252 781037 623641 405418 369296 507727
36776 507727 614677 589778 554341 634583 768331 818165 759182 631417 418534 146410
36766 146410 13779 197866 552903 733243 636953 499154 499778 528529 444754 331857 329710
36755 329710 407343 481112 587840 745781 804785 664827 511571 576982 762452 779829
36745 779829 607780 502580 560605 592013 497418 458715 606135 753447 668174 425594
36735 425594 281139 307221 360120 340004 293670 273503 246768 172109 84010 81195 248464
36724 248464 552266 806904 835023 694312 631506 756228 894765 858112 712347 645185
36714F45185M1317M4338J4862K5809L584q0111r3742K1055R8761M271j31375j08039
36702D85915N2740J81217J89605P4526j56678l87973l84118q5957K25358K74530
36692D69165J56641J17147J29806P639j82778j89050k2402L3242j04647j91500
36682B23263q7738K6719O032j1203J07696K20994J54108p064q5910r5809j31086
36671C20002j40222l8673Q6182J11826J02822J65051J97320N1918j51666j68837
36661E35723l3156k180j08012j02262Q9578K07262R3727l2142L6873J25607r06
36650H10112j72542o4018K10517K01423j56165l78469j57455J60157J22035j28248
36640D47347j25149J39075K21816m082j25826J07284L42637K00285j02285j30782
$$ plain form
36714 645185 686502 730840 745702 771511 775095 694984 601242 622297 721058 725329 593954 485915
36702 485915 538655 719872 909477 984003 827325 439352 55234 -30723 194635 469165
36692 469165 625806 742953 872759 880398 697620 508570 486168 519410 414763 223263
36682 223263 135525 162244 168276 157073 264769 485763 639871 632807 546897 451088 320002
36671 320002 179780 141107 227289 339115 441937 606988 804308 856226 704560 535723
36661 535723 502567 500387 392375 290113 379691 586953 680680 648538 685411 811018 810112
36650 810112 637570 573552 784069 985492 829327 450858 293403 453560 575595 447347
36640 447347 322198 461273 683089 679007 553181 660465 1003102 1203387 1101102 970320
36630I70320M2808J7664j88632j60120J41666K34431o9623k88743o0367K10325
36620H49729J823m16444l79446P9035K57881p4532l08424N820M33490L58588q2241
36609G25279l01468j67995l3934l5265L5843J92245J62891o0035j09914J26530
36599E34177K48725l970k59278o5271L77305M98871J99220p4300l4693J13104
36589A533890J13910M3298Q5386K08419K50993J72148P7450R0690K50877M31165
36579C258226L73785k5540m83952n97073l39848o2276J0426l3111j23818l36530
36569A640289n50431m18659N8868L32886M1081m01775l98739n5580Q1275m3843
36559B85372N138K75576K70484j59836m45183j64315K68820K55193p7106j64300
$$ plain form
36630 970320 1013128 1030792 842160 682040 823706 1058137 988514 699771 639404 849729
36620 849729 851552 435108 55662 134697 392578 318046 9622 15442 448932 807520 725279
36609 725279 423811 255816 221882 186617 222460 414705 577596 517561 407647 534177
36599 534177 782902 778932 519654 454383 831688 1330559 1529779 1455479 1420786 1533890
36589 1533890 1647800 1691098 1776484 1984903 2235896 2408044 2485494 2576184 2827061 3258226
36579 3258226 3632011 3606471 3122519 2525446 2185598 2123322 2133748 2100637 1976819 1640289
36569 1640289 1089858 671199 730067 1062953 1104034 702259 303520 247940 329215 285372
36559 285372 290510 566086 836570 676734 231551 67236 336056 591249 514143 349843
36549C49843O3443J53259n6474j85661K5993K95368K52452k5402j92635j25650
36539E54536J2835O3279N288j15576k10438j45833J10660L62195L52920P9836
36529A069702j88103k25674p8709N8751R3520R1015J39822K26958K45850J17707
36519A550839q4201j66675l2027J82556K88816L26197M69860O50984N31118m638
36509C712829n70384p33501n63045m31913m16071k67369O1545K78814K11868L4372
36499A317145q3743k01116l27178k78706l0677J25791L4779m0370J11098K19103
36489H46126l1502m17453m93214k83125j52617j32811O5380M03886M68936J60834
36479D34440r8879k1689J51987J22387k5489r9902j50175k43901k09705P5752
$$ plain form
36549 349843 413286 566545 510071 324410 350403 645771 898223 872821 680186 554536
36539 554536 567371 630650 635938 520362 309924 164091 274751 636946 989866 1069702
36529 1069702 881599 655925 577216 635967 729487 820502 960324 1187282 1433132 1550839
36519 1550839 1466638 1299963 1267936 1450492 1739308 2065505 2535365 3186349 3717467 3712829
36509 3712829 3142445 2408944 1845899 1413986 997915 730546 792091 1070905 1282773 1317145
36499 1317145 1233402 1032286 705108 426402 395725 521516 556295 515925 627023 846126
36489 846126 814624 397171 -96043 -379168 -531785 -664596 -599216 -195330 273606 434440
36479 434440 335561 313872 465859 588246 562757 462855 312680 68779 -140926 -65174
36469f5174L75089L73143J09041j33517k16017j85028o9308J11329K34986J99955
36459G34499Q9504M2908M5246j803r5592j66749k03294k07574j30427K8026J56274
36448B91018J76583J37732Q5730K783m7631O6157K66347K54142m2869k68783j27773
36437G93436J65211K25403Q8659R6227L07366M12399K20898r5587k93747l29793
36427A590472k83755k17876j66883j30131o1416L2196M5083m8678q5744L9711
36417G12979J47065K2202k11326k56495j05980l0622j30012k17068j76429j17404
36407c63090r2609L0240K80722M29805K97035K7440j07918n6780J3856l1834j62304
36396B64563k31511j10974J57512L27607J87072j50074l37852k22153o813O4381
$$ plain form
36469 -65174 309915 683058 792099 658582 442565 257537 188229 299558 534544 734499
36459 734499 824003 866911 912157 910354 814762 648013 444719 237145 106718 134744 291018
36448 291018 467601 605333 691063 693846 646215 712372 978719 1232861 1189992 921209 793436
36437 793436 958647 1184050 1272709 1368936 1676302 2088701 2309599 2214012 1920265 1590472
36427 1590472 1306717 1088841 921958 791827 730411 762607 807690 759012 673268 712979
36417 712979 860044 882246 670920 414425 308445 277823 147811 -69257 -245686 -363090
36407 -363090 -455699 -425459 -144737 285068 582103 609543 501625 444845 458701 426867 264563
36396 264563 33052 -77922 79590 407197 594269 444195 106343 -115810 -122623 -58242
36386e8242J2390l103L9419L0672o7385j67646j71556m5327J73888L65420L66236
36375D74766J25239j90143l19896j67663R9892K23465J08137j02081k03731j50856
36365a02871m8033L3263J16775J92083J79142R8135J11138K53768K81353l888
36355A110865l85650m64218k10924M770k8284r1755M7096K29629J51794j52523
36345B10800l40819k24358K5229J50399J11097M7807O1195J23026J59473J42101
36335D65950R1612L6060j3748o2396j15234j53578j22788J5177J88349K26868
36325E56272M7060k01655k73459j13598R2190J69560J38405J03740Q7541M5813
36315F51869l8579j48322k37554k08902j451K52634L07244J14293r6815j39882
$$ plain form
36386 -58242 -45852 -48955 -9536 21136 -46249 -213895 -385451 -430778 -256890 108530 474766
36375 474766 600005 409862 89966 -77697 22195 245660 353797 251716 47985 -102871
36365 -102871 -150904 -117641 -866 191217 370359 468494 579632 833400 1114753 1110865
36355 1110865 725215 260997 50073 54843 26559 -65196 -18100 211529 363323 210800
36345 210800 -130019 -354377 -329148 -178749 -67652 -19845 41350 164376 323849 465950
36335 465950 557562 593622 579874 517478 402244 248666 125878 141055 329404 556272
36325 556272 603332 401677 128218 14620 106810 276370 414775 518515 606056 651869
36315 651869 613290 464968 227414 18512 17061 269695 576939 691232 594417 454535
36305D54535r2827p6765k2226J44879K61601J32453j25778j99510N384K73982
36295G55728L68929K26932o4838l05839k80796j7698J54163J7371j97998j62373
36285D93581K3755K2160j25483m1813L09813M94199K96615P2733J49185K96633
36275A991378J66607p6736j5900L20419M99454L76294K75492L94706M48072J33286
36265D513072l52378n81512n14581m91395o36009o46183l14563O2041Q1363j55888
36255I63967k02114M5162K10404N4040j82038k15074j41371j49761j34066N4638
36245C03787K11793N3098k57892k89899M049K40617K20247J59542K20721K21318
36235A087381P738k16165j96250l7547k6558j68275j80352N2631K52905J05622
$$ plain form
36305 454535 361708 284943 262717 407596 669197 801650 675872 476362 481746 755728
36295 755728 1124657 1351589 1286751 980912 700116 682418 836581 853952 655954 493581
36285 493581 517336 539496 414013 372200 682013 1176212 1472827 1545560 1694745 1991378
36275 1991378 2157985 2081249 2065349 2385768 2885222 3261516 3537008 3931714 4379786 4513072
36265 4513072 4160694 3579182 3064601 2573206 1937197 1291014 976451 1038492 1119855 963967
36255 963967 761853 807015 1017419 1071459 889421 674347 532976 383215 249149 303787
36245 303787 515580 568678 310786 20887 24936 265553 485800 645342 866063 1087381
36235 1087381 1095119 878954 682704 645157 618599 450324 269972 322603 575508 681130
36225F81130k66485l89695o4560L00093K16532j56137k15071J54404L64478N1519
36215F76208l15195j68847K68042M01458K21199J58965K17242Q419l93538m29135
36205F44818O398L25636J69278r0591m5133J52690K13973J97319J99416M4603
36195A818407l22977n52084l77214m0292J20058J29120J03630n5692l19690l19740
36185A83526O0617L02283o051m20605k65788K86896M69390R7542k29428j25555
36175C52827P6980mj79071j02067J81835L27586J86326o5393j89300j19882K1081
36164D90918P3395J8157j4413M6195Q5662j5069j71373k01351p5109O7923J05636
36153D10571M3644k0023R040J11974J57486R9338Q2322J71558J23065k44433n78334
$$ plain form
36225 681130 414645 24950 -39610 260483 477015 320878 105807 260211 624689 676208
36215 676208 361013 192166 460208 861666 1082865 1241830 1459072 1467491 1073953 644818
36205 644818 651216 976852 1146130 1055539 1010406 1163096 1377069 1574388 1773804 1818407
36195 1818407 1495430 943346 566132 525840 645898 775018 878648 822956 503266 183526
36185 183526 244143 546426 540375 119770 -146018 140878 610268 707810 478382 352827
36175 352827 429807 429803 250732 148665 330500 658086 844412 779019 589719 469837 490918
36164 490918 564313 582470 568057 614252 699914 684845 513472 312121 237012 304935 410571
36153 410571 454215 434192 443232 555206 712692 812030 894352 1065910 1188975 944542 366208
36142C66208l84697J38060K63790j55007m19213r2678L10303J99404j55589j61024
36132i0443J29897K49207J38312O6988K6174j32293j98911P8476L89841K54589
36122I11837j46567k21744P5186K42415J06084j8615j9147j20317k89524k05539
36112C14069R3240J94949M8857N4488K97120L68892J25598m2025R1705K70656
36102A817549L90778P63697J364549J451569M95749q88411j465253o99725P07949
36093C938451J473219Q40350o93067j739468j429349l94857Q4908k42047m91095
36084A347045j58498J94460M4436k32697j32657J05689L6404j83928j73531k7755
36074H18968j8249j6874J70622K92855Q7736j40630l304K60077J92882p0518q4743
$$ plain form
36142 366208 -18489 119571 383361 228354 -190859 -283537 26766 226170 70581 -90443
36132 -90443 39454 288661 426973 493961 520135 387842 188931 267407 657248 911837
36122 911837 765270 543526 618712 861127 967211 948596 929449 809132 519608 314069
36112 314069 407309 602258 651115 705603 1002723 1371615 1497213 1455188 1546893 1817549
36102 1817549 2208327 2972024 4336573 5788142 6283891 5395480 3930227 3230502 3938451
36093 3938451 5411670 6252020 5558953 3819485 2390136 1995279 2080187 1838140 1347045
36084 1347045 1188547 1383007 1427443 1194746 1062089 1167778 1204182 1020254 846723 818968
36074 818968 800719 783845 954467 1247322 1335058 1194428 1191124 1451201 1644083 1573565 1488822
36063A488822Q9652N7165j28102o6796K22911L39539K21154J76803K48327J82414
36053B831889R248K2132J99227K63407K86473N81588J020159J170079J127740
36044G511942J431604K076623K492202K676832L326872M380379M501585K894112
36036C1292151Q13992J07868O45090M56384j538005m084578n269080m725896l552406
36027A4145520k661147k046675j457220r67716p02008n24359l08242j96450l08198
36018D973505m15935k31113J21284K47540O8209o3301J33255N27997Q47906J037782
36008G247129J225544J515681J938104K461183K994649L514133M109674M608908
36000B9615005M264448K437649k21341j980496j962371j350914j924874l716302
$$ plain form
36063 1488822 1578474 1635639 1507537 1440741 1663652 2003191 2224345 2401148 2649475 2831889
36053 2831889 2841137 2863269 3062496 3325903 3612376 4193964 5214123 6384202 7511942
36044 7511942 8943546 11020169 13512371 16189203 19516075 23896454 28398039 31292151
36036 31292151 32106143 32214011 32859101 33315485 31777480 27692902 22423822 17697926 14145520
36027 14145520 11484373 9437698 7980478 7012762 6310754 5786395 5478153 5281703 4973505
36018 4973505 4557570 4326457 4447741 4695281 4763490 4700189 4833444 5361441 6209347 7247129
36008 7247129 8472673 9988354 11926458 14387641 17382290 20896423 25006097 29615005
36000 29615005 33879453 36317102 36095761 34115265 32152894 30801980 28877106 25160804
35992B5160804n017722m653777l295709k262832j886277j627912j205618q47975
35984D362982o79386n31292l52585k92787l24393k20229o515k3385l40820m92046
35974A099544j15197M09413L97176j73061o06219m64863j13195n3232j63830l3766
35964A82770K59317K73572j3442j49141K0697J09863j00521k65645q5609J75719
35954D07580J63938J8373M5289J44595M8395j24369o4758J43315J45781o9234
35944H58905j66928l9730O4460l06r2307q6653k4073N9346J48153J26279n1869
35933G95277j47896M5875K70457J09131l18141m51924j15179K46415K49401M1100
35923G24516q0064j02425j41990j65249q9858N2065J83457K33486R8896k01288
$$ plain form
35992 25160804 20143082 15489305 12193596 9930764 8044487 6416575 5210957 4362982
35984 4362982 3683596 3152304 2799719 2506932 2182539 1962310 1955795 1932410 1591590 1099544
35974 1099544 984347 1393760 1790936 1617875 1011656 546793 433598 380366 216536 182770
35964 182770 442087 715659 702217 553076 573773 683636 583115 317470 231861 407580
35954 407580 571518 589891 635180 779775 828170 703801 639043 782358 928139 858905
35944 858905 691977 652247 716707 716401 624094 537441 513368 572714 720867 847146 795277
35933 795277 647381 693256 963713 1072844 754703 302779 187600 434015 683416 724516
35923 724516 644452 542027 400037 234788 144930 196995 380452 613938 712834 511546
35913E11546l60241j05885L18758L87957L7233k50226j75067J6848M7542K3827
35903D52292J13497J99034J19457m7594j66863k33244k15202j6520K53580L06177
35893G64614J24760L5769J70697K61579J69238J71646M48179P03178O39017M12296
35883C900973K57651N1001l19251n08542j77422L40224L81674j34711o33922o84875
35873B472800m40736k55144k36486k76328k57532j38591J6928O2606p2287k62535
35863F12695l11291j58461Q0003K13484J19945r5496j34719J11301L05304R1361
35853H34126l06390l43038R574K14208L8178j20212J9584J53044O756j43028M664
35842C67466K24081K00451Q0521J08704J28444n1372j86079k1556J75739O4420
$$ plain form
35913 511546 151305 45420 364178 752135 789368 539142 364075 380923 428465 452292
35903 452292 565789 764823 884280 836686 669823 436579 221377 204857 458437 764614
35893 764614 889374 925143 1095840 1357419 1526657 1698303 2146482 2849660 3488677 3900973
35883 3900973 4158624 4209625 3890374 3381832 3204410 3544634 3926308 3791597 3157675 2472800
35873 2472800 2032064 1776920 1540434 1264106 1006574 867983 884911 947517 875230 612695
35863 612695 301404 142943 222946 436430 556375 460879 326160 437461 742765 834126
35853 834126 527736 184698 194272 408480 446658 326446 346030 499074 505830 362802 367466
35842 367466 591547 791998 872519 981223 1109667 1058295 872216 850660 1026399 1090819
35832A090819j42567o3391J70522K11032J46967K29660K61655m2944l60180j78920
35822A322653K70104K96053j47292m26057k65714n0898l8932j5590J42663K33787
35812A320777K05842K63911L67103J99641k15933m39778l05225j56704k32840
35803A006794l15919j82658M2226J64331J77771J18413j1460j16235j09077r9159
35793F75027j61360q5130K35309M05833Q5759l09790j56651L23942L70477o1223
35783A322193k47320O1697K75233K2471k94685k89203j49926j10450o2792J5128
35773E42346p9001k32428k9538M52655N81720J73436j75061n9855J58827J05226
35763A438327j4955M5532J09464L7079L1640J39362O3415k16610k79244L415K24954
$$ plain form
35832 1090819 948252 884861 1055383 1266415 1413382 1643042 1904697 1861753 1501573 1322653
35822 1322653 1592757 1888810 1741518 1315461 1049747 998849 959917 944327 1086990 1320777
35812 1320777 1526619 1790530 2157633 2357274 2141341 1701563 1396338 1239634 1006794
35803 1006794 690875 508217 550443 714774 892545 1010958 999498 883263 774186 675027
35793 675027 513667 428537 663846 1069679 1155438 845648 688997 1012939 1383416 1322193
35783 1322193 1074873 1136570 1411803 1434274 1139589 850386 700460 590010 527218 542346
35773 542346 463345 230917 201379 654034 1235754 1409190 1234129 1174274 1333101 1438327
35763 1438327 1423372 1468904 1578368 1615447 1647087 1786449 1849864 1633254 1354010 1357425 1582379
35752A582379J86912J78353K91309K24078p997J7109K89720L11168O5232Q1180
35742C219443L44835K42193j92795j98937K68103L65717q802P7886P83019J010335
35732E910997L99702Q6160O51798J086722P67613O47873J350102J947840J887441
35723A4736248K150194L169637L778024L711968M660245P058424Q782073R267624
35715E7314437J1462119J6671811K1659055K5286428L2952937M6489590N3059130
35708B64895507L5555744l884062m0687360n3215413m4109696l1159373k4398139
35701A02997208k0570925j5402593j0695031q760722p898031o112069m375255
35694B9182582l864787l557317k498728j626415j718815j879475j390363r98724
$$ plain form
35752 1582379 1769291 1947644 2238953 2463031 2455034 2472143 2761863 3073031 3138263 3219443
35742 3219443 3564278 3806471 3613676 3414739 3682842 4048559 4039757 4117643 4900662 5910997
35732 5910997 6310699 6396859 7048657 8135379 8902992 9550865 10900967 12848807 14736248
35723 14736248 16886442 20056079 23834103 27546071 32206316 39264740 48046813 57314437
35715 57314437 68776556 85448367 107107422 132393850 165346787 211836377 264895507
35708 264895507 300451251 296567189 255879829 202664416 158554720 127395347 102997208
35701 102997208 82426283 67023690 56328659 47567937 39669906 33557837 29182582
35694 29182582 25317795 21760478 19261750 17635335 15916520 14037045 12646682 11647958
35686A1647958j216751j243442o22114k15911n56932q48053n19019k36087m80376
35677E709273n97667j62370J04547k99135o65108l77320j0077j81547m18437j44960
35667B957199J84803m6842m54427l40190J12614K47520J304k29612l25787l66560
35657A740022k40575Q4049K97961K16769P9830L7654j15588l63547k73265K08455
35647A671765M39396N1617m13031l73590r1839q8403k46700j56357J01449J60971
35637A055278K9226l3398j3984m7969p7826r839N3913N3516J18077K14335O5519
35626A406848l00240m06872p1719K19434O8280k17366j99650q98P3049J19192
35616F90058L02865L66822N6854l14419l00519k0544J12019P6713J29620K57680
$$ plain form
35686 11647958 10431207 9187765 8565651 8349740 7792808 6944755 6425736 6189649 5709273
35677 5709273 5111606 4949236 5053783 4754648 4089540 3712220 3702143 3520596 3102159 2957199
35667 2957199 3142002 3095160 2640733 2300543 2413157 2660677 2661981 2432369 2106582 1740022
35657 1740022 1499447 1583496 1881457 2098226 2178056 2215710 2100122 1736575 1463310 1671765
35647 1671765 2111161 2162778 1749747 1376157 1284318 1195915 949215 792858 894307 1055278
35637 1055278 1084504 1051106 1037122 989153 911327 901488 955401 1008917 1126994 1341329 1406848
35626 1406848 1106608 699736 628017 847451 915731 698365 498715 497817 570866 690058
35616 690058 992923 1359745 1416599 1102180 801661 781117 893136 969849 1099469 1357149
35606A357149K76464K47745K97790K38345j30493n38367n63655k73782q5614j35947
35596F89635k18073j93794p5700J28768K98280J61569k47117m04955k0410M00501
35586E18704K56797j96056k57977R2481K40954r41j67090k4517O9964r9704j97139
35575B35476L5064K84132J79732j22157k47867j82018j56762j85847q4401J45180
35565i9468K66521J48980o3309j55896q2807L5373O9199n563j14000j57654q0373
35554b38997R8516K75063L14495J75570l6938j94032k60923k29082n3213J96400
35544D6859K63847L4584j91836p9204J92173J62404j56410k66534O429K33049
35534B45361J04770r1160k6434J22392O9683n4741j2898O0243n5819j91914p7487
$$ plain form
35606 1357149 1633613 1881358 2179148 2417493 2287000 1748633 1184978 911196 825582 689635
35596 689635 471562 277768 202068 330836 629116 790685 543568 138613 118203 518704
35586 518704 775501 579445 321468 413949 654903 653962 486872 462355 532319 432615 235476
35575 235476 270540 554672 734404 612247 364380 182362 25600 -160247 -244648 -99468
35565 -99468 167053 316033 252724 96828 14021 49394 118593 113030 -970 -158624 -238997
35554 -238997 -140481 134582 449077 624647 587709 393677 132754 -96328 -149541 46859
35544 46859 310706 345290 153454 74250 266423 428827 272417 5883 12312 245361
35534 245361 350131 258971 232537 354929 424612 369871 356973 417216 361397 169483 91996
35523I1996J36046J20936n0691n5476J06099J55337M6943k0708k7465j21261k35908
35512A45848j47610R5144J85328J3970k14140l09186k43207k1196K82942M21672
35502B09565K24972r6428j99315p7654K5779N8156J36218J86347K4916k36004
35492B56552k74637n9655J15924J15997J01784J57334J43705J480j21465j24612
35482C12407p3374k0425N1181J04782J02132J30619K33834K24002k9571k60265
35472G75322j44903J26880R0744k35762l51987p1437J99677J20348j15483j68554
35462B24845l0745J00651J27236N6367n6635q5031J2931K5743k05744l82111j02669
35451c15162L97059M46321l2339l40958q5237K25352N4070k94567k37450J31392
$$ plain form
35523 91996 228042 348978 298287 242811 348910 504247 551190 530482 503017 381756 145848
35512 145848 -1762 93382 278710 292680 78540 -230646 -473853 -495049 -212107 209565
35502 209565 434537 338109 138794 61140 86919 145075 281293 467640 492556 256552
35492 256552 -18085 -77740 38184 154181 255965 413299 557004 558484 437019 312407
35482 312407 239033 218608 269789 374571 476703 607322 841156 1065158 1035587 775322
35472 775322 630419 757299 848043 612281 260294 188857 388534 508882 393399 224845
35462 224845 194100 294751 421987 478354 421719 336688 349619 375362 169618 -212493 -315162
35451 -315162 81897 528218 495879 154921 69684 295036 349106 54539 -182911 -51519
35441e1519K88532J57742P2559O5563j23665m01555l50515L1637K38191O2998
35431a0032o7280J55288L51676O3788m42837n14939p8590K73172J71796n5559
35421a53517J3121K51314K73710Q1562Q74J06331J39223l454j11448p7690p8635
35410D41391j80929j49649J10479K73960P4494k27556k26945J6318J51694J25768
35400D09025J46545J96395O6998j68023j96719n749Q2737k7434n9163J05211J80381
35389G30204l3189k82653k30684P2396L07151K86454P2129j49463j93704k9639
35379E49002J34764Q2607r2573j15086L7441J07236j6346j49277j45970p7512
35369C14286j4408O5538R2967m8135k26751j60219J17908K50457J12060k2174
$$ plain form
35441 -51519 237013 394755 467314 532877 409212 7657 -342858 -311221 -73030 -10032
35431 -10032 -77312 77976 429652 493440 50603 -464336 -542926 -269754 -97958 -153517
35421 -153517 -140396 110918 384628 466190 467064 573395 712618 709164 597716 520026 441391
35410 441391 260462 110813 221292 495252 569746 342190 115245 131563 283257 409025
35400 409025 555570 751965 818963 650940 454221 448472 531209 503775 444612 549823 730204
35389 730204 697015 414362 183678 256074 563225 849679 921808 772345 578641 549002
35379 549002 683766 766373 673800 558714 596155 703391 687045 537768 391798 314286
35369 314286 299878 365416 458383 410248 183497 23278 141186 391643 503703 481529
35359D81529J0872P587j55628k44161q7216J00636R3796Q544J3222K3590m0061
35348B12710l5953P3098L6390k23506l38012n3332K94434K85147N6485k6650j9075
35337B61736j66812l00828q0892L10731L54521J9415k05408j13040r798o3029
35327F596k0462K25604L39141R5533k03876k00453j4862K6209p1027o2647P1859
35316A91615J13857j5800j48526j34994j2821J07263J72182J80207J42557P3472
35306F69012k1016j26138j75821j02478K6182K1386j73673l23863j51945K56439
35296a01915M68479K20580k02859k85116N3397L23052J11202l35568m18256R399
35286a57605M48821M27098P2676j52333p8364O5347O5275k3431n4419j7923p718
$$ plain form
35359 481529 492401 499988 344360 100199 12983 113619 207415 215959 229181 252771 212710
35348 212710 176757 249855 286245 62739 -275273 -328605 -34171 250976 307461 280811 261736
35337 261736 94924 -205904 -286796 23935 378456 397871 192463 79423 69625 6596
35327 6596 -13866 211738 550879 646412 442536 242083 227221 253430 182403 119756 191615
35316 191615 305472 289672 141146 6152 -6669 100594 272776 452983 595540 669012
35306 669012 647996 521858 346037 243559 269741 291127 117454 -206409 -358354 -101915
35296 -101915 366564 587144 384285 99169 152566 475618 586820 251252 -167004 -157605
35286 -157605 291216 718314 790990 638657 560293 625640 690915 667484 613065 595142 587424
35275E87424o2465j17103q9335J1412P3273J5792p3182k2733J69532K83131J50922
35264I26668j09831k53820k17454j35511r3948l0076R6354J78427J04139n0308
35254D14640q8261M2368J58914Q7436q3464j22533J35O8592l4046j35174n8281
35243B50326P9191N3642j08699j98106j58255j04932n8848O9016K27579K30447
35233B81361N6387q8669o7494L3885Q9770P2764k4782j99776l32658k76443q1837
35222e37492O3916J22185J98740K68474J83450k5620j47257j25912j06708j09920
35212b16144J2913K37367L20682J86048K3827o6745j79620k68994j25143J90573
35202A14764L13945J47705K7045J21065J38113j09274l19345k22281m9176q6529
$$ plain form
35275 587424 524959 407856 318521 329933 403206 418998 345816 323083 492615 775746 926668
35264 926668 816837 563017 345563 210052 116104 86028 182382 360809 464948 414640
35254 414640 326379 368747 527661 615097 531633 409100 409235 477827 443781 308607 250326
35243 250326 329517 383159 274460 76354 -81901 -186833 -245681 -176665 50914 281361
35233 281361 337748 249079 181585 215470 305240 378004 353222 153446 -179212 -455655 -537492
35222 -537492 -473576 -351391 -152651 115823 299273 273653 126396 484 -106224 -216144
35212 -216144 -203231 34136 354818 540866 564693 497948 318328 49334 -75809 114764
35202 114764 428709 576414 603459 724524 862637 753363 434018 211737 162561 76032
35192G6032j55541K6259K93765K98507O8285j13482j61953j51884o0396R5476
35182B15068J08332r4167k36126j20630M3912N8288Q0081J94804J09759k56873
35172A02448l85515N0433M85742K74547k37430k80208O6732J12178j80013j93910
35162a84996J46839K43473l8546j20271J83213K87824q1477l48369q2110K66717
35152B72297J66774j40767j70278j0218j8023j33322o6337J43354K41661J83426
35142D68567O7323q9965k16540j35480Q2677R3787j29084j39311K16997M01134
35132F20105K0128m27685k58500L13243M82960M6231l88787l29724L9157K70994
35122C88122J80518j12093l32378k30496J29632L23027O8476l36389l88855o4776
$$ plain form
35192 76032 -79509 -53250 240515 539022 607307 493825 331872 179988 119592 215068
35182 215068 323400 229233 -6893 -127523 -83611 -25323 54758 249562 359321 102448
35172 102448 -283067 -232634 253108 527655 290225 10017 76749 188927 8914 -184996
35162 -184996 -38157 205316 166770 46499 229712 517536 436059 87690 5580 272297
35152 272297 439071 298304 128026 117808 99785 -33537 -99874 43480 285141 468567
35142 468567 535890 445925 229385 93905 176582 270369 141285 1974 218971 620105
35132 620105 640233 212548 -45952 267291 750251 796482 407695 77971 117128 388122
35122 388122 568640 456547 124169 -106327 23305 346332 414808 78419 -310436 -375212
35112c75212K16604K12451P2903j1940k5512R381P2475N8550q8653j95184p2577
35101a26714J49551J89649M4450n1095l0603l3363p5948l3338N9359L0012r2628
35090B9332j05235j5288l7687j56663q3585K28766M15590K34993o7618j61194
35080B81411q7923m8599p104J52018K77180J47396r3817j01148R7929J00677k11846
35069E06174m11913j48222K86109L47736J5890k24540j17333O5224M3734m6208
35059C16651J4042R4168m0033k51800k01582R1238K56655J56721O4153J55824
35049F56037K06936J881k55917k34620J1890J16028r0474l71696l86115m4263
35039c90313M13674O10650L61380j17839m05568l33087j26672m3866n3038Q593
$$ plain form
35112 -375212 -158608 53843 126746 114806 89294 98675 171150 229700 141047 -54137 -126714
35101 -126714 22837 212486 256936 205841 175238 141875 65927 32589 91948 121960 29332
35090 29332 -75903 -91191 -128878 -285541 -369126 -140360 275230 510223 442605 281411
35080 281411 193488 144889 137785 289803 566983 714379 620562 519414 617343 718020 506174
35069 506174 94261 -53961 232148 579884 595774 371234 253901 319125 362859 316651
35059 316651 330693 424861 384828 133028 -68554 22684 279339 436060 500213 656037
35049 656037 862973 864854 608937 374317 386207 502235 411761 40065 -346050 -390313
35039 -390313 23361 634011 995391 877552 471984 138897 12225 -31641 -84679 -76086
35029g6086J43682K35446K39181J62582j3314k20337k54191m7827J37225L7222
35019C43583j99016k02877N8387K27575R0335j32447j43322J3425P2723m5915
35009H2451j45937l9548K13413L84394L22866Q2506j62987k70990j97131O796
34999B75833K01360K33250J00131n804O2031J72866R3619j37966k37853r7312
34989F60155O4078N1476m0583n3779l1237p0332r7393p463J06806Q4738l9690
34978F26776j05114p4909l6990k1276P311L3709K7613K8028N2202J1413j30542
34967D18221k24312j39793M401J8844n3133m1297L2693J2519o8713k1825J28218
34956F5823J10639j55797l56455j78085K52275N04281L50518l451j87396p6726
$$ plain form
35029 -76086 67596 303042 542223 704805 691491 471154 216963 169136 306361 343583
35019 343583 144567 -58310 77 227652 317987 185540 42218 55643 128366 82451
35009 82451 -63486 -103034 110379 494773 817639 900145 737158 466168 269037 275833
34999 275833 477193 710443 810574 804770 866801 1039667 1133286 995320 757467 660155
34989 660155 724233 775709 735126 681347 650110 579778 482385 474922 581728 666466 626776
34978 626776 521662 446753 409763 388487 395798 429507 457120 485148 537350 548763 418221
34967 418221 193909 54116 58517 77361 24228 -17069 15624 28143 -40570 -62395 65823
34956 65823 176462 20665 -335790 -513875 -261600 242681 593199 589748 402352 325626
34946C25626J08536J04927o1672j45883o8045m0028k03490l31019j11960L53709
34936f9299O03364L74630q0323l13683j79608P4944J50641L8862j2787J29339
34926G16080K52857P9236k83851m25046k11937Q041n2372j84724o8136J68963
34916h89J55306j01040k18824m1076J71815J93524J14691O7675j3888j94375l30367
34905a97448k48750O707K36504K97067J81042j4800j55086j80749j58075j34568
34895c68156k6133K00634L39181J82616j05162j53068P7576K26206O9344j79785
34885B63253k30763j05807n497J281k2312l6303k9943J2853N6506L6053j5047
34874g5726n303K9440j7377o5819P8939L37190L59594N9916j89892j13455M3134
$$ plain form
34946 325626 434162 539089 477417 331534 263489 223461 19971 -311048 -423008 -69299
34936 -69299 534065 908695 828372 514689 335081 410025 560666 599528 586741 716080
34926 716080 968937 1048173 764322 339276 127339 135380 83008 -101716 -169852 -889
34916 -889 154417 53377 -165447 -206523 -34708 158816 273507 341182 327294 132919 -197448
34905 -197448 -446198 -439491 -202987 94080 275122 260322 105236 -75513 -233588 -368156
34895 -368156 -394289 -193655 145526 328142 222980 69912 147488 373694 443038 263253
34885 263253 32490 -73317 -78814 -77533 -99845 -136148 -166091 -153238 -96732 -60679 -75726
34874 -75726 -81029 -51589 -68966 -134785 -55846 281344 640938 700854 510962 397507 440641
34863D40641o0236k81247k36537N8607K18171R2626n5744j9142O5793K127j59887
34852F5172k34511j45137M4734K14605K40483R2306p8038p2900R2194J98829J27873
34841E45610R19l9172l6241j03921k12637k22751q5673Q9101J62098J04883J4992
34830B17208R450R3069J42052N2852j13938k00184j45779l6924L6982P5562R6883
34819B27233Q0453L0199K387R409j9249j08963j60237r1132K0678N6814M7638
34808I5230R0724J35062N0789q8866m3906J88187K60616l7784l98266l75232j9585
34797a43031K10213J22739m304M2061P7271p6753k07525n5522K01974J89484p6918
34786B79689k23712r8374O0103N5121j4316k0600j4954m5268m0267m810o5877
$$ plain form
34863 440641 380405 99158 -137379 -78772 139399 232025 176281 157139 222932 225059 65172
34852 65172 -169339 -314476 -269742 -55137 185346 277652 199614 126714 218908 417737 545610
34841 545610 546529 507357 471116 367195 154558 -68193 -153866 -64765 97333 202216 217208
34830 217208 226658 319727 461779 514631 400693 200509 54730 17806 54788 130350 227233
34819 227233 307686 337885 340272 349681 330432 221469 61232 -29900 -9222 47592 95230
34808 95230 185954 321016 371805 282939 239033 427220 687836 650052 251786 -123446 -143031
34797 -143031 67182 189921 185617 227678 304949 228196 20671 -34851 167123 356607 279689
34786 279689 55977 -42397 17706 72827 58511 37911 22957 -22311 -62578 -67388 -133265
34775a33265j84886j12659J78082L15302N9225k55861j73340J87928L16747R4910
34765B92183p3516M4390J52743n3101l84551m52601k12648O4921K02733K26541
34755a92906J78603P9064J6882N9014J12790P1598K4473R1947J32312p8558l86774
34744A08445l50893R2954M17004J95945k70493l64155l145K94982J67481j47890
34734A40235k20240K883K08413J52241q4160k26936j09922J54140K97195K06912
34724E20761M8735J1542M4854m0p8532l9482N6746l3j76746j81574O5136K49174
34712E20541J15428j62361k68020j71894m5580N2096J41379J28374o7512k79512
34702c7061k55068j1365J97085K29298J63850Q9207P495n3001k4607P3746J37037
$$ plain form
34775 -133265 -318151 -430810 -252728 62574 121799 -134062 -307402 -119474 197273 292183
34765 292183 218667 263057 415800 362699 -21852 -474453 -687101 -622180 -419447 -192906
34755 -192906 -14303 64761 81643 140657 253447 325045 349518 441465 573777 495219 108445
34744 108445 -242448 -149494 267510 463455 192962 -171193 -174338 120644 288125 140235
34734 140235 -80005 -77122 131291 283532 199372 -27564 -137486 16654 313849 520761
34724 520761 569496 581038 625892 625852 547320 507838 564584 564551 387805 206231 271367 520541
34712 520541 635969 473608 205588 33694 -11886 40210 181589 309963 242451 -37061
34702 -37061 -292129 -303494 -106409 122889 286739 375946 383441 330440 305833 379579 516616
34691E16616J08670J4367j00574j71389j25890j473N3045J362o808P7320N5445
34680D20691j58343k70894l3278K71190J88757j75906k80133K6153L01138K31347
34670E20722N0120L8279O0055j03496l10351k91502r1890M5471P0073J07460J72080
34659B67021J59854N5968n5936j28375j40997n3775Q7022J20585Q241m0994J25729
34648D04343L08498K01918j43319l65058k78880p6242P737j629L6478R5201L2345
34637B21392j17996j11155J51439L75412J97259k74679n14476k67861R8483J47760
34627i4422q782P177J66831J21577j29820k03224n842Q9274r1299j93956N9339
34616b83147L94568M43310K91565K07777J58879n407j64793j40521p7557k08316
$$ plain form
34691 516616 625286 639653 539079 367690 241800 240327 293372 294734 287926 365246 420691
34680 420691 262348 -8546 -41824 229366 418123 242217 -37916 -11763 289375 520722
34670 520722 570842 609121 669176 565680 255329 -36173 -128063 -82592 -12519 94941 267021
34659 267021 426875 482843 426907 298532 157535 103760 190782 311367 319608 278614 404343
34648 404343 712841 914759 771440 406382 127502 51260 58997 57368 93846 189047 221392
34637 221392 103396 -7759 143680 519092 716351 441672 -72804 -340665 -242182 -94422
34627 -94422 -103204 -96027 70804 192381 62561 -140663 -146505 -57231 -148530 -342486 -283147
34616 -283147 111421 554731 846296 1054073 1212952 1207545 1042752 902231 824674 616358
34606F16358m08140l74334j05181J54676K99053L57351K88763J26017J10180K98785
34596A363528K92553j80485o69010n69657q9195M9309k46231l49950q499K83973
34586a23664J93495N6730J55210J89180q1650k95200j07871J67691J08198r4831
34576A67288n8796N2086j04803k78231J874M74401M15100j66249m49963r1648
34566c8941K40010k4350m32410k67974K96022M87889J06961k75370k24417M6865
34556h5715J67757J19168N9539R519n1838l5026P8961J00661q5295k51818j08560
34545h2647K40618L99094K17996l8292j12883p8144j12766j79836j24600L6469
34535A65009J28942P1627m7984j22202j14693l1891P0756P8267o1920k21372k15544
$$ plain form
34606 616358 208218 -166116 -271297 -116621 182432 539783 828546 954563 1064743 1363528
34596 1363528 1656081 1475596 806586 236929 147734 197043 -49188 -399138 -407637 -123664
34586 -123664 69831 126561 281771 470951 389301 94101 -13770 153921 262119 167288
34576 167288 108492 160578 55775 -222456 -220582 253819 668919 502670 52707 -38941
34566 -38941 201069 176719 -255691 -523665 -227643 260246 367207 91837 -132580 -85715
34556 -85715 82042 201210 260749 270268 218430 183404 262365 363026 277731 25913 -82647
34545 -82647 157971 557065 775061 736769 623886 545742 432976 253140 128540 165009
34535 165009 293951 365578 317594 195392 80699 48808 119564 197831 135911 -85461 -301005
34524c01005m1125J25383J61399J15860Q6826Q7518N8377m9087j96300k39230
34514a91384o8864J74572J78405j17413l45516j84904J52581K23671K2034n9073
34504b15891J00352J79463J2850j21461k1612P1320o6399k03690o9317J16425
34494b17960q007k82898k24810K10056N50607M93313K16908k0210j72735k16212
34484C28052o9704J46074J31711j38856l08862j62832N0094L5571r7739q9277
34474a75768J5322q320j25170q0301J57306K95061J19713k06619l42659j56701
34464e08136J45490K52954R3692q2792k9902J44934J28394j06730k18042k255
34454a82393K83357L03659J12813j9057m7031j06365j74933j38078j04273k64956
$$ plain form
34524 -301005 -342130 -216747 -55348 60512 147338 234856 293233 244146 47846 -191384
34514 -191384 -260248 -85676 92729 -24684 -370200 -555104 -402523 -178852 -156818 -215891
34504 -215891 -115539 63924 76774 -44687 -66299 5021 -61378 -265068 -334385 -217960
34494 -217960 -225967 -508865 -733675 -523619 26988 520301 737209 716999 544264 328052
34484 328052 258348 404422 536133 397277 88415 -74417 -24323 11248 -86491 -175768
34474 -175768 -160446 -168766 -293936 -374237 -216931 78130 197843 -8776 -351435 -508136
34464 -508136 -362646 -109692 -16000 -98792 -128694 16240 144634 37904 -180138 -182393
34454 -182393 100964 404623 517436 498379 451348 344983 170050 31972 -72301 -337257
34444c37257m53851k67591K80963O33486M09499p5048k73325j21877L2116L1528
34434a41357N3372J88153K38511N1881j95219k23905l6085J06539M6104r0266
34424b272j07766j2580L8382j6382q4875r1913n2431M8492K61673M69601L79821
34413H29750q7808n59456n95517k30056J27433K52892K71086K87280K09341K1608
34403E26553q3645n477Q4519K5173q1365o5391M3252J00717M6251j05368k95327
34392A89892l52086j19971K30158K95217N912k10085n3335J94665J61072n530
34382C35909N1462K25934J21754k29591l75146j64143M8050L518j13420p5904
34372a71577M6264J20469J74976K07846Q4496j84089l35774k19105k3135K0549
$$ plain form
34444 -337257 -791108 -1058699 -777736 -144250 265249 190201 -83124 -205001 -172885 -141357
34434 -141357 -87985 100168 338679 390560 195341 -28564 -64649 41890 87994 -2272
34424 -2272 -110038 -122618 -84236 -100618 -185493 -277406 -329837 -281345 -19672 449929 829750
34413 829750 741942 182486 -413031 -643087 -515654 -262762 8324 295604 504945 526553
34403 526553 442908 437431 521950 547123 465758 400367 443619 544336 590587 485219 189892
34392 189892 -162194 -282165 -52007 243210 249122 39037 -14298 180367 341439 335909
34382 335909 387371 613305 735059 505468 130322 -33821 14229 17747 -95673 -171577
34372 -171577 -125313 -4844 170132 377978 462474 278385 -57389 -276494 -299629 -279080
34362b79080o2001j32798j51322r1189J05212L29559L18300L9367j80381j05951
34352b10284P8035J01108J1155p578J7973k4085n1831N9409K00213J92484R4162
34341D60761N4345P857j71256l34722k29956N8983J89612O9251m2663L1673J56373
34330B50258J55577O4778R174J1395L797p7447k26621l12456j61413J75337L61612
34319B53991J78136j42113k24318o9624L7109J8994L1473O0660o6718k46489j24627
34308b93526L09527N74430L41151j23371l73233l25741j58562K8791J80688J71574
34298C31728P219p3483M9156J47611L2403q9546L3490K26350J58239r7051k00901
34287E25215j22851j15779j87763q9778J55562K10173J151j35447m8283k3914
$$ plain form
34362 -279080 -341081 -473879 -625201 -716390 -611178 -281619 36681 76048 -104333 -210284
34352 -210284 -132249 -31141 -19986 -27564 -9591 -33676 -85507 -26098 174115 366599 460761
34341 460761 515106 522963 351707 16985 -212971 -153988 35624 104875 62212 93885 250258
34330 250258 405835 470613 479787 491182 494979 417532 190911 -121545 -282958 -107621 253991
34319 253991 432127 290014 65696 -3928 33181 52175 83648 144308 77590 -168899 -293526
34308 -293526 16001 590431 931582 808211 434978 109237 -49325 -20534 160154 331728
34298 331728 338947 265464 314620 462231 494634 405088 438578 664928 823167 726116 525215
34287 525215 402364 286585 98822 9044 164606 374779 375930 240483 192200 168286
34277A68286k03880k33794J25104M47216K11402l53398n53320k32965Q2271N6225
34267d86853k0176J61799L81186K76927n1492k05637o7629J19493J56808P9123
34257C43549k0762r9158r5924J6918J10377K3395j69714k16677m6777J32224J59599
34246A37050J28870J53393J32364n5928k73525k75249q0800M7261N627p798J56165
34235F7430L12675J89254j51596l49116k01654R4654K26808J36696j913o9882
34225B53356r8626j14434p2268R910J2104r4333j43016R34K01638K08280J3251
34214A76796j22491k4333J69314K00430P071k23791k59470m1085K46404L17000
34204D45845P0776k63057l64282j95011n070L8206L9389J21530J81263O7149j25179
$$ plain form
34277 168286 -35594 -269388 -144284 302932 514334 160936 -392384 -625349 -543078 -486853
34267 -486853 -507029 -345230 35956 312883 261391 55754 -11875 107618 264426 343549
34257 343549 322787 223629 127705 144623 255000 278395 108681 -107996 -154773 -22549 137050
34246 137050 265920 419313 551677 495749 222224 -53025 -133825 -86564 -80937 -88735 67430
34235 67430 380105 569359 417763 68647 -133007 -38353 188455 325151 323238 253356
34225 253356 154730 40296 -31972 -22062 -9958 -104291 -247307 -246373 -44735 163545 176796
34214 176796 54305 29972 199286 399716 406787 182996 -76474 -117559 128845 445845
34204 445845 516621 253564 -110718 -305729 -310799 -272593 -233204 -111674 69589 136738 11559
34193A1559j45993N6425K57484K44470M9060j33341j53323j3217J51823J80333
34183E05280M6772p6025j548K11781K91511Q8939k12620l18178j83116l1723l3136
34172B87937j05685r6865j9228J8748J6855L8482J7343j55280l39565k31732J45384
34161d23606L39635R0480k26265j25488K33286K85648m6531k50941o6711J34324
34151e6169K6689j31265o460J88100O1436k49706k69207N8177L00091K10967K0497
34140A53150j1766N9396P8637L4098l7943j40987k01778r0720J40016K46773J19700
34129C48576p8221j84261k34124k70679j74439J25821M20944M12757R0271k40390
34119B16255k93866p6527J73614K47165J47963L7490J6721J9562m1815j11127
$$ plain form
34193 11559 -134434 -78009 179475 423945 473005 339664 186341 173124 324947 505280
34183 505280 552052 476027 474479 686260 977771 1066710 854090 535912 352796 321073 287937
34172 287937 182252 85387 66159 84907 101762 140244 157587 2307 -337258 -568990 -423606
34161 -423606 -83971 6509 -219756 -345244 -111958 173690 127159 -123782 -190493 -56169
34151 -56169 -29480 -160745 -167205 20895 82331 -167375 -436582 -378405 -78314 132653 153150
34140 153150 141384 200780 279417 313515 275572 134585 -67193 -157913 -17897 228876 348576
34129 348576 270355 86094 -148030 -418709 -593148 -467327 -46383 366374 456645 216255
34119 216255 -77611 -154138 19476 266641 414604 452094 468815 488377 446562 335435
34109C35435p2844N3759J36881J20966O1307j2277j25520k47931k79589j75100
34099b04913K906J48190J68018M0128j05998p4069J13803J65423p0255l15075
34089a31842k45990J861O5599m7486l1495J16726Q9332r8012l5384L34244M65897
34078D83450M3015m45634m06337j1690J53591J4745k1704J38173J32405j76044
34068i6030m10162k32055J88960M34055L15126j7024k61555k14877K0374J07680
34058a65508q0099k25361l4675K37770J50090j68357j65535K13924L76139L4729
34048A73117k89770r8957K77927K29555j55765k60792Q4058L90541K74921p3792
34038E51043k82958k60088j36194l7463l5464j17698j45186j7933J28234J04784
$$ plain form
34109 335435 262591 316350 453231 574197 635504 623227 497707 249776 -29813 -204913
34099 -204913 -202007 -53817 114201 154329 48331 -25738 88065 253488 183233 -131842
34089 -131842 -377832 -375971 -310372 -357858 -389353 -272627 -183295 -281307 -316691 17553 483450
34078 483450 526465 80831 -325506 -337196 -183605 -168860 -190564 -52391 80014 -96030
34068 -96030 -506192 -738247 -549287 -115232 199894 182870 -78685 -293562 -273188 -165508
34058 -165508 -245607 -470968 -505643 -267873 -117783 -286140 -451675 -237751 138388 173117
34048 173117 -116653 -215610 62317 291872 136107 -124685 -40627 349914 624835 551043
34038 551043 268085 7997 -128197 -165660 -201124 -318822 -464008 -481941 -353707 -248923
34028b48923o48L6793J55177Q2955j45861j70026R8147K74696J08650j10519l0429
34017E0012K18439K83817J23244o6080k08269k87930j59421J89352L86847J33294
34007F63305k57339k60409L3464N9912k72558m03669l8039L52246K51279j46488
33997a8296k98545r6400J28512J73578J45666J60051J75357J22141M419j11855
33987C84628j23402Q348J29984M0330j79778k17547j668J61522P5318m5803J1429
33976B43361P5201o4785k21072j12383J22893J48893L302j0636J04749O6607j20762
33965B35368j24816J18380K43644N6044j33584j7947K03675J43225j73587l48424
33955B01978j74449J11081J65144m0354k19208j39833R2303J82575M1583j11155
$$ plain form
34028 -248923 -249571 -212778 -57601 25354 -120507 -290533 -192386 82310 190960 80441 50012
34017 50012 268451 552268 675512 609432 401163 113233 -46188 143164 530011 663305
34007 663305 405966 145557 179021 238933 -33625 -437294 -475333 -123087 128192 -18296
33997 -18296 -316841 -413241 -284729 -111151 34515 194566 369923 492064 496483 384628
33987 384628 261226 269574 399558 439888 260110 42563 40895 202417 277735 231932 243361
33976 243361 318562 253777 32705 -79678 43215 192108 195410 184774 289523 356130 235368
33965 235368 110552 228932 472576 528620 395036 377089 580764 723989 550402 201978
33955 201978 27529 138610 303754 263400 44192 -95641 -3338 179237 220820 109665
33945A09665q2771L4402P1836O9666J36083J69532N461k36389k59650m3375J06508
33934H0968R568j47427j16999P1948K03316J58113L841j19776j40215j10321j21279
33923b28263j40750l0898K16182M03947L92902K67448J14663j38405m64830n65338
33913a73342k61159J39373K14211J0611j06015l6738K1529J4609O1879J15920
33903H78K7804r0818p546J66826J11947j28312j90720j3972R1630K5829J9443
33892A2989J07443L2193k09863k72417o2832R3342M9395M3064J30606J9840k90442
33881c46682l27740P6321M27620L57578J72959J99220J85937j11579l33931j25024
33871A74679J51851r114l56471k81323J68233L97973K14410k6027j07292j48709
$$ plain form
33945 109665 26894 61296 133132 202798 338881 508413 513874 277485 17835 -25540 80968
33934 80968 90536 -56891 -173890 -101942 101374 259487 263328 143552 3337 -106984 -228263
33923 -228263 -369013 -399911 -183729 220218 613120 880568 995231 856826 391996 -173342
33913 -173342 -434501 -295128 -80917 -70306 -176321 -213059 -191530 -176921 -115042 878
33903 878 28682 -62136 -69682 97144 209091 80779 -109941 -123913 -32283 -6454 12989
33892 12989 120432 152625 -57238 -329655 -392487 -299145 -249750 -206686 -76080 -56240 -346682
33881 -346682 -674422 -598101 -170481 187097 360056 559276 745213 633634 299703 174679
33871 174679 326530 317416 -39055 -320378 -152145 245828 460238 434211 326919 178210
33861A78210j62558j7012J65294J10883r9107j24150L9949N6560j39657k16998
33851b08586j4777J98427J58215m8737j86428j56678j2326J17863J08226m876
33841d9677j8872J35816K58910K11967J37910J29269L129k81607l52167L762L46072
33830E24512J90317k05139k58895n200O1774j13600j39430L0625M4380j15142
33820A4202q2405J41123J22241j82720k58721R2151L72874J89198j57596k13926
33810C6421k2147J11918J00804K5205o7730q8695O3681K49748K01772j6519n9439
33799E35019J08819J31370j16598l10826k42890j10392o6977J6165J45259Q0354
33789A69303j58049j88655O7538J68944r6564k95000n8259L00079L11564M9037
$$ plain form
33861 178210 15652 -1360 163934 274817 175710 51560 91509 148069 8412 -208586
33851 -208586 -223363 -24936 133279 84542 -101886 -258564 -270890 -153027 -44801 -49677
33841 -49677 -68549 67267 326177 538144 676054 805323 808452 526845 174678 178440 524512
33830 524512 714829 509690 250795 245595 307369 193769 54339 84964 129344 14202
33820 14202 -68203 72920 195161 12441 -246280 -154129 218745 407943 250347 36421
33810 36421 14274 126192 226996 252201 184471 95776 159457 409205 610977 594458 535019
33799 535019 643838 775208 658610 347784 104894 -5498 -72475 -56310 88949 169303
33789 169303 11254 -177401 -109863 59081 -37483 -332483 -390742 -90663 220901 269938
33779B69938j38709j86989j87673p9799J22941J62155k2432p4979J62607K69293
33769B96353n8297l85898j84263L01183M45924K00438N404r233q3454k29104k00646
33758I8407q115Q2387K4548M871M9552M8253N9341J62150J56978j23400l73901
33747A81071k07871J66886K27837l0010j51005l1971k1058j90612j78979J18444
33737a17268L11562J56573r7757j96126k13639k12447n0478K32162K88969j329
33727A00222k72505k07135K2081J11190Q7203J23710J81496J27719N82q8770j33214
33716E2579j23985K0313K44011L00277R3710j37719j63971p0674m3127o2214k1403
33705H7797M6367O6516Q0810J16183N8014j49613l16897k17574J04850L80844
$$ plain form
33779 269938 131229 -55760 -243433 -323232 -200291 -38136 -60568 -135547 27060 296353
33769 296353 238056 -147842 -332105 -30922 415002 615440 620844 611611 528157 299053 98407
33758 98407 90292 172679 197227 202098 251650 299903 359244 521394 678372 554972 181071
33747 181071 -26800 140086 367923 337913 186908 154937 133879 -56733 -235712 -117268
33737 -117268 194294 350867 253110 56984 -156655 -369102 -419580 -187418 101551 100222
33727 100222 -172283 -379418 -357337 -246147 -158944 -35234 146262 273981 274563 185793 52579
33716 52579 -71406 -51093 192918 493195 586905 449186 285215 214541 171414 109200 87797
33705 87797 134164 200680 281490 397673 455687 306074 -10823 -228397 -123547 257297
33695B57297L84211Q9384l05466m66816k30584J25982J54606j53081l23508r3132
33685e61107K03950J66465q4544j67014l1314P7842Q1373J08084J66407J28482
33675H8624J5456p645P5548J06004K6247m1264q141P2653J13706N8797j10227
33664C89758k79733k14853J32546M29526L32663k3381k01703q3729K3605p3518
33654D31181j69354m5133J61848J84300J6412j34143j59959j28329j07620p4451
33644b5248J6848J52427K39640J65326o4556k57547k20673j8950Q8577l971j18666
33633d6793o7024R4169J70328Q1309q3085j84414j52987m2322J9581l389J3179
33622b01448J41304K16861Q2788p9702J3052K25021J43088k02070k68894J29422
$$ plain form
33695 257297 641508 730892 425426 -41390 -271974 -145992 8614 -144467 -467975 -561107
33685 -561107 -357157 -190692 -275236 -442250 -473564 -395722 -314349 -206265 -39858 88624
33675 88624 104080 96435 171983 277987 304234 262970 254829 327482 441188 499985 389758
33664 389758 110025 -104828 27718 457244 789907 766526 564823 481094 504699 431181
33654 431181 261827 216694 378542 562842 579254 445111 285152 156823 49203 -25248
33644 -25248 -8400 144027 383667 548993 484437 226890 6217 -12733 75844 71873 -46793
33633 -46793 -113817 -19648 150680 231989 148904 -35510 -188497 -230819 -211238 -214627 -201448
33622 -201448 -60144 156717 239505 159803 172855 397876 540964 338894 70000 199422
33612A99422M23384J36946l40201l64427l7416O1453j19009j16677J18981J16295
33602G8751k13232l33383k546K65671M1725l19179k76476Q6437L42726L95545
33592F6039L58331J34077l13708n62066k21283L52053M49561K6372k79797j25599
33582a16020J40908J44816n031n1755O257N7480Q6526O9372n8862k09825j87154
33571a23288j1898Q0117L1368L9779J67320K08887O5815p3138n6617J9128M1444
33560C88917L0564l2900k07082l33509j56877J93562K65177k1399j98621N320
33550f6848K43354J81099N0429J42114K08407p5327m16023l02960J29731K91454
33540C85430O3032j13843m5468k7327j82112j82160J35280L95801K40925j36640
$$ plain form
33612 199422 622806 759752 419551 55124 17708 79161 -39848 -156525 -37544 78751
33602 78751 -134481 -467864 -470410 -204739 -163014 -482193 -758669 -672232 -329506 66039
33592 66039 424370 558447 244739 -317327 -538610 -186557 263004 289376 9579 -116020
33582 -116020 24888 169704 164673 112918 119175 176655 263181 332553 273691 63866 -123288
33571 -123288 -135186 -55069 -23701 16078 183398 392285 458100 384962 328345 347473 388917
33560 388917 419481 386581 179499 -154010 -310887 -117325 147852 126453 -72168 -66848
33550 -66848 176506 357605 408034 550148 758555 683228 267205 -35755 93976 385430
33540 385430 448462 334619 289151 261824 79712 -102448 32832 428633 669558 532918
33530E32918l23418k43957q5707P5220K45770K95810R8758j93711k98003j77586
33520g3906m0978K238M0722J10244R2482m6098j19179K0971K22937K19857R884
33509D39174j46424j04797j325K2644L8411J27149J57477n040k01144j64192O5752
33498B27685J97064J24801J5176m5922j51875k61740j43201K18887M66270L20687
33488I67832m5019k70678k28504k7217J68574J71972j14580m55486m28222L041
33478b58287L64101L28504J47687J47247J75796m1032l19968k86535j5652R0419
33468C32280n4132j60221q2388K7213M9088J7156m4476r2909J4899K57526K88912
33457E52948o7927l87295j95618K39101K72378r1891k30236N8868K75467J12728
$$ plain form
33530 532918 209500 -34457 -120164 -44944 200826 496636 595394 401683 103680 -73906
33520 -73906 -114884 -112646 -71924 38320 130802 84704 -34475 -13504 209433 429290 439174
33509 439174 292750 187953 186628 209272 247683 374832 532309 527269 326125 161933 227685
33498 227685 424749 549550 564726 518804 366929 105189 -38012 180875 647145 967832
33488 967832 922813 652135 423631 396414 564988 736960 622380 166894 -261328 -258287
33478 -258287 105814 434318 582005 729252 905048 864016 544048 257513 241861 332280
33468 332280 278148 117927 35539 62752 111840 128996 84520 -8389 6510 264036 552948
33457 552948 485021 97726 -97892 141209 413587 321696 91460 150328 425795 538523
33447E38523q2108m909R2893m8428j86150l5862J91368J48189q3392j93567j53596
33436A82961j51606k19112k40374j75722l5187J94474M04959L69337Q1190j46289
33426B64631j07611K2593K6191l6944m7798o3125j00872l227K31614L02718P5730
33415E63900j30648m9597P9042n9381k87905k52818l8870K1386n0829J6322J83710
33404e688J72286J9398L1547J87958J19935k34534m46881k29927J56582L25847
33394I6523K47929J05635m3263k15612l09840k03922L4033J91114J37768m8988
33384h623j54286k6158K27542L01325O1119k34491k50708l4171P2189o2023j86649
33373b94934n6681K30154L75547K29648p2822k56708j74195L3963J05679J3109
$$ plain form
33447 538523 456415 451506 544399 495971 309821 273959 465327 613516 530124 336557 182961
33436 182961 31355 -187757 -428131 -603853 -639040 -444566 -39607 329730 410920 264631
33426 264631 157020 179613 205804 168860 121062 57937 -42935 -46162 185452 488170 563900
33415 563900 433252 383655 462697 403316 115411 -137407 -176277 -154891 -205720 -189398 -5688
33404 -5688 166598 185996 217543 405501 525436 290902 -155979 -385906 -229324 96523
33394 96523 344452 450087 406824 191212 -118628 -322550 -288517 -97403 40365 -8623
33384 -8623 -162909 -189067 38475 339800 400919 166428 -84280 -118451 -46262 -108285 -294934
33373 -294934 -351615 -121461 254086 483734 410912 154204 -19991 13972 119651 132760
33363A32760j5679R0952Q4989j41216k36028R4770M95889L91101j21236l71292
33353D05010j18540J45786L2177j89619j34832R2973J88702J34585M5722j18869
33343D83095l23246k70675J36472M59353K99910n7334r0325J09512L2819l33954
33333D45627m58072j50985J37557P4352r1187n9754L7516l71n3653K045j1843
33322a28768j90654k22279J15487M52573L17151j14219k86584j14151N372p1083
33312b37155p5420P8727J33900K3300J3131J50348J13649j56223k23668J14015
33302f5396L76057J15555l36405l62100J9018K71061J86667N3891O4363P4739
33292C97450k5993j35694j68218j38377k9814J28402J36828r2886k57598o3740
$$ plain form
33363 132760 117081 208033 293022 151806 -84222 10548 506437 897538 776302 405010
33353 405010 286470 432256 464433 274814 139982 232955 421657 556242 601964 483095
33343 483095 159849 -110826 25646 484999 784909 727575 637250 746762 779581 445627
33333 445627 -12445 -163430 -25873 48479 -42708 -102462 -64946 -65317 -118970 -116925 -128768
33322 -128768 -319422 -541701 -426214 26359 343510 229291 -57293 -171444 -166072 -237155
33312 -237155 -312575 -233848 -99948 -76648 -63517 86831 200480 44257 -179411 -65396
33302 -65396 310661 426216 89811 -272289 -253271 17790 204457 258348 322711 397450
33292 397450 371457 235763 67545 -70832 -100646 27756 164584 71698 -185900 -249640
33282b49640K25439J35020k25629k95607J7860K01816L3729o0376J92436L92832
33272C67880J60562j89828j63253J25994K01543j4273j88254j50269l8677J5168
33262A26593p643j09128j87527k6423L41759M84288J21898l85576m90352j91672
33252c23783R0998J79328J95431J21010j53739l97425k17416K73237M88714J95344
33242D51699j66209j60258O4795J15646o2136k09360j52370L8001J60536N3558
33232A33902k14295l09519O06M51201N29258J47460k49637l14258j75622p4395
33222g5299L764J16893J26657m8078j88876p6312J54397K16037P1530j01252j97205
33211B256k10326j17235M1709J03087J7145j1076J51503K74098R0481k26307k65780
$$ plain form
33282 -249640 -24201 110819 -114810 -410417 -392557 -190741 -157012 -217388 -24952 367880
33272 367880 528442 338614 175361 301355 502898 488625 300371 150102 111425 126593
33262 126593 118950 9822 -177705 -204128 137631 621919 743817 358241 -132111 -323783
33252 -323783 -232785 -53457 141974 262984 109245 -288180 -505596 -232359 256355 451699
33242 451699 285490 125232 190027 305673 243537 34177 -118193 -80192 80344 133902
33232 133902 -80393 -389912 -389306 61895 591153 738613 488976 174718 -904 -75299
33222 -75299 -71535 45358 172015 123937 -64939 -141251 13146 229183 300713 199461 2256
33211 2256 -208070 -325305 -283596 -180509 -163364 -174440 -22937 251161 341642 115335 -150445
33200a50445J3000K28861J31968j13323k36579j60919N7736L14482M12606K07940
33190G05327j18181j94189L5306K11747R3575j14190j47704r8810j65471k46744
33180c9334j41598K9615M305j23202j8487K86363L62297O2861k11411j40799L0320
33169A00930l9469j83524l0443L02750L33190j4887k59385r2411J69996J00717
33159C87464k02246l04347p7027J69982J54972m3014j68624j25940k5098K3753
33149b10125M4279R8892J42073P6951m7098m4932J15101J91877O579k44025k51972
33138a22400p3360k0123j09233r689L61687N79761K86153k62290n11669k92882
33128a74045Q9103L07688K83386R4057j20112k02133j36824j13025k42992l16233
$$ plain form
33200 -150445 -137445 91416 223384 110061 -126518 -287437 -229701 84781 497387 705327
33190 705327 587146 392957 428263 640010 733585 619395 471691 372881 207410 -39334
33180 -39334 -180932 -151317 -147012 -270214 -288701 -2338 359959 422820 211409 70610 100930
33169 100930 61461 -122063 -152506 150244 483434 468547 209162 116751 286747 387464
33159 387464 185218 -119129 -196156 -26174 128798 85784 -82840 -208780 -233878 -210125
33149 -210125 -165846 -66954 75119 152070 104972 60040 175141 367018 373597 129572 -122400
33138 -122400 -195760 -215883 -325116 -334805 26882 606643 892796 630506 118837 -174045
33128 -174045 -84942 222746 506132 600189 480077 277944 141120 28095 -214897 -531130
33118e31130p9925L03444L87181O2726k46902j53651J67662K42456k9854k43760
33108a21753q4066J95333J31420k19950k89323J63227O00737M38976q2125k58663
33098D73813K4119K27952J30921J42739M76704P51896P89680J062761J750416
33089E831001K008633J030139n89907j482069j292251r05048r34355r87954o40138
33080B038051k13318j41987k50921j77281o692j860q7947o2914j0863r0831j74659
33069H18778q0487N8327J7494j25799j62835j26962j64204k04042r7179O3335
33059c574R1476N2341J20507K01553N9741k21125k74003R222K89519K43801k5504
33048E43954j87915j29039k5982l4236o2734N9921K68041K75769j8145l10816
$$ plain form
33118 -531130 -611055 -307611 79570 142296 -104606 -258257 -90595 151861 122007 -121753
33108 -121753 -205819 -10486 120934 -99016 -388339 -225112 375625 814601 732476 473813
33098 473813 497932 725884 856805 999544 1476248 2228144 3017824 4080585 5831001
33089 5831001 7839634 8869773 8279866 6797797 5505546 4600498 3666143 2678189 2038051
33080 2038051 1824733 1682746 1431825 1254544 1247852 1245992 1158045 1095131 1084268 993437 818778
33069 818778 738291 796618 814112 688313 525478 398516 234312 30270 -66909 -3574
33059 -3574 87902 140243 260750 462303 522044 300919 26916 36138 325657 569458 543954
33048 543954 356039 227000 201018 166782 104048 163969 432010 707779 689634 378818
33038C78818k70229r366Q2710p7606j79589k4330K18527L31653K97810J37110
33028H85508j52524l76696k51481J10636K35213J0827q7410K04639M28694J41437
33018A148843l05566l18891l0278j3824k71643k66470J03535L28210J66463l253
33008E37126R6182K04213P0977j16192j56680j86078k78675j82081J70331L31564
32998D90687j1603m34738l42533J31763L49707J25895j07583n3479Q1211N5173
32988B84500l3552k0170K6208k7904j44056k02626j59502k1169J63767K36736
32978A02232O2292k13766k73134o7263J05650O5838n02P7220J39981K8441o1248
32967c4259R3584K81019J53216j51878j76042J05620K21974j5412k08392p4086
$$ plain form
33038 378818 108589 99223 181933 104327 -75262 -99592 118935 450588 748398 885508
33028 885508 732984 356288 104807 215443 450656 461483 374073 578712 1007406 1148843
33018 1148843 843277 524386 494108 480284 208641 -57829 45706 373916 540379 537126
33008 537126 633308 837521 908498 792306 635626 449548 170873 -11208 159123 490687
32998 490687 479084 44346 -298187 -166424 183283 309178 201595 148116 229327 284500
32988 284500 250948 230778 256986 229082 85026 -117600 -277102 -298271 -134504 102232
32978 102232 164524 -49242 -322376 -389639 -283989 -218151 -218653 -141433 -1452 26989 -34259
32967 -34259 59325 340344 493560 341682 165640 271260 493234 477822 269430 195344
32957A95344O2602j41087l91927k15253K13935K85556r9867l85916k13793J12253
32947e78153J86397P4238N8886J57727K00062J60369J25364P8256l3626j25435
32937C04085q7150J7236N0406J8560J3969K4041k5263j01530j10320n6756j3311
32926C3967K0194Q2421J33894J14377N6348N004r4789k69385l57182j87190J19920
32915c42421K47367R2514j12310j25262L5464K02678K77170K45740J09447r2243
32905E38144k44293k34214o5206J33483K05344R7878p5203j40201o9234j3915
32895A32583p3318j29287l6485J16203J21319j3575o7979L5933J06871K218j32599
32884F1884r5848M9081P6345n4286j46341n7669J20133K10490J60665N0318k3051
$$ plain form
32957 195344 257946 116859 -275068 -490321 -276386 9170 -90697 -476613 -690406 -578153
32947 -578153 -391756 -317518 -258632 -100905 99157 259526 384890 463146 429520 304085
32937 304085 216935 234171 284577 303137 317106 341147 315884 214354 104034 47278 33967
32926 33967 54161 136582 270476 384853 441201 446205 351416 82031 -275151 -462341 -342421
32915 -342421 -95054 -2540 -114850 -240112 -204648 -1970 275200 520940 630387 538144
32905 538144 293851 59637 -5569 127914 333258 431136 355933 215732 146498 132583
32895 132583 59265 -70022 -106507 9696 131015 117440 49461 85394 192265 194483 61884
32884 61884 -33964 15117 91462 37176 -109165 -166834 -46701 163789 324454 374772 351721
32873C51721j6601L5935L6258p7263k04991j56314Q4719K67226J73485p0716j61921
32862B61538m7052M4904R308J8261J51666J75298o8636k97288j60714J78372K48036
32851E13693j1516j81651o4956K6911j34657k69987p9854K03979J74369q7070
32841H9261j61850J3017Q0657j03414k25412l3233K58916L00234R7181n1486J8844
32830B82715J73962J90684K068k44861l18083j31170J30549J93285K5391j26178
32820A78362p0499R3809J67544J35061J07213P7887n3206k27160k21412J0186
32810A97785J81567L4761k64086l23856q6162R5807P903r0496J03149M05343L82714
32799F44429R686k84887k42069p5828m1801n1943O4915J98717J45134j9831n4370
$$ plain form
32873 351721 335120 371055 407313 330050 125059 -31255 53464 320690 494175 423459 261538
32862 261538 214486 259390 268698 286959 438625 613923 545287 247999 87285 265657 513693
32851 513693 502177 320526 255570 282481 147824 -122163 -202017 1962 176331 89261
32841 89261 -72589 -59572 21085 -82329 -307741 -340974 -82058 218176 315357 263871 282715
32830 282715 456677 647361 649429 404568 86485 -44685 85864 279149 304540 178362
32820 178362 107863 201672 369216 504277 611490 689377 636171 409011 187599 197785
32810 197785 379352 414113 150027 -173829 -259991 -164184 -156281 -246777 -143628 261715 644429
32799 644429 654115 369228 127159 51331 9530 -42413 22502 221219 366353 346522 292152
32788B92152N2284Q3896l2105j22496o6450K5758O801r4348j43758r2509j5884
32777a06659m24l6349k4847R5658K34824K20613Q116k47211l57710k78877r5283
32766e88149P9243J57251J30562R7699J40553J75216P0036r8241j20863j4417
32756B8890l0851k20972k90716o5100K00097K12209P7930N1035Q7045M653j02232
32745d8012j8554J49274J10942q1161p5862J84448L34396J47259j44455k39056
32735C19219j63085r9447p2307m974P9989R9074M5495k6118o9939m6480N2825
32724A14252J47447J37272L5314p4315j68360k32010j55974R3830K71421J09450
32714B78327k26231k75194N6521L19980J66732j47825j57269J44145L24018J14672
$$ plain form
32788 292152 344436 428332 396227 273731 207281 233039 239840 145492 1734 -90775 -106659
32777 -106659 -107083 -143432 -168279 -72621 162203 382816 390932 143721 -213989 -492866 -588149
32766 -588149 -508906 -351655 -221093 -123394 17159 192375 262411 164170 43307 28890
32756 28890 -1961 -222933 -513649 -578749 -378652 -166443 -88513 -37478 49567 54220 -48012
32745 -48012 -66566 82708 193650 112489 36627 221075 555471 702730 558275 319219
32735 319219 156134 56687 -15620 -20594 59395 158469 203964 177846 107907 61427 114252
32724 114252 261699 398971 434285 359970 191610 -40400 -196374 -102544 168877 278327
32714 278327 52096 -223098 -166577 153403 320135 172310 15041 159186 483204 597876
32704E97876k66806m10124j65159K25480L80114J64596j64658k53204o3826J17533
32694A61822Q7868l5924n3040K1728L3619m7922j03115o5299j1224k4478o3666
32683i9631l2064N9276R0856K7895R007J27844K18429O4266k18210k83708p8787
32672a14827O9951p14l6148J29909K16821k83j97845N574L52351L04487q9622
32661F39654l00290j89474j28690k46235k27526K1930J61186N4652J5778J63850
32651c5165J43144j88286l70422o3758L49586L66652J26336N0026R5845m9058
32641D24900l01246l02542n8692R3000P0745R5899J95588J44498p5975k00053
32631H6122j24435n1950j04365j29368k485J61194K14711J75612J15181L8279
$$ plain form
32704 597876 331070 -79054 -244213 -18733 361381 525977 361319 108115 44289 161822
32694 161822 249690 213766 160726 182454 216073 168151 65036 -263 -11487 -35965 -99631
32683 -99631 -131695 -72419 18437 46332 55339 183183 401612 465878 247668 -36040 -114827
32672 -114827 -44876 -45590 -81738 48171 264992 264709 66864 72438 424789 729276 639654
32661 639654 339364 149890 21200 -225035 -452561 -430631 -269445 -214793 -199015 -35165
32651 -35165 107979 -80307 -450729 -514487 -164901 201751 328087 378113 473958 424900
32641 424900 123654 -178888 -237580 -144580 -73835 22064 217652 362150 286175 86122
32631 86122 -38313 -90263 -194628 -323996 -326481 -165287 49424 225036 340217 378496
32621C78496m0288n5320j386L5623J332p1435j38483j71863j20125M0985K15285
32610G2821K54054J33540j8300q4195q0578r9402j62469j68376k5442J62994J62541
32599A47188n7184k00993m5769J87350J40919j12142j83357k151J09451L6242
32589A9554N6698K79581L74702J19703k05516k64579j33252k7830O6807J77613
$$ plain form
32621 378496 338208 282888 281502 317125 318457 247022 108539 -63324 -183449 -142464 72821
32610 72821 326875 460415 442115 357920 277342 177940 15471 -152905 -178347 -15353 147188
32599 147188 90004 -110989 -156758 30592 171511 59369 -123988 -126139 -16688 19554
32589 19554 76252 355833 730535 850238 644722 380143 246891 219061 285868 463481
$$ [...]
##END NTUPLES=NMR SPECTRUM
##END=
