##TITLE=31Pdec_LR-746-R3-CHL
 CDCl3, 24 sc
 6.4.2022
##JCAMPDX= 6.0         $$ Bruker NMR JCAMP-DX V2.0
##DATA TYPE= NMR SPECTRUM
##DATA CLASS= NTUPLES
##ORIGIN= UXNMR, Bruker Analytische Messtechnik GmbH
##OWNER= root
$$ XWIN-NMR		Version 3.5
$$ Wed Apr  6 10:47:54 2022 Russian Standard Time (UT+4h)  she@DPX200
##.OBSERVE FREQUENCY= 81.013821
##.OBSERVE NUCLEUS= ^31P
##.ACQUISITION MODE= SIMULTANEOUS
##.ACQUISITION SCHEME= undefined
##.AVERAGES= 24
##.DIGITISER RES= 16
##SPECTROMETER/DATA SYSTEM= spect
##.PULSE SEQUENCE= zgpg30
##.SOLVENT NAME= CDCl3
##.SHIFT REFERENCE= (INTERNAL, CDCl3, 0, 248.564)
##AUDIT TRAIL= $$ (NUMBER, WHEN, WHO, WHERE, WHAT)
$$ ##TITLE= Audit trail, XWIN-NMR		Version 3.5
$$ ##JCAMPDX= 5.01
$$ ##ORIGIN= Bruker BioSpin GmbH
$$ ##OWNER= she
$$ F:/spectra/data/she/nmr/P31/1/pdata/1/auditp.txt
$$ ##AUDIT TRAIL=  $$ (NUMBER, WHEN, WHO, WHERE, WHAT)
(   1,<2022-04-06 10:46:51.87 +0400>,<she>,<DPX200>,
      <created by zg, POWCHK disabled, PULCHK disabled
       configuration hash MD5:
       00 E9 B6 7A A2 85 ED C7 34 08 36 98 17 FE 4E 26
       data hash MD5: 32K
       BE A4 7D 92 F0 83 25 8C 4B 6F 79 03 51 1A FE CA>)
(   2,<2022-04-06 10:46:53.48 +0400>,<she>,<DPX200>,
      <Start of raw data processing
       efp BC_mod = 2 LB = 1 FT_mod = 6 PKNL = 1 PHC0 = -9599.713 PHC1 = 218.2756 SI = 64K 
       data hash MD5: 64K
       BD 49 EF 6E 10 FC A5 56 60 5D 25 63 94 95 71 D4>)
(   3,<2022-04-06 10:47:16.62 +0400>,<she>,<DPX200>,
      <pk PHC0 = 48.58201 PHC1 = -92.39999 
       data hash MD5: 64K
       47 4A A0 F1 14 44 26 52 A4 10 5C B4 BB CB 35 2B>)
(   4,<2022-04-06 10:47:26.15 +0400>,<she>,<DPX200>,
      <abs ABSG = 5 
       data hash MD5: 64K
       42 42 3E 2A B7 2D F6 60 43 DF AF 50 13 6C D4 F8>)
$$ ##END=
$$ 
$$ hash MD5
$$ E7 63 68 FF BD 30 7C 0A 54 2D 87 6E 1A FC 03 A2
##$RELAX= 
##$RELAX= 
##$RELAX= 
##$RELAX= 
##$RELAX= 
##$RELAX= 
##$RELAX= 
##$RELAX= 
$$ Bruker specific parameters
$$ --------------------------
##$DU= <F:/spectra>
##$EXPNO= 1
##$NAME= <P31>
##$PROCNO= 1
##$TYPE= <nmr>
##$USER= <she>
##$AMP= (0..31)
100 100 100 100 100 100 100 100 100 100 100 100 100 100 100 100 100 100 
100 100 100 100 100 100 100 100 100 100 100 100 100 100 
##$AQSEQ= 0
##$AQ_mod= 1
##$AUNM= <au_zg>
##$AUTOPOS= <>
##$BF1= 81.014009
##$BF2= 200.13
##$BF3= 200.13
##$BF4= 200.13
##$BF5= 200.13
##$BF6= 200.13
##$BF7= 200.13
##$BF8= 200.13
##$BYTORDA= 1
##$CFDGTYP= 0
##$CFRGTYP= 5
##$CHEMSTR= <none>
##$CNST= (0..31)
1 1 145 1 1 1 1 1 1 1 1 1 1 1 1 1 1 1 1 1 1 1 1 1 1 1 1 1 1 1 1 1 
##$CPDPRG= <waltz16>
##$CPDPRG1= <>
##$CPDPRG2= <waltz16>
##$CPDPRG3= <>
##$CPDPRG4= <mlev>
##$CPDPRG5= <mlev>
##$CPDPRG6= <mlev>
##$CPDPRG7= <mlev>
##$CPDPRG8= <mlev>
##$CPDPRGB= <>
##$CPDPRGT= <>
##$D= (0..31)
0 1 0 0 0 0 0 0 0 0 0 0.03 2e-05 3e-06 0 0 0 0 0 0 0 0 0 0 0 0 0 0 0 0 
0 0 
##$DATE= 1649227611
##$DBL= (0..7)
120 120 120 11 120 120 24 19 
##$DBP= (0..7)
150 150 150 150 150 150 150 150 
##$DBP07= 0
##$DBPNAM0= <>
##$DBPNAM1= <>
$$ [...]
##$SUBNAM3= <"">
##$SUBNAM4= <"">
##$SUBNAM5= <"">
##$SUBNAM6= <"">
##$SUBNAM7= <"">
##$SUBNAM8= <"">
##$SUBNAM9= <"">
##$SW= 501.771253377433
##$SWIBOX= (0..15)
0 1 3 0 0 0 0 0 0 0 0 0 0 0 0 0 
##$SW_h= 40650.406504065
##$TD= 32768
##$TD0= 1
##$TE= 0
##$TE2= 300
##$TE3= 300
##$TEG= 300
##$TL= (0..7)
0 120 53 12 22 120 120 120 
##$TP= (0..7)
150 150 150 150 150 150 150 150 
##$TP07= 0
##$TPNAME0= <>
##$TPNAME1= <>
##$TPNAME2= <>
##$TPNAME3= <>
##$TPNAME4= <>
##$TPNAME5= <>
##$TPNAME6= <>
##$TPNAME7= <>
##$TPOAL= (0..7)
0.5 0.5 0.5 0.5 0.5 0.5 0.5 0.5 
##$TPOFFS= (0..7)
0 0 0 0 0 0 0 0 
##$TUNHIN= 0
##$TUNHOUT= 0
##$TUNXOUT= 0
##$USERA1= <user>
##$USERA2= <user>
##$USERA3= <user>
##$USERA4= <user>
##$USERA5= <user>
##$V9= 5
##$VALIST= <valist>
##$VCLIST= <CCCCCCCCCCCCCCC>
##$VD= 0
##$VDLIST= <DDDDDDDDDDDDDDD>
##$VPLIST= <PPPPPPPPPPPPPPP>
##$VTLIST= <TTTTTTTTTTTTTTT>
##$WBST= 1024
##$WBSW= 4
##$XGAIN= (0..3)
0 0 0 0 
##$XL= 0
##$YL= 0
##$YMAX_a= 7664
##$YMIN_a= -9921
##$ZGOPTNS= <>
##$ZL1= 120
##$ZL2= 120
##$ZL3= 120
##$ZL4= 120
##$ABSF1= 248.5645
##$ABSF2= -253.2056
##$ABSG= 5
##$ABSL= 3
##$ALPHA= 0
##$AQORDER= 0
##$ASSFAC= 0
##$ASSFACI= 0
##$ASSFACX= 0
##$ASSWID= 0
##$AUNMP= <proc_1d>
##$AZFE= 0.1
##$AZFW= 0.5
##$BCFW= 0
##$BC_mod= 2
##$BYTORDP= 0
##$COROFFS= 0
##$CY= -3
##$DATMOD= 1
##$DC= 0
##$DFILT= <>
##$DTYPP= 0
##$F1P= 0
##$F2P= 0
##$FCOR= 1
##$FTSIZE= 65536
##$FT_mod= 6
##$GAMMA= 0
##$GB= 0
##$INTBC= 1
##$INTSCL= 5.30512e-09
##$ISEN= 30
##$LB= 1
##$LEV0= 0
##$LPBIN= 0
##$MAXI= 10000
##$MC2= 0
##$MEAN= 0
##$ME_mod= 0
##$MI= 50
##$NCOEF= 0
##$NC_proc= -4
##$NLEV= 6
##$NOISF1= 182.463
##$NOISF2= 159.3651
##$NSP= 0
##$NTH_PI= 0
##$NZP= 0
##$OFFSET= 248.5645
##$PC= 4
##$PHC0= -9551.131
##$PHC1= 125.8756
##$PH_mod= 1
##$PKNL= yes
##$PPARMOD= 0
##$PSCAL= 0
##$PSIGN= 0
##$REVERSE= no
##$SF= 81.014009
##$SI= 65536
##$SIGF1= 159.3651
##$SIGF2= -187.1042
##$SINO= 113.3802
##$SIOLD= 16384
##$SREGLST= <1H.CDCl3>
##$SSB= 0
##$STSI= 65536
##$STSR= 0
##$SW_p= 40650.406504065
##$SYMM= 0
##$S_DEV= 0
##$TDeff= 32768
##$TDoff= 0
##$TI= <>
##$TILT= no
##$TM1= 0
##$TM2= 0
##$TOPLEV= 0
##$USERP1= <user>
##$USERP2= <user>
##$USERP3= <user>
##$USERP4= <user>
##$USERP5= <user>
##$WDW= 1
##$XDIM= 65536
##$YMAX_p= 403413609
##$YMIN_p= -15554890
$$ End of Bruker specific parameters
$$ ---------------------------------
##NTUPLES= NMR SPECTRUM
##VAR_NAME=  FREQUENCY,     SPECTRUM/REAL,   SPECTRUM/IMAG
##SYMBOL=    X,             R,               I
##VAR_TYPE=  INDEPENDENT,   DEPENDENT,       DEPENDENT
##VAR_FORM=  AFFN,          ASDF,            ASDF
##VAR_DIM=   65536,         65536,           65536
##UNITS=     HZ,            ARBITRARY UNITS, ARBITRARY UNITS
##FACTOR=    0.620285442955139, 1,           1
##FIRST=     20137.2065510759, 0,            0
##LAST=      -20513.1999529892, 0,           0
##MIN=       -20513.1999529892, -15554890,   0
##MAX=       20137.2065510759, 403413609,    0
$$ Real data points
##PAGE= N=1
##DATA TABLE= (X++(R..R)), XYDATA
$$ [...]
##PAGE= N=2
##DATA TABLE= (X++(I..I)), XYDATA
38547D92859J81491M8026r543m4391q6486l5912Q2743R9007J8466K7557J01763
38536H75580n724k69961l12977j0494K38985J23656r0694k2193K08372K25416
38526I59966J9983j01795m0021K7606Q560k2381m7796j09285j38045n6881J6981
38515E16892o3973j92603j59170j527Q4214R6140J73964K60755J60592q3026k01955
38504E90303j16586k4431m3900o8060k1960J7837K2628P0706J49254J41886N8269
38493G75946L1390N8537J3009o2664J3018J81105J38703j63766l63326k08209
38483D13743O8494J31391K4831j2567J807j28127l50371l53968j8052L70059M41247
38472E88487J62517j59154k38809j00765J9560N525k4029M4088J18989Q0731J2882
$$ y = [492859, 674350, 722376, 712833, 668442, 581956, 546044, 628787, 727794, 746260, 773817, 875580, 869856, 599895, 286918, 276424, 515409, 639065, 548371, 526178, 734550, 959966, 979949, 878154, 838133, 865739, 874299, 851918, 804122, 694837, 556792, 499911, 516892, 452919, 260316, 101146, 99619, 183833, 279973, 453937, 714692, 875284, 792258, 590303, 473717, 449286, 405386, 337326, 315366, 333203, 355831, 426537, 575791, 717677, 775946, 807336, 865873, 878882, 816218, 829236, 1010341, 1149044, 985278, 621952, 413743, 482237, 613628, 638459, 625892, 627699, 499572, 149201, -204767, -222819, 147240, 588487, 751004, 591850, 353041, 252276, 271836, 277361, 253332, 297420, 416409, 497140, 510022]
38461E10022N7707J44559J09685J3500N0245J72268J27473r5635j88280J1173
38451I12717K58367K51949J5260k00018k13537l9109J27926L7379k98835m75458
38441C76641j85759K29852J76035k57556l24187K44108P36632M67099k39742n58032
38431F65091k81895R7632J92151O8797p2499j29414o5066L3249k5274k00775j41051
38420A40946K58070N22608K60697j59241j46941J50546J07965k95187m16685k7560
38410C95218L09617J65903j19519q4220J25626J04286j28124k37470j20255N4660
38400D65722J75678K31233J61718m0430j89489j19387M6519N6889j12033k58911
38390D17509k52007j41666k0782P2069J27211J49633J55963J32753M8603n7473
$$ y = [510022, 567729, 712288, 821973, 835473, 885718, 1057986, 1185459, 1089824, 901544, 912717, 1171084, 1423033, 1438293, 1238275, 1024738, 985629, 1113555, 1150934, 852099, 376641, 190882, 420734, 596769, 339213, 15026, 259134, 995766, 1462865, 1223123, 665091, 383196, 480828, 672979, 741776, 669277, 539863, 474797, 508046, 482772, 281997, 140946, 399016, 921624, 1182321, 1023080, 876139, 1026685, 1134650, 839463, 422778, 395218, 704835, 870738, 751219, 666999, 792625, 896911, 768787, 531317, 411062, 465722, 641400, 872633, 1034351, 993921, 804432, 685045, 731564, 788453, 676420, 417509, 165502, 23836, 3054, 75123, 202334, 351967, 507930, 640683, 689286, 631813]
38380F31813q6980k6001K0567o790k5929M9125J58485J61428J0768j77079k13012
38369D96395k6225K04527K02857m1955j99907l9779K09622J73915j20213l16241
38359E42996k61384j20369N234J78630L21513K20340n8527j59421J0202J16239
38349G95453k0834r7277J32054L63568J89860k34896m02527j75801R2817J09390
38339G51807l6595j05867j6090J20384J26484n5443k43681j93631M7160J61985
38329E56513L6725o6735K7800J02553l0677j26948Q4166L53769K49983j26679
38319A060470k69000l5910J98874J78872O2440R611p3440k26336k63884j02227
38309E39470O3560Q3497O5737J02706P6047p4464j60254m4163R9985O0684p1847
$$ y = [631813, 544833, 518832, 539399, 532609, 506680, 555805, 714290, 875718, 886486, 709407, 496395, 470170, 674697, 877554, 835599, 635692, 595913, 805535, 979450, 859237, 542996, 281612, 161243, 166477, 345107, 666620, 886960, 828433, 669012, 679214, 795453, 774619, 677342, 809396, 1172964, 1362824, 1127928, 725401, 549600, 642417, 751807, 715212, 609345, 593255, 713639, 840123, 784680, 540999, 347368, 394528, 556513, 593238, 526503, 554303, 656856, 626179, 499231, 583397, 937166, 1187149, 1060470, 791470, 755560, 954434, 1133306, 1195746, 1205357, 1131917, 905581, 641697, 539470, 603030, 686527, 752264, 854970, 931017, 856553, 696299, 652136, 752121, 812805, 740958]
38298G40958p8169L1550P0039j8493j15682j31044p9245r342K1069l0479j05642
38287B95520q7900m591k7080j65892j67324J10192M06342L85342J15031m8982
38277H10658K1442J05226J1399j75245k70863k18248q0311M7975Q3045K1261k6713
38266C29626K7633J06017P8561j4899j3237J15379K31331K29976J41275K8166
38256A259828o7478q9804l2828j7873j42203k84547k54215r4226l588O729R1232
38245C71027K07954J28311j19853j89584N1896K82482K25940M9246k368k7914
38235I77137j88500l04404j45848J02569J07920n3683o1016P0168O1523o0503
38225E05363m390J92815J61697j39021k94509j01896J44717K09074K38938L15040
$$ y = [740958, 662789, 694339, 764378, 745885, 630203, 499159, 419914, 410572, 431641, 401162, 295520, 207620, 203029, 175949, 10057, -157267, -47075, 359267, 744609, 859640, 810658, 832100, 937326, 948725, 773480, 502617, 284369, 204058, 252033, 335078, 356339, 329626, 357259, 463276, 541837, 526938, 513701, 629080, 860411, 1090387, 1231662, 1259828, 1192350, 1102546, 1069718, 1051845, 909642, 625095, 370880, 276654, 273066, 279795, 371027, 578981, 707292, 587439, 397855, 449751, 732233, 958173, 1007419, 1005051, 977137, 788637, 484233, 338385, 440954, 548874, 495191, 434175, 504343, 565866, 505363, 500973, 693788, 855485, 716464, 421955, 320059, 464776, 673850, 912788, 1227828]
38215A227828K00972j43051k95205j7267K76628J48226j59764j60053O5238O7405
38205A210957j70094k42079m1439J00216J306j33523j25430n5068j4841K3813
38195E53818M4229j1020n7892J8050J03995K5452r7597k4158J43575R2836j29760
38184F61528j49234R6317K24937L5292j90686j72676q506J16164K12435K88268
38174A113839K21747L3475m9023K0529O088j46825j51181P9999J64630j33474
38164A159804m17660k29320J99844K75361n7588k63524l7099K99482L18851N0042
38154A298193j57749j22396L191j1967j72698k59342j27238Q2453J34986L5108
38144G02541q768Q1807J75205J80234J43630R0302J3070J1824J49764J95131j12303
$$ y = [1227828, 1428800, 1285749, 990544, 973277, 1249905, 1398131, 1238367, 1078314, 1143552, 1210957, 1040863, 798784, 757345, 857561, 858867, 725344, 599914, 544846, 530005, 553818, 598047, 587027, 529135, 547185, 651180, 676632, 579035, 554877, 698452, 791288, 661528, 512294, 608611, 833548, 868840, 678154, 505478, 496972, 613136, 825571, 1113839, 1335586, 1369061, 1320038, 1340567, 1346655, 1199830, 1048649, 1128648, 1293278, 1159804, 742144, 512824, 712668, 988029, 930441, 666917, 629818, 929300, 1248151, 1298193, 1140444, 1018048, 1021239, 1009272, 836574, 577232, 449994, 532447, 667433, 702541, 693773, 775580, 950785, 1131019, 1274649, 1364951, 1378021, 1389845, 1539609, 1734740, 1622437]
38133A622437n25324m88376K6637L89659K09242j53895k38325j26020p5114j1361
38123F29560J59425J77928j12065l20017p9482K74815K02817j50567k11534P8276
38113F49156K49690J28475J364j0070r7651k50173j91844P0943J85371M2333o9217
38102G08377J342O5582L9695R9157K54866K50483M3443o5766M1400R0787p5644
38091A453722k13315j27610j1985p5595j84574j37127N895J03011J64405J92553
38081A169380P6396j48856k23802n8198Q0946j1618j60832j44750o0353q6952
38071D31361j38392m5970J10469J40757O1882K1552L2111R153l3463k6139J3817
38060E77138L9749P3539J20829J10400K8158k2853J1082N6534P0311R3289Q9425
$$ y = [1622437, 1097113, 608737, 635374, 1025033, 1234275, 1080380, 842055, 716035, 640921, 629560, 788985, 966913, 854848, 534831, 455349, 730164, 932981, 782414, 570880, 649156, 898846, 1027321, 1028685, 1018615, 920964, 670791, 478947, 549890, 735261, 777594, 708377, 709719, 775301, 814996, 914153, 1169019, 1419502, 1462945, 1397179, 1438579, 1529366, 1453722, 1240407, 1112797, 1100812, 1025217, 840643, 703516, 709411, 812422, 976827, 1169380, 1245776, 1096920, 873118, 814920, 895866, 884248, 723416, 578666, 518313, 431361, 292969, 246999, 357468, 498225, 560107, 581659, 613770, 622923, 589460, 563321, 577138, 616887, 690426, 811255, 921655, 949813, 926960, 938042, 994576, 1064887, 1158176, 1247601]
38049A247601m1982k18598k00084L0921J81467P4026j10000j56749j09157o4863
38039F32582K4784J56289J56578j6075j20475p530J21546O9818k4416J2891L9919
38028A045911j22226k95029j93860R1048K21813J14415o013K0810J30181J88839
38018A195889J09837j01538k68502j68486J20299K31780M1337j22787l0862N3903
38008A060870j15271k43260K1727L80048K77899j53676k39548J57281L75264l1011
37998A490323n97926o18571j02215L26714K81564J094q0900J12003K78993J78918
37988A269997o2917j69993j21102j06758j13057R0230M39120M76458L8434l59312
37978A381100k27027J49560J69395j44972k66018o2429O5526o3381j50579q544
$$ y = [1247601, 1205619, 987021, 786937, 817858, 999325, 1073351, 963351, 806602, 697445, 632582, 657366, 813655, 970233, 954158, 833683, 826153, 947699, 1017517, 993101, 1005992, 1045911, 923685, 628656, 434796, 525844, 747657, 862072, 856059, 876869, 1007050, 1195889, 1305726, 1204188, 935686, 767200, 887499, 1119279, 1160616, 1037829, 1006967, 1060870, 945599, 702339, 724066, 1104114, 1382013, 1228337, 988789, 1146070, 1521334, 1490323, 892397, 273826, 171611, 498325, 779889, 780983, 700083, 812086, 1091079, 1269997, 1207080, 1037087, 915985, 809227, 696170, 786400, 1225520, 1701978, 1740412, 1381100, 1154073, 1303633, 1473028, 1328056, 1062038, 999609, 1065135, 1001754, 851175, 842631]
37968H42631J39097J08155L3970L4769J2672n7215l5376M5079n0556l02047l50810
37957D20369n1529K68441K90059R9921o4694j31058r1891P0200K08947J05531
37947A124296j40775j81815J6499J15005J9395L3796K10711J43382k76605m97959
37937E65930j58766K54134J56120j98347j81817J72709L23686J69286R9676J97134
37927A399745J09547k30699m08806j95505J16774K16943J67313J16477J6752j65129
37917A143412k67362j68325J3669R9368N6917m2718j11261n9253R7434J67102
37907I28983K1208j51558q6339J22624J47664l2120q3826J24114K80199R5191
37897A366140k71742m35691k53890P4853K62513J97933L1322q966O6895J7440
$$ y = [842631, 981728, 1089883, 1123853, 1158622, 1171294, 1114079, 1078703, 1123782, 1073226, 771179, 420369, 368840, 637281, 927340, 1027261, 962567, 831509, 739618, 809818, 1018765, 1124296, 983521, 801706, 818205, 933210, 952605, 986401, 1197112, 1340494, 1063889, 565930, 407164, 661298, 817418, 619071, 437254, 609963, 933649, 1102935, 1202611, 1399745, 1509292, 1278593, 869787, 674282, 791056, 1007999, 1175312, 1291789, 1308541, 1143412, 876050, 707725, 721394, 820762, 877679, 834961, 723700, 664447, 761881, 928983, 950191, 798633, 712294, 834918, 982582, 950462, 866636, 990750, 1270949, 1366140, 1094398, 658707, 404817, 479670, 742183, 940116, 971438, 962472, 1029367, 1046807]
37887A046807j86075j87590J87556M76347J73506m07160m87221P348L24974N3973
37877A002465l02413k11781Q6401J19746j7364M4563K48418K71168J22203M4273
37867A407679J7298j20999k22289k9578K67003K17337j61896l64921j55143J36229
37857I90720J82331Q5222N0318K6093q9272j76722r5342M3045L9086p7177j01982
37846H76320L3780J78000J67990K2743r6639q4648j6017k6317q6245l0382J42669
37835A081254J94430J4210j44548l7212J44306N1004k32218k80428l67K19966
37825A010397J29968k2740N1428K11623J49489j10024k65714j74879J2641R4640
37815A086829K0277r9949q9574J09030K92697J89915j40226l11235j31794J08547
$$ y = [1046807, 860732, 673142, 860698, 1337045, 1510551, 1103391, 616170, 623518, 948492, 1002465, 700052, 488271, 574672, 694418, 677054, 721617, 970035, 1241203, 1363406, 1407679, 1424977, 1303978, 1081689, 1052111, 1319114, 1536451, 1374555, 1009634, 854491, 990720, 1173051, 1258273, 1308591, 1334684, 1245412, 1068690, 973348, 1016393, 1055479, 978302, 876320, 910100, 1088100, 1256090, 1278833, 1182194, 1097546, 1081529, 1055212, 968967, 938585, 1081254, 1275684, 1289894, 1145346, 1108134, 1252440, 1303444, 1071226, 790798, 790431, 1010397, 1140365, 1117625, 1169053, 1380676, 1530165, 1420141, 1154427, 979548, 992189, 1086829, 1107106, 1007157, 917583, 1026613, 1319310, 1509225, 1368999, 1057764, 925970, 1034517]
37805A034517O7401j58350k27779o8710J06686J80975K01044J33936r5748l14871
37795H59101k06613J89609M06463J63899k04493j95025J67402L76425J45879k26807
37785A475840k86301k617K38907J47522j47045l03816j80052O0460J93670J72356
37775A368924R3263K3119n4065j38868j57154m9062J13837J65979L2413j61632
37765A236754k23348j22053r923l511m7060m4211q365K2983J09726K75814L35240
37754A522046Q3622l35764n03287k46004J21153K12025N1723l9160P7606K15797
37744A159757J77473J3707q8255o4864l1662r8458j97169j53492O6279K66497
37734A049813K56784J02143J3852M7587Q1254O4641P4324R5378j2825k44283l65728
$$ y = [1034517, 1101918, 943568, 715789, 647079, 753765, 934740, 1135784, 1269720, 1173972, 859101, 652488, 842097, 1248560, 1412459, 1207966, 1012941, 1180343, 1556768, 1702647, 1475840, 1189539, 1186922, 1425829, 1573351, 1426306, 1122490, 942438, 1002898, 1196568, 1368924, 1462187, 1485306, 1431241, 1292373, 1135219, 1086157, 1199994, 1365973, 1398386, 1236754, 1013406, 891353, 881430, 877919, 830859, 786648, 778283, 801266, 910992, 1186806, 1522046, 1605668, 1269904, 766617, 520613, 641766, 853791, 905514, 866354, 943960, 1159757, 1337230, 1350937, 1262682, 1197818, 1166156, 1067698, 870529, 717037, 783316, 1049813, 1306597, 1408740, 1422592, 1470179, 1551433, 1616074, 1690398, 1785776, 1772951, 1528668, 1162940]
37723A162940k41851m1249L7029N0749J40415K42385K06893Q1040L6016Q4249
37713A758616Q6522n133j02505j38618j04514J3084J64772J82960j7827k47293
37703A590064k43524k4718J53490J45901L1461p2377j10540m9731O7481Q3443
37693A570950n8240j39019M8984L28594L43764Q1768j41571j85281j94419j98514
37683A457016l2743K36624K54031n0829k39113J439L53614L48759N0303j37751
37673B241350j19682j23901j97639j39750P2812J95005J15828K3960Q0396J88865
37663B337244J85222M7472j42571k58445j41824K10521M70258K83459j97643m19013
37653B374680j66260J59300J86109R7324J94888L10188J26004j63326r3038K59318
$$ y = [1162940, 921089, 879840, 916869, 967618, 1108033, 1350418, 1557311, 1638351, 1674367, 1758616, 1845138, 1840005, 1737500, 1598882, 1494368, 1507452, 1672224, 1855184, 1837357, 1590064, 1346540, 1321822, 1475312, 1621213, 1652674, 1580297, 1469757, 1420026, 1487507, 1570950, 1512710, 1373691, 1422675, 1751269, 2095033, 2176801, 2035230, 1849949, 1655530, 1457016, 1424273, 1660897, 1914928, 1864099, 1624986, 1626425, 1980039, 2328798, 2379101, 2241350, 2121668, 1997767, 1800128, 1660378, 1733190, 1928195, 2044023, 2067983, 2148379, 2337244, 2522466, 2569938, 2427367, 2168922, 2027098, 2237619, 2707877, 2991336, 2793693, 2374680, 2208420, 2367720, 2553829, 2651153, 2846041, 3156229, 3282233, 3118907, 3025869, 3285187]
37643C285187L17024o8898l41334j05024K87556L65608K57807L13371M13648K39449
37633D964394m4266P700L74859O27442O08965M00707k91840j830060l551021l941975
37623b675095k457993m40125M63068K24442K6213M06176Q01092P57946N61885
37614b332391M91151L26116m1939k11114O8700L67056K02574j91987k48439O4066
37604a506207K73220J76969P1211J87089L34474K50079N790j22495l7943J00489
37594b67324J31230Q3601Q9344J72549K07545R9776o4204j17012k2128R4935J06290
37583E14602k297j50474k22320j39384M3454J54213R6275l3429j01017j13120
37573D6503j20560o9967P0285J52062M4388r9722l7314J60112J92688J2584r8365
$$ y = [3285187, 3602211, 3533313, 3191979, 3086955, 3374511, 3740119, 3997926, 4311297, 4724945, 4964394, 4920128, 4927828, 5302687, 5930129, 6539094, 6939801, 6647961, 4817901, 1266880, -2675095, -5133088, -5573213, -5110145, -4885703, -4859490, -4453314, -3652222, -2894276, -2332391, -1841240, -1515124, -1557063, -1768177, -1699477, -1332421, -1129847, -1321834, -1570273, -1506207, -1232987, -1056018, -984807, -797718, -463244, -213165, -207375, -329870, -367813, -267324, -136094, -52493, 36851, 209400, 416945, 516721, 452517, 335505, 313377, 408312, 514602, 512305, 361831, 139511, 127, 43581, 197794, 294069, 260640, 159623, 46503, -74057, -144024, -73739, 78323, 122711, 22989, -14325, 145787, 338475, 351059, 252694]
37562B52694J4026J46698Q6187p1152j05119J096P4378n265j71065k31402o5870
37551g4794J84049K13630m0004k45399j24419J36490K09095J50321J99526K28531
37541H37026o0080m51828l66290K22095O22448L97555o5309k31184j39028r4432
37531F70973j05210l5610L7576J7405L3451J52122J54302n5982j55751R9361L97539
37520A210176L15173k8191j94369r0620J2232m2925j79164k89749k57328K5950
37510D81185L80226L70377o6300l75590j57089K06692J72975r9515j04650J33334
37500I41645K14637J34705J67857J70973k04383o89627o11337L0662M81851L51559
37490I88542O2865P066k829j51636j90330L4145J94288K8595k04959j96804p6763
$$ y = [252694, 266720, 413418, 499605, 428453, 323334, 324430, 398808, 393543, 222478, -8924, -74794, 109255, 322885, 282881, 37482, -86937, 49553, 258648, 408969, 608495, 837026, 776946, 325118, -41172, 180923, 803371, 1200926, 1135617, 904433, 765405, 670973, 565763, 530153, 567729, 585134, 618585, 770707, 925009, 869027, 713276, 812637, 1210176, 1525349, 1497158, 1302789, 1212169, 1224401, 1181476, 1002312, 712563, 455235, 481185, 861411, 1231788, 1165488, 789898, 632809, 839501, 1012476, 912961, 808311, 941645, 1156282, 1290987, 1458844, 1629817, 1425434, 735807, 124470, 155132, 636983, 988542, 1051407, 1058473, 1055644, 904008, 713678, 747823, 942111, 970706, 765747, 568943, 492180]
37479D92180p6311r7149K1718J56257J54904J22880J47785P5857j34882j86502
37469F76737R2422L71147K72029o7293k42202j58315k1857M2383M7984n69m5529
37458I66937M6231K21204J96963r1378k95018j71697J5090n2229k06932j09674
37448E19497J66800K99304K50772K03298J29937j06261l50435l18348r1440o518
37438F96606r3137o2756J43616K39918R2541o5490l1088Q9228J18973N7882k4308
37427A161985j11030j60397r6025N2181J54390J52870Q4816l1588j63301j84855
37417H59046m4681P3738l314j36216r8015J7443k2440j04827P0275L81859L70265
37406A363133P85k18152o3735L5771k14558l95372p6565L63234K73062j96662
$$ y = [492180, 415869, 318720, 340438, 496695, 651599, 774479, 922264, 998121, 863239, 676737, 769159, 1140306, 1412335, 1345042, 1102840, 944525, 922668, 965051, 1013035, 1012466, 966937, 1013168, 1234372, 1431335, 1339957, 1044939, 873242, 888332, 836103, 629171, 519497, 686297, 985601, 1236373, 1439671, 1569608, 1463347, 1112912, 794564, 703124, 696606, 603469, 540713, 684329, 924247, 1016788, 951298, 920210, 1009438, 1128411, 1186293, 1161985, 1050955, 890558, 794533, 846714, 1001104, 1153974, 1238790, 1207202, 1043901, 859046, 814365, 888103, 884789, 748573, 650558, 668001, 645561, 540734, 611009, 992868, 1363133, 1363918, 1145766, 1082031, 1117802, 903244, 507872, 431307, 794541, 1067603, 870941]
37396H70941k85059J84758N27907K58852k07949k41537R7998K58822K2246k96771
37386A190208l59971j65934Q3525K21071J99673J08814J02624J96510J98186k2736
37376A751970k89753l33195j71277m7928l9825l01J01409R7401l3371m7118J59451
37365A147463K98717R9036k46086l32587j13720J00860J37047J14275J15685L8705
37355A359395j31817j89461r359K13282K04166k9478k27835j99704r003J18559
37345A098745K2977k12200l09472j04405K23882L54814K23477L9281n9500j19058
37335A158541j21122O3295L48717L80026K8105l24074k80247l639N8341j21891
37325A186052j40827J53380L85273K05199j97072l59273j48023J31854J57842
$$ y = [870941, 585882, 770640, 1298547, 1557399, 1349450, 1107913, 1205911, 1464733, 1486979, 1190208, 830237, 664303, 747828, 968899, 1168572, 1277386, 1380010, 1576520, 1774706, 1751970, 1462217, 1129022, 957745, 909817, 869992, 869691, 971100, 1068501, 1035130, 988012, 1147463, 1446180, 1545216, 1299130, 966543, 852823, 953683, 1090730, 1205005, 1320690, 1359395, 1227578, 1038117, 1028758, 1242040, 1446206, 1416728, 1188893, 989189, 980186, 1098745, 1121722, 909522, 600050, 495645, 719527, 1074341, 1297818, 1337099, 1277599, 1158541, 1037419, 1100714, 1449431, 1829457, 1857562, 1533488, 1253241, 1249602, 1307943, 1186052, 1045225, 1198605, 1583878, 1789077, 1592005, 1232732, 1084709, 1216563, 1374405]
37316A374405o0250k53131k08520J6642J74833J09636p1217j51281r2323n2983
37306G85811j15971j40484K4258K76860L52190J56855j04670j82702p4472K4062
37296A001737J7131K6246J58790K85885J98607o3318k21821j30848L6410N6325
37286A365144m3875q7322l0280K1304P533l3753o7239o8055J8071J66708J92275
37275A440511k2410k60015j90683J28684K71756N0242k02312j42403P0453O6407
37265A210230j35766j95745k6435J00392N2186M9062K32609L56000J50461k27940
37255A565054l95464k51256k7787Q8719J28639J53472J42179R6648P4681P8649
37245A653534N8237L5444P0182R8123j0287j99874k43903q0077O3231r048j79553
$$ y = [1374405, 1314155, 1061024, 852504, 869146, 1043979, 1153615, 1082398, 931117, 838794, 785811, 669840, 529356, 553614, 830474, 1182664, 1339519, 1234849, 1052147, 977675, 1001737, 1018868, 1045114, 1203904, 1489789, 1688396, 1625078, 1403257, 1272409, 1308819, 1365144, 1321269, 1233947, 1203667, 1224971, 1232504, 1198751, 1131512, 1063457, 1081528, 1248236, 1440511, 1418101, 1158086, 967403, 1096087, 1367843, 1418085, 1215773, 1073370, 1143823, 1210230, 1074464, 878719, 852284, 952676, 1004862, 1053924, 1286533, 1642533, 1792994, 1565054, 1169590, 918334, 890547, 979266, 1107905, 1261377, 1403556, 1500204, 1574885, 1653534, 1711771, 1747215, 1817397, 1915520, 1905233, 1705359, 1461456, 1381379, 1444610, 1435562, 1256009]
37234A256009k08012o6139P7095J13573Q0226L4369j3393m9830l9215L8195J58940
37223A381818K43148J78175n5929k81931k77073o2438J04442P6789r036J0585
37213A308550Q1996P6326J0339l6336q5949j69682j87073m4916J49138K09344
37203A311737J23280K5104j3841j7334L786M4091M9307j974l5433j1809j3343
37192A463571p6781p8106N5901J62455O6817j25735j72718l8234J06464J43904
37182A507538Q3936l7841j55389j55301k6261Q3776R5908J14485J63824O2555
37172A737230k07672k90778M8308M58847M35787L3167k68741k54042r9163M6453
37162A639396J46129O0574k66351m97855k83617J31885K15748j4228o1828J65086
$$ y = [1256009, 1047997, 981858, 1058953, 1172526, 1252752, 1287121, 1273728, 1223898, 1184683, 1222878, 1381818, 1624966, 1803141, 1747212, 1465281, 1188208, 1125770, 1230212, 1307001, 1297965, 1308550, 1390546, 1466872, 1477211, 1440875, 1354926, 1185244, 998171, 953255, 1102393, 1311737, 1435017, 1460121, 1446280, 1428946, 1432732, 1476823, 1526130, 1524156, 1488723, 1476914, 1463571, 1386790, 1308684, 1364585, 1527040, 1593857, 1468122, 1295404, 1257170, 1363634, 1507538, 1591474, 1553633, 1398244, 1242943, 1216682, 1300458, 1396366, 1510851, 1674675, 1737230, 1529558, 1238780, 1287088, 1745935, 2181722, 2214889, 1946148, 1692106, 1592943, 1639396, 1785525, 1846099, 1579748, 1081893, 798276, 930161, 1145909, 1131681, 1069853, 1234939]
37152A234939K24736k7013j72769P590J74588Q8211R266J25670J60601p5725k69631
37141A480463j41482O5185L4029j07796j13278m9682k9924P8138K85191K52436
37131A753280j38018m08128j62785K49872K82568L3768k6316J25933J39493k5773
37121A823894r1272j7563j5799q0318j7869J14713P6577r3071j14614N4027J70730
37110A809435J10732k7575j56381k26621j34624R1351J73133k5605k04331q4683
37100A324831J03721M0038p7007J06751L77869K56539j35880k19353Q7600K64379
37090B129488P1073j61737k13702k56402l10443j09028K79343L62432M4182j14657
37080A720549J85909M34393J43173l19720l13221P1770K16800n4014l08858k29298
$$ y = [1234939, 1459675, 1432662, 1259893, 1267483, 1442071, 1530282, 1539548, 1665218, 1825819, 1750094, 1480463, 1338981, 1404166, 1438195, 1330399, 1217121, 1167439, 1137515, 1215653, 1500844, 1753280, 1615262, 1207134, 1044349, 1294221, 1576789, 1610557, 1584241, 1710174, 1849667, 1823894, 1732622, 1715059, 1699260, 1618942, 1601073, 1715786, 1792363, 1699292, 1584678, 1638705, 1809435, 1920167, 1892592, 1736211, 1509590, 1374966, 1466317, 1639450, 1613845, 1409514, 1324831, 1428552, 1468590, 1391583, 1498334, 1876203, 2132742, 1996862, 1777509, 1865109, 2129488, 2200561, 2038824, 1825122, 1568720, 1258277, 1149249, 1428592, 1791024, 1835206, 1720549, 1906458, 2340851, 2484024, 2164304, 1851083, 1922853, 2139653, 2085639, 1776781, 1547483]
37070A547483J1910J16009K5430j26776j82165n0582J86100K95602J63518l9212
37060A947317r5780l3329j0438l9922k0255M6512O2315O904m9398n7728n6J36615
37048A892757K86034L01010J44853k0793o2461o5751j49642k21022j19965P9125
37038B064145J49955P2889O6038K08829K64165K2511l26553l76281l2760L30377
37028B443315L21203j0034k91679l08802j65303q910J51789K86283K46236J27
37018B664225k16967j88103j6145O1989M0206Q4777J95689J91093J7110j58785
37008B675089j87115q9324M0695J32781J40236P9930M8888Q1578O4808o1495j33572
36997B792499l17J75774J13184j56201l24457k54238j17237q0128j09743j23104
$$ y = [1547483, 1559393, 1675402, 1700832, 1574056, 1391891, 1341309, 1527409, 1823011, 1986529, 1947317, 1851537, 1818208, 1807770, 1767848, 1747593, 1794105, 1856420, 1863324, 1813926, 1756198, 1756142, 1892757, 2178791, 2479801, 2624654, 2603861, 2541400, 2475649, 2326007, 2104985, 1985020, 2064145, 2214100, 2286989, 2353027, 2561856, 2826021, 2848532, 2521979, 2145698, 2112938, 2443315, 2764518, 2754484, 2462805, 2154003, 1988700, 1979790, 2131579, 2417862, 2664098, 2664225, 2447258, 2259155, 2243010, 2304999, 2345205, 2429982, 2625671, 2816764, 2833874, 2675089, 2487974, 2398650, 2439345, 2572126, 2712362, 2792292, 2841180, 2922758, 2987566, 2926071, 2792499, 2792182, 2967956, 3081140, 2924939, 2600482, 2346244, 2229007, 2148879, 2039136, 1916032]
36987A916032j05112m2254P1300J57063J53866J46497J98187J59169q4720k78895
36977B291133q1048L62049N24160K32512j06263j24188L8473N6507j04019k44130
36967B845186k35594q1174J51499L22434L07319J76847J15901J28595M8887j23263
36957C656637j76639n3562L2856l8851r9402M693J60254J96519J21182J0176j20964
36946C692899k09491j29750Q8039K33327K17696J81632K04728J61243j4511j66734
36936D259078j58967n7831K9727P8587L5273j46484k96477j68197J37110K42448
36926C954267P8658j8693Q0622Q2746j25353j80166J13160L47719J66039j17450
36916D381549o7497J12751o897k44345r1337L48964M57634R9923j85379p9398
$$ y = [1916032, 1810920, 1768666, 1839966, 1997029, 2150895, 2297392, 2495579, 2654748, 2570028, 2291133, 2210085, 2572134, 3096294, 3328806, 3222543, 3098355, 3136828, 3193335, 3089316, 2845186, 2609592, 2528418, 2679917, 3002351, 3309670, 3486517, 3602418, 3731013, 3779900, 3656637, 3479998, 3426436, 3459292, 3420441, 3321039, 3325732, 3485986, 3682505, 3803687, 3813863, 3692899, 3483408, 3353658, 3441697, 3675024, 3892720, 4074352, 4279080, 4440323, 4425812, 4259078, 4100111, 4042280, 4072007, 4150594, 4185867, 4039383, 3742906, 3574709, 3711819, 3954267, 4032925, 4014232, 4094854, 4177600, 4052247, 3872081, 3985241, 4332960, 4498999, 4381549, 4314052, 4426803, 4419906, 4175561, 4084224, 4433188, 4890822, 4990745, 4805366, 4725968]
36906D725968J03196P6727M4779K10102L45725K15361J6694K5811J17942L8696
36896E921001q6199O3114M29021O04613M34272K37175L37871O35159P94776P13002
36886A0083805N99815O40489P48182P26370N69705M53710M37689L54578P2126
36877A4686469l27190q19012j724144l345811n246327o240773n433118l188609
36869a1638515q52384M88257Q02365P46001Q05014R62869J010996Q89854O97826
36860f087717N55933N40256O31754O81404N44232K99461J94906K98501L80286
36851a960984K71624J49765K48341M48108M50027K53977J22169J07224J2736j32662
36841b9675j0959L86111N23678L3168o73013r32496p58377p16836r59344r64013
$$ y = [4725968, 4829164, 4905891, 4950670, 5160772, 5506497, 5721858, 5738552, 5764363, 5882305, 5921001, 5834802, 5897916, 6326937, 6931550, 7365822, 7602997, 7940868, 8576027, 9370803, 10083805, 10683620, 11324109, 12072291, 12798661, 13368366, 13822076, 14259765, 14614343, 14686469, 14359279, 13540267, 11816123, 8470312, 3223985, -3016788, -8449906, -11638515, -12490899, -12002642, -11200277, -10454276, -9649262, -8686393, -7675397, -6785543, -6087717, -5531784, -4991528, -4359774, -3678370, -3134138, -2834677, -2639771, -2341270, -1960984, -1689360, -1539595, -1291254, -843146, -393119, -139142, -16973, 90251, 102987, -29675, -40634, 345477, 869155, 902323, 229310, -703186, -1461563, -2178399, -3137743, -4101756]
36831d101756l96186K95402M96088K81593K03549M09495M92959K32106k6109O5160
36821b047699K91532K30455p9943k27320p3866R0760N6351l0889j078O4531N7282
36810a669884O5698J82544L01941K92800J92199P4801p0092j89798j37297M6192
36800i10896R2518m9203n1166K32327L95516Q4740l29423k16158L49651O57418
36790B55324L64761j08900k60788r6376R6901J68696J18953j5918j32868j20301
36780B69484k5499P861l5727p6949j41241k87151m08976l67907k25939q9780J15625
36769a266199L99291M52824Q4792l00498j93898K11888L15666Q3557K4742K29478
36759D1643K24466j00519k25913Q3956L50769K11300j1600K8041J04700m5489
$$ y = [-4101756, -4497942, -4202540, -3706452, -3424859, -3221310, -2811815, -2318856, -2086750, -2112859, -2047699, -1756167, -1525712, -1605655, -1832975, -1906841, -1816081, -1759730, -1790619, -1791697, -1727166, -1669884, -1604186, -1421642, -1119701, -826901, -634702, -559901, -629993, -819791, -957088, -910896, -818378, -867581, -918747, -686420, -290904, -206164, -535587, -751745, -402094, 255324, 620085, 511185, 250397, 154021, 250922, 419618, 538571, 522653, 389785, 269484, 243985, 251846, 216119, 139170, -2071, -289222, -698198, -1066105, -1292044, -1381824, -1266199, -866908, -414084, -329292, -629790, -823688, -611800, -296134, -212577, -187835, 41643, 266109, 165590, -60323, 23633, 374402, 585702, 574102, 602143, 706843, 661354]
36749F61354j76110l1073J09521p0349l00602j58327K18458L84721K77970J54743
36739A070306P6168o6605j98930j64345m0314r847o3865r3545q1600J0515K69660
36728G07598N39389M58410L7273k07709N253K77484J69974j56162l40832m14768
36718A075910n17934m58550r2263K24145J16960j75835k02135k2667J2379p3271
36708a13261k4731P9962o701j71474j30543L4464O1368K4978J31066K10579k515
36697I3192k79189j80135K13067M29679L39401J90366O4849j27096k46142r7633
36687D00359J14375P1415o8182N4761L05066K70495J3915p3974l2222k02062m44181
36676D09765k85711J62846K60122j10764l38087r6834J91066J44539k4271k5705
$$ y = [661354, 485244, 454171, 563692, 493343, 192741, 34414, 252872, 637593, 915563, 1070306, 1146474, 1079869, 880939, 716594, 676280, 666433, 602568, 509023, 427423, 437938, 707598, 1246987, 1705397, 1742670, 1534961, 1540214, 1817698, 1987672, 1831510, 1490678, 1075910, 557976, 99426, 7163, 231308, 348268, 172433, -29702, -52369, -39990, -113261, -137992, -58030, -64731, -236205, -366748, -332284, -270916, -245938, -114872, 95707, 93192, -185997, -366132, -153065, 276614, 616015, 806381, 871230, 744134, 497992, 400359, 514734, 586149, 517967, 572728, 877794, 1148289, 1162204, 1088230, 1056008, 853946, 409765, 124054, 286900, 547022, 436258, 98171, 1337, 192403, 336942, 312671, 286966]
36666B86966M7409N7434R3716J69846J29829K3648Q3429K11028M3319l52125m52023
36655C42476j09919K03465J84742R3210J35890J05816p4469p8695K04868L62539
36645A369923J35497j24763n6507J60278K19561J68500J13430n8005k95761k41195
36635A390958J38035K84479j22515n71683m62822o71K06272O4338o3790m7688
36625H14913n5897j24957j44474j21838q5716P2075L25164L62041O7010j68846
36615I39475k6611J88655N0473k59858k78187m4861L8901l9125O9014L58240L96485
36604A392601K1924l82789m13049p3400L55379N69746L89322m5390k92658j30027
36594A391659R0991k8898k67726j43224K30721K91214j2826j19608J69277L38916
$$ y = [286966, 334375, 391809, 485525, 655371, 785200, 808848, 892277, 1103305, 1146624, 794499, 342476, 232557, 436022, 620764, 713974, 849864, 955680, 881211, 802516, 1007384, 1369923, 1505420, 1380657, 1324150, 1484428, 1703989, 1872489, 1985919, 1927914, 1632153, 1390958, 1528993, 1813472, 1690957, 1119274, 656452, 655781, 862053, 926391, 862601, 814913, 759016, 634059, 489585, 367747, 282031, 354106, 679270, 1041311, 1108321, 939475, 912864, 1101519, 1151992, 892134, 613947, 569086, 607987, 568862, 637876, 996116, 1392601, 1414525, 1031736, 618687, 545287, 900666, 1470412, 1859734, 1814344, 1521686, 1391659, 1482650, 1453752, 1186026, 1042802, 1273523, 1564737, 1551911, 1432303, 1601580, 1940496]
36584A940496P6169j54455Q2876L97871K06627k56300k86388J42043L42087L4767
36574B525793k37414l4137K94497K40761l7627m2584K37069L81031K53913J14483
36564C695785O7903m4809j89154j35523k8734l58976j106627j502065j051635
36555f53835k97515l7739k18024k21188O6961K02449L8079q7945j1417N8825N5092
36544a106257J66062L57224L48092J62765J34844K63930J74721j40724j94739
36535A65918J51523L76102J54005j10077j5457J69194O5904j28385p4091O2905
36525H17541r268q8052J34368M13818L56101J72260K89361M26272r4350j125765
36515A292286j627979j029656K0618N60479M20453Q8201p2119m8889P6269K11103
$$ y = [1940496, 2016665, 1862210, 1945086, 2342957, 2549584, 2293284, 2006896, 2148939, 2491026, 2525793, 2288379, 2254242, 2548739, 2789500, 2751873, 2709289, 2946358, 3327389, 3581302, 3695785, 3763688, 3718879, 3529725, 3394202, 3365468, 3006492, 1899865, 397800, -653835, -951350, -989089, -1207113, -1428301, -1361340, -1158891, -1120812, -1208757, -1220174, -1161349, -1106257, -940195, -582971, -234879, -72114, 62730, 326660, 501381, 360657, 165918, 317441, 693543, 847548, 737471, 722014, 891208, 957112, 828727, 754636, 817541, 808273, 720221, 854589, 1268407, 1624508, 1796768, 2086129, 2512401, 2418051, 1292286, -335693, -1365349, -1344731, -784252, -363799, -275598, -347717, -396606, -320337, -109234]
36505a09234K05744K3422j17227M097K76532L81501K18227J2762l0961j9096j71840
36494F73927m13586l76640P9731N39603M84024O705k70247n9543K00222L8290
36484I02486l25738l39725L7230L21760K57528J00691R4303R9537n4066j91789
36474I02217n1223K71507M08484J86898j96753m47892m57270l04230j11015M7145
36464B47868J48953K03534K23496K15807J95084J77277J36294K496k34678m38289
36454H77842m33626k37366o9481n7842n1333J20863L14169K41602n4158k07574
36444D43096o6464R9847O6254k433R9988K31049J68691K3006K4546R7572K3847
36433A208999j24046j11612J6321L0596m4683o450J06234J05449P9258K33770
$$ y = [-109234, 96510, 119932, 2705, 6802, 283334, 664835, 883062, 895824, 864863, 845767, 673927, 260341, -116299, -36568, 503035, 987059, 993764, 723517, 663974, 864196, 902486, 576748, 237023, 274253, 596013, 853541, 954232, 1048535, 1148072, 1094006, 902217, 850994, 1122501, 1530985, 1717883, 1521130, 1073238, 615968, 311738, 200723, 247868, 396821, 600355, 823851, 1039658, 1234742, 1412019, 1548313, 1550809, 1316131, 877842, 444216, 206850, 137369, 79527, 28194, 149057, 463226, 704828, 650670, 443096, 376632, 476479, 542733, 540300, 640288, 871337, 1040028, 1063034, 1087580, 1185152, 1208999, 1084953, 973341, 989662, 1020258, 975575, 969125, 1075359, 1180808, 1260066, 1493836]
36423A493836L81769J48540l18774m49703j26930J49692R7419L628N0636k8228
36413A401885l01799l23980R2543L97775J43640k34357j09721K98455L05162j07699
36403A561904k96094P174L60820L69562J75337O2411N2356O7743J27053J85825
36393B674091N3549l45439p86398r47712p20142k77964Q1055J73410P8122K0458
36383C030Q3921J43386J14394Q7170J25424J33463N4358O99L4830K3533j07257
36372F96951j75170j5189K21304K70925J29021K110k207N2016P7242L3900o2536
36361A228367j18347o5171j8387j29995k63702j20947K37114L68642J12167j24376
36351A105365J9269L21751L70811J59692m1646j23902j15146N195J45351M6197
$$ y = [1493836, 1875605, 2024145, 1705371, 1255668, 1128738, 1278430, 1375849, 1379477, 1430113, 1401885, 1100086, 776106, 868649, 1266424, 1410064, 1175707, 1065986, 1364441, 1669603, 1561904, 1265810, 1272984, 1633804, 2003366, 2178703, 2241114, 2293470, 2361213, 2488266, 2674091, 2727640, 2382201, 1595803, 648091, -72051, -350015, -268960, -95550, -17428, 3030, 86951, 230337, 344731, 431901, 557325, 690788, 745146, 745845, 780675, 804208, 696951, 521781, 506592, 727896, 998821, 1127842, 1129952, 1127745, 1179761, 1257003, 1290903, 1228367, 1110020, 1044849, 1026462, 896467, 632765, 511818, 748932, 1117574, 1229741, 1105365, 1124634, 1446385, 1817196, 1976888, 1935242, 1811340, 1696194, 1701389, 1846740, 1892937]
36341A892937k78002l74882j9813L12929J36192k31133j44241L10705M44694P0342
36331B119728k36738p2764K36749K35629j4332j65716j04260L8876J50343J84414
36321B371929J09382l4861j27776r5669L2972J91309K82021J80575j08032l53355
36311B448495l35391j19923O5404J36696J45577P8781r6319k67858k95756k20667
36301A539039j46574l0305J65618K47235L5048k55399k32861R3434L03071J62074
36291A880380q5881j07014J02483K85886K34312m3595l26504l38974l1447L19364
36281A889010M14215K73791J37098J15861J38888J52571J60419J22128K0560k5166
36271C399375Q8659K51612K94049K56621K66693K18718j27447p12488j114567
$$ y = [1892937, 1614935, 1240053, 1220240, 1533169, 1669361, 1438228, 1293987, 1604692, 2049386, 2119728, 1882990, 1810226, 2046975, 2282604, 2268272, 2102556, 1998296, 2037172, 2187515, 2371929, 2481311, 2446450, 2318674, 2223005, 2255977, 2447286, 2729307, 2909882, 2801850, 2448495, 2113104, 1993181, 2058585, 2195281, 2340858, 2419639, 2323320, 2055462, 1759706, 1539039, 1392465, 1362160, 1527778, 1775013, 1810061, 1554662, 1321801, 1415235, 1718306, 1880380, 1794499, 1687485, 1789968, 2075854, 2310166, 2266571, 1940067, 1601093, 1569646, 1889010, 2303225, 2577016, 2714114, 2829975, 2968863, 3121434, 3281853, 3403981, 3424541, 3399375, 3488034, 3739646, 4033695, 4290316, 4557009, 4775727, 4648280, 3935792, 2821225]
36262B821225j029467o51715m58110o61595r50612q14742j57440N08587O30161
36253g63708K91508N2787J55024K80622J76182M8078J13753K01861J28389P5942
36243G60438K05545K54611j3322k74445r6069L14633L89634P8460j41311o0687
36233A417487M8264K9230O2199J74247P7773k88084n12179k88287J02294J82041
36223A004985p3059k54322p8488K97929N06517L86520J40140P0241J98050K60514
36213B459027J17367l5766O442J19279N3100j68144l01152k47383j32325p4165
36203A796280o6609n6412l396Q5593J19413L8294j8948J05719K25758j0556m79949
36192A735187n86327j34355K91107J82058j34718q7560K13463K47023k1336j60759
$$ y = [2821225, 1791758, 1140043, 681933, 20338, -930274, -1745016, -1902456, -1393869, -763708, -472200, -419413, -264389, 16233, 192415, 240493, 354246, 556107, 684496, 760438, 965983, 1220594, 1207272, 932827, 836758, 1151391, 1541025, 1619485, 1478174, 1417487, 1465751, 1494981, 1557180, 1731427, 1809200, 1521116, 1008937, 720650, 822944, 1004985, 931926, 677604, 599116, 897045, 1403562, 1790082, 1930222, 2000463, 2198513, 2459027, 2576394, 2540628, 2547070, 2666349, 2719449, 2551305, 2250153, 2002770, 1870445, 1796280, 1729671, 1673259, 1669863, 1755456, 1874869, 1913163, 1894215, 1999934, 2225692, 2215136, 1735187, 1148860, 1014505, 1305612, 1487670, 1352952, 1265392, 1478855, 1725878, 1704542, 1543783]
36182A543783k4854J32201J87199K35720K36859R9816J8089J74647K45263j85646
36172B663077q06925q74261l29489R5667J2974j12115J54349M89140L90656j4591
36162A668482k18815q2573Q5900L9914j41628k29164q7832K01188L88863L13598
36152A937933J05266p025l6160j60230l47264l48981r8303J62682K19288J20094
36142A547300J8602j6238J8740R3865J29128Q1920L2172N0060N8968j0380m6185
36131A957952N9711J73322J02248q0950j38505r793J55846K14836J03705j56921
36121B381451l68254k75239L5474J42796p7015j86607J20726M67799L88296R9203
36111B728630J05634L34682L17941L6968j05986n8415j55824l97154l73018j3641
$$ y = [1543783, 1518929, 1651130, 1838329, 2074049, 2310908, 2410724, 2428813, 2603460, 2848723, 2663077, 1856152, 981891, 652402, 748069, 761043, 648928, 803277, 1292417, 1683073, 1668482, 1449667, 1367094, 1452994, 1492908, 1351280, 1122116, 1034284, 1235472, 1624335, 1937933, 2043199, 2036174, 2000014, 1839784, 1492520, 1143539, 1045236, 1207918, 1427206, 1547300, 1565902, 1549664, 1568404, 1662269, 1791397, 1873317, 1905489, 1955549, 2014517, 2004137, 1957952, 2017663, 2190985, 2293233, 2212283, 2073778, 2063985, 2219831, 2434667, 2538372, 2381451, 2013197, 1737958, 1773432, 1916228, 1839213, 1652606, 1773332, 2241131, 2629427, 2728630, 2834264, 3168946, 3486887, 3523855, 3417869, 3359454, 3203630, 2806476, 2433458, 2419817]
36101B419817K23110P5032j66018k06881j67685k24044k55376r0415J96328M05142
36091B209010M02214J43108k34921l67924m8730L64014L08340j91621n13237k91636
36081A778617J16846J85471j00589l21380j79692J97379M38356L34070O8024j9041
36071B498061J20144K25761J88724J86812K46596R1755l21985n52024l01491Q9199
36061B471552J76864N1644P087k2175j88760k71878m2359K29952J82063l0426
36051B563564o0513J6442l2769o4393J29629L16183K19792O4160J15014J04180
36041C371289k27029m73213k13939J41143J741l43684k42294J45965J82874p1022
36031B271831n5500J85847J59676n2546O978J73207l7220l42671r5749M20436
$$ y = [2419817, 2642927, 2717959, 2551941, 2345060, 2177375, 1953331, 1697955, 1607540, 1803868, 2209010, 2611224, 2754332, 2519411, 2151487, 2102757, 2466771, 2775111, 2583490, 2070253, 1778617, 1895463, 2080934, 1980345, 1658965, 1479273, 1676652, 2115008, 2449078, 2517102, 2498061, 2618205, 2843966, 3032690, 3219502, 3466098, 3557853, 3235868, 2683844, 2382353, 2471552, 2648416, 2700060, 2707147, 2684972, 2496212, 2224334, 2181975, 2411927, 2593990, 2563564, 2503051, 2519493, 2486724, 2422331, 2551960, 2868143, 3087935, 3152095, 3267109, 3371289, 3144260, 2671047, 2457108, 2598251, 2599992, 2256308, 2014014, 2159979, 2342853, 2271831, 2216331, 2402178, 2561854, 2509308, 2516286, 2689493, 2652273, 2309602, 2213853, 2634289]
36021B634289L54888j71546k23123K75225M07036q2843l95192j65015J1870j40223
36011B505366q3653L40925M77149O9473k38659p8237P8908m7009n1534J87940
36001C160669J69067j75226j94328K57984M61064J42329l2247K24379K57468j96257
35991D074902l87684M5445L24469m0901l20186M9572L66812j8012m36531j08737
35981C549149M03371K00401l51475l25757J32235J89444j47819j62606K16734
35972C703677L61129J06580m1091J49178L08322J35417k06326l95401k83548N040
35962C842977J12464j75111n04300l45372J44812K85681j5912j24924J73354L17054
35952C710723O3390o0096J76538K19849j52981k85536J51340M53170J30122j69095
$$ y = [2634289, 2989177, 2817631, 2594508, 2869733, 3276769, 3193926, 2798734, 2633719, 2645589, 2505366, 2421713, 2762638, 3239787, 3309260, 3070601, 2992364, 3071272, 3024263, 2972729, 3160669, 3329736, 3154510, 2960182, 3218166, 3679230, 3821559, 3789312, 4013691, 4271159, 4074902, 3687218, 3732663, 4057132, 4016231, 3696045, 3745617, 4112429, 4094417, 3657886, 3549149, 3952520, 4152921, 3801446, 3475689, 3607924, 3797368, 3649549, 3486943, 3703677, 4064806, 4171386, 4130295, 4279473, 4587795, 4723212, 4516886, 4121485, 3837937, 3842977, 3955441, 3780330, 3276030, 2930658, 3075470, 3361151, 3345239, 3220315, 3393669, 3710723, 3774113, 3714017, 3890555, 4110404, 3957423, 3671887, 3823227, 4276397, 4406519, 4237424]
35942D237424J55028N21859K09337l45129l30359Q2261K08162N2841M7384J24967
35932D963775l052j41277k2631Q1692p1044j06858K24004L85744l4023m47387
35922D828943k08919K38269J42967k51119k30687R2143Q7615k01409k14953Q9309
35912D372159K92682L21599L55803K48919j53570m51092k22095K13859K97009
35903E275273J13935P1840J09193k8752j42946M4413K57968J22933j38677j31427
35893E553753R681k4836j03471l515R6593M0192P3743K74731K31227j62863l21389
35882E663846L3292K90953L3010j88442R0874L31809K0310k95692j59M04462J87337
35871F571600k89238k55483J22295J89438P09N393R0403m9401j35739J35137L37208
$$ y = [4237424, 4392452, 4914311, 5123648, 4778519, 4448160, 4530421, 4738583, 4791424, 4838808, 4963775, 4960723, 4819446, 4796815, 4878507, 4807463, 4700605, 4924609, 5310353, 5276330, 4828943, 4620024, 4858293, 5001260, 4750141, 4519454, 4611597, 4699212, 4497803, 4282850, 4372159, 4664841, 4986440, 5342243, 5591162, 5437592, 4986500, 4764405, 4978264, 5275273, 5389208, 5461048, 5570241, 5541489, 5398543, 5442956, 5700924, 5823857, 5685180, 5553753, 5563434, 5538598, 5435127, 5431612, 5528205, 5568397, 5642140, 5916871, 6148098, 5985235, 5663846, 5697138, 5988091, 6021101, 5832659, 5923533, 6255342, 6275652, 5979960, 5979801, 6384263, 6571600, 6282362, 6026879, 6149174, 6338612, 6339321, 6344714, 6435117, 6385716, 6249977, 6385114, 6722322]
35860F722322N0460k68347p5755K61354J88685k6170M4764Q2538k31644l61790
35850F386417J38127O29174M21711k0412k1222N2429l10623n27638N9830P69001
35840G576794O14748J5752k510L86889L17939p5152k3007L18474J99542k27196
35830I102273k01171J87615K14147j01777j22939J76226K98270K43670L52016
35821A0148330M65129K42537j00570k49788m17422o90264n26579K12752O47424
35812I731549K57090j37337J97098O19922L88618J870L8221n9735o90435r32466
35802I414395j58598N63656K60955j85268K41429P16480K03302m39142m2272O15395
35792A1190332L24027j82194L16754J032491N81036l47765k55246L89309K11461
$$ y = [6722322, 6772782, 6504435, 6428680, 6690034, 6878719, 6852549, 6897313, 6979851, 6748207, 6386417, 6524544, 7153718, 7575429, 7555017, 7533795, 7586224, 7275601, 6747963, 6807793, 7576794, 8191542, 8207294, 8204784, 8591673, 8909612, 8834460, 8811453, 9129927, 9329469, 9102273, 8901102, 9088717, 9302864, 9201087, 9078148, 9254374, 9552644, 9796314, 10148330, 10613459, 10855996, 10755426, 10505638, 10088216, 9397952, 8871373, 9084125, 9731549, 9988639, 9851302, 10048400, 10668322, 11056940, 11058810, 11097031, 11037296, 10346861, 9414395, 9255797, 9819453, 10080408, 9895140, 10136569, 10853049, 11056351, 10617209, 10574937, 11190332, 11514359, 11332165, 11648919, 12681410, 13262446, 12914681, 12659435, 13048744, 13260205]
35783A3260205l34424N5280Q38240N97959k16826j82458L81056K19171k76913
35774A4341290M2254O07836K38157l36438J87449R64482M87654m18950j06008
35765A6007726O85576L06806m32958J97190J260354P48364m73491j55522J065575
35756A9209620Q97187j88489M7301J161454R15790k39770j4901J155795R40231
35747B3884218k08582J36892J540270J452409J79715K13916J241988Q84488k61409
35738B9063905L87942K050987J749984J41022L90400J966709J686302J86010Q00586
35729C8423847K730417K323338M48004J111465L449349L157740J181756K184688
35721E5010604N043355M534947J913567L108553O812979O336512L143957M970262
$$ y = [13260205, 12925781, 12981061, 13819301, 14417260, 14200434, 14017976, 14399032, 14618203, 14341290, 14383544, 14991380, 15229537, 14893099, 15080548, 16045030, 16532684, 16113734, 16007726, 16693302, 17000108, 16567150, 16764340, 18024694, 18773058, 18299567, 18144045, 19209620, 20106807, 19918318, 19965619, 21127073, 22042863, 21803093, 21788192, 22943987, 23884218, 23675636, 23812528, 25352798, 26805207, 26984922, 27198838, 28440826, 29325314, 29063905, 29451847, 31502834, 33252818, 33393840, 33784240, 35750949, 37437251, 37623261, 38423847, 41154264, 43477602, 43925606, 45037071, 48486420, 51644160, 52825916, 55010604, 60053959, 64588906, 66502473, 69611026, 76424005, 82760517, 85904474, 90874736]
35713I0874736J0204940R782811N555194Q362436J5624441J3241182M668156R699620
35705A68013516K1744775o04426p1920686j36963660j28492392n4720175J1164902
35698a91778146K4242676R531391O554829J5048203J4917576O898943N469307
35691a09115221J0154820R649033M262692L270301O497733O154021K386902J914717
35683f4825002M564047M358128J408561J042254L168316L010101P09280O43743
35675d5920572K609679K471864M04324L33924K160765K144465K62424N5803J714466
35666c3762858J967096M64585R2064J209019J321139K47387K55658J296339J136155
35657b5773416m3384L1479J156920J027027j86767j44681J089752J184390J4323
$$ y = [90874736, 101079676, 110862487, 116417681, 124780117, 140404558, 153645740, 158313896, 168013516, 189758291, 189153865, 117233179, -19730481, -148222873, -202943048, -191778146, -167535470, -158004079, -151449250, -136401047, -121483471, -114584528, -109115221, -98960401, -89311368, -85048676, -81778375, -75280642, -69126621, -66739719, -64825002, -60260955, -55902827, -54494266, -53452012, -50283696, -47273595, -46564315, -45920572, -43310893, -40839029, -40434705, -40100781, -37940016, -35795551, -35533127, -35477324, -33762858, -31795762, -31331177, -31239113, -30030094, -28708955, -28461568, -28205910, -26909571, -25773416, -25816800, -25785321, -24628401, -23601374, -23788141, -23932822, -22843070, -21658680, -21644357]
35648b1644357k45146O51002P76736o9399j41941O38785O04861j85608k0963R72317
35638a8663713R40906j23358l50743M80196P11373Q9230K7013N84865L83266m37483
35628a6358448l03765O90586Q35800K4109j15079O09075O63121j42027k82061
35619a4378689M90115O72112r4360m20503J20412L28381j38134j62312M77742
35610a3105236O00722m5296k65807K95320N75651K25796J62131N87109N58698
35601a0410912q0116l70888j51451k84342p28837m62937L96944N23291k22840
35592a1792088m40551L15332P76869K69707k17779M4439L62984J15569k00028
35583a0765546j12082L4769M611J17261L72267L31949J01573K18543N06612L15913
$$ y = [-21644357, -21889503, -21238501, -20461765, -20531164, -20673105, -20034320, -19429459, -19615067, -19636030, -18663713, -17722807, -17846165, -18196908, -17716712, -17005339, -16916109, -16889096, -16304231, -15920965, -16358448, -16662213, -15971627, -15135827, -15111718, -15226797, -14617722, -13954601, -14096628, -14378689, -13888574, -13216462, -13310822, -13731325, -13610913, -13282532, -13420666, -13582978, -13105236, -12504514, -12549810, -12815617, -12520297, -11944646, -11718850, -11556719, -10969610, -10410912, -10491028, -10861916, -11013367, -11297709, -12026546, -12489483, -12092539, -11569248, -11792088, -12232639, -11917307, -11140438, -10870731, -11088510, -11044071, -10681087, -10565518, -10765546, -10877628, -10842859, -10838248, -10720987, -10348720, -10016771, -9915198, -9696655, -9190043, -8874130]
35573h874130j55374j49383J82660P2837k97603j22335L50156J90672l40677j60280
35563i303457N20074M28725m02757n85330J47510N01418m497k97943J26994L59438
35553h509825m0051k04789K70799N07592M6064k82914M0541L13031N3657j26296
35543g932191J54241K81386o2275k15289J39918L09648n6905k61803R4377L53151
35533g195742R4490p8866K14805L48650q3057m20589j22901K82121K12104m150
35523f753135P8048J89510J9709j34615j9938P8142r57M2678K24417R3415l16878
35512f499604l27818J89589M71764J49461j60583k2359J18121p0470j52054J34919
35502f169034K73685n4856l10275n2745K81092J94770n6271p2109l790p9639j07096
$$ y = [-8874130, -9029504, -9178887, -8996227, -8923390, -9220993, -9343328, -8993172, -8802500, -9143177, -9303457, -8783383, -8354658, -8757415, -9342745, -9195235, -8693817, -8698314, -8996257, -8869263, -8509825, -8549876, -8754665, -8483866, -7976274, -7930210, -8213124, -8172583, -7859552, -7805895, -7932191, -7777950, -7496564, -7558839, -7774128, -7634210, -7324562, -7381467, -7643270, -7548893, -7195742, -7101252, -7180118, -6965313, -6616663, -6699720, -7120309, -7243210, -6961089, -6748985, -6753135, -6675087, -6485577, -6465868, -6600483, -6620421, -6542279, -6543236, -6500558, -6276141, -6182726, -6499604, -6827422, -6637833, -6166069, -6016608, -6177191, -6199550, -6081429, -6151899, -6303953, -6169034, -5895349, -5950205, -6260480, -6313225, -6032133, -5837363, -5893634, -5965743, -5969533, -6049172, -6156268]
35491f156268M7140J05375o7185j63121k1493J01389R2394J52141K41079Q6104
35481e582445j50972k9592K74425J56443k69542k65990J71656K27745k42440l83246
35471f093958J32009M94344J86528j76567l2213K16245J12934m8785J7176l178
35461e195465k38952k02804K45074M45892P0433k50218n3321J60491n6474k45756
35451e321100L5914L39033J65376j29129p4764L8982j63634l22414j6821L79576
35441e068981L25194K0279n9647L103p9088j30857R8629L40813K48080O936n2559
35430d348098k3905r3402j07911M5322J02750q3037k02745m8126J07440N6023
35420d595689J9850J18454Q2699j52775k23945m0829j0178k23009k05729J51874
$$ y = [-6156268, -6109128, -6003753, -6070938, -6234059, -6255552, -6154163, -6061769, -5909628, -5668549, -5582445, -5733417, -5763009, -5488584, -5332141, -5601683, -5867673, -5696017, -5468272, -5710712, -6093958, -5961949, -5467605, -5281077, -5457644, -5489857, -5273612, -5160678, -5209463, -5192287, -5195465, -5434417, -5637221, -5392147, -4946255, -4875822, -5126040, -5179361, -5018870, -5075344, -5321100, -5285186, -4946153, -4780777, -4909906, -4984670, -4945688, -5109322, -5431736, -5448557, -5068981, -4743787, -4723508, -4783155, -4780052, -4859140, -4989997, -4891368, -4550555, -4302475, -4295539, -4348098, -4372003, -4465405, -4573316, -4527994, -4425244, -4508281, -4711026, -4759152, -4651712, -4595689, -4575839, -4457385, -4374686, -4527461, -4751406, -4792235, -4802413, -5025422, -5231151, -5079277]
35410e079277K82598j3757j31300K21943M24780Q6491j79098J31021M51094J61401
35400c644104k93822k38098N5124r92j70494O7157M15597K60629j73682k03917
35390c926602J16912J70648j13180k46122j03608q911k5973O5211J93117Q1233
35380c797275j81225k46077p3139J06620K15666K68926J46849j24809j85462J13822
35370c756104L42313J46911j43522j06256L3939j24429l68260k48045R0088J63023
35360c970342j8197o3958N5204M5435r1546q5797P2902J63379J60049J70055J18912
35349c443904o7647j83046n7729R8051P0230L5982J55489J58974j46998l61362
35339c741960q2251L33666K76426j26519k31732P6366K62125J8149l38923l93784
$$ y = [-5079277, -4796679, -4810436, -4941736, -4719793, -4295013, -4208522, -4387620, -4256599, -3805505, -3644104, -3937926, -4176024, -4120900, -4121892, -4292386, -4225229, -3809632, -3549003, -3722685, -3926602, -3809690, -3639042, -3752222, -3998344, -4101952, -4110863, -4136836, -4071625, -3878508, -3797275, -3978500, -4224577, -4297716, -4191096, -3975430, -3706504, -3559655, -3684464, -3869926, -3756104, -3413791, -3266880, -3410402, -3516658, -3482719, -3607148, -3975408, -4223453, -4133365, -3970342, -3988539, -4052497, -3997293, -3951858, -4043404, -4129201, -4056299, -3892920, -3732871, -3562816, -3443904, -3511551, -3694597, -3752326, -3654275, -3584045, -3548063, -3392574, -3233600, -3380598, -3741960, -3824211, -3490545, -3214119, -3340638, -3572370, -3496004, -3233879, -3215730, -3554653, -3948437]
35329c948437j00327K98694M94120L08858p6969k50680j12195p176j09738j10842
35319c614692J59866L15606P3581j74496j8224K25352Q0492k07737j18700J71947
35309c107005J02663k22377j75015K77290M58810Q0509l24049k62428N1145J56497
35299b963960o537j71243j35297R7309L32383K92765n8467l43757k05824J58535
35289c004093K49916l024j69595J138K28967J62726j27553l06430k24592l2791
35279c225331P1071O5619N6600P0842N129j66631k62721j30753Q7504J50368Q7401
35268c190902J05719K03595J95312O1336o3810j75565k99590k34340J38796M22634
35258b836815J65766l36519l82347L7018K54486P7904L8183L10849L32857j39654
$$ y = [-3948437, -4048764, -3750070, -3255950, -2947092, -3024061, -3274741, -3386936, -3394112, -3503850, -3614692, -3454826, -3139220, -3065639, -3240135, -3258359, -3033007, -2952515, -3160252, -3278952, -3107005, -3004342, -3226719, -3401734, -3124444, -2665634, -2585125, -2909174, -3171602, -3120457, -2963960, -2970497, -3141740, -3277037, -3179728, -2847345, -2554580, -2613047, -2956804, -3162628, -3004093, -2754177, -2757201, -2926796, -2925658, -2696691, -2533965, -2661518, -2967948, -3192540, -3225331, -3154260, -3088641, -3032041, -2961199, -2956070, -3122701, -3385422, -3516175, -3428671, -3278303, -3190902, -3085183, -2881588, -2686276, -2624940, -2688750, -2864315, -3163905, -3398245, -3259449, -2836815, -2671049, -3007568, -3389915, -3352897, -3098411, -3020507, -2982324, -2671475, -2338618, -2478272]
35248b478272m88331k48215J35376J30243k7998Q4777K92037K37945M4491m1756
35238b359703j40879l34804l06566P7079L60741K06307m8512m6387j3664j68549
35228b774937j91474J03659K50039m7157k59351M5487L33047O773m80032l71419
35218c385365J07996K30260L4554O7290K50244Q7625k81161k87912P847O7081
35208c101541r5777l613L00145L24257Q9484P5085K68254J87772j65227k69351
35198b390512r748J88119J59231J37409J10809j55806m63492l50179O8666K14326
35188b491177L282r5686L9196M5830j21086p8166K03281K86793N6827j24895j37906
35177b413707k34420l72507j92038K24242L38660O4152p2243J48580K98033J06139
$$ y = [-2478272, -2966603, -3214818, -3079442, -2949199, -2977197, -2892420, -2600383, -2362438, -2317947, -2359703, -2500582, -2835386, -3141952, -3064873, -2704132, -2497825, -2546337, -2592724, -2606388, -2774937, -2966411, -2862752, -2612713, -2659870, -2919221, -2873734, -2540687, -2533914, -3013946, -3385365, -3277369, -3047109, -3012555, -2945265, -2695021, -2607396, -2888557, -3176469, -3168622, -3101541, -3197318, -3200931, -2900786, -2576529, -2487045, -2411960, -2143706, -1955934, -2121161, -2390512, -2400260, -2212141, -2052910, -1915501, -1804692, -1960498, -2423990, -2774169, -2705503, -2491177, -2487895, -2583581, -2544385, -2498555, -2619641, -2697807, -2494526, -2207733, -2150906, -2275801, -2413707, -2648127, -3020634, -3212672, -2988430, -2649770, -2585618, -2657861, -2509281, -2211248, -2105109]
35167b105109j02962m6367Q3778P5201R773p4236k67383l90060j15299L63794
35157b568870M30671j6469l72829k68451l2987J8282P6440K88444L53248P6145
35147b016376j99826j28584J00201J27275l6549j61246j69978r1118P3428K21674
35137b281099J72942k7366j07543J7548J34993J10703N3076L5771j4013r6552
35127b001540j18116j00807j22315j12716k4078m1762k36885k43898J94403O08410
35117b199304L89565j97585l57315J80K12377L2597p7204O3889K2115l17558l85630
35106b813873Q5501M98249L09023j48671k68690m6853J38035J49464N2996j40261
35096b185080l05030j67827K23728L97835J32576j84460j70518J7815Q4418Q2219
$$ y = [-2105109, -2208071, -2254438, -2170660, -2095459, -2085686, -2159922, -2427305, -2817365, -2932664, -2568870, -2138199, -2154668, -2527497, -2795948, -2828935, -2810653, -2734213, -2445769, -2092521, -2016376, -2216202, -2344786, -2244585, -2117310, -2153859, -2315105, -2485083, -2576201, -2502773, -2281099, -2108157, -2135523, -2243066, -2225518, -2090525, -1979822, -1926746, -1890975, -1904988, -2001540, -2119656, -2220463, -2342778, -2455494, -2479572, -2521334, -2758219, -3002117, -2807714, -2199304, -1809739, -2007324, -2364639, -2364459, -2152082, -2119485, -2196689, -2132800, -2110685, -2428243, -2813873, -2728372, -2230123, -1921100, -2069771, -2338461, -2385314, -2247279, -2097815, -2044819, -2185080, -2490110, -2657937, -2434209, -2036374, -1903798, -2088258, -2258776, -2240961, -2156543, -2074324]
35086b074324J39636J09598j16647k87969j61073R1316J62727N2004m4215l4515
35076b163462P7489K54074L32747J65187o6514l4811J67365J00219k83850m97583
35066a949139k86803j443L4149j2190P1187J34840L8892l1102N4060R1974m6133
35055a901708j53405j00782o9819j18701j0832K47826K49843r8718k81729o103
35045b244128K50582L6575k80251j32630K85678L58961K6128k48340k55490j69287
35035b372202n7336J44449K75357J14036j64695j84628L6990J45845M8372m691
35025b018503P8269Q4900q4721k29518j69358K6194K07940L18608L32533K12044
35015a241612o138j93135k34908j15384P1879J68222R0298n2105q9511l7775m5873
$$ y = [-2074324, -1934688, -1825090, -1941737, -2229706, -2390779, -2299463, -2136736, -2084732, -2128947, -2163462, -2085973, -1831899, -1499152, -1333965, -1400479, -1435290, -1267925, -1167706, -1451556, -1949139, -2235942, -2237385, -2203236, -2215426, -2144239, -2009399, -1970507, -2001609, -1947549, -1855575, -1901708, -2055113, -2155895, -2225714, -2344415, -2355247, -2107421, -1857578, -1956296, -2238025, -2244128, -1993546, -1956971, -2237222, -2369852, -2084174, -1725213, -1699085, -1947425, -2202915, -2372202, -2429538, -2285089, -2009732, -1895696, -2060391, -2245019, -2208029, -2062184, -2013812, -2018503, -1940234, -1855334, -1940055, -2169573, -2338931, -2312737, -2104797, -1786189, -1453656, -1241612, -1247750, -1440885, -1675793, -1791177, -1719298, -1551076, -1460778, -1512883, -1602394, -1640169, -1686042]
35004a686042j14676r3206L8427J40898J86156K62130K85987O6604k79550l64624
34994a557896j09336J03034J9732j29180q5584K1565o841n7562M0727J62534J05916
34983a492891n1995j08374n8258j7510K61J3008m6123j79037k29465j07991N9696
34972b218679J37385J41885J07464J0409q9814q1357l1229j04192k16480j16182
34962b460790J47003K36337Q7230Q997J19622J56723M396q9583j5771j2325j47216
34951a965377j21927J34968K21112o2348l18744k14105m956L751N589K22869L84385
34940a714783K04923n0853l2798P3491m0675j66011K6157K82756J44152k24993
34930a498634k66795N5944K36416N4554j69610j64074l7146K4274l651o3108n9680
$$ y = [-1686042, -1800718, -1893924, -1855497, -1714599, -1528443, -1266313, -980326, -913722, -1193272, -1557896, -1667232, -1564198, -1544466, -1673646, -1759230, -1737665, -1744506, -1802068, -1761341, -1598807, -1492891, -1544886, -1653260, -1711518, -1729028, -1728767, -1715759, -1761882, -1940919, -2170384, -2278375, -2218679, -2081294, -1939409, -1831945, -1821536, -1911350, -1992707, -2023936, -2128128, -2344608, -2460790, -2313787, -2077450, -1990220, -1981223, -1861601, -1704878, -1700482, -1790065, -1805836, -1818161, -1965377, -2087304, -1952336, -1731224, -1793572, -2112316, -2326421, -2331377, -2327626, -2322037, -2099168, -1714783, -1509860, -1560713, -1593511, -1520020, -1560695, -1726706, -1700549, -1417793, -1273641, -1498634, -1765429, -1709485, -1473069, -1418515, -1588125, -1752199, -1789345, -1765071, -1768722, -1831830, -1891510]
34919a891510R4219K57368J07484l16666m59839l1102M32701L10542j40486k15844
34909a853133J07384K25202k8868j66701N0406K30762P7028j32032p0536J07769
34899a452719Q4021j23425k47643j48478Q2736K39119J45967j49153l42289k21857
34889b133721J0772J8723j53934j61943Q9241L24397L47258K67167K14029J34752
34879a043259k1723j57243j70033q5685J1675N1712j3561j43599j91671q6363
34869a849750L7523K6694o5793q9679k3872N1545Q9557N7459n8721j24602L9620
34858a910019L04307K85404o5254k89929j08494J27005K5846j93431j28124Q3838
34848a868851L7268j95013k03420K7998J40152O0233N4999J64052J52125K2508
$$ y = [-1891510, -1797291, -1539923, -1432439, -1749105, -2208944, -2240046, -1807345, -1496803, -1637289, -1853133, -1745749, -1520547, -1549415, -1716116, -1665710, -1434948, -1357920, -1489952, -1560488, -1452719, -1368698, -1492123, -1739766, -1888244, -1805508, -1566389, -1420422, -1569575, -1911864, -2133721, -2122949, -2104226, -2258160, -2420103, -2330862, -2006465, -1659207, -1392040, -1178011, -1043259, -1064982, -1222225, -1392258, -1477943, -1466268, -1414556, -1428117, -1571716, -1763387, -1849750, -1812227, -1785533, -1851326, -1941005, -1964877, -1913332, -1823775, -1766316, -1825037, -1949639, -1910019, -1605712, -1320308, -1385562, -1675491, -1783985, -1656980, -1631134, -1824565, -1952689, -1868851, -1831583, -2026596, -2230016, -2202018, -2061866, -2001633, -1946634, -1782582, -1630457, -1607949]
34838a607949K3352J24682M0552j85758j79400R7836K33159N3365j05473n45J54619
34827a351560J54717J51015K58098K41812o9088m00143m02351j55861J2306K0574
34817a540481M2690J49931K14697J31575n2592k22348k98638k63511j36420N3309
34807a921788K44060L10127J72695k6944m4363J02320J18172q9923k18221o7878
34797a421743Q5477n2460k80003k46502l5809O1494J01417K78178L89935J32000
34787i88016k31781j68749K22122L19048o653k25454r8530k2448k02685k39721
34777a642867R5441L52464J39327j95478j45201J36443J50228j33727l09372j87566
34767a740308M0460J68839J47682j984j63327j41931O5539J88867P2293p1406
$$ y = [-1607949, -1584597, -1459915, -1419363, -1605121, -1784521, -1686685, -1453526, -1400161, -1505634, -1506179, -1351560, -1196843, -1045828, -787730, -545918, -615006, -1015149, -1417500, -1573361, -1561055, -1540481, -1497791, -1347860, -1133163, -1001588, -1054180, -1276528, -1575166, -1838677, -1975097, -1921788, -1677728, -1367601, -1194906, -1221850, -1266213, -1163893, -1045721, -1135644, -1353865, -1421743, -1336266, -1388726, -1668729, -1915231, -1951040, -1889546, -1788129, -1509951, -1120016, -988016, -1219797, -1388546, -1166424, -847376, -854029, -1079483, -1178013, -1200461, -1403146, -1642867, -1547426, -1194962, -1055635, -1251113, -1396314, -1259871, -1109643, -1243370, -1552742, -1740308, -1699848, -1531009, -1383327, -1385311, -1548638, -1690569, -1625030, -1436163, -1363870, -1435276]
34757a435276j3834J24094J17444J8305R756P4895Q9386P3894R4916P4112o4763
34746h37071k17302k75112k95319l01217j54814J43402K99606J55757Q5J12192
34736a369793K67124J04827k28657k84098j4461K10269K21191J88375J53775n5392
34726h06840l57642l62907J1401K96435J18962k44079k76097N7943L42681L19846
34716i00297J23989m2227j51084k14901j63472R688J32399M1551j74235k53712
34706a592301q2009J72846K68520J48707n3910j98512k31641j46236L5000K14402
34696a465134K53244J11544q6858j72582r5791M6518J28558J23811J13747J57917
34686h85026J72166J4229k72974m09083j88766K07626L70314J41358j93735k51225
$$ y = [-1435276, -1449110, -1325016, -1207572, -1189267, -1179511, -1104616, -1015230, -941336, -846420, -772308, -837071, -1054373, -1329485, -1624804, -1926021, -2080835, -1937433, -1637827, -1482070, -1481985, -1369793, -1102669, -997842, -1226499, -1510597, -1525058, -1314789, -1093598, -905223, -751448, -806840, -1164482, -1527389, -1515988, -1219553, -1100591, -1344670, -1620767, -1562824, -1220143, -900297, -776308, -818535, -969619, -1184520, -1347992, -1338304, -1205905, -1164354, -1338589, -1592301, -1674310, -1501464, -1232944, -1084237, -1138147, -1336659, -1568300, -1714536, -1679536, -1465134, -1211890, -1100346, -1187204, -1359786, -1455577, -1409059, -1280501, -1156690, -1042943, -885026, -712860, -698631, -971605, -1380688, -1569454, -1361828, -991514, -850156, -1043891, -1295116]
34676a295116R897K72231K45210j2454j87303j01637P5899Q3235n4257q0593O2349
34665i82539J20338n5057k40406k01693q4038j42903k69382j56376J56139L05711
34655a550206J72346K2896L1035M0445o6949j30021k4278R3658P4936M0851J21114
34644a174173J74214L7698j39155j03438R3089J72607L7916j43890k06636j21426
34634a373194P3231K74346L03507R5372j45262j63211J5995J58209J59770J02027
34624d99210K5904r4762j75656r1379N7780L6383j09520m8226K80829M37985Q4363
34613i5509m50453n74393k54797k954o6125j13327J24121L51133J91567j41226
34603a031963j23199K48431L89378l4076o20559p87381m95750j56283k3874M725
$$ y = [-1295116, -1285219, -1012988, -767778, -780232, -967535, -1069172, -993273, -910038, -964295, -1044888, -982539, -862201, -917258, -1157664, -1359357, -1443395, -1586298, -1855680, -2012056, -1855917, -1550206, -1377860, -1354964, -1323929, -1283484, -1350433, -1480454, -1504732, -1411074, -1336138, -1295287, -1174173, -999959, -962261, -1101416, -1204854, -1111765, -939158, -901242, -1045132, -1251768, -1373194, -1299963, -1025617, -722110, -626738, -772000, -935211, -919216, -761007, -601237, -499210, -473306, -568068, -743724, -835103, -777323, -740940, -850460, -898686, -617857, -179872, -95509, -545962, -1120355, -1375152, -1378106, -1444231, -1557558, -1433437, -1082304, -890737, -1031963, -1155162, -906731, -517353, -551429, -1171988, -1959369, -2455119, -2611402, -2635276, -2630551]
34593b630551Q3111J97074K65325K48593J25258q5632k50730k12715L775J86397
34583b070095J76801L2050q8383j15141r6842q1792k9983J33371L68960M70103
34573a300951K55997j57369l96061k29167J48680L41544K01429o1158j78235j07430
34563a482721j809M968o5274q6961N074J26986J57043J04646P8877R9563O6859
34552i92749n8156j82307k33245k33449j67356M0333L12125L80167J28695j83673
34542a189615k37938o8988L8698k6406j09800p9153P264L8904J1162J3050J24476
34531a478346L05557L60829J20977k77477m47689k10148J52410K50374N7650j48813
34521a314676j83786p5546J02861K88960L62240K27707l6044k49976l22836k65316
$$ y = [-2630551, -2547440, -2350366, -2085041, -1836448, -1711190, -1796822, -2047552, -2260267, -2256492, -2070095, -1893294, -1861244, -1949627, -2064768, -2161610, -2243402, -2273385, -2140014, -1771054, -1300951, -1044954, -1202323, -1598384, -1827551, -1678871, -1337327, -1135898, -1197056, -1375291, -1482721, -1484530, -1479562, -1544836, -1631797, -1626723, -1499737, -1342694, -1238048, -1159171, -1059608, -992749, -1050905, -1233212, -1466457, -1699906, -1867262, -1826929, -1514804, -1134637, -1005942, -1189615, -1427553, -1496541, -1457843, -1484249, -1594049, -1673202, -1665938, -1627034, -1615872, -1602822, -1478346, -1172789, -811960, -690983, -968460, -1416149, -1626297, -1473887, -1223513, -1165863, -1314676, -1498462, -1574008, -1471147, -1182187, -819947, -592240, -628284, -878260, -1201096, -1466412]
34511a466412j06442P8409J56599R4303L1837Q3676J73433J74894Q0370o7856
34501g67189k38227l14114j74734K5345l1864k88937k75795J48706M60207K44959
34491a211643j26818j04669J59691J54149p9352q6872J31950J59712j4425J7073
34481a001204K41768J66426k60610m37625q7836K60025J31808j79407j89798K3253
34471a333200J16202Q4253Q8670L7128j82922l30796j35659K11918L10765J29987
34461a003654l9597p6401j08184j89992k19599j33717L4091K22658L09761J47679
34451a056955j94973l90441k40497N4279J95366J70219J33829J03809J8979n3328
34441a259713j3840P9555J21722J36047J61993J17862l7752j69200j80136j87812
$$ y = [-1466412, -1572854, -1494445, -1337846, -1243543, -1211706, -1128030, -954597, -779703, -699333, -767189, -1005416, -1319530, -1494264, -1468919, -1500783, -1789720, -2065515, -1916809, -1456602, -1211643, -1338461, -1443130, -1283439, -1129290, -1208642, -1295514, -1163564, -1003852, -1018277, -1001204, -759436, -593010, -853620, -1291245, -1379081, -1119056, -987248, -1166655, -1356453, -1333200, -1216998, -1132745, -1044075, -1006947, -1189869, -1520665, -1656324, -1444406, -1133641, -1003654, -1043251, -1119652, -1227836, -1417828, -1637427, -1771144, -1737053, -1514395, -1204634, -1056955, -1251928, -1642369, -1882866, -1828587, -1633221, -1463002, -1329173, -1225364, -1206385, -1259713, -1273553, -1193998, -1072276, -936229, -774236, -656374, -694126, -863326, -1043462, -1231274]
34431a231274k71224k47476K9738L25274L02086L9567o6248J09200K55346J05979
34421f49032j84977k76174q9055J22748J17177l7741q5339L1674P3226r8624k17932
34410a294049R504L57238L11571j43912m35856k30511J00118J01210q9691o4399
34400a378777J72139K73660J26373n5371j09910o3161L9207J38123R2978j06681
34390h71420j81164O3362L16827J20799m00431o02825j99688L27141L87665L8519
34380a001215j98847q1117J17716Q2232j14771j85270o1410N2361L4216K2004
34370a334101J35016K22474R7628j16312j45014L030O3038m0518r7252O72J01941
34359a109398J12860J42530K09336J33256j11449k53549j38203J0766l6402j58762
$$ y = [-1231274, -1502498, -1749974, -1720236, -1394962, -1092876, -1053309, -1119557, -1010357, -755011, -649032, -834009, -1110183, -1199238, -1076490, -959313, -997054, -1082393, -1050719, -977493, -1076117, -1294049, -1284545, -927307, -615736, -759648, -1195504, -1426015, -1325897, -1224687, -1314378, -1378777, -1206638, -932978, -806605, -861976, -971886, -1035047, -995840, -857717, -764739, -871420, -1052584, -989222, -672395, -551596, -952027, -1554852, -1754540, -1427399, -1039734, -1001215, -1200062, -1281179, -1163463, -1081231, -1196002, -1381272, -1442682, -1390321, -1356105, -1334101, -1199085, -976611, -878983, -995295, -1140309, -1137279, -1074241, -1114759, -1212011, -1211339, -1109398, -996538, -854008, -644672, -511416, -622865, -876414, -1014617, -1003851, -1040253, -1199015]
34349a199015j40462k3127M8329R2120J53226J31352j4470j21650j06184j20283
34339a300164k03129j08467K26662M05200J48802j87936j43802J11271R9008j47115
34329a099670j86270L8404J31930m6010j83708r0853L6941K8365k1416j4493K0115
34318a386665J12931L02121L87619J47083j99628k04198R8531K00325o7145k66141
34308h75167q2563J95828J95228m329j41684j87573j83895m2329J88097K10292
34298g28095m4961j93471L675J94350J4231k52469j27912K23344K37032j15550
34288g89826k88602o0114J63706P7344o6076K4307J81616J36114p935j2703N4217
34277e87952p735j25845r7558K845n1448j89985j24035J27242J99808l5859k46298
$$ y = [-1199015, -1339477, -1362604, -1314275, -1222155, -1068929, -937577, -952047, -1073697, -1179881, -1300164, -1503293, -1611760, -1385098, -979898, -831096, -1019032, -1162834, -1051563, -952555, -1099670, -1285940, -1247536, -1115606, -1161616, -1345324, -1436177, -1399236, -1370871, -1392287, -1406780, -1386665, -1273734, -971613, -583994, -436911, -636539, -840737, -742206, -541881, -609026, -875167, -957730, -761902, -566674, -571003, -712687, -900260, -1084155, -1126484, -938387, -728095, -773056, -966527, -962852, -768502, -754271, -1006740, -1134652, -911308, -674276, -789826, -1078428, -1138542, -974836, -897492, -963568, -939261, -757645, -621531, -629466, -642169, -587952, -595687, -721532, -819090, -816245, -867693, -1057678, -1181713, -1054471, -854663, -890522, -1136820]
34266a136820j60325L0422M9293j15J06847K29506P1510k33850k26677J52141
34256a118068L94279J57211k27748k56726L3722J99918N6681j60505k35207k15598
34246a372041j77158n0244J75413K94931J34135j52871k24450J3632K61957J85847
34236i10849j58900l70515j79610K22453M13065K28220r7800k57810j90374l9631
34226a341751O5470J02597J06870J16703J37827J27551N5849k0697k7085o277
34216f82943o7538j84534j93399m4815R3397P3331k8075m7709L4414J17121J33819
34205g96931Q2258q921m9663O1618K44918K26393j14748m88841m91627j17151
34195a452695K32510K62094J06273O0979J62506J91540K3960j99616k86019k27821
$$ y = [-1136820, -1297145, -1266723, -1217430, -1217545, -1110698, -881192, -809682, -1043532, -1270209, -1118068, -723789, -566578, -794326, -1051052, -1017330, -817412, -760731, -921236, -1156443, -1372041, -1549199, -1599443, -1424030, -1129099, -994964, -1147835, -1372285, -1358653, -1096696, -910849, -1069749, -1440264, -1619874, -1397421, -984356, -756136, -853936, -1111746, -1302120, -1341751, -1276281, -1173684, -1066814, -950111, -812284, -684733, -628884, -649581, -676666, -682943, -750481, -935015, -1128414, -1173229, -1079832, -1006501, -1034576, -1082285, -1047871, -930750, -796931, -714673, -723594, -773257, -711639, -466721, -240328, -355076, -843917, -1335544, -1452695, -1220185, -958091, -851818, -790839, -628333, -436793, -412833, -612449, -898468, -1126289]
34185a126289j29942q651J62093K56656R5123k16518l10211o8414J43569n834
34175a208418k97403k86730K6468K46738K04677J06155Q2981L0228o3362m6129
34165a204795N1614J6146j10323k7953K54122L27315N5351j59667n3674O2868
34155g88996r1201k22674k051K84386J92361j04737j22955R0336Q9116j32770
34145h09185j34284J45985K44050j7176k04936j9370J87651l172l83278m18975
34135a412690q407M41547N68020L65548J1972l31779n21258m43539j40352J62080
34125a308858K32269N4331j52006j56537L6441K02998J64031k1995j53111j08444
34115a210881N3410J66265J08502o1074j33890j186J71209J53739j3826r7684
$$ y = [-1126289, -1256231, -1264882, -1102789, -846133, -751010, -967528, -1277739, -1346153, -1202584, -1208418, -1505821, -1792551, -1766083, -1519345, -1314668, -1208513, -1125532, -1095304, -1158666, -1204795, -1153181, -1137035, -1247358, -1275311, -1021189, -693874, -638523, -798190, -851864, -788996, -880197, -1102871, -1104922, -820536, -628175, -732912, -855867, -765531, -676415, -809185, -943469, -797484, -553434, -570610, -775546, -794916, -607265, -610437, -993715, -1412690, -1421097, -979550, -411530, -45982, -34010, -365789, -887047, -1330586, -1470938, -1308858, -1076589, -1022258, -1174264, -1330801, -1294360, -1091362, -927331, -949326, -1102437, -1210881, -1157471, -991206, -882704, -943778, -1077668, -1078854, -907645, -753906, -767732, -865416]
34105h65416m0351J46k2819J7397J11162P5841p5375q0342J09012J72260o7465
34094f65950l27188l06179j13780J3879R7440K11300K14556K8059j03369K0964
34084i30268J91030J40101l001J0999Q8510M317j63934k10525j76433j64482m9420
34073a263106K18281L23124O2356k02584q9258J40802N2931j57775l8003K31891
34063g21341J25033k34761k30724J60126L24054Q3275p9110K1606q173k50152
34053h10167k12641K06793L69879m0926m14572k07384J82395J62662p1300j5457
34043h50718K00378J20720j43455j09561J84849K15745j49186m33527k70295J47009
34033a088041M13652L52444M6195k79946l70865j59753J16992J84265N3498o3830
$$ y = [-865416, -905767, -905621, -928440, -911043, -799881, -724040, -799415, -879757, -770745, -598485, -665950, -993138, -1299317, -1413097, -1399218, -1301778, -1090478, -875922, -847863, -951232, -930268, -739238, -599137, -602138, -591139, -502629, -498312, -662246, -872771, -1049204, -1213686, -1263106, -1044825, -721701, -659345, -861929, -951187, -810385, -757454, -915229, -953232, -721341, -596308, -831069, -1061793, -901667, -577613, -494338, -573448, -551842, -560015, -810167, -1022808, -816015, -446136, -487062, -901634, -1109018, -926623, -763961, -835261, -850718, -650340, -529620, -673075, -782636, -597787, -382042, -531228, -964755, -1235050, -1088041, -674389, -321945, -275750, -555696, -926561, -1086314, -969322, -785057, -731559, -795389]
34023g95389o2365P130Q3357J17447N4201o0018o9120O2840J62514J13878K6323
34012c59202r789j09744l26267m09405j19368L45708N21265K45920j56541k76310
34002f53733n8504J86351J62939m9599j03283R8251J80836j57767n73394m65712
33992a433615J21145M96044K93009p9021j50445l9017o3950j57211p7439R9731
33982i90769J23703k912r3841j08193j05254l9159J16822K02901R5184n8059n6993
33971i16570N6101J30538J44782J16873J036j32493p5621J49733J99072p6463
33961d03012l39508k74053m6795N7410J02016K19981K30265j3436k22598j23331
33951h13061J0953j63066l57050r9147L51294L18437j51040k97784J16368M10785
$$ y = [-795389, -857754, -850624, -767267, -649820, -595619, -655637, -724757, -661917, -499403, -385525, -359202, -368991, -478735, -805002, -1214407, -1333775, -988067, -466802, -220882, -377423, -653733, -712237, -525886, -362947, -412546, -515829, -417578, -236742, -394509, -967903, -1433615, -1312470, -816426, -523417, -602438, -752883, -791900, -855850, -1013061, -1090500, -990769, -867066, -869978, -963819, -1072012, -1177266, -1216425, -1099603, -896702, -801518, -859577, -916570, -860469, -729931, -585149, -468276, -467240, -599733, -675354, -525621, -326549, -403012, -742520, -1016573, -1063368, -1005958, -903942, -683961, -453696, -467132, -689730, -813061, -802108, -965174, -1322224, -1421371, -1070077, -751640, -902680, -1200464, -1084096, -673311]
33941f73311R6056l61153l23822N1283J80100r348q1050J43699L41587K14603
33931d21356j03059k60847j17287J42956K42750J05826r8744j95154j90739j57653
33921a053307n8847J38582K87004K24062M4187m0746m5941j33450k40166j37341
33911a015963J19974J79488o6074k72696j49439J32789K40586J35144P671m6141
33901g34661o5452p4424p4928q4315o4871M9427J77324J42027r434m126J90878
33890e52555K17750j03349l75848j79761K33186K84340m3505k23446o7304K1177
33880g89315j78053k79442K2507L64572K81762l3553r2990N6036n102k33421j66653
33869a053652J96732K92899n6214k98255q3718J35359p0884l03788k3185M36462
$$ y = [-673311, -577255, -938408, -1262230, -1210947, -1030847, -1040195, -1121245, -977546, -635959, -421356, -524415, -785262, -902549, -759593, -516843, -411017, -509761, -704915, -895654, -1053307, -1112154, -973572, -686568, -462506, -418319, -459065, -505006, -638456, -878622, -1015963, -895989, -716501, -782575, -1055271, -1204710, -1071921, -831335, -696191, -688520, -734661, -800113, -874537, -949465, -1033780, -1098651, -1049224, -871900, -729873, -739307, -743433, -552555, -334805, -438154, -814002, -993763, -760577, -476237, -519742, -743188, -810492, -789315, -967368, -1246810, -1224303, -859731, -577969, -611522, -704512, -648476, -653578, -886999, -1053652, -856920, -564021, -620235, -918490, -1002208, -866849, -937733, -1241521, -1264706, -828244]
33859h28244L47887j89684l81430m930L15756J89073j9017K5069P1341j06480
33849e80659k14693p936J94387N5366j73686j08827R8722R1401k9122N7660K33401
33838c83986J24092k02783l06268q6036J00307L7982j00508j42847j19470l5646
33828a115163J59543L25245K29105m6318j62012m5318J8936j02716j82673o4939
33818i86310O3250J8073q4039p9404k3249L824Q4385K31659K32118m693j75672
33807g20058r30K66672J51519k96193n00296j80038K42828K74150M2511J4595
33797g05240K28905K66392l2744k86160j75712N2241N083k16009j99236R7577
33787i64903K86696J57055p0142j62125j71133j79787r8429R4431K01217J03969
$$ y = [-828244, -480357, -670041, -1051471, -1056401, -740645, -551572, -570589, -545520, -474179, -580659, -795352, -803288, -608901, -553535, -727221, -836048, -737326, -645925, -675047, -617387, -383986, -259894, -462677, -768945, -854981, -754674, -716692, -817200, -960047, -1079517, -1115163, -955620, -630375, -401270, -447588, -609600, -654918, -635982, -738698, -921371, -986310, -923060, -904987, -989026, -1068430, -1091679, -1087855, -1003470, -771811, -539693, -544386, -720058, -720988, -454316, -302797, -598990, -1099286, -1279324, -1036496, -762346, -719835, -705240, -476335, -209943, -242687, -528847, -704559, -652318, -647235, -863244, -1062480, -964903, -678207, -521152, -591294, -753419, -924552, -1104339, -1202768, -1108337, -907120, -803151]
33777h03151k7445k1096L3572L625l6617J2196N3767j9077j08841r2491k7619
33766a033177J4416J05959K48601K44789K6472j35650k8906J37805P5324j15788
33756d60155j57689n9512k779L3944J44284J79586r224j86979n3347J97423J38462
33745b35986j71346k76919r4958j3037j72152k35442k6607J47045N1891o6679
33735a094190O1221K57158K11213j5790j34202p0308K0085M5476M2569L4287P055
33724f35426k7557n6123q2314p7106j1150N0739K5489k1440M1574J67711J70582
33713d55021J3587j48891k20792k30990j61603K7958K00539J54316l1835o5331
33703i18063R8598J79732L8233j09564p0955K8995r72j18060j54558l7636J92802
$$ y = [-803151, -830596, -851692, -818120, -814495, -851112, -838916, -785149, -804226, -913067, -1005558, -1033177, -1018761, -912802, -664201, -419412, -392940, -528590, -557496, -419691, -344367, -460155, -617844, -677356, -680135, -646191, -501907, -322321, -331545, -518524, -571871, -374448, -235986, -407332, -684251, -779209, -792246, -964398, -1199840, -1226447, -1079402, -1027511, -1094190, -1032969, -775811, -564598, -580388, -714590, -784898, -764813, -719337, -676768, -642481, -635426, -662983, -719106, -801420, -878526, -889676, -838937, -813448, -834888, -793314, -625603, -455021, -441434, -590325, -811117, -1042107, -1203710, -1175752, -975213, -820897, -852732, -918063, -819465, -639733, -601500, -711064, -782019, -753024, -753996, -872056, -1026614, -1064250, -871448]
33692h71448L96337L43390k8150l70080k71703J34816L14826J16798o2539p223
33682c04976j6756k65664l92807j21244K03671J70739j9007L7692K07189Q7528
33672d13635k27734k82156l1174J17138N089q6206J3537J23882J02056M3861J7817
33661f17525k6151l6105Q6431J94839N8232j77354j36756J40333K08254l4319
33651c40121j57055L9919J51491j08382l45848j28756K43962J96492j84069k88890
33641i21257N2845L62169K78820K670j50629j76648j80825j20336K9756J22853
33631g00582O2037k9113k6863q332p1788j36713r1165J8379J01761J72778K22811
33620d86790J21757j48279l14509j25570K48013L89277J76820r8362j60718n0861
$$ y = [-871448, -475111, -131721, -159871, -529951, -801654, -666838, -352012, -235214, -297753, -304976, -321732, -587396, -980203, -1101447, -897776, -727037, -746044, -708352, -501163, -413635, -641369, -923525, -954699, -837561, -832472, -918678, -905141, -781259, -679203, -635342, -617525, -643676, -679781, -593350, -398511, -340279, -517633, -654389, -514056, -305802, -340121, -497176, -457257, -305766, -414148, -759996, -888752, -644790, -448298, -632367, -921257, -868412, -506243, -227423, -224753, -375382, -552030, -732855, -853191, -823435, -700582, -638545, -667658, -694521, -702853, -774641, -911354, -1002519, -984140, -882379, -709601, -486790, -365033, -513312, -827821, -953391, -705378, -316101, -139281, -237643, -398361, -449222]
33610d49222N1942Q3966O8686J559j09591j89883j88250j55397j52125j42471
33600a180786n6581Q3780J76794J59310O1271m4198r4797m6853J05789K73703
33590e62568K81089M2728k53877k88032j9452J95247P4424j64625j41551O3858
33580g72759N2658j65668j36055K19082L46151l5848l63532q9609L82910L16925
33570b45745j70417l41783o5918O2830j78701l01208k7869K46327K10077J27347
33560f85060K12259J73393j82080m63814k95338Q0609K48654K32435K17312J03426
33550c58204j82897l35941j29934J26977P9772r5379q5510j8445j01133q1449
33540a182143K89087O02144L21005k83934m67900j24047J68248J15779J485J6626
$$ y = [-449222, -397280, -313314, -244628, -243069, -352660, -542543, -730793, -886190, -1038315, -1180786, -1237367, -1153587, -976793, -817483, -756212, -800410, -895207, -942060, -836271, -562568, -281479, -238751, -492628, -780660, -800112, -604865, -530441, -695066, -836617, -772759, -720101, -885769, -1021824, -802742, -456591, -492439, -855971, -945580, -562670, -245745, -416162, -757945, -823863, -761033, -939734, -1240942, -1268811, -1022484, -812407, -685060, -472801, -299408, -481488, -945302, -1240640, -1160031, -911377, -678942, -461630, -358204, -541101, -877042, -1006976, -879999, -800227, -895606, -981116, -999561, -1100694, -1182143, -893056, -290912, 30093, -253841, -721741, -845788, -677540, -561761, -560276, -543650]
33530e43650P497n5300K84Q3557q4721l56119k38240K75294N66198K75726k17077
33519b86551m13145k96681j02058P2604J84225J49126K8553P027Q2065Q7045M1990
33508d45800J01144J64554K872k34542j70630J05156R0422k75258m38945j15543
33498a216570K76689L29850K07210J69516J01372j08541k18222p3944M4610p1561
33488e59591j38651J05683L68686K62831l8446j09106K7449J5165j86633k62432
33478e15045q6330J00041P3527q7923j49907r282J70027J11050j89180l33948
33468i16970n0237L01066J86054k21823k44191J85520L61362j6731l11720l3768
33458g61438L17422J29780k63149j85576K15918K69786p9498k88107j91332j32578
$$ y = [-543650, -536153, -591453, -591169, -507612, -592333, -948452, -1186692, -911398, -345200, -69474, -286551, -699696, -996377, -1098435, -1025831, -841606, -692480, -663927, -656900, -574835, -487790, -445800, -344656, -180102, -177230, -411772, -582402, -477246, -386824, -662082, -1101027, -1216570, -939881, -610031, -402821, -233305, -131933, -240474, -458696, -532640, -488030, -559591, -698242, -592559, -223873, 38958, 512, -108594, -81145, -65980, -252613, -515045, -601375, -501334, -427807, -515730, -665637, -674919, -504892, -393842, -583022, -916970, -967207, -666141, -480087, -701910, -946101, -760581, -399219, -415950, -727670, -761438, -444016, -314236, -577385, -762961, -547043, -277257, -356755, -644862, -836194, -968772]
33448i68772j79849j5902L32208L88250J4400l13333k22656P0807K03073J52532
33438e39242Q0020K8219j9592l4467k9553n6083o9700j738O1593O105o5481J1287
33426f28632J38041R6320n5855p5068L1072K6572j12534j52612j4968J15794J27535
33415e04335J01632P5549k416o9273j0663P1887k0834k08149k13880k8920P2837
33404g36565O23m3177L8129R7959P1043P4364J12872M1185j06719j10249L6279
33393e24256Q2135l8028j06023n2932o8715j57698m7032K66542L52778J8650k95324
33382e69903j56745J93808K43672j7368j82008r0136N0130J04087J43434J63947
33372a17082N4441j19412j28069N2967J58121J6068j93584j93733J8101J82263
$$ y = [-968772, -1148621, -1164523, -832315, -444065, -429665, -742998, -965654, -894847, -691774, -539242, -459222, -431003, -450595, -485062, -514615, -570698, -640398, -642136, -580543, -574438, -639919, -628632, -490591, -394271, -450126, -525194, -494122, -467550, -580084, -732696, -747664, -631870, -504335, -402703, -327154, -329570, -398843, -409506, -337619, -358453, -566602, -780482, -809402, -736565, -735942, -779119, -740990, -643031, -571988, -497624, -384752, -343567, -450286, -560535, -524256, -442121, -480149, -586172, -639104, -707819, -865517, -912549, -646007, -293229, -274579, -569903, -726648, -532840, -289168, -306536, -488544, -578680, -528550, -424463, -281029, -117082, -62641, -182053, -310122, -257155, -99034, -82966, -276550, -470283, -452182, -269919]
33362b69919J12892p6658j19129N5701J98811O0955k34888l28496j26810P3864
33352f53677N3558j6011Q6971K20861J02865k00319l32338j54693J05297K21462
33342e66024K02034J10556o4513k48960k44108k5032J18078m5398l05088k58104
33332a326559J13249L84050K58418m3796j16979Q7030K54127J66598o0912k14589
33322d99363k37784j69586r023K04643K91643J04767k22433l66621j80093J52494
33312i31356L47935L07220J30177m3860j36108j34485q1416m3564m9795o0455
33302f95707j5821Q5938J61579J04568r0493k63434k22104J7051K07359J73823
33292e37241M6303N4735J68391J47880n1599j76749o4508R9811Q7318k859P0590
$$ y = [-269919, -157027, -233685, -352814, -297113, -98302, -37347, -272235, -600731, -727541, -653677, -600119, -616130, -529159, -308298, -205433, -405752, -738090, -892783, -787486, -566024, -363990, -253434, -317947, -566907, -811015, -836047, -717969, -763367, -1068455, -1326559, -1213310, -829260, -570842, -614638, -731617, -644587, -390460, -223862, -284774, -499363, -737147, -906733, -915756, -711113, -419470, -314703, -537136, -903757, -1083850, -931356, -583421, -276201, -146024, -189884, -325992, -460477, -541893, -585457, -635252, -695707, -711528, -625590, -464011, -359443, -449936, -713370, -935474, -918423, -711064, -537241, -490938, -436203, -267812, -119932, -171531, -348280, -412788, -312977, -225659, -228518, -157928]
33281a57928K49035K26710n7248k86856k26165l8294J8507j8956K9271J16926
33271a44998N4419j17531j52844o439Q4050p786j01070k8060R8230R7804o444
33260b30669j04375j85476k25119r2579J95538L27781R2998k32722k19866J03052
33250e71437L20391K43410P7354j1233r5419j93235j58979k555K9390j34174k07991
33239g04478O490K72546K61783K9515j17447p3190N288o880p3513j16733r4713
33228f11332K341J17089J46622Q8025O8140J39801J70348M5166j37653k03419
33218a74872j30444k5328L5503L3610k0532m6620N8921K34537K48208J0069k41832
33207a8780k28193J846J59045J04947j9035l7195L3713M5775n9493j48509n0532
$$ y = [-157928, 91107, 317817, 260569, -26287, -252452, -290746, -272239, -291195, -261924, -144998, -90579, -208110, -360954, -367393, -283343, -291129, -392199, -420259, -322029, -224225, -230669, -335044, -520520, -745639, -838218, -642680, -314899, -221901, -454623, -674489, -571437, -251046, -7636, 69718, 58485, -36934, -230169, -389148, -391703, -362313, -496487, -704478, -697988, -425442, -163659, -134144, -251591, -324781, -319493, -326373, -399886, -516619, -611332, -608991, -491902, -345280, -257255, -189115, -49314, 121034, 166200, 28547, -174872, -305316, -330644, -295141, -261531, -282063, -328683, -269762, -35225, 212983, 223052, -18780, -246973, -245127, -86082, 18865, -170, -37365, -3652, 42123, -17370, -165879, -216411]
33196b16411J83882K84505J13042j11278j17932l33n0435k44712k49337K8799
33186c80210K66765K23998P1147L8866N0834n8640k14805k41320j41213k6220
33176d10798O4601J02998K3347r9626m9500J80695K90591J28095m2787J2683Q8816
33165B89115q0799l01511k08279J01245J95975m015j41951l6868P0177n875p1269
33154a94055Q2751K94121K72138M7776q3842k18J12164Q0554j946L4634J32976
33143G77053Q7823j05321k02408p1615J09368J36043N2691j5625q9146j74061
33133E04802j05208J61909L20084J31618j13526J1134L68580M32094Q2314k53265
33123A540536k33382O2448L89335N19338K86723j23060j53515L48069O81336K93609
$$ y = [-216411, -32529, 251976, 365018, 253740, 135808, 135475, 85040, -159672, -409009, -380210, -113445, 110553, 181700, 220566, 271400, 212760, -2045, -243365, -384578, -410798, -346197, -243199, -219852, -319478, -368978, -188283, 102308, 230403, 187616, 200299, 289115, 208316, -93195, -301474, -200229, -4254, -8269, -150220, -187088, -116911, -122786, -194055, -111304, 182817, 454955, 502731, 418889, 418671, 530835, 611389, 609443, 644077, 777053, 864876, 759555, 557147, 485532, 594900, 730943, 783634, 768009, 678863, 504802, 399594, 561503, 881587, 1013205, 899679, 910813, 1279393, 1711487, 1793801, 1540536, 1307154, 1369602, 1758937, 2278275, 2564998, 2441938, 2288423, 2636492, 3317828, 3611437]
33113C611437k05247L8498O29966N88042J48557L48048R72148Q07172N8541K50267
33103G247429J066468j31468m078907p236454o005011j693397J333445J370325
33095h127570M50610L39193M95717K57715K66716Q28172J000309L30322k06773
33086d365589P4709M42188K24507j7368K55017M64735J00534k07398J37949N17567
33076b373149J98212l20886k09733K41518K40743q7261o9778K20176J84147j20382
33066b096393r8143K67090L82463O4254k39274k32705r8474l4880k3082l9761
33056b148905o9007J6207K28852K98201O6949j79319j29316Q1097J66317J49131
33046a519793J48538M8181k16260l72596k31465n2449p5217n9679K38458N08624
$$ y = [3611437, 3406190, 3444688, 4074654, 4662696, 4811253, 5159301, 6131449, 6938621, 6997162, 7247429, 8313897, 8182429, 4103522, -3132932, -9137943, -10831340, -9497895, -8127570, -7676960, -7337767, -6842050, -6584335, -6317619, -5489447, -4489138, -4158816, -4365589, -4290880, -3848692, -3624185, -3641553, -3386536, -2921801, -2821267, -3028665, -2890716, -2373149, -2174937, -2495823, -2705556, -2464038, -2223295, -2310556, -2380334, -2160158, -1976011, -2096393, -2194536, -1927446, -1544983, -1480729, -1720003, -1952708, -2051182, -2086062, -2109144, -2148905, -2217912, -2201705, -1972853, -1674652, -1607703, -1787022, -1916338, -1835241, -1668924, -1519793, -1371255, -1323074, -1539334, -1911930, -2143395, -2195844, -2271061, -2330740, -2092282, -1583658]
33036a583658L36591r5453k93399j69068K5745K02165L61519L04948m4500k90931
33026a246041q7867K38039J59970j88171k49916L0302J82903L6096q2021J2156
33016a194550R1280q147j25320j12624n5066m3808k4742N0211J37323J84859J48102
33005i52482p710j82330j76879o559N4994p4703r8035J53392L66400K36526l0301
32994g17687j01985p6820j95522k95439q2816K64701L12581N5096j21850p5254
32984a034995k9377j16664k12235j97519o2981J70196L63397K77881m3656j85060
32974a071013K5564J58077j31427m47694k60507J93794L01030Q6388P2610K87554
32964g85624K42827j19398k85079q4057K9215j77920l04530n8313K14475J26605
$$ y = [-1583658, -1247067, -1342520, -1635919, -1804987, -1779242, -1577077, -1215558, -910610, -955110, -1246041, -1333908, -1095869, -935899, -1124070, -1373986, -1343684, -1160781, -1124685, -1206706, -1194550, -1103270, -1111417, -1236737, -1349361, -1404427, -1448235, -1472977, -1422766, -1285443, -1100584, -952482, -960192, -1142522, -1319401, -1325960, -1270966, -1345669, -1443704, -1290312, -923912, -687386, -717687, -819672, -896492, -1092014, -1387453, -1470269, -1205568, -892987, -837891, -959741, -1034995, -1064372, -1181036, -1393271, -1590790, -1653771, -1483575, -1120178, -842297, -885953, -1071013, -1045449, -887372, -1018799, -1466493, -1727000, -1533206, -1232176, -1145788, -1073178, -785624, -542797, -662195, -947274, -1031331, -1002116, -1180036, -1484566, -1542879, -1328404, -1201799]
32954a201799j17788j00403J62539L37245K92679J71867R8196O5405L3228k2102
32944b80933r4034j33365j24100j35014j82275j41983L0689J33828Q84j92352
32934a118655j70618L4170K02743K84600L15181J79273j51748l40997j01102K70733
32924e96420K65673o1879k22181q5006L2787J7685Q1342K17402J56910n6130n2196
32913c02013J77477J79671k00483n26537m50281j56863Q0411K62374L54015J58618
32903d23611k11488k65535J26032M14567J69928k70757l70988j80199o8346m2720
32893a123117J19696L03505J85789j65239l26206j49692N7895L9933p2923l6707
32883a167066J36281K21891R0811j29774j97432l7088J63802J95186Q4883l257
$$ y = [-1201799, -1319587, -1419990, -1257451, -920206, -627527, -455660, -357464, -292059, -258831, -280933, -374967, -508332, -632432, -767446, -949721, -1091704, -1061015, -927187, -926303, -1118655, -1289273, -1255103, -1052360, -767760, -452579, -273306, -425054, -766051, -867153, -596420, -330747, -392626, -614807, -699813, -667026, -649341, -567999, -350597, -193687, -249817, -302013, -124536, 55135, -145348, -671885, -1122166, -1279029, -1198618, -936244, -582229, -423611, -635099, -900634, -774602, -360035, -190107, -460864, -831852, -1012051, -1080397, -1123117, -1003421, -699916, -514127, -679366, -1005572, -1155264, -1097369, -1057436, -1130359, -1167066, -1030785, -808894, -718083, -847857, -1045289, -1082377, -918575, -723389, -638506, -641763]
32873f41763m0678j00994j31642l1785P7424j9537k26398k11726N0341J98323
32863a078435O0306q3719m810J02162J9249p5188O4919K80317K47732R912j19050
32852e76605o4662l4973j01217r6279L6093J08298Q421r3328p447J69223J85909
32841d66567L832j45464q9837M1683J8108j38038j76453q181J40819P5022o0365
32830h05441p275J94518K59222P1019j66031k00251n08K46941L01295O9009k61887
32819b99389l72397j88789K6519O0322J5647L4557J8148j18089j70339K7443K29028
$$ y = [-641763, -682441, -783435, -915077, -946862, -869438, -888975, -1115373, -1327099, -1276758, -1078435, -1018129, -1101848, -1106658, -1004496, -985247, -1060435, -995516, -715199, -467467, -457555, -576605, -641267, -676240, -777457, -873736, -837643, -729345, -720924, -814252, -821699, -652476, -466567, -462735, -608199, -698036, -656353, -638245, -776283, -952736, -960917, -820098, -745076, -805441, -812716, -618198, -358976, -287957, -453988, -654239, -654747, -407806, -106511, -37502, -299389, -671786, -860575, -834056, -773734, -758087, -723530, -705382, -823471, -993810, -966367, -737339]
$$ [...]
##END NTUPLES=NMR SPECTRUM
##END=
