##TITLE=31Pdec_LR-746-R3-BZL
 CCl4, 24 sc
 6.4.2022
##JCAMPDX= 6.0         $$ Bruker NMR JCAMP-DX V2.0
##DATA TYPE= NMR SPECTRUM
##DATA CLASS= NTUPLES
##ORIGIN= UXNMR, Bruker Analytische Messtechnik GmbH
##OWNER= root
$$ XWIN-NMR		Version 3.5
$$ Wed Apr  6 14:30:21 2022 Russian Standard Time (UT+4h)  she@DPX200
##.OBSERVE FREQUENCY= 81.013821
##.OBSERVE NUCLEUS= ^31P
##.ACQUISITION MODE= SIMULTANEOUS
##.ACQUISITION SCHEME= undefined
##.AVERAGES= 24
##.DIGITISER RES= 16
##SPECTROMETER/DATA SYSTEM= spect
##.PULSE SEQUENCE= zgpg30
##.SOLVENT NAME= CDCl3
##.SHIFT REFERENCE= (INTERNAL, CDCl3, 0, 248.564)
##AUDIT TRAIL= $$ (NUMBER, WHEN, WHO, WHERE, WHAT)
$$ ##TITLE= Audit trail, XWIN-NMR		Version 3.5
$$ ##JCAMPDX= 5.01
$$ ##ORIGIN= Bruker BioSpin GmbH
$$ ##OWNER= she
$$ F:/spectra/data/she/nmr/P31/1/pdata/1/auditp.txt
$$ ##AUDIT TRAIL=  $$ (NUMBER, WHEN, WHO, WHERE, WHAT)
(   1,<2022-04-06 14:28:40.17 +0400>,<she>,<DPX200>,
      <created by zg, POWCHK disabled, PULCHK disabled
       configuration hash MD5:
       00 E9 B6 7A A2 85 ED C7 34 08 36 98 17 FE 4E 26
       data hash MD5: 32K
       78 70 93 C8 01 E1 59 83 EA 78 5F 45 D4 78 E2 04>)
(   2,<2022-04-06 14:28:43.14 +0400>,<she>,<DPX200>,
      <Start of raw data processing
       efp BC_mod = 2 LB = 1 FT_mod = 6 PKNL = 1 PHC0 = -9546.759 PHC1 = 81.2756 SI = 64K 
       data hash MD5: 64K
       9A A2 E8 8B 28 09 62 C1 0F 08 93 37 79 4D E0 E9>)
(   3,<2022-04-06 14:29:00.70 +0400>,<she>,<DPX200>,
      <pk PHC0 = -58.34375 PHC1 = 177.2001 
       data hash MD5: 64K
       09 5A 21 BB F7 06 56 38 2D CC 4C A3 82 37 0B 17>)
$$ ##END=
$$ 
$$ hash MD5
$$ FA 6F 71 BD 28 10 4D 9D 5A BD 0F BB 06 B2 32 E5
##$RELAX= 
##$RELAX= 
##$RELAX= 
##$RELAX= 
##$RELAX= 
##$RELAX= 
##$RELAX= 
##$RELAX= 
$$ Bruker specific parameters
$$ --------------------------
##$DU= <F:/spectra>
##$EXPNO= 1
##$NAME= <P31>
##$PROCNO= 1
##$TYPE= <nmr>
##$USER= <she>
##$AMP= (0..31)
100 100 100 100 100 100 100 100 100 100 100 100 100 100 100 100 100 100 
100 100 100 100 100 100 100 100 100 100 100 100 100 100 
##$AQSEQ= 0
##$AQ_mod= 1
##$AUNM= <au_zg>
##$AUTOPOS= <>
##$BF1= 81.014009
##$BF2= 200.13
##$BF3= 200.13
##$BF4= 200.13
##$BF5= 200.13
##$BF6= 200.13
##$BF7= 200.13
##$BF8= 200.13
##$BYTORDA= 1
##$CFDGTYP= 0
##$CFRGTYP= 5
##$CHEMSTR= <none>
##$CNST= (0..31)
1 1 145 1 1 1 1 1 1 1 1 1 1 1 1 1 1 1 1 1 1 1 1 1 1 1 1 1 1 1 1 1 
##$CPDPRG= <waltz16>
##$CPDPRG1= <>
##$CPDPRG2= <waltz16>
##$CPDPRG3= <>
##$CPDPRG4= <mlev>
##$CPDPRG5= <mlev>
##$CPDPRG6= <mlev>
##$CPDPRG7= <mlev>
##$CPDPRG8= <mlev>
##$CPDPRGB= <>
##$CPDPRGT= <>
##$D= (0..31)
0 1 0 0 0 0 0 0 0 0 0 0.03 2e-05 3e-06 0 0 0 0 0 0 0 0 0 0 0 0 0 0 0 0 
0 0 
##$DATE= 1649240919
##$DBL= (0..7)
120 120 120 11 120 120 24 19 
##$DBP= (0..7)
150 150 150 150 150 150 150 150 
##$DBP07= 0
##$DBPNAM0= <>
##$DBPNAM1= <>
##$DBPNAM2= <>
##$DBPNAM3= <>
##$DBPNAM4= <>
##$DBPNAM5= <>
##$DBPNAM6= <>
##$DBPNAM7= <>
##$DBPOAL= (0..7)
0.5 0.5 0.5 0.5 0.5 0.5 0.5 0.5 
##$DBPOFFS= (0..7)
$$ [...]
##$SUBNAM2= <"">
##$SUBNAM3= <"">
##$SUBNAM4= <"">
##$SUBNAM5= <"">
##$SUBNAM6= <"">
##$SUBNAM7= <"">
##$SUBNAM8= <"">
##$SUBNAM9= <"">
##$SW= 501.771253377433
##$SWIBOX= (0..15)
0 1 3 0 0 0 0 0 0 0 0 0 0 0 0 0 
##$SW_h= 40650.406504065
##$TD= 32768
##$TD0= 1
##$TE= 0
##$TE2= 300
##$TE3= 300
##$TEG= 300
##$TL= (0..7)
0 120 53 12 22 120 120 120 
##$TP= (0..7)
150 150 150 150 150 150 150 150 
##$TP07= 0
##$TPNAME0= <>
##$TPNAME1= <>
##$TPNAME2= <>
##$TPNAME3= <>
##$TPNAME4= <>
##$TPNAME5= <>
##$TPNAME6= <>
##$TPNAME7= <>
##$TPOAL= (0..7)
0.5 0.5 0.5 0.5 0.5 0.5 0.5 0.5 
##$TPOFFS= (0..7)
0 0 0 0 0 0 0 0 
##$TUNHIN= 0
##$TUNHOUT= 0
##$TUNXOUT= 0
##$USERA1= <user>
##$USERA2= <user>
##$USERA3= <user>
##$USERA4= <user>
##$USERA5= <user>
##$V9= 5
##$VALIST= <valist>
##$VCLIST= <CCCCCCCCCCCCCCC>
##$VD= 0
##$VDLIST= <DDDDDDDDDDDDDDD>
##$VPLIST= <PPPPPPPPPPPPPPP>
##$VTLIST= <TTTTTTTTTTTTTTT>
##$WBST= 1024
##$WBSW= 4
##$XGAIN= (0..3)
0 0 0 0 
##$XL= 0
##$YL= 0
##$YMAX_a= 2425
##$YMIN_a= -4294
##$ZGOPTNS= <>
##$ZL1= 120
##$ZL2= 120
##$ZL3= 120
##$ZL4= 120
##$ABSF1= 0
##$ABSF2= 0
##$ABSG= 0
##$ABSL= 0
##$ALPHA= 0
##$AQORDER= 0
##$ASSFAC= 0
##$ASSFACI= 0
##$ASSFACX= 0
##$ASSWID= 0
##$AUNMP= <proc_1d>
##$AZFE= 0.1
##$AZFW= 0.5
##$BCFW= 0
##$BC_mod= 2
##$BYTORDP= 0
##$COROFFS= 0
##$CY= -3
##$DATMOD= 1
##$DC= 0
##$DFILT= <>
##$DTYPP= 0
##$F1P= 0
##$F2P= 0
##$FCOR= 1
##$FTSIZE= 65536
##$FT_mod= 6
##$GAMMA= 0
##$GB= 0
##$INTBC= 1
##$INTSCL= 5.30512e-09
##$ISEN= 30
##$LB= 1
##$LEV0= 0
##$LPBIN= 0
##$MAXI= 10000
##$MC2= 0
##$MEAN= 0
##$ME_mod= 0
##$MI= 50
##$NCOEF= 0
##$NC_proc= -8
##$NLEV= 6
##$NOISF1= 182.463
##$NOISF2= 159.3651
##$NSP= 0
##$NTH_PI= 0
##$NZP= 0
##$OFFSET= 248.5645
##$PC= 4
##$PHC0= -9605.103
##$PHC1= 258.4757
##$PH_mod= 1
##$PKNL= yes
##$PPARMOD= 0
##$PSCAL= 0
##$PSIGN= 0
##$REVERSE= no
##$SF= 81.014009
##$SI= 65536
##$SIGF1= 159.3651
##$SIGF2= -187.1042
##$SINO= 113.3802
##$SIOLD= 16384
##$SREGLST= <1H.CDCl3>
##$SSB= 0
##$STSI= 65536
##$STSR= 0
##$SW_p= 40650.406504065
##$SYMM= 0
##$S_DEV= 0
##$TDeff= 32768
##$TDoff= 0
##$TI= <>
##$TILT= no
##$TM1= 0
##$TM2= 0
##$TOPLEV= 0
##$USERP1= <user>
##$USERP2= <user>
##$USERP3= <user>
##$USERP4= <user>
##$USERP5= <user>
##$WDW= 1
##$XDIM= 65536
##$YMAX_p= 394300407
##$YMIN_p= -50292122
$$ End of Bruker specific parameters
$$ ---------------------------------
##NTUPLES= NMR SPECTRUM
##VAR_NAME=  FREQUENCY,     SPECTRUM/REAL,   SPECTRUM/IMAG
##SYMBOL=    X,             R,               I
##VAR_TYPE=  INDEPENDENT,   DEPENDENT,       DEPENDENT
##VAR_FORM=  AFFN,          ASDF,            ASDF
##VAR_DIM=   65536,         65536,           65536
##UNITS=     HZ,            ARBITRARY UNITS, ARBITRARY UNITS
##FACTOR=    0.620285442955139, 1,           1
##FIRST=     20137.2065510759, 0,            0
##LAST=      -20513.1999529892, 0,           0
##MIN=       -20513.1999529892, -50292122,   0
##MAX=       20137.2065510759, 394300407,    0
$$ Real data points
##PAGE= N=1
##DATA TABLE= (X++(R..R)), XYDATA
$$ [...]
35481C3758758l185036n119596k477194N19589O79417r13073j658246q62325J56378
$$ 33758758 30573722 25454126 22976932 23496521 24175938 23262865 21604619 20742294 20898672
35472B0898672J52994m16261J5765J611896K078129l12066l416209l558323r78290
$$ 20898672 21051666 20635405 20651170 22263066 24341195 24029129 20612920 17054597 16076307
35463A6076307L69432r23193j482012J028503L629702K670007k18357o63741J781684
$$ 16076307 16445739 15522546 14040534 15069037 18698739 21368746 21150389 20486648 22268332
35454B2268332L475244K269756l38241k183416k308664l00734L001624M535582
$$ 22268332 25743576 28013332 27675091 25491675 23183011 22882277 25883901 30419483
35446C0419483K239257r96682m74226L185672M577772J925874k18700J183490
$$ 30419483 32658740 31662058 31187832 34373504 38951276 40877150 40658450 41841940
35438D1841940K491542J4726k851106q36435L856718M189685n78033l262129M13629
$$ 41841940 44333482 44348208 41497102 40660667 44517385 48707070 48129037 44866908 45280537
35429D5280537N411510M853383o33932m938169m853109k361667j76070R96124
$$ 45280537 50692047 55545430 54911498 49973329 45120220 42758553 42582483 43578607
35421D3578607J038620l55784k384889l297300k638341j835434j937641k040545
$$ 43578607 44617227 44261443 41876554 38579254 35940913 34105479 32167838 30127293
35413C0127293p58106J525500K757876J509204j259480k958483j994315M89699
$$ 30127293 29369187 30894687 33652563 35161767 33902287 30943804 28949489 29439188
35405B9439188J720409N6104l483692o048197n104466o65886L888003M345071
$$ 29439188 31159597 31215701 27732009 21683812 16579346 15913460 19801463 24146534
35397B4146534L48429l570503l401625p03610L94772k73366M15302K221581J088674
$$ 24146534 24494963 20924460 17522835 16819225 17213997 16940631 17355933 19577514 20666188
35388B0666188l216888m691589J57126N837412M995399j241117n363369l916174
$$ 20666188 17449300 12757711 12914837 18752249 23747648 22506531 17143162 13226988
35380A3226988m30836J136125O57853n68077j906946k384384j212481K32725O4414
$$ 13226988 12796152 13932277 14590130 14022053 12115107 9730723 8518242 8750967 8815381
35371H815381o85902L31388K278381K203185K50709o31875p0071m54635j606504
$$ 8815381 8129479 8460867 10739248 12942433 13193142 12561267 12491196 12036561 10430057
35362A0430057p68765J346790O86877k371659k233327J948598K850018l334507
$$ 10430057 9661292 11008082 11694959 9323300 7089973 9038571 11888589 8554082
35354H554082q626050m221394N275417P697005R68132m655562k194483L357583
$$ 8554082 -71968 -4293362 982055 8679060 9647192 4991630 2797147 6154730
35346F154730M568068J893939j42023j138906l285417n175315l273245J595922
$$ 6154730 10722798 12616737 12474714 11335808 8050391 2875076 -398169 1197753
35338A197753M423078K918291R5719r13437r64033k004111l061363j994919L97163
$$ 1197753 5620831 8539122 8634841 7721404 6757371 4753260 1691897 -303022 94141
35329I4141J288592L88854K21416J293408O55664k661680m254840k62294N565280
$$ 94141 1382733 1771587 1993003 3286411 3942075 1280395 -2974445 -3236739 2328541
35320B328541N794040j80870m947236l468747O34415J691944l1687q63473k96845
$$ 2328541 8122581 7941711 2994475 -474272 160143 1852087 1820400 956927 660082
35311F60082j79800k7444J665632L131370J609657j099722q05625J775630J730917
$$ 660082 480282 452838 2118470 5249840 6859497 5759775 4954150 6729780 8460697
35302H460697j602680l181219r55856M25848k039689l822794n32981L569722J687858
$$ 8460697 6858017 3676798 2720942 3146790 1107101 -2715693 -3248674 321048 2008906
35293B008906l939872m486800K043840P675628O346874J848884L83199J150103
$$ 2008906 -1930966 -6417766 -4373926 3301702 9648576 11497460 11880659 13030762
35285A3030762l35791l512394l681983k70541J735351p02517m297173m317184
$$ 13030762 12694971 9182577 5500594 5230053 6965404 6262887 1965714 -2351470
35277b351470p73662K300046K093239r1480p09977J733920M254198K453693l122281
$$ -2351470 -3125132 -825086 1268153 1176673 466696 2200616 6454814 8908507 5786226
35268E786226o160279k748246K261645J674385l141107m230836K35348K985238
$$ 5786226 -374053 -3122299 -860654 813731 -2327376 -6558212 -6322864 -3337626
35260c337626l01580l865962j690517K548213K329400l87556P68746M682257M366386
$$ -3337626 -3639206 -7505168 -9195685 -6647472 -4318072 -4705628 -3936882 745375 5111761
35251E111761p36892l526424j086569J154195n31065k199524k26362J837478l35137
$$ 5111761 4374869 848445 -238124 916071 385006 -1814518 -2040880 -203402 -538539
35242e38539l854953k851993K439887O098092M485430j83458l481580l277518
$$ -538539 -4393492 -7245485 -4805598 1292494 5777924 5594466 2112886 -1164632
35234a164632j061335k0928j119482j528901R52903L346381J609834j738163l50791
$$ -1164632 -2225967 -2246895 -3366377 -4895278 -3942375 -595994 1013840 -724323 -1075114
35225a075114N192682O757582J106469m612705l943218m83934n18775k672080
$$ -1075114 4117568 10875150 11981619 7368914 3425696 2941762 2422987 -249093
35217b49093j970938O54056N74879k041875l134537j863024m08355J120040L419754
$$ -249093 -2220031 -1565975 -991096 -3032971 -6167508 -8030532 -8438887 -7318847 -3899093
35208c899093M015250Q90063k254747j001102J886243P41051l027748l288736
$$ -3899093 116157 1006220 -1248527 -2249629 -363386 377665 -2650083 -5938819
35200e938819j3998J012269j074612q63685L029977N150950K707919l23321j102802
$$ -5938819 -5952817 -4940548 -6015160 -6878845 -3848868 1302082 4010001 3686680 2583878
35191B583878j969239l584745k084201K849703M731709L04707m013989j813959
$$ 2583878 614639 -2970106 -5054307 -2204604 2527105 2831812 -1182177 -2996136
35183b996136L058543K911197j659114l695917j265421Q28234Q7562n5003K797492
$$ -2996136 62407 2973604 1314490 -2381427 -3646848 -2818614 -2731052 -2786055 11437
35174A1437M946634J827237m468606o621492j289854N702223N893727p38901n166075
$$ 11437 4958071 6785308 2316702 -4304790 -5594644 107579 6001306 5262405 96330
35165I6330j522388M573535M446385p83446k861887J74499J975291l82543j864576
$$ 96330 -1426058 3147477 7593862 6810416 3948529 4123028 6098319 5715776 3851200
35156C851200N68193K207722n81137l456976j809022J214045R15881l96846J613449
$$ 3851200 4419393 6627115 6045978 2589002 779980 1994025 2909906 2513060 4126509
35147D126509M382182K450980k656239m506716j971406J20669k97875k55979J677040
$$ 4126509 8508691 10959671 8303432 3796716 1825310 1945979 1648104 1392125 3069165
35138C069165K865905J545603p72784k504642l364127k566996R0409J806115M2423
$$ 3069165 5935070 7480673 6707889 4203247 839120 -1727876 -1637467 168648 211071
35129B11071k346906n10471M092161M747483k74602m675655l549680k02254k5537
$$ 211071 -2135835 -2646306 1445855 6193338 5918736 1243081 -2306599 -2508853 -2534390
35120b534390k145199j842680J406910L243969J173698k035963k622661q03609
$$ -2534390 -4679589 -6522269 -5115359 -1871390 -697692 -2733655 -5356316 -6159925
35112f159925L44701k30171j77370K123142M204530K696854j179160k717502n53416
$$ -6159925 -5815224 -6045395 -6222765 -4099623 104907 2801761 1622601 -1094901 -1648317
35103a648317J451157M93895j046887l27149R97580K31837j108658L6055K545995
$$ -1648317 -197160 296735 -750152 -1077301 -79721 152116 -956542 -920487 1625508
35094A625508K640010k45694l216584m315068l371243j51172M141506N341821
$$ 1625508 4265518 4019824 803240 -3511828 -6883071 -7034243 -2892737 2449084
35086B449084J218697l552514k692350K385328M350468O78972l450026l510462
$$ 2449084 3667781 115267 -2577083 -191755 4158713 4837685 1387659 -2122803
35078b122803j026667O66984P90582l33991k440484l579430j485990K296952L864978
$$ -2122803 -3149470 -2482486 -1691904 -2025895 -4466379 -8045809 -9531799 -7234847 -3369869
35069c369869K846818K030920J311412j690023m679202k219164L920365M571034
$$ -3369869 -523051 1507869 2819281 1129258 -3549944 -5769108 -1848743 2722291
35061B722291k744505q122721l778138L581641L185504l006888m006030K776505
$$ 2722291 -22214 -8144935 -11923073 -8341432 -5155928 -8162816 -12168846 -9392341
35053i392341Q215355N754352n7797j803318P73626K512307M78442l360238n141008
$$ -9392341 -1176986 4577366 4519569 2716251 3489877 6002184 6480626 3120388 -2020620
35044b020620l029817Q82716K522768P33963r81568N34234L239868L012158n6982
$$ -2020620 -5050437 -4167721 -1644953 -910990 -1892558 -1358324 1881544 4893702 4836720
35035D836720k212345j837971p70827l13088J87204Q21058P37517L37661O68611
$$ 4836720 2624375 786404 15577 -297511 -110307 710751 1448268 1785929 2454540
35026B454540R40636l7860o49689J308999L781152K585905j558219l396481j367818
$$ 2454540 3395176 3357316 2707627 4016626 7797778 10383683 8825464 5428983 4061165
35017D061165P9943j763363l444164j726889Q22147Q09124P5628J629607L019567
$$ 4061165 4141108 2377745 -1066419 -2793308 -1971161 -1162037 -1086409 543198 3562765
35008C562765j04963n670769o828849j947789K807251K289197j030329j699353
$$ 3562765 3457802 -2212967 -9041816 -10989605 -8182354 -5893157 -6923486 -8622839
35000h622839J004240L097905J860391r83617j803435O30010L601809L315259
$$ -8622839 -7618599 -4520694 -2660303 -3643920 -5447355 -4817345 -1215536 2099723
34992B099723k79546k579314o0277M088853L365391k811734p285298m540610J755475
$$ 2099723 1820177 -759137 -819414 3269439 6634830 3823096 -3462202 -8002812 -6247337
34983f247337M068101J240991j133703L84629K735737J886864j344479l199834
$$ -6247337 -2179236 -938245 -2071948 -1687319 1048418 2935282 1590803 -1609031
34975a609031k106877L76776K118718K034625M00381r79135j97651J898522K002138
$$ -1609031 -3715908 -3339132 -1220414 814211 1214592 235457 37806 1936328 3938466
34966C938466q90193l037819q23541L549124M503000N50546m063027n223589l165546
$$ 3938466 3048273 10454 -813087 2736037 7239037 7789583 3726556 -1497033 -4662579
34957d662579k52873K097410K871032R58003k451284l304807N39406N287036N067073
$$ -4662579 -4915452 -2818042 52990 1010993 -1440291 -4745098 -4205692 1081344 6148417
34948F148417m23137n082888m025214M50729K388963J61286j949669m51498K055799
$$ 6148417 5725280 642392 -3382822 -2932093 -543130 -381844 -2331513 -2783011 -727212
34939g27212Q16407l468646m967090j214671K905755K299920p85786o89863K519237
$$ -727212 89195 -3379451 -8346541 -9561212 -6655457 -4355537 -5141323 -5831186 -3311949
34930c311949L531383R94574q8763K964640N255701J667384m724620o674106k917113
$$ -3311949 219434 1214008 1125245 4089885 9345586 11012970 6288350 -385756 -3302869
34921c302869Q62640N73958j536956j496338P85441K346799J504355m39367j088697
$$ -3302869 -2440229 -1866271 -3403227 -4899565 -4114124 -1767325 -262970 -702337 -1791034
34912a791034M03600K502896L072704J923760P27007K21629p79920k655048l313626
$$ -1791034 -1387434 1115462 4188166 6111926 6838933 7060562 6280642 3625594 311968
34903C11968j246028J472380J757598j08214j406058j300057j109088q72342P23729
$$ 311968 -934060 538320 2295918 2187704 781646 -518411 -1627499 -2499841 -1776112
34894a776112K753122K122941j540007m337145l237789p5889J649438J593898
$$ -1776112 977010 3099951 1559944 -2777201 -6014990 -6090879 -4441441 -2847543
34886b847543J688645K271038J978253N74485p92967j734530k567864k368405
$$ -2847543 -1158898 1112140 3090393 3664878 2871911 1137381 -1430483 -3798888
34878c798888K54045L979991M976922J591394l054330m739166k972754m21737
$$ -3798888 -3544843 435148 5412070 7003464 3949134 -790032 -3762786 -4184523
34870d184523J152482J955736J847122K5886k379345k354029O62823K893349J168451
$$ -4184523 -3032041 -1076305 770817 796703 -1582642 -3936671 -3273848 -380499 787952
34861G87952k079117k055050J160232K638451K34335k076844n80219K103589R89645
$$ 787952 -1291165 -3346215 -2185983 452468 686803 -1390041 -1970260 133329 1122974
34852A122974l319493n102620j832961K160659K009074q66915j238844K092233
$$ 1122974 -2196519 -7299139 -9132100 -6971441 -4962367 -5829282 -7068126 -4975893
34844d975893M561098K549756j323744k021367P04480K410811R37998p24974Q6668
$$ -4975893 -414795 2134961 811217 -1210150 -505670 1905141 2843139 2118165 2204833
34835B204833J273426j1913k062053j478293P87997J021994q71263j728787j264128
$$ 2204833 3478259 3466346 1404293 -74000 713997 1735991 864728 -864059 -2128187
34826b128187k090555l429693j265126L738688N255955J163616k290917m62623
$$ -2128187 -4218742 -7648435 -8913561 -5174873 81082 1244698 -1046219 -1508842
34818a508842K010055n80360m745754l316923K607987N444894K880477j74513
$$ -1508842 501213 -79147 -4824901 -8141824 -5533837 -88943 2791534 2617021
34810B617021p41144j159867k690390k748311k57200J923944J750757N92687j11352
$$ 2617021 1875877 716010 -1974380 -4722691 -4979891 -3055947 -1305190 -712503 -823855
34801h23855n20649j01518J877028L259534J210022k400087l120243j399634j687399
$$ -823855 -1344504 -1446022 431006 3690540 4900562 2500475 -619768 -2019402 -3706801
34792c706801l752782k350719K867388N163096J661622j398559Q99275L820220
$$ -3706801 -7459583 -9810302 -6942914 -1779818 -118196 -1516755 -617480 3202740
34784C202740J329816l415552l360175J059929L492695J898545j09186o67449
$$ 3202740 4532556 1117004 -2243171 -1183242 2309453 4207998 4098812 3431363
34776C431363j624120l370478l456758r51674J920929K855199J417695j347579
$$ 3431363 1807243 -1563235 -5019993 -5971667 -4050738 -1195539 222156 -1125423
34768a125423k947639q89627L363999M493560L96780l990602l599018l61117J068296
$$ -1125423 -4073062 -4962689 -1598690 2894870 3291650 -698952 -4297970 -4659087 -3590791
34759c590791Q97264J783393K316541k50788l309736k260947J176249J566158
$$ -3590791 -2693527 -910134 1406407 1155619 -2154117 -4415064 -3238815 -1672657
34751a672657o31191j50815K950387K972816r65338k927556m33065J728471N52988
$$ -1672657 -2303848 -2454663 495724 3468540 2503202 -424354 -857419 871052 1424040
34742A424040n44229N28367K53185k867350m171594j241199J035633o12104j315357
$$ 1424040 879811 1408178 1661363 -1205987 -5377581 -6618780 -5583147 -6195251 -7510608
34733g510608K771290N949658K000129m259804m000017J450768L615581J053322
$$ -7510608 -4739318 1210340 3210469 -1049335 -5049352 -3598584 16997 1070319
34725A070319j79411J152247j57301m363077m636860R26931M970644K635727j011504
$$ 1070319 890908 2043155 1885854 -2477223 -7114083 -6187152 -1216508 1419219 407715
34716D07715l32594J898344Q82717j532760j408856m26363j682274k323040J499480
$$ 407715 75121 1973465 2856182 1323422 -85434 -511797 -2194071 -4517111 -3017631
34707c017631N668193L099875l861262n474617M57254M978992J996893k740732
$$ -3017631 2650562 5750437 1889175 -3585442 -3128188 1850804 3847697 1106965
34699A106965j676823K578283K232982l096157o296324l641331R55692K783789
$$ 1106965 -569858 2008425 4241407 1145250 -5151074 -8792405 -7836713 -5052924
34691e052924J930131P70698J22364k61557k41332M8714N7010J89051J338021
$$ -5052924 -3122793 -2352095 -2229731 -2491288 -2732620 -2683906 -2626896 -2437845 -1099824
34682a099824K546178J544649j558425l586356k474420R0075J514647J608354
$$ -1099824 1446354 2991003 1432578 -2153778 -4628198 -4538123 -3023476 -1415122
34674a415122J467442J087747L6622r88372j115881o73618j87087O31800J547464
$$ -1415122 52320 1140067 1176689 188317 -927564 -1601182 -1788269 -1156469 390995
34665C90995J150172q02432k168093j484600m19492q62111j482248j49803J835681
$$ 390995 1541167 738735 -1429358 -2913958 -3333450 -4195561 -5677809 -5827612 -3991931
34656c991931J558355l90996n59852J666982K945166J294425j042068j406869
$$ -3991931 -2433576 -2824572 -3384424 -1717442 1227724 2522149 1480081 73212
34648G3212l14517M29822N29100K16176j182166l447615m061629j176116L011742
$$ 73212 -241305 188517 717617 933793 -248373 -3695988 -7757617 -8933733 -5921991
34639e921991M372653K079957m98380m96303Q38653M81782j628257k297561O8157
$$ -5921991 -1549338 530619 32239 -464064 374589 856371 -771886 -3069447 -3001290
34630c001290K331442M46484m388842o317042k244792M082618P038829N626362
$$ -3001290 -669848 -223364 -4612206 -10929248 -13174040 -9091422 -2052593 3573769
34622C573769K738316K88659j679683k655069k124330j597374k640167l480280
$$ 3573769 6312085 6600744 4921061 2265992 141662 -1455712 -4095879 -7576159
34614g576159j317352K333124K856984m54817k908609j174530K349182L687110
$$ -7576159 -8893511 -6560387 -3703403 -4158220 -7066829 -8241359 -5892177 -2205067
34606b205067K382691M68334p14821p19952M04987J106957m18395k627966j586267
$$ -2205067 177624 645958 -68863 -788815 -383828 723129 304734 -2323232 -3909499
34597c909499K718299M811604J302497l554203l687770J40500K005917l67919
$$ -3909499 -1191200 3620404 4922901 1368698 -2319072 -2178572 -172655 -540574
34589e40574l027235j933920K041293N025596M542712J277682j917672k381764
$$ -540574 -3567809 -5501729 -3460436 1565160 6107872 7385554 5467882 3086118
34581C086118j52245J802079P25414k673969m778854k790120K197813N625042
$$ 3086118 2933873 4735952 5461366 2787397 -1991457 -4781577 -2583764 3041278
34573C041278L711999j840010m839829k192434J528745N45534l212020l225300
$$ 3041278 6753277 4913267 73438 -2118996 -590251 -44717 -3256737 -6482037
34565f482037O36192J697138j826205k961759K413456P807506N823285o88647
$$ -6482037 -5845845 -4148707 -5974912 -8936671 -6523215 1284291 7107576 6418929
34557F418929m105913l488453k890174k389681O81638M192583L493498j19694
$$ 6418929 2313016 -1175437 -4065611 -6455292 -5773654 -1581071 1912427 1792733
34549A792733j347660l00653j630526m676737l417885K713218O623705M352530
$$ 1792733 445073 144420 -1486106 -6162843 -9580728 -6867510 -243805 4108725
34541D108725J82814j608467k423295l572357k409987J533987L424559R58702
$$ 4108725 4291539 2683072 259777 -3312580 -5722567 -4188580 -764021 194681
34533A94681q61431J977627N232621L392647j152957k619401j422578k010150
$$ 194681 -666750 1310877 6543498 9936145 8783188 6163787 4741209 2731059
34525B731059l854099k214848L003149O123556M005847j07847k120252j895151
$$ 2731059 -1123040 -3337888 -334739 5788817 9794664 9686817 7566565 5671414
34517E671414j233232p39891l05803j85761l63226m80692q07448j731640k377772
$$ 5671414 4438182 3698291 3392488 3206727 2843501 2362809 1555361 -176279 -2554051
34508b554051j499370K98316R70665j90939j623365j570279j49409Q77479J55920
$$ -2554051 -4053421 -3755105 -2784440 -2975379 -4598744 -6169023 -6318432 -5440953 -5285033
34499e285033j297357p35574K590456N248584L579555p29344k494122n45412R99472
$$ -5285033 -6582390 -7317964 -4727508 521076 4100631 3371287 877165 331753 1331225
34490A331225K8812k33727K117077L048246p61550n072483l860533J019006K582330
$$ 1331225 1360037 1126310 3243387 6291633 5530083 457600 -3402933 -2383927 198403
34481A98403l54183j965059O21751K865997M60083l949499n002745k080483R16956
$$ 198403 -155780 -2120839 -1499088 1366909 1826992 -2122507 -7125252 -9205735 -8288779
34472h288779J356505M43992N34329J939161K912141K188922Q01264N46387R52635
$$ -8288779 -6932274 -6488282 -5953953 -4014792 -1102651 1086271 1887535 2433922 3386557
34463C386557k87867l226259m477110j831235K264293M040475K990684O97340
$$ 3386557 3098690 -127569 -4604679 -6435914 -4171621 -131146 2859538 3556878
34455C556878k262592m963271m424696L01010M420957K900855j681518k395612
$$ 3556878 1294286 -3668985 -8093681 -7792671 -3371714 -470859 -2152377 -4547989
34447d547989J536000L683283N46897l453698l304038l75298J028105P7883q87166
$$ -4547989 -3011989 671294 1218191 -2235507 -5539545 -5914843 -4886738 -4808855 -5696021
34438e696021l43125J352909K839558K190770j179872m220466k981055J507280
$$ -5696021 -6039146 -4686237 -1846679 344091 -835781 -5056247 -8037302 -6530022
34430f530022L919663K323507N97955J325553J553027j006416k708479Q5599L841844
$$ -6530022 -2610359 -286852 311103 1636656 3189683 2183267 -525212 -439613 3402231
34421C402231K631386k397924m561893j606240J877678K169420R72100Q64834
$$ 3402231 6033617 3635693 -926200 -2532440 -654762 1514658 2486758 3351592
34413C351592R00361q13521l244172l718598j572150J157359J893598k32598l410775
$$ 3351592 4251953 3438432 194260 -3524338 -5096488 -3939129 -2045531 -2278129 -5688904
34404e688904m369233j675281K402464M534772M171555L078995J948371J2870
$$ -5688904 -10058137 -11733418 -9330954 -4796182 -624627 2454368 4402739 4415609
34396D415609k238727k815768j223281O70404J380104J262089Q03441o5866l52120
$$ 4415609 2176882 -638886 -1862167 -1191763 188341 1450430 2253871 2188005 1835885
34387A835885J376625L540683K016907l587072p181208l440524M053594O380922
$$ 1835885 3212510 6753193 8770100 5183028 -1998180 -5438704 -1385110 4995812
34379D995812P38805o010908o375495j093158L191960K364728j746143m748181
$$ 4995812 5734617 -276291 -6651786 -7744944 -4552984 -2188256 -3934399 -8682580
34371h682580l902689J83246M073029M446968J952577O37603J969538K052277
$$ -8682580 -12585269 -12402023 -8328994 -3882026 -1929449 -1291846 677692 2729969
34363B729969k065385o132032l970380K578442N550144K703269M9346Q36242L01529
$$ 2729969 664584 -5467448 -9437828 -6859386 -1309242 1394027 1443373 2279615 2581144
34354B581144m291583o632422j573688M479243K762889l203349l142186K677216
$$ 2581144 -1710439 -8342861 -9916549 -5437306 -2674417 -5877766 -9019952 -6342736
34346f342736M081292j135935l176380K575148O961469K267590m768018m126387
$$ -6342736 -2261444 -3397379 -6573759 -3998611 2962858 5230448 462430 -3663957
34338c663957J640324L037787o63731k215818L29578J709776j41933j296786L0941
$$ -3663957 -2023633 1014154 350423 -1865395 -1535817 173959 32026 -1264760 -1233819
34329a233819P22974o16770j253378L7877J014704Q94284J553425K760922J852179
$$ -1233819 -510845 -1127615 -2380993 -2343116 -1328412 -434128 1119297 3880219 5732398
34320E732398q08772j777196r88653k146577n214668n139486m86706L220571K151197
$$ 5732398 4923626 3146430 2157777 11200 -5203468 -10342954 -10829660 -7609089 -5457892
34311e457892o3985O95079K182621R02515j136462n46133Q18279m75722k508314
$$ -5457892 -5521877 -4826798 -2644177 -1741662 -2878124 -3424257 -2605978 -3081700 -5590014
34302e590014j162693K233398K898371O19211o00347Q4153k09668j564672p35863
$$ -5590014 -6752707 -4519309 -1620938 -1001727 -1602074 -1517921 -1727589 -3292261 -4028124
34293d028124K161134K810675J63689j269784R60815K957441J168062j640721
$$ -4028124 -1866990 943685 1107374 -162410 798405 3755846 4923908 3283187
34285C283187j409637K72535o78164l512900l891222j121735J042649P10030K50411
$$ 3283187 1873550 2146085 1467921 -2044979 -5936201 -7057936 -6015287 -5305257 -5054846
34276e054846J628766L382624L655465K952389K233895J024874q28357j938576
$$ -5054846 -3426080 -43456 3612009 6564398 8798293 9823167 8994810 7056234
34268G056234j738227j792276k811299k745432l66398J573041J22797k678141
$$ 7056234 5318007 3525731 714432 -2031000 -2397398 -824357 -701560 -3379701
34260c379701k434078P17836K287433M60896j669381j695122r66193m42178J594556
$$ -3379701 -5813779 -5095943 -2808510 -2347614 -4016995 -5712117 -6678310 -7120488 -5525932
34251e525932M858808M883132k76866n130725l710627J515430L387993O21380
$$ -5525932 -667124 4216008 3939142 -1191583 -4902210 -3386780 1213 622593
34243F22593j615654o42305P79263O14320K90912J80320j572943m043476l310549
$$ 622593 -993061 -1635366 -856103 -241783 49129 229449 -1343494 -5386970 -8697519
34234h697519N53222K249167k26843k017040J8087J650514o40216k207771K095809
$$ -8697519 -8144297 -5895130 -6121973 -8139013 -8120926 -6470412 -7110628 -9318399 -7222590
34225g222590P761719O566774l49077m174990j831292J171907J259119J164100
$$ -7222590 539129 7105903 6756826 2581836 750544 1922451 3181570 4345670
34217D345670K083364J96385n297110q163672m149494J857371L061979M43121
$$ 4345670 6429034 6625419 1328309 -6835363 -10984857 -9127486 -6065507 -5622386
34209e622386n06645J015888J413101m2729l42653J559790L343662L538071K832247
$$ -5622386 -6129031 -5113143 -3700042 -3742771 -4085424 -2525634 818028 4356099 7188346
34200G188346J227612j998246n203618n140999j568410K073461L151901K077472
$$ 7188346 8415958 6417712 1214094 -3926905 -5495315 -3421854 -269953 1807519
34192A807519q3617k752717m133614k192511J556315K987285J439996P74772K442279
$$ 1807519 1723902 -1028815 -5162429 -7354940 -5798625 -2811340 -1371344 -596572 1845707
34183A845707K275348k231869n993693l187266L044008M377635m22390m009825
$$ 1845707 4121055 1889186 -4104507 -7291773 -4247765 129870 -292520 -4302345
34175d302345j755856K331393L164787J695315Q78215J12571j509901j088494
$$ -4302345 -6058201 -3726808 -562021 1133294 2011509 2124080 614179 -474315
34167d74315L100680O074196K382818m264536n029306Q79395M646009Q29206n198769
$$ -474315 2626365 8700561 11083379 6818843 1789537 2668932 7314941 8144147 2945378
34158B945378n818053j268741K774022L229927J098173j646679k814808n36376
$$ 2945378 -2872675 -4141416 -1367394 1862533 2960706 1314027 -1500781 -2037157
34150b037157L567415M614963J012077k552103k090389l84708j577358l669309
$$ -2037157 1530258 6145221 7157298 4605195 2514806 2130098 552740 -3116569
34142c116569k347357Q42633J089935q88851j39362L246927L972830J122553n8797
$$ -3116569 -5463926 -4621293 -3531358 -4420209 -4559571 -1312644 2660186 3782739 3723942
34133C723942K200576K642984j559386m995213k511856K369252L200435L01094
$$ 3723942 5924518 8567502 7008116 2012903 -498953 1870299 5070734 5371828
34125E371828j261434k12530M08372n59581j218553r05210j059862j980321k267908
$$ 5371828 4110394 3897864 4306236 3746655 2528102 1622892 563030 -1417291 -3685199
34116c685199j297987M14458K440800L649410J887722k656351n683810l766112
$$ -3685199 -4983186 -4568728 -2127928 1521482 3409204 752853 -4930957 -8697069
34108h697069P08603L144868L185628L239832K738395n16825m401886m151097
$$ -8697069 -7988466 -4843598 -1657970 1581862 4320257 3803432 -598454 -4749551
34100d749551j87197J899052K11594q83457R63504J716703j480252m178440j341397
$$ -4749551 -4936748 -3037696 -2826102 -3709559 -2746055 -1029352 -2509604 -6688044 -8029441
34091h029441L988124M759385K77040l454582k815472m13583M65225K73495O02977
$$ -8029441 -4041317 718068 995108 -2459474 -5274946 -5688529 -5223304 -4949809 -4346832
34082d346832J013667M82174n46647j301052j906663k039950k98788L331814N893765
$$ -4346832 -3333165 -2850991 -3397638 -4698690 -6605353 -8645303 -8944091 -5612277 281488
34073B81488M381288l88563m462775m994845k534886N33512K357843K338167R37160
$$ 281488 4662776 4274213 -188562 -5183407 -7718293 -7184781 -4826938 -2488771 -1551611
34064a551611m37997j30963K195371M663860M514861Q87821l700651n246197k318492
$$ -1551611 -1989608 -2120571 74800 4738660 9253521 10141342 6440691 1194494 -1123998
34055a123998J955382L006476J34521k690228k149022J16331O02939k30145J056955
$$ -1123998 831384 3837860 3972381 1282153 -866869 -750538 -147599 -377744 679211
34046F79211M248241M477590j70589m475938l255620Q33315J771065j74282J22517
$$ 679211 4927452 9405042 9234453 4758515 1502895 2336210 4107275 3932993 4055510
34037D055510K595190J277577m768585p786271k869487L586949L156018k056785
$$ 4055510 6650700 7928277 3159692 -4626579 -7496066 -3909117 -753099 -2809884
34029b809884l571903J00040K589621R79729m48761J197997K672862J024770j398402
$$ -2809884 -6381787 -6281747 -3692126 -2712397 -3161158 -1963161 709701 1734471 336069
34020C36069j619403o63445k26605P81930K848812L109153j00036l450222l451604
$$ 336069 -1283334 -1946779 -2173384 -1391454 1457358 4566511 4466475 1016253 -2435351
34011b435351j914596k195814k836965j18580M781857O567528L393958r29969
$$ -2435351 -4349947 -6545761 -9382726 -9501306 -4719449 1848079 5242037 4312068
34003D312068k476731j073083J508788L594034L512196P72633k295987k953652
$$ 4312068 1835337 762254 2271042 5865076 9377272 10149905 7853918 4900266
33995D900266j909632j614980j382489J398102N145181M486183j580876o883058
$$ 4900266 2990634 1375654 -6835 1391267 6536448 11022631 9441755 2558697
33987B558697o203068j986600M13625L81718P45653J853573J855885J178909J740195
$$ 2558697 -3644371 -5630971 -5217346 -4835628 -4089975 -2236402 -380517 798392 2538587
33978B538587K399623J09244m115299n133278j034788L528105L677127P47724
$$ 2538587 4938210 5047454 932155 -4201123 -5235911 -1707806 1969321 2717045
33970B717045n47448Q68165J774608K22402j654690j184377Q51674J404527o83297
$$ 2717045 2169597 3037762 4812370 5034772 3380082 2195705 3047379 4451906 3768609
33961C768609l340457m022161k446998p9900J879322K818450K058874q1518r69608
$$ 3768609 428152 -3594009 -6041007 -6120907 -4241585 -1423135 635739 554221 -415387
33952d15387J801580N882721N395462j200462p429613o472771l75260K959179
$$ -415387 1386193 7268914 12664376 11463914 4034301 -2438470 -2813730 145449
33944A45449R58435r42921J339825M193375K480518k261140m326406k200384K42084
$$ 145449 1103884 160963 1500788 5694163 8174681 5913541 1587135 -613249 -371165
33935c71165J48605r11934n12639R72466J713273J472463J712280L220872M605942
$$ -371165 -222560 -1134494 -1647133 -674667 1038606 2511069 4223349 7444221 12050163
33926A2050163L556531k22679l939937m777337l604426l531632m772691m068620
$$ 12050163 15606694 15384015 11444078 6666741 3062315 -469317 -5242008 -9310628
33918i310628l28553K681820J695367j147545j893033n23913N45293J174418K342740
$$ -9310628 -9639181 -6957361 -5261994 -6409539 -8302572 -8826485 -8281192 -7106774 -4764034
33909d764034K424309l57107l223793k008120J871406L311461J899268K006478
$$ -4764034 -2339725 -2696832 -5920625 -7928745 -6057339 -2745878 -846610 1159868
33901A159868M210862L706641q96744m128602k174705J351325J967722R29287
$$ 1159868 5370730 9077371 8180627 4052025 1877320 3228645 5196367 6125654
33893F125654Q54529J66082k747268m455818j655744K141729J412426k468005
$$ 6125654 6980183 7146265 4398997 -56821 -1712565 429164 1841590 -626415
33885f26415l488841n18707J742994O81670j171477j174100K27804J772371K864607
$$ -626415 -4115256 -4633963 -2890969 -2209299 -3380776 -4554876 -4327072 -2554701 309906
33876C09906K622087Q37051n14446M1369L87470j912397m683680l875930p4985
$$ 309906 2931993 3769044 3254598 3295967 3683437 1771040 -2912640 -6788570 -6863555
33867f863555K488285K602591K707366L359472K429216J1786j048901j99487K2758
$$ -6863555 -4375270 -1772679 934687 4294159 6723375 6735161 5686260 5486773 5509531
33858E509531j133410j591376q62657p89110j233957P8580K529027K383819j074020
$$ 5509531 4376121 2784745 1922088 1132978 -100979 -22399 2506628 4890447 3816427
33849C816427l839158k984036J07791L213795N429432N166386J120996l734401
$$ 3816427 -22731 -3006767 -2898976 314819 5744251 10910637 12031633 8297232
33841H297232m387252j134960O89326p90134j949566j194470j336761k484720
$$ 8297232 3909980 2775020 3464346 2674212 724646 -469824 -1806585 -4291305
33833d291305m81129M289537M741208j465845o178602k635750L955776M929099
$$ -4291305 -4772434 -482897 4258311 2792466 -3386136 -6021886 -2066110 2862989
33825B862989J129050o98330L81465M5495k214362k919717j681512j114025j043905
$$ 2862989 3992039 3293709 3675174 3720669 1506307 -1413410 -3094922 -4208947 -5252852
33816e252852O78992K935071K897991J381224J065122J276152K5458j161895k85707
$$ -5252852 -4573860 -1638789 1259202 2640426 3705548 4981700 5007158 3845263 3559556
33807C559556J04956k582329m531310j114834L837577L008938k097882l253835
$$ 3559556 3664512 1082183 -3449127 -4563961 -726384 2282554 184672 -3069163
33799c069163Q94591L281812J108649l5883K885269M715394J325827l346985l935436
$$ -3069163 -2174572 1107240 2215889 2180006 5065275 9780669 11106496 7759511 3824075
33790C824075j174366J119003J435130j19515l039597m685052k326976J564418
$$ 3824075 2649709 3768712 5203842 5084327 2044730 -2640322 -4967298 -3402880
33782c402880J758890r65419m76333L797342M842516j26019m385242k589266J271279
$$ -3402880 -1643990 -2609409 -3085742 711600 5554116 5428097 1042855 -1546411 -275132
33773b75132K072528J740559K980045K533623j820161m512492q77755L505077
$$ -275132 1797396 3537955 6518000 9051623 7231462 2718970 1841215 5346292
33765E346292J401687l462377k639056K335615K791496j870559l701800o36427
$$ 5346292 6747979 3285602 646546 2982161 5773657 3903098 201298 -435129
33757d35129N32655k538061l019194K287086N827984J430926m829326l889545
$$ -435129 97526 -2440535 -5459729 -3172643 2655341 4086267 -743059 -4632604
33749d632604K072800L486333j685474n695103l380282J075415J903802K07612
$$ -4632604 -2559804 926529 -758945 -6454048 -9834330 -8758915 -6855113 -6647501
33741f647501O78110L448735M009918M49440l400965l301665k84569J249126l43220
$$ -6647501 -5969391 -2520656 1489262 1938702 -1462263 -4763928 -5048497 -3799371 -4142591
33732d142591k278500j502234J757039M849023N310064K478348j660231l335931
$$ -4142591 -6421091 -7923325 -6166286 -1317263 3992801 6471149 4810918 1474987
33724A474987r85218J791100K95768m157373n286732j116750K552238P45725l106907
$$ 1474987 489769 2280869 2576637 -1580736 -6867468 -7984218 -5431980 -4686255 -7793162
33715g793162k610921J881382M338607K166016j026502j466426N30016K736459
$$ -7793162 -10404083 -8522701 -4184094 -2018078 -3044580 -4511006 -3980990 -1244531
33707a244531L660459K373258j098173m401868m452094j169713K213875K873215
$$ -1244531 2415928 4789186 3691013 -710855 -5162949 -6332662 -4118787 -1245572
33699a245572R07642j521922k039223J93564K961202K517943j496307m520277
$$ -1245572 -337930 -1859852 -3899075 -3705511 -744309 1773634 277327 -4242950
33691d242950l019416K15860L39645j923048j635640K280690N464305M861174
$$ -4242950 -7262366 -7046506 -6706861 -8629909 -10265549 -7984859 -2520554 2340620
33683B340620K264737K02117j273824k309875j862015l40991p5567j378204j568857
$$ 2340620 4605357 4807474 3533650 1223775 -638240 -979231 -1054798 -2433002 -4001859
33674d001859K42179R68190j384180l733313k252740J662173L303409J314460
$$ -4001859 -3759680 -2791490 -4175670 -7908983 -10161723 -8499550 -5196141 -3881681
33666c881681r07882l68842J688271J997068j66694j988529p96541K166154L059940
$$ -3881681 -4789563 -5158405 -3470134 -1473066 -1639760 -3628289 -4424830 -2258676 801264
33657H01264P03546j579871p92838J266026J008146j259967k235459j158637l90665
$$ 801264 1504810 -75061 -867899 398127 1406273 146306 -2089153 -3247790 -3638455
33648c638455p38338m38303Q15003J039164L0107J68554J987625K945796J937310
$$ -3638455 -4376793 -4815096 -4000093 -2960929 -2930822 -2762268 -774643 2171153 4108463
33639D108463Q49726J26555k501971o534717o885411j172004N316017O138028
$$ 4108463 4958189 5084744 2582773 -3951944 -10837355 -12009359 -6693342 -555314
33631e55314J961601j783921k506973j365432P04313L069662L476059P55144k028872
$$ -555314 1406287 -377634 -2884607 -4250039 -3545726 -476064 2999995 3755139 1726267
33622A726267j562090K07757p08757l186942k608518J111662L098950J515946
$$ 1726267 164177 371934 -336823 -3523765 -6132283 -5020621 -1921671 -405725
33614d05725J16836J329626K219987o5708l202162l145974K62117L767332M553865
$$ -405725 -288889 1040737 3260724 3195016 -7146 -3153120 -2891003 876329 5430194
33605E430194J861215k855444n877386l983444J168147M121492K552370m1811
$$ 5430194 7291409 4435965 -1441421 -5424865 -4256718 -135226 2417144 2375333
33597B375333l31631r847j681204l485124k066974J449991L005627J780234M50053
$$ 2375333 2043702 2033855 352651 -3132473 -5199447 -3749456 -743829 1036405 1486458
33588A486458M1588r78534k466142j937226Q02760K263660K89799k554199k648149
$$ 1486458 1528046 549512 -1916630 -3853856 -3051096 -787436 -497637 -3051836 -5699985
33579e699985j04232K108899K156897O18780r96117j410741j38748J878110K876125
$$ -5699985 -5804217 -3695318 -1538421 -919641 -1915758 -3326499 -3465247 -1587137 1288988
33570A288988K239419R80013r0129j187119k049827j526775L27859J663113J571013
$$ 1288988 3528407 4508420 4418291 3231172 1181345 -345430 -17571 1645542 3216555
33561C216555J360531J581520K55376l427867n915638l387980K163664M884993
$$ 3216555 4577086 6158606 6413982 2986115 -2929523 -6317503 -4153839 731154
33553G31154K908801L63928P67778K093110M60994l732699n984552l297233K051914
$$ 731154 3639955 4003883 4771661 6864771 7325765 3593066 -2391486 -5688719 -3636805
33544c636805M669802J841094l052867m114225m06112K559128P33883k189872
$$ -3636805 1032997 2874091 -178776 -4293001 -4699113 -2139985 -1406102 -3595974
33536c595974n87348L601608L530183j171352l247971M13515L651430J369499
$$ -3595974 -4183322 -581714 2948469 1777117 -1470854 -1057339 2594091 3963590
33528C963590k300322j804558K43656j371064m241423k338849K730549L634912
$$ 3963590 1663268 -141290 102366 -1268698 -5510121 -7848970 -5118421 -1483509
33520a483509n92103l359501j723732K5222m59404M79443M215500N468344Q62796
$$ -1483509 -2075612 -5435113 -7158845 -7133623 -7593027 -7113584 -2898084 2570260 3433056
33511C433056m641862n014710j567386R34628J773473K540064K153717n44820
$$ 3433056 -1208806 -6223516 -7790902 -6856274 -5082801 -2542737 -389020 -933840
33503i33840k532976p73275J953750J062026k186111k785263o6594K085461J950743
$$ -933840 -3466816 -4240091 -2286341 -1224315 -3410426 -6195689 -6262283 -4176822 -2226079
33494b226079J276923O54207p92920j491536J129243N107523N340223J107867
$$ -2226079 -949156 -294949 -1087869 -2579405 -1450162 3657361 8997584 10105451
33486A0105451k894109l663922k912630k304177j175768k20814j778971m544082
$$ 10105451 7211342 3547420 634790 -1669387 -2845155 -3065969 -4844940 -9389022
33478i389022l573038J866858N844546M259352N74546o46412p95716k996881n195997
$$ -9389022 -12962060 -11095202 -5250656 -991304 -416758 -1063170 -1858886 -4855767 -10051764
33469a0051764l284888J587789M375286L256399Q07267n08341K0890K452429M923120
$$ -10051764 -13336652 -11748863 -7373577 -4117178 -3309911 -3818252 -3797362 -1344933 3578187
33460C578187L470052k404648o400871l032842L548904M677913k91945l785033
$$ 3578187 7048239 4643591 -1757280 -4790122 -1241218 3436695 3144750 -640283
33452f40283k117589M3918j121666k615706j147853R44684O01107m56005L34824
$$ -640283 -2757872 -2713954 -3835620 -6451326 -7599179 -6654495 -6053388 -6509393 -6174569
33443f174569J381003N26617k47816J481022L515946K578755R5269m55044N38328
$$ -6174569 -4793566 -4266949 -4514765 -3033743 482203 3060958 3156227 2701183 3239511
33434C239511N06285m4923P52906J243913j193972m255003l413072M28900K190777
$$ 3239511 3745796 3700873 4453779 5697692 4503720 248717 -3164355 -2735455 -544678
33425e44678R64490N17031J457476K02181l003295k622600K708990O257547K952606
$$ -544678 419812 936843 2394319 2596500 -406795 -3029395 -320405 5937142 8889748
33416H889748k816582m073255j069547J028713L78640r91594j873140k007463
$$ 8889748 6073166 1999911 930364 1959077 2337717 1346123 -527017 -2534480
33408b534480r3515L423509M092439p75569o256934n376354R85352N483516M660787
$$ -2534480 -2627995 795514 4887953 4112384 -2144550 -7520904 -6535552 -1052036 3608751
33399C608751K010419R39536O69091j2173k87699n9156p08760j902219j727912
$$ 3608751 5619170 6558706 7227797 7215624 6927925 6868769 6160009 4257790 2529878
33390B529878q20054j867647m118679l367521J014652M148150L015107P73800
$$ 2529878 1709824 -157823 -4276502 -7644023 -6629371 -2481221 533886 1307686
33382A307686Q01930J350309k0191j176367N19400K369669J43059m391941n382215
$$ 1307686 2109616 3459925 3439734 2263367 2782767 5152436 5295495 903554 -4478661
33373d478661j578488K107667K011278O3872m55039K63397O3582j128618j016319
$$ -4478661 -6057149 -3949482 -1938204 -1874332 -2329371 -2065974 -2002392 -3131010 -4147329
33364d147329J736118M988493M581526q83511o901125o835348M1353O616794O190315
$$ -4147329 -2411211 2577282 7158808 6275297 -625828 -7461176 -7419823 -803029 5387286
33355E387286N17783l371106k599247o46055p68133j778898j505190o07935o62820
$$ 5387286 5905069 2533963 -65284 -711339 -1479472 -3258370 -4763560 -5371495 -6034315
33346f034315r62180J56677K108205K598940J020195o27112n43962M62418K96914
$$ -6034315 -6996495 -6839818 -4731613 -2132673 -1112478 -1739590 -2283552 -1821134 -1524220
33337a524220j227613j799969J66564K779499K804068K88613j205919K65638K095458
$$ -1524220 -2751833 -4551802 -4385238 -1605739 1198329 1486942 281023 546661 2642119
33328B642119J149371j333760j716018K67039J052979j222376l793690l187282
$$ 2642119 3791490 2457730 741712 1008751 2061730 839354 -2954336 -6141618
33320f141618J905K090400J208098m55676L68648L587079N262871K182257l737511
$$ -6141618 -6139713 -4049313 -2841215 -3296891 -2928243 658836 5921707 8103964 4366453
33311D366453p134333n398239j292308J255936J623541J223209K98646j223097
$$ 4366453 -2767880 -8166119 -9458427 -8202491 -6578950 -5355741 -5057095 -6280192
33303f280192j495506J135608M591039N091395K480104J21454n15350j402513
$$ -6280192 -7775698 -6640090 -2049051 3042344 5522448 5643902 5128552 3726039
33295C726039l352737l821097j255771J616982J597676r3147K98772L362144N449387
$$ 3726039 373302 -3447795 -4703566 -3086584 -1488908 -1582055 -1283283 2078861 7528248
33286G528248L345153j750855n378632m374658j60062K697383J665064p66720
$$ 7528248 10873401 9122546 3743914 -630744 -790806 1906577 3571641 2804921
33278B804921p09429J421932J644398j134343l000874r55844K332047K435046
$$ 2804921 2095492 3517424 5161822 4027479 1026605 70761 2402808 4837854
33270D837854n50695k887773k837096j910142j168015J18295J768927J920754
$$ 4837854 4287159 1399386 -1437710 -3347852 -4515867 -4397572 -2628645 -707891
33262g07891J65797j064595J05792K072354K110655M24446l20478R22937K163627
$$ -707891 -542094 -1606689 -1500897 571457 2682112 3106558 2786080 3709017 5872644
33253E872644J520628q3653o63593l13530p41694k203614l067426k618712k002572
$$ 5872644 7393272 7309619 6646026 6332496 5590802 3387188 319762 -2298950 -4301522
33244d301522j583713R3976L048557M119517J247493k499014k639200L41431K211170
$$ -4301522 -5885235 -5791259 -2742702 1376815 2624308 125294 -2513906 -2172475 38695
33235C8695J628292J034033J256534M13577j197958p17587J215958J044m597467
$$ 38695 1666987 2701020 3957554 4371131 3173173 2455586 3671544 3672588 -924879
33226i24879n939969o45586M859044L884185O7512P63848M311906L370842j561490
$$ -924879 -6864848 -7510434 -2651390 1232795 1300307 2064155 6376061 9746903 8185413
33217H185413k694473J022055J558797l834279o700562j215723N381515L775089
$$ 8185413 5490940 6512995 8071792 4237513 -2463049 -3678772 1702743 5477832
33209E477832l139967n652889j994871J411561J522355J355037K109809J212371
$$ 5477832 2337865 -3315024 -5309895 -3898334 -2375979 -1020942 1088867 2301238
33201B301238j159183j179324J467213K203070o38042k708956r32716J614803
$$ 2301238 1142055 -37269 1429944 3633014 2994972 286016 -646700 968103
33193I68103J246157p05390j314490j051648j584869j929587n76675J199172J658237
$$ 968103 2214260 1508870 194380 -857268 -2442137 -4371724 -4948399 -3749227 -2090990
33184b090990J793729K877582L294596J392149q90520j095898o75366k062909
$$ -2090990 -297261 2580321 5874917 7267066 6376546 5280648 4605282 2542373
33176B542373l480891j734192J411494J488332p21468q330L846902M442694r01314
$$ 2542373 -938518 -2672710 -1261216 227116 -494352 -502682 3344220 7786914 6885600
33167F885600n743483l917927J012945J546911k245199l770968p42813K087142
$$ 6885600 1142117 -2775810 -1762865 -215954 -2461153 -6232121 -6974934 -4887792
33159d887792J403013K8124R11851J782041n01499l897533l830444j14329K831050
$$ -4887792 -3484779 -3456655 -2544804 -762763 -1264262 -5161795 -8992239 -9106568 -6275518
33150f275518K270757J97743m58895J06850k48122j922821k727661o49885L320435
$$ -6275518 -4004761 -3807018 -4265913 -4159063 -4407185 -6330006 -9057667 -9707552 -6387117
33141f387117N618401L705539q50816l708266k469316R37886L145259L150693
$$ -6387117 -768716 2936823 2086007 -1622259 -4091575 -3153689 -8430 3142263
33133C142263J970747J00995k294163l544429j796085J701731L433750K324146
$$ 3142263 5113010 5214005 2919842 -624587 -2420672 -718941 2714809 5038955
33125E038955Q37697N19200l64398k882845m265998j727512K633778M198807K004057
$$ 5038955 5876652 6395852 6031454 3148609 -1117389 -2844901 -211123 3987684 5991741
33116E991741o26930r88079M17109J752867J575068q15418l961195l958586J025921
$$ 5991741 5364811 4376732 4793841 6546708 8121776 7306358 3345163 -613423 412498
33107D12498O492197N899945o20517o096407n940870k817078q66627P2706J731639
$$ 412498 6904695 12804640 12184123 6087716 146846 -2670232 -3536859 -3464153 -1732514
33098a732514L116260K598552J244070N50248n29723k890143m101745j669828
$$ -1732514 1383746 3982298 5226368 5776616 5246893 2356750 -1744995 -3414823
33090c414823K473863M309028K940621L57397k014193l260247j856874J607830
$$ -3414823 -940960 3368068 6308689 6666086 4651893 1391646 -465228 1142602
33082A142602K984546J04228k699047n83658L705816L794439q3665j859940K1772
$$ 1142602 4127148 4231376 1532329 948671 4654487 8448926 8365261 6505321 6527093
33073F527093P25549j682239k823409l24590J578532n64847l426497k628122L18604
$$ 6527093 7252642 5570403 2746994 2422404 4000936 3436089 9592 -2618530 -2299926
33064b299926J206586m17866j932163j753436K93266L621819N514498K910032
$$ -2299926 -1093340 -1511206 -3443369 -5196805 -4903539 -1281720 4232778 7142810
33056G142810k147635l463206K91567K976506P67501j808875m89288Q19294k311920
$$ 7142810 4995175 1531969 1823536 4800042 5567543 3758668 3269380 4088674 1776754
33047A776754n375693j968132M322023N103251J236741P37523L903984K489097
$$ 1776754 -3598939 -5567071 -1245048 3858203 5094944 5832467 9736451 12225548
33039A2225548m822746p956485r96258P792232P871405P63201m425358m086943
$$ 12225548 7402802 -553683 -1549941 6242291 14113696 14876897 10451539 6364596
33031F364596j718892m38519n20500j924761l722377k916788J514822N415600
$$ 6364596 4645704 4207185 3686685 1761924 -1960453 -4877241 -3362419 2053181
33023B053181M607976J110535j91115J064270J412804q7000j228920j345228j775631
$$ 2053181 6661157 7771692 7580577 8644847 10057651 9970651 8741731 7396503 5620872
33014E620872k198216j002200J047154J801915J886445L321007M470329J640062
$$ 5620872 3422656 2420456 3467610 5269525 7155970 10476977 14947306 16587368
33006A6587368l922026o170249k840376J317410J924694N40755J25681m9629j114893
$$ 16587368 12665342 6495093 3654717 4972127 6896821 7437576 7563257 7513628 6398735
32997F398735o59923L005408N994561L749998j364051l052443m42102J401476
$$ 6398735 5738812 8744220 14738781 18488779 17124728 14072285 13630183 15031659
32989A5031659R881j489583q00791P2134j12864J088560M349700N170423M82363
$$ 15031659 15041540 13551957 12751166 12823300 12710436 13798996 18148696 23319119 23801482
32980B3801482n144331n171607m60913K537777J475342J97213J405994K980510
$$ 23801482 18657151 13485544 13024631 15562408 17037750 17234963 18640957 21621467
32972B1621467K726444J763158J332641N87115l18842R06562M049003M578782
$$ 21621467 24347911 26111069 27443710 28030825 27711983 28618545 32667548 37246330
32964C7246330R3624m687544l740349J622698M624078K515579n47025l73720J877225
$$ 37246330 37339954 32652410 28912061 30534759 35158837 37674416 37127391 36753671 38630896
32955C8630896K749912J694599R20474J753380L294075M243758M558218M924405
$$ 38630896 41380808 43075407 43995881 45749261 49043336 53287094 57845312 62769717
32947F2769717N247488M564971K945074K507569M842449P806842P547222M275235
$$ 62769717 68017205 72582176 75527250 78034819 82877268 90684110 98231332 102506567
32939A02506567K830618N787858R406221R470521P972781R420421J2694887J2483971
$$ 102506567 105337185 111125043 120531264 130001785 137974566 147394987 160089874 172573845
32931A72573845Q562488P429303J2717428J9182437J9757329J5072556J1893876
$$ 172573845 181136333 188565636 201283064 220465501 240222830 255295386 267189262
32924B67189262J3909192J7929356J8920827J5817812J1673294R732484J0251173
$$ 267189262 281098454 299027810 317948637 333766449 345439743 355172227 365423400
32917C65423400J0810390R329660O153658K583299j650296p513844j3615024j6661596
$$ 365423400 376233790 385563450 391717108 394300407 392650111 385136267 371521243 354859647
32909C54859647j5733892j3698225j3156670j3327581j2630736j2018787j3146453
$$ 354859647 339125755 325427530 312270860 298943279 286312543 274293756 261147303
32902B61147303j4877230j4715735j3038217j2791254j4806402j6273980j4814933
$$ 261147303 246270073 231554338 218516121 205724867 190918465 174644485 159829552
32895A59829552j1711023r585565q605648o929260m098926k060285k699105n577298
$$ 159829552 148118529 138532964 129927316 122998056 118899130 116838845 114139740 108562442
32887A08562442q344627q700091o110602k477763q79002k483501m891323n055299
$$ 108562442 100217815 91517724 85407122 82929359 82050357 79566856 74675533 69620234
32879F9620234l681060m259384p073619p479171k661121K795076K314854l120712
$$ 69620234 65939174 61679790 54606171 47127000 44465879 47260955 49575809 46455097
32871D6455097n874424k343931K326142K076635j946674m217227k660981j48303
$$ 46455097 40580673 38236742 40562884 42639519 40692845 36475618 33814637 33666334
32863C3666334K16851j537938k824114j039592L141954M711016m17944q340010
$$ 33666334 33883185 32345247 29521133 28481541 31623495 36334511 35916567 27576557
32855B7576557r861482k521196N061969M644365p87476k997550q92122K15680
$$ 27576557 17715075 15193879 20255848 24900213 24112737 21115187 20223065 20438745
32847B0438745j178727j468798K3476k19961k425359k256481J170874K807683
$$ 20438745 19260018 17791220 17814696 17594735 15169376 12912895 14083769 16891452
32839A6891452j85517l809880l803162j571216k62027L42149J432520J783182
$$ 16891452 16705935 12896055 9092893 7521677 7259650 7601799 9034319 10817501
32831A0817501M73369l71159R55451K473394J896945M27396L0927k88467k113092
$$ 10817501 11290870 10919711 11875162 14348556 16245501 16672897 16703824 16415357 14302265
32822A4302265l864119k912097J66226K369510K017738m37811l626390n263716
$$ 14302265 10438146 7526049 7692275 10061785 12079523 11641712 8015322 2751606
32814B751606l054707K054145N441024M006934J07583j874407j072263O2089j17485
$$ 2751606 -303101 1751044 7192068 11199002 11306585 9432178 8359915 8422004 8304519
32805H304519r55036j185696l74370O38391J00009k382795l879548j152555L886247
$$ 8304519 7349483 6163787 5789417 6427808 6527817 4145022 265474 -887081 2999166
32796B999166N247776P81642m489106m944244j113166K312113K330143n71221
$$ 2999166 8246942 9028584 4539478 -404766 -1517932 794181 3124324 2553103
32788B553103l760650l892635J50454M491856L961674l61353j922944J423404
$$ 2553103 -1207547 -5100182 -4949728 -457872 3503802 3142449 1219505 2642909
32780B642909L995163J611577j732482r96141J629467J196006j724157l249532
$$ 2642909 6638072 8249649 6517167 5521026 7150493 8346499 6622342 3372810
32772C372810l073331l106618k300395J116530M705920M887575K717128J360086
$$ 3372810 299479 -2807139 -5107534 -3991004 714916 5602491 8319619 9679705
32764I679705N25556j205685j840557P0841M97175l832024p622686l921931L796269
$$ 9679705 10205261 8999576 7159019 7229860 7727035 3895011 -3727675 -7649606 -3853337
32755c853337N995103K029691K84016L311222M002832j023978m985662k512241
$$ -3853337 2141766 4171457 4455473 7766695 11769527 10745549 5759887 3247646
32747C247646J566604R53836k091188k013712N59983J296070m3601m68298M47657
$$ 3247646 4814250 5768086 3676898 1663186 2223169 3519239 3475638 3007340 3454997
32738C454997R14548Q15163Q85479K41344j429138j637393J093107L589527K230051
$$ 3454997 4369545 5184708 6070187 6311531 4882393 3245000 4338107 7927634 10157685
32729A0157685j296984k532421q68280N02784Q0013o34943q25680j450772k364929
$$ 10157685 8860701 6328280 5460000 5962784 6042797 5407854 4582174 3131402 766473
32720G66473j697791R40768L086062K491491O2271j489501j140065m74713j005108
$$ 766473 -931318 9450 3095512 5587003 5649274 4159773 3019708 2544995 1539887
32711A539887j683582m23685K188100K875204L15618k516325k598057j175972
$$ 1539887 -143695 -567380 1620720 4495924 4811542 2295217 -302840 -1478812
32703a478812j002430j412372n5930J995823J569762p98375j327260N93802J517874
$$ -1478812 -2481242 -3893614 -3949544 -1953721 -383959 -1182334 -2509594 -1915792 -397918
32694c97918K60135r6750J837995K811135M33290k719566l405089k407272j964083
$$ -397918 -137783 -234533 1603462 4414597 4847887 2128321 -1276768 -3684040 -5648123
32685e648123j762815n59144R12749J522676J938392K744808K592897N38378j820640
$$ -5648123 -7410938 -7970082 -7057333 -5534657 -3596265 -851457 1741440 2279818 459178
32676D59178k502845j453816O18776L145932M301022K028862k042773l448195
$$ 459178 -2043667 -3497483 -2878707 267225 4568247 6597109 4554336 1106141
32668A106141j408518k39451j956846k515909Q95686L876559J471347l210206
$$ 1106141 -302377 -541828 -2498674 -5014583 -4118897 -242338 1229009 -1981197
32660a981197l429494P37840L241363K114243J596730L697635M390213P13865
$$ -1981197 -5410691 -4672851 -1431488 682755 2279485 5977120 10367333 11081198
32652A1081198l584220l174501J251666M129500K277041j965736m386213l384345
$$ 11081198 7496978 4322477 5574143 9703643 11980684 10014948 5628735 2244390
32644B244390n07618J895440K593515J679385L1734j113190q76450K90324Q66833
$$ 2244390 1736772 3632212 6225727 7905112 7936846 6823656 5947206 6237530 7104363
32635G104363Q8575j184179j960665k266798k024434o57919Q40488r106k760461
$$ 7104363 7192938 6008759 4048094 1781296 -243138 -901057 -60569 -69675 -2830136
32626b830136k793738J890212N888485L718430r34771m12368M158884M005558
$$ -2830136 -5623874 -3733662 2154823 5873253 4938482 4526114 8684998 12690556
32618A2690556l013443q532235o580823j481029J045067K084211L666888K941813
$$ 12690556 9677113 1144878 -5435945 -6916974 -5871907 -3787696 -120808 2821005
32610B821005j127447k656804J842323N660396K081720l595173k290221L380586
$$ 2821005 1693558 -963246 879077 6539473 8621193 5026020 2735799 6116385
32602F116385L375039k717319n203610q00218K493668m35926l683719j041883
$$ 6116385 9491424 6774105 1570495 770277 3263945 2828019 -855700 -1897583
32594a897583L950312M462292M74449l167824m038507k505769J222311N685346
$$ -1897583 2052729 6515021 6989470 3821646 -216861 -2722630 -1500319 4185027
32586D185027O896969K970062k119148l203896o64350Q98987o27324k813638k885297
$$ 4185027 11081996 14052058 11932910 8729014 8064664 8963651 8336327 5522689 2637392
32577B637392j220342j28887o06087j209089k82745J195647M99895k493647m057718
$$ 2637392 1417050 1288163 682076 -527013 -809758 385889 885784 -1607863 -5665581
32568e665581j653226K042560L077993K002709J765266J824129m18139l363521
$$ -5665581 -7318807 -5276247 -2198254 -195545 1569721 3393850 2975711 -387810
32560c87810k577868J249551K178940j393301l455211L0349M190148K818543j762933
$$ -387810 -2965678 -1716127 462813 -930488 -4385699 -4355350 -165202 2653341 890408
32551H90408k640807N85103J471136k676179o198237l397451K973046N341790
$$ 890408 -1750399 -1165296 305840 -2370339 -8568576 -11966027 -8992981 -3651191
32543c651191J565028k462330r95287L914524N431837J129787m206608n322087
$$ -3651191 -2086163 -4548493 -5543780 -1629256 3802581 4932368 725760 -4596327
32535d596327k659449L1898J320245K267779K886214K045812L04895l61662L91743
$$ -4596327 -7255776 -7223878 -5903633 -3635854 -749640 1296172 1601067 1239405 1631148
32526A631148J052078Q72498L99280k08829r93030q39282J124398L163759K540670
$$ 1631148 2683226 3555724 3955004 3746175 2753145 1913863 3038261 6202020 8742690
32517H742690o96127l693849m174840k051010J249009L211112J779312j375412
$$ 8742690 8046563 4352714 177874 -1873136 -624127 2586985 4366297 2990885
32509B990885j661058J678487L128821q07011n006116l278281J305542J382341
$$ 2990885 1329827 3008314 6137135 5330124 324008 -2954273 -1648731 -266390
32501b66390k183293k060091K366063L839268J99568j916484Q56602K875326J65900
$$ -266390 -2449683 -4509774 -2143711 1695557 1895125 -21359 835243 3710569 3876469
32492C876469k496594p44888J632483M83723r15279J075255K721475l7573l314113
$$ 3876469 1379875 634987 2267470 2751193 1835914 2911169 5632644 5595071 2280958
32483B280958k344794o96257l161454n170500q8366P299667O722944n07385l119263
$$ 2280958 -63836 -760093 -3921547 -9092047 -9180413 -1880746 4842198 4334813 1215550
32474A215550J625846M079798q52110n539623l371956N23943n11670k834404L78766
$$ 1215550 2841396 6921194 6069084 529461 -2842495 -2318552 -2830222 -5664626 -5285860
32465e285860O518691P300025J583010l946536n088834l716335j904399O32299
$$ -5285860 1232831 8532856 10115866 6169330 1080496 -2635839 -4540238 -3907939
32457c907939K879181K279259n89112j829393l1803J844284J624772Q51828Q69693
$$ -3907939 -1028758 1250501 661389 -1168004 -1199807 644477 2269249 3121077 3990770
32448C990770N1666k474676l882054j806029J257694J536750m9820J91538K103697
$$ 3990770 4042436 1567760 -2314294 -4120323 -2862629 -1325879 -1375699 -1184161 919536
32439I19536J903788j010536k662257j192760P7876j219207k085453L04645K760987
$$ 919536 2823324 1812788 -849469 -2042229 -1964353 -3183560 -5269013 -4964368 -2203381
32430b203381R22479k875581k486236K532531O133953M524788M00250k156194
$$ -2203381 -1280902 -4156483 -6642719 -4110188 2023765 6548553 6948803 4792609
32422D792609k165126l37403K149407K515202j233594n636342m502408K103668
$$ 4792609 2627483 2290080 4439487 6954689 5721095 84753 -4417655 -2313987
32414b313987O757808M675408m00621k904048k598800j578843N36281L897243
$$ -2313987 4443821 9119229 8718608 5814560 3215760 1636917 2173198 6070441
32406F070441N435126L423586J242977J987153L192533J796537K25603J788658
$$ 6070441 11505567 14929153 16172130 18159283 21351816 23148353 23373956 25162614
32398B5162614L776010J776777k057090k156967J034505J949162r20894l657331
$$ 25162614 28938624 30715401 28658311 26501344 27535849 29485011 28564117 24906786
32390B4906786m096042l610558k135142J572161M524428J628131n561145r018726
$$ 24906786 20810744 17200186 15065044 16637205 21161633 22789764 17228619 8209893
32382H209893n137151O82152K494261J092115J87622M72976N59687p6025j539924
$$ 8209893 3072742 3754894 6249155 7341270 7528892 8001868 8561555 8485530 6945606
32373F945606l704375m679808k631193L74452N89917j216512r89229J088490P31950
$$ 6945606 3241231 -1438577 -4069770 -3695318 -3105401 -4321913 -5311142 -4222652 -3490702
32364c490702j986967j779878K196099L754243K63812k139550J038641M527340
$$ -3490702 -5477669 -7257547 -5061448 -1307205 -1043393 -3182943 -2144302 2383038
32356B383038K113788k786125k995425Q10844K325160J60869j459194m96827J205674
$$ 2383038 4496826 1710701 -1284724 -473880 1851280 2012149 552955 56128 1261802
32347A261802K439415K989231J430485j912374k481384J971381N443586J497336
$$ 1261802 3701217 6690448 8120933 6208559 3727175 5698556 11142142 12639478
32339A2639478n769300o960798j714377J556894l36221j713944L62816J073495
$$ 12639478 6870178 -90620 -1804997 -248103 -584324 -2298268 -1935452 -861957
32331h61957k113991l655013O44488N974916O063281K278588m62583j498875k333715
$$ -861957 -2975948 -6630961 -5986473 -11557 6051724 8330312 7867729 6368854 4035139
32322D035139j638418J417884K977649J06304k927812p75685L591662L115661
$$ 4035139 2396721 3814605 6792254 6898558 3970746 3195061 6786723 9902384
32314I902384j710899l652155p66742Q37860k172161m818885k617115Q91638M92871
$$ 9902384 8191485 4539330 3772588 4610448 2438287 -2380598 -4997713 -4106075 -3613204
32305c613204j847195n39130M099974O062641K642321k181568l985412l090763
$$ -3613204 -5460399 -5999529 -1899555 4163086 6805407 4623839 638427 -2452336
32297b452336j955992r65625O95464K271173K360852J544810J471381J719697
$$ -2452336 -4408328 -5373953 -4678489 -2407316 -46464 1498346 2969727 4689424
32289D689424K46025k649396l574322q42990K269640J694556j437917k362499
$$ 4689424 4935449 2286053 -1288269 -2131259 138381 1832937 395020 -1967479
32281a967479R6981J841636K31971j491638M73529L823328L211186j408584m399325
$$ -1967479 -1870498 -28862 203109 -1288529 -815000 3008328 6219514 4810930 411605
32272D11605k695344K66166N56967m99044L85940K572711K781120N54167j477577
$$ 411605 -2283739 -2017573 -1460606 -1959650 -1573710 999001 3780121 4334288 2856711
32263B856711k062760k298246k241359m32434K387320K807631j99101k898006
$$ 2856711 793951 -1504295 -3745654 -4178088 -1790768 1016863 817762 -2080244
32255b080244j916728Q00597J206974n37878o77137J824496L385489J181276k467867
$$ -2080244 -3996972 -3196375 -1989401 -2527279 -3204416 -1379920 2005569 3186845 718978
32246G18978k975874N77392M119026L162425j973445o016749m432748R38759L708765
$$ 718978 -2256896 -1679504 2439522 5601947 3628502 -2388247 -6820995 -5882236 -2173471
32237b173471J142528k056940n26952L760876M487341N82518k523188j556472
$$ -2173471 -1030943 -3087883 -3614835 146041 4633382 5215900 2692712 1136240
32229A136240L64092J05304l17760J536772L272121J718221j185420j572540j17663
$$ 1136240 1500332 1605636 1287876 2824648 6096769 7814990 6629570 5057030 4939367
32220D939367j35461j318840r95931j19849j819687m624907l728044O26685K799761
$$ 4939367 4803906 3485066 2489135 2369286 549599 -4075308 -7803352 -7176667 -4376906
32211d376906J119421N38712L335709M323306k29849n246678m299801N42386K913118
$$ -4376906 -3257485 -2718773 616936 4940242 4710393 -536285 -4836086 -4293700 -1380582
32202a380582K328892K888196M417072K907049j020776k036226O76475J505794
$$ -1380582 948310 3836506 8253578 11160627 10139851 8103625 8780100 10285894
32194A0285894k176596n471067m090848j049083q24187j819082o3111L112233
$$ 10285894 8109298 2638231 -1452617 -2501700 -3325887 -5144969 -5208080 -2095847
32186b095847L217414O30842K50527L114721M207100M21974m081175l740574L52921
$$ -2095847 1121567 1752409 2002936 5117657 9324757 9746731 5665556 1924982 2277903
32177B277903K270530k63415l326611l057091o63598P13275J158380K702071M483256
$$ 2277903 4548433 4285018 958407 -2098684 -2762282 -2049007 -890627 1811444 6294700
32168F294700L351885n19044k741127j025586J263164M17253k029799k526576
$$ 6294700 9646585 9127541 6386414 5360828 6623992 7041245 5011446 2484870
32160B484870j509552j645666k040689L11742L975982L949464j06203k407201
$$ 2484870 975318 -670348 -2711037 -2399295 1576687 5526151 5419948 3012747
32152C012747Q4158K882541J342221k170790k848590j169864q64190j945599j362677
$$ 3012747 3096905 5979446 7321667 5150877 2302287 1132423 268233 -1677366 -3040043
32143c040043Q79456J684394M83434j28113M99053J12839j553062j546305J114005
$$ -3040043 -2160587 -476193 7241 -120872 378181 491020 -1062042 -2608347 -1494342
32134a494342L091157J728884r42706j620742m23552M29950M60389O46643P94504
$$ -1494342 1596815 3325699 2382993 762251 338699 768649 1229038 1875681 2670185
32125B670185J8609r12330l67124J135314J073380j397289l758995l140028J09709
$$ 2670185 2688794 1776464 1409340 2544654 3618034 2220745 -1538250 -4678278 -4568569
32116d568569K986914L415652K032166M69176o51118j223258o19460J010828J346123
$$ -4568569 -1581655 1833997 3866163 4335339 3684221 2460963 1841503 2852331 4198454
32107D198454j411304m506825k918051K963241N862561J035842o121128o581325
$$ 4198454 2787150 -1719675 -4637726 -1674485 4188076 5223918 -897210 -7478535
32099g478535J49434N921657N484476K134382O57545N42261p20126k330804k300222
$$ -7478535 -7329101 -1407444 4077032 6211414 6868959 7411220 6691094 4360290 2060068
32090B060068j569023j800050j518874J192308L972389K863066j124483k853072
$$ 2060068 491045 -1309005 -2827879 -1635571 2336818 5199884 4075401 1222329
32082A222329n80521J914093J669519N88075J103356J751323L37815j334812j00140
$$ 1222329 641808 2555901 4225420 4813495 5916851 7668174 8005989 6671177 6571037
32073F571037K546501J679553l272727o311007k853970L219549M321167n16174
$$ 6571037 9117538 10797091 7524364 1213357 -1640613 1578936 5900103 5383929
32065E383929m564836l104077M33989O08283j599834j135523K266259L267754
$$ 5383929 819093 -2284984 -1850995 -1242712 -2842546 -3978069 -1711810 1555944
32057A555944m10099l840020k074560K565679M226905J919854k78286k49620l06855
$$ 1555944 1145845 -2694175 -4768735 -2203056 2023849 3943703 3665417 3415797 3108942
32048C108942k069747l174837j313441J423609J278083j576869l323736k130846
$$ 3108942 1039195 -2135642 -3449083 -2025474 -747391 -2324260 -5647996 -7778842
32040g778842m19525n29523q59659J272550M542307M708198Q13379k951027k861135
$$ -7778842 -8198367 -8727890 -9587549 -8314999 -3772692 935506 1748885 -1202142 -4063277
32031d063277l63641R05366M24807K34939P77434O90617j03888n30176j094836
$$ -4063277 -4426918 -3521552 -3096745 -2861806 -2084372 -1393755 -1497643 -2027819 -3122655
32022c122655k923222m297312k232719K057030L622049R06026j917400j498169
$$ -3122655 -6045877 -10343189 -12575908 -10518878 -6896829 -5990803 -7908203 -9406372
32014i406372K83471R49373J772180L803842L945092q441l777770j924025L321161
$$ -9406372 -9122901 -8173528 -6401348 -2597506 1347586 1339145 -2438625 -4362650 -1041489
32005a041489M703665N35763l538552l568144j963234j635760j131420J421327
$$ -1041489 3662176 4197939 659387 -2908757 -4871991 -6507751 -7639171 -6217844
31997f217844L790913K810100l82194j653324N75905L446284L061984j245712
$$ -6217844 -2426931 383169 975 -1652349 -1076444 2369840 5431824 4186112
31989D186112n725005n404905L81173O227107O329056J364465k830970k919368
$$ 4186112 -1538893 -6943798 -6562625 -335518 5993538 7358003 4527033 1607665
31981A607665j005134R2266M43821P35175K62100q69053q66483L61784J92106
$$ 1607665 602531 694797 1138618 1873793 2135893 1266840 400357 762141 954247
31972I54247k047172k804367K52837L687161L033311m02619j874064o19904j07647
$$ 954247 -1092925 -3897292 -3644455 42706 3076017 2673398 799334 179430 71783
31963G1783j456962j646075Q61919L116381K281206o2619o85892M68823Q79795
$$ 71783 -1385179 -3031254 -2169335 947046 3228252 3165633 2479741 2948564 3828359
31954C828359m11877j844384k167235j903448j537899k34656K319524M109319
$$ 3828359 3416482 1572098 -595137 -2498585 -4036484 -4271140 -1951616 2157703
31946B157703K883511k27686j539132j1808P89591k150319o264434o534616k440479
$$ 2157703 5041214 4813528 3274396 3262588 4052179 1901860 -4362574 -10897190 -13337669
31937a3337669J799809L489001L890816L971915K201603j533764l851141k539683
$$ -13337669 -11537860 -8048859 -4158043 -186128 2015475 481711 -3369430 -5909113
31929e909113j62617J0380j105049q38631M23867N65823k3974O60050K429868
$$ -5909113 -6071730 -6061350 -7166399 -8005030 -7581163 -7015340 -7039314 -6379264 -3949396
31920c949396L455886L376438K603340K03988l790234n792988k943773J451184
$$ -3949396 -493510 2882928 5486268 5690256 1900022 -3892966 -6836739 -5385555
31912e385555J938829n80914l36554L378565M469150p478m511014l077665K225161
$$ -5385555 -3446726 -4027640 -4364194 -985629 3483521 3476043 -1034971 -4112636 -1887475
31903a887475M943549K851205r15594k869303k038064L65186J735406K68350k205926
$$ -1887475 3056074 5907279 4991685 2122382 84318 449504 2184910 2453260 247334
31894B47334k031725O65023J818736K02862l86093J821366K659516q17190m332578
$$ 247334 -1784391 -1119368 699368 902230 516137 2337503 4997019 4179829 -152749
31885a52749k915343Q25193J199740j169411j376542P83424J283647m5339M30656
$$ -152749 -3068092 -2242899 -1043159 -2212570 -3589112 -2805688 -1522041 -1567380 -1136724
31876a136724K316296J211991k572343l028764J647701N188210K480652l180009
$$ -1136724 1179572 2391563 -180780 -3209544 -1561843 3626367 6107019 2927010
31868B927010n509118l037642J553776N334816N602491J128933m354310m758133
$$ 2927010 -2582108 -5619750 -4065974 1268842 6871333 8000266 3645956 -1112177
31860a112177l18537J845948j247389l580361o87050K222043n90264m689926k745826
$$ -1112177 -1430714 415234 -832155 -4412516 -5099566 -2877523 -3467787 -8157713 -10903539
31851a0903539K401163K213905k712465l307483K689908O919606M047620n60338
$$ -10903539 -8502376 -6288471 -9000936 -12308419 -9618511 -2698905 1348715 788377
31843G88377p81968J059193K79570j595625o02343J961222J837547r56154k604141
$$ 788377 6409 1065602 1345172 -250453 -852796 1108426 2945973 1989819 -614322
31834f14322j553398K68518J046613L29853k014038m859192n143187j331870L451984
$$ -614322 -2167720 -1899202 -852589 -522736 -2536774 -7395966 -12539153 -13871023 -10419039
31825a0419039M751062K426762K61628O27960K221233K731193J427577p90917
$$ -10419039 -5667977 -3241215 -2979587 -2351627 -130394 2600799 4028376 3237459
31817C237459k191252j407121Q10382J886162P79390l21435O30573K136718J538112
$$ 3237459 1046207 -360914 449468 2335630 3115020 2793585 3424158 5560876 7098988
31808G098988o33447j711163j409388j850147l180189k813393j01576J497227
$$ 7098988 6465541 4754378 3344990 1494843 -1685346 -4498739 -4600315 -3103088
31800c103088q91884m834257n250797j019379L633808M620902K704216J464004
$$ -3103088 -3994972 -8829229 -14080026 -15099405 -11465597 -6844695 -4140479 -2676475
31792b676475K088872K443232J072105m60356l90258K74842k58165j136433j93134
$$ -2676475 -587603 1855629 2927734 2467378 2077120 2351962 2093797 957364 764230
31783G64230K016272K557092N54577j625861k137611j786957j587188r29752N49403
$$ 764230 2780502 5337594 5892171 4266310 2128699 341742 -1245446 -2175198 -1625795
31774a625795J662175J573460R99503M71801n05942j743029k150874j968195k492078
$$ -1625795 36380 1609840 2609343 3081144 2575202 832173 -1318701 -3286896 -5778974
31765e778974k926563q55905L099208M921658L046834N08959n95778k046426m241904
$$ -5778974 -8705537 -9561442 -6462234 -1540576 1506258 2015217 1419439 -626987 -4868891
31756d868891l388178J835071N859393L972986J18159N64477L527502K569445
$$ -4868891 -8257069 -6421998 -562605 3410381 3528540 4093017 7620519 10189964
31748A0189964k219450m642958k901035j390131j875907j065666J691682K208500
$$ 10189964 7970514 3327556 426521 -963610 -2839517 -3905183 -2213501 -5001
31740e001n71845j729613J146979L268462N76270l404072l358357j19462K030637
$$ -5001 -576846 -2306459 -1159480 2108982 2685252 -718820 -4077177 -4196639 -2166002
31731b166002K156274K007307J695997N75449j48196K27302m40145l076516l935103
$$ -2166002 -9728 1997579 3693576 4269025 4120829 4348131 3907986 831470 -3103633
31722c103633q2355M160862K141255m797095p911901k638755N569045Q635694
$$ -3103633 -3185988 974874 3116129 -1680966 -9592867 -12231622 -6662577 1973117
31714A973117N001473q53948m780110n824865m458787j232451K420874M138121
$$ 1973117 6974590 6120642 1340532 -4484333 -8943120 -10175571 -7754697 -3616576
31706c616576K814631K96525m10175J262994K915403K631270J200593j35365j829856
$$ -3616576 -801945 -505420 -915595 347399 3262802 5894072 7094665 6959300 5129444
31697E129444l775522l452269J35951K931083J061330k136701o14984L687939
$$ 5129444 1353922 -2098347 -1962396 968687 2030017 -106684 -721668 2966271
31689B966271K638527m354960p411014j134755O076607M484408k346549m079870
$$ 2966271 5604798 1249838 -6161176 -7295931 -1219324 3265084 918535 -3161335
31681c161335L16072K978843R30259q22886L83373J072705m55985r55378P26474
$$ -3161335 -2845263 133580 1063839 240953 624326 1697031 1241046 285668 1012142
31672A012142J073450q59913q70382K325922L386535r06607n414823m366097l7981
$$ 1012142 2085592 1225679 355297 2681219 6067754 5161147 -253676 -4619773 -4657754
31663d657754J932250J404760J720391K442038Q24275j779535j630107N69265
$$ -4657754 -2725504 -1320744 399647 2841685 3665960 1886425 256318 825583
31655H25583Q87552n79166j65742J706241K74709m706694o620089j752958M153225
$$ 825583 1713135 1133969 968227 2674468 2949177 -1757517 -8377606 -10130564 -5977339
31646e977339L651157j929994m715961j031651M648521O048898J970471l418267
$$ -5977339 -2326182 -4256176 -8972137 -10003788 -5355267 693631 2664102 -754165
31638g54165n035913j570760L049093L494395o83586m096708k336953K165325
$$ -754165 -5790078 -7360838 -4311745 -817350 -1500936 -5597644 -7934597 -5769272
31630e769272L577209M76589k893560k632611N79402L419544L643234J497651
$$ -5769272 -2192063 -1715474 -4609034 -7241645 -6662243 -3242699 400535 1898186
31622A898186p87990r38321N27202L59169k576583m300738j006946M097602M061374
$$ 1898186 1110196 171875 699077 1058246 -1518337 -5819075 -6826021 -2728419 1332955
31613A332955j843752o686422n490718j077483J716240K512321L014974K809052
$$ 1332955 -510797 -7197219 -12687937 -13765420 -12049180 -9536859 -6521885 -3712833
31605c712833J413669P23362J460951P93736k391972l664680M52530N587603N064518
$$ -3712833 -2299164 -1575802 -114851 678885 -1713087 -5377767 -4925237 662366 5726884
31596E726884j72804l421281k190750R9479J120249J643692J181512j560578l859136
$$ 5726884 5554080 2132799 -57951 41528 1161777 2805469 3986981 2426403 -1432733
31587a432733j439488L745556N067784J363119j601781r61904l33741j593490
$$ -1432733 -2872221 873335 5941119 7304238 5702457 4740553 4406812 2813322
31579B813322j346021J132412Q26003l483808m818780P01574N789617K878965
$$ 2813322 1467301 2599713 3425716 -58092 -4876872 -4175298 1614319 4493284
31571D493284l478013m056540L55224J752556r26276j161713K607029M280619
$$ 4493284 1015271 -3041269 -2686045 -933489 -1859765 -3021478 -414449 3866170
31563C866170J166120j648225p38302J1050k806701n437327l091710K025103M026841
$$ 3866170 5032290 3384065 2645763 2656813 -149888 -5587215 -8678925 -6653822 -2626981
31554b626981J810089m66126J26193K205122L051694J745694q59911l341136m364940
$$ -2626981 -816892 -1283018 -1156825 1048297 4099991 5845685 4985774 1644638 -2720302
31545b720302l300377r44553O72619P2894j642321j487589J478681M022612K868480
$$ -2720302 -6020679 -6965232 -6292613 -6219719 -7862040 -9349629 -7870948 -3848336 -979856
31536i79856K5157K54866L346843L845683k37020l946557l307842j040128m09496
$$ -979856 -954699 -699833 2647010 6492693 6255673 2309116 -998726 -2038854 -2448350
31527b448350O82511L852099M317180j474535p082591m353194K758372L398585
$$ -2448350 -1765839 2086260 6403440 4928905 -2153686 -6506880 -3748508 -349923
31519c49923k507366l810584L197740Q083846L117422m307482l888730J630392
$$ -349923 -2857289 -6667873 -3470133 4613713 7731135 3423653 -465077 1165315
31511A165315K404082k263176m130234k80658K794547L38229l493618k667512
$$ 1165315 3569397 1306221 -2824013 -3104671 -310124 28105 -3465513 -6133025
31503f133025J941650M650954K921040m22305j910534j357243n03374J26633J106825
$$ -6133025 -4191375 459579 3380619 2958314 1047780 -309463 -812837 -686204 420621
31494D20621J640010p2910l213856l924027n95875K951111K580742k16647j362656
$$ 420621 2060631 1987721 -1226135 -5150162 -5746037 -2794926 -214184 -430831 -1793487
31485a793487r65437j931661l302802j273103L224182M621093J609478o74376
$$ -1793487 -2758924 -4690585 -7993387 -9266490 -6042308 -1421215 188263 -486113
31477d86113M84199J012560k004753m337626j426778L842835N500796K780206
$$ -486113 -1914 1010646 -994107 -5331733 -6758511 -2915676 2585120 5365326
31469E365326r70078m111154o236247n105265J49708N003767M433054L22400j352669
$$ 5365326 4395248 284094 -5952153 -11057418 -10907710 -5903943 -1470889 -1148489 -2501158
31460b501158O16334K200594J653571J522638K780477K604178l63100l088504
$$ -2501158 -1884824 315770 1969341 3491979 6272456 8876634 8513534 5425030
31452E425030k699606o59572j74521j663095k780746j742310O92573K099016J013130
$$ 5425030 2725424 2065852 1891331 228236 -2552510 -4294820 -3602247 -1503231 -490101
31443d90101j028501r21606J801959L754801K152475j243373k756739j740419
$$ -490101 -1518602 -2440208 -638249 3116552 5269027 4025654 1268915 -471504
31435d71504k97648N21337J223961J493625L95782j405705k243084j778008m80958
$$ -471504 -769152 -247815 976146 2469771 2865553 1459848 -783236 -2561244 -3042202
31426c042202K024217N217494N713301J016543n334785o755518k170798K521424
$$ -3042202 -1017985 4199509 9912810 10929353 5594568 -1160950 -3331748 -810324
31418h10324K514847m05487k126310k138595k346953k648921j221268J696876
$$ -810324 1704523 1299036 -827274 -2965869 -5312822 -7961743 -9183011 -7486135
31410g486135L262212J677838j251765k002297O27031L865737L831867Q6242l561664
$$ -7486135 -4223923 -2546085 -3797850 -5800147 -5173116 -1307379 2524488 2610730 -950934
31401i50934l385936J60892L615702M478075K593189r42877m004156l733189M22653
$$ -950934 -4336870 -4175978 -560276 3917799 6510988 5568111 1563955 -2169234 -1746581
31392a746581M373919L259100j974988m942818j871810L455675M627574M93091
$$ -1746581 2627338 5886438 3911450 -1031368 -2903178 552497 5180071 5673162
31384E673162m078617m409961r40052K169868K034433j76067j352826n24899L60901
$$ 5673162 1594545 -2815416 -3755468 -1585600 448833 272766 -1080060 -1604959 -1244058
31375a244058k12795j030309m58172N60128J8504j580405j762159m2300J149373
$$ -1244058 -1456853 -2487162 -2945334 -2385206 -2366702 -3947107 -5709266 -5751566 -4602193
31366d602193k8710k441484l687742k544031O46821M257376N711750L586564N8322
$$ -4602193 -4630903 -7072387 -10760129 -13304160 -12657339 -8399963 -2688213 898351 956673
31357I56673q39957J543376L112130N51293l701419m537788j201558J804532J125669
$$ 956673 116716 1660092 4772222 5323515 1622096 -2915692 -4117250 -2312718 -1187049
31348a187049j060385p89272J700357K688494J039890j0021J651140L025949N17220
$$ -1187049 -2247434 -3036706 -1336349 1352145 2392035 2382014 4033154 7059103 7576323
31339G576323l718983m110034J36400L604335K382655r91206k365035j897885
$$ 7576323 3857340 -252694 -116294 3488041 5870696 4879490 2514455 616570
31331F16570j897932j771079N48655L586799L241367j079021m867560m258368
$$ 616570 -1281362 -3052441 -2503786 1083013 4324380 3245359 -1622201 -5880569
31323e880569q58239P84025p57511k061372M09388M867028N480168J72532n113515
$$ -5880569 -6738808 -5954783 -6712294 -8773666 -8364278 -3497250 1982918 2155450 -2958065
31314b958065l299635L865835P562605L978553j029753j470172N68623L96793
$$ -2958065 -6257700 -2391865 5170740 9149293 8119540 6649368 7217991 7614784
31306G614784r43376J87632K323398J073383l040774n328442m317002k501969
$$ 7614784 6671408 6859040 9182438 10255821 7215047 1886605 -2430397 -4932366
31298d932366q51918J378386K327227l83967l597942j612527M310798O474151
$$ -4932366 -5784284 -4405898 -2078671 -2462638 -6060580 -7673107 -3362309 3111842
31290C111842K065321k987340l496294j566168q56236o89071N38518J597984J695398
$$ 3111842 5177163 2189823 -1306471 -2872639 -3728875 -4417946 -3879428 -2281444 -586046
31281e86046K482450L571321J418718l782814n893062j932069K285645R60991
$$ -586046 1896404 5467725 6886443 3103629 -2789433 -4721502 -2435857 -1474866
31273a474866k573840j868585K080876L449491J425513l028P0505q49227k285856
$$ -1474866 -4048706 -5917291 -3836415 -386924 1038589 1035561 1106066 256839 -2029017
31264b029017j126549K047297L383490K358220J824207J677438r62600m880654
$$ -2029017 -3155566 -1108269 2275221 4633441 6457648 8135086 7172486 2291832
31256B291832m993953q76753J669868j22541j653648Q19187L703972K379796j018841
$$ 2291832 -2702121 -3578874 -1909006 -2031547 -3685195 -2866008 837964 3217760 2198919
31247B198919j532702M87781Q69155j021833k046215j326395j066136j397923
$$ 2198919 666217 1153998 2023153 1001320 -1044895 -2371290 -3437426 -4835349
31239d835349L23374L890600M687341L40261m652976m387979N23943M226206L770886
$$ -4835349 -4511975 -621375 4065966 4406227 -246749 -4634728 -4110785 115421 3886307
31230C886307J904749J336643N44406k262458m437040k356979J981862K714081
$$ 3886307 5791056 7127699 7672105 5409647 972607 -1384372 597490 3311571
31222C311571j232327l996746j236216L499391M112227M76543k492535k253699
$$ 3311571 2079244 -1917502 -3153718 345673 4457900 4934443 2441908 188209
31214A88209o56682N05738J428387J682733m6388k629531k619388P38959L673963
$$ 188209 -468473 37265 1465652 3148385 3101997 472466 -2146922 -1407963 2266000
31205B266000K828987m33799k417264j702200K88400J590551J117070o94406j690796
$$ 2266000 5094987 4661188 2243924 541724 830124 2420675 3537745 2843339 1152543
31196A152543k82509J528499J75635l487746m074627J64431L311735K08889m640800
$$ 1152543 870034 2398533 2574168 -913578 -4988205 -4823774 -1512039 -1303150 -5943950
31187e943950k836083M867768Q571619L303846l963511m735712n13306J402942
$$ -5943950 -8780033 -3912265 4659354 7963200 3999689 -736023 -1249329 153613
31179A53613n16835j373600Q38978K243483M81065q72912J661811N239382M519835
$$ 153613 -363222 -1736822 -897844 1345639 1826704 953792 2615603 7854985 12374820
31170A2374820m98975m461663l797813n56491J170449P8970j987161k869061k203023
$$ 12374820 11875845 7414182 3616369 3059878 4230327 4309297 2322136 -546925 -2749948
31161b749948j242755j058603r86175M86905K931592L414993J53277m257662n275846
$$ -2749948 -3992703 -5051306 -6037481 -5550576 -2618984 796009 949286 -3308376 -8584222
31152h584222j809075K721497M708616L841168J967783M14397o52101j432867
$$ -8584222 -10393297 -7671800 -2963184 877984 2845767 3260164 2608063 1175196
31144A175196j951137j782809l46925J771414K423571M07771k119056j888282
$$ 1175196 -775941 -2558750 -2905675 -1134261 1289310 1697081 -421975 -2310257
31136b310257R15086K748380J662826m15363j059443m02133K74129N69417L23601
$$ -2310257 -1395171 1353209 3016035 2600672 1541229 1139096 1413225 1982642 2306243
31127B306243p41410j529751k56857K096255K029358j024175k920254j064251
$$ 2306243 1564833 35082 -221775 1874480 3903838 2879663 -40591 -1104842
31119a104842J136399k25713k873031k019267J608294L034192J198085k300J116902
$$ -1104842 31557 -194156 -3067187 -5086454 -3478160 -443968 754117 751817 1868719
31110A868719J578296l45648k048746j451063l95163p44358j046357K15098J491801
$$ 1868719 3447015 3101367 1052621 -398442 -793605 -1537963 -2584320 -2369222 -877421
31101h77421J099476K04819J01420m59771k137226k237217J076620M292228K762729
$$ -877421 222055 426874 528294 68523 -2068703 -4305920 -3229300 1062928 3825657
31092C825657k015892l966588r41155K649450K365790p12394k366600p26807K103035
$$ 3825657 1809765 -2156823 -3097978 -448528 1917262 1204868 -1161732 -1888539 214496
31083B14496K725549L8641l376080l917697j524688J31367p11902p94432K676965
$$ 214496 2940045 2978686 -397394 -4315091 -5839779 -5708412 -6420314 -7214746 -4537781
31074d537781O152423M205165j593071m143358j256571J604011N37991j227829
$$ -4537781 1614642 5819807 4226736 83378 -1173193 430818 968809 -259020
31066b59020k38860P39459j692734m258034j786807L508332M568380M14432k293194
$$ -259020 -497880 241579 -1451155 -5709189 -7495996 -3987664 580716 995148 -1298046
31057a298046N33548M727835M632221O96738k668583l310818k230562o26680R04854
$$ -1298046 -764498 3963337 8595558 9292296 6623713 3312895 1082333 455653 1360507
31048A360507J439661L56820j582904l020732l227323k116822l05070N99176m46961
$$ 1360507 2800168 3156988 1574084 -1446648 -4673971 -6790793 -7095863 -6496687 -6943648
31039f943648j778557o65174K465971M126652K854445J102458P43323J64095j909954
$$ -6943648 -8722205 -9387379 -6921408 -2794756 59689 1162147 1905470 2069565 159611
31030A59611l088382j111611J622567J129903k149573m039288k401243R34492
$$ 159611 -2928771 -4040382 -2417815 -1287912 -3437485 -7476773 -9878016 -8943524
31022h943524L299716L508240J824969K145K29425J918657J516015j906590l768178
$$ -8943524 -5643808 -2135568 -310599 -308454 -79029 1839628 3355643 1449053 -2319125
31013b319125o35389L239755J654375l418519m337391K77499L703193K154499
$$ -2319125 -2954514 285241 1939616 -1478903 -5816294 -5538795 -1835602 318897
31005C18897m9429R80316K294035N10148j582038j81842K585701K558904N67228
$$ 318897 269468 1249784 3543819 4053967 2471929 2290087 4875788 7434692 8001920
30996H001920j56894l77269k544526m550255k411499K054633K897102p18893l321621
$$ 8001920 7845026 7467757 4923231 372976 -2038523 16110 2913212 2194319 -1127302
30987a127302k055415n63302j815989k753368K31696M606884N010490J132479
$$ -1127302 -3182717 -3746019 -5562008 -8315376 -8083680 -3476796 1533694 2666173
30979B666173j950647q40117K188436K918702O06307j791699j842974l95006L68335
$$ 2666173 715526 -124591 2063845 4982547 5588854 3797155 1954181 1559175 1927510
30970A927510K26067M77546P44932r48939m008512m302185J29243M935587M609805
$$ 1927510 2153577 2631123 3376055 2427116 -1581396 -5883581 -5754338 -818751 3791054
30961C791054J41225k680497j796564q29012k011057k369435O76846M246173M168676
$$ 3791054 3932279 1251782 -544782 -1373794 -3384851 -5754286 -5077440 -831267 3337409
30952C337409J331468j83121M38467L78567j271764j862394O5652J954103J058898
$$ 3337409 4668877 4485756 4924223 5302790 4031026 2168632 2234284 4188387 5247285
30943E247285j416885k361415j255860o4627L63220Q66053J181417j29679k138023
$$ 5247285 3830400 1468985 213125 148498 511718 1377771 2559188 2429509 291486
30934B91486j370037K636849M761606R30067m966434n690305j262905R27207k407923
$$ 291486 -1078551 1558298 6319904 7249971 2283537 -3406768 -4669673 -3742466 -6150389
30925f150389n124523j190298N705531P358861K498228k819995m410108l531534
$$ -6150389 -11274912 -12465210 -6759679 599182 3097410 277415 -4132693 -7664227
30917g664227j860641R41952L667567L175715k68707j946671L65717K547544N45106
$$ -7664227 -9524868 -8582916 -4915349 -1739634 -2008341 -3955012 -3589295 -1041751 -496645
30908d96645k969505k605451J491672M131815K849238N22660p6352n7621j170948
$$ -496645 -3466150 -6071601 -4579929 -448114 2401124 2923784 2847432 2789811 1618863
30899A618863k286621j658008l19131k10202l82212J404912L724031K260771l134366
$$ 1618863 -667758 -2325766 -2644897 -2855099 -3237311 -1832399 1891632 4152403 1018037
30890A018037o198372k286249M326170N717441J205685k592249k308780j806338
$$ 1018037 -5180335 -7466584 -3140414 2577027 3782712 1190463 -1118317 -2924655
30882b924655l611199l336431K326846P637778N109138k363605m848034j8517
$$ -2924655 -6535854 -9872285 -7545439 92339 5201477 2837872 -2010162 -2028679
30874b028679L944110J504366k351139j300355K132366J620749k249595l301513
$$ -2028679 1915431 3419797 1068658 -231697 1900669 3521418 1271823 -2029690
30866b029690O6325K756041J369376j001884m25038J729427J510626j193120k600396
$$ -2029690 -1963365 792676 2162052 1160168 735130 2464557 3975183 2782063 181667
30857A81667q89871J171022N85061j236178n74551K774200M711668K514851j364237
$$ 181667 -708204 462818 1047879 -188299 -762850 2011350 6723018 9237869 7873632
30848G873632k939379k000976j261084j694471j834540j056429l44767K03361
$$ 7873632 4934253 2933277 1672193 -22278 -1856818 -2913247 -3258014 -3054653
30840c054653J501750K715856J572489j635192l387788j714636J040576J867935
$$ -3054653 -1552903 1162953 2735442 1100250 -2287538 -4002174 -2961598 -1093663
30832a093663J049681N53413O24215K12265p10139j301819j237793m24089J398816
$$ -1093663 -43982 509431 1133646 1345911 635772 -666047 -1903840 -2327929 -929113
30823i29113L395911L575629J644457K70748J403058K735505M51600n070698q822899
$$ -929113 2466798 6042427 7686884 7957632 9360690 12096195 12547795 7477097 -1345802
30814a345802o847713p77652L902490L421878p97295m082087l694616j241048
$$ -1345802 -8193515 -8971167 -5068677 -1646799 -2444094 -6526181 -10220797 -11461845
30806a1461845O11971J992990M044827M927735J896246k752202l037061J702881
$$ -11461845 -10849874 -8856884 -4812057 115678 2011924 -740278 -3777339 -2074458
30798b074458M506490Q60348l983330k928875J805644K329591k273364m712276
$$ -2074458 2432032 3292380 -690950 -3619825 -1814181 515410 -1757954 -6470230
30790f470230j216098K948083K170640j450711k582327n72597J474784K285343
$$ -6470230 -7686328 -4738245 -2567605 -4018316 -6600643 -7173240 -5698456 -3413113
30782c413113K542208J624098j185999l431640j967304J585235K291393o65554
$$ -3413113 -870905 753193 -432806 -3864446 -5831750 -4246515 -1955122 -2620676
30774b620676k449060r6544K697748J470014j737825j509262K296439M199660
$$ -2620676 -5069736 -5166280 -2468532 -998518 -2736343 -4245605 -1949166 2250494
30766B250494J515984j937438k263437j058959j430525k142730j76218L122157
$$ 2250494 3766478 1829040 -434397 -1493356 -2923881 -5066611 -5242829 -2120672
30758b120672L465040M98905j605281p96616K42019o04876j297292L64614K670349
$$ -2120672 1344368 1843273 237992 -558624 -316605 -921481 -2218773 -1854159 816190
30749H16190K742701P82538j168703k582444l787196l767567j637699Q39552J151822
$$ 816190 3558891 4341429 3172726 590282 -3196914 -6964481 -8602180 -7762628 -6610806
30740f610806q9707J58105K834616N189661M260604N45558k436666j903174J023862
$$ -6610806 -6700513 -6542408 -3707792 1481869 5742473 6288031 3851365 1948191 2972053
30731B972053K335310K1465k996942k723831O9306J131633m01268q96614R74751
$$ 2972053 5307363 5328828 2331886 -391945 -322639 808994 407726 -488888 485863
30722D85863J466425j432190l425434o69207K967116J202220m615045p044063
$$ 485863 1952288 520098 -2905336 -3574543 -607427 594793 -4020252 -11064315
30714a1064315l226362J955021L690877K844690K445700K956368K964614J796855
$$ -11064315 -14290677 -12335656 -8644779 -5800089 -3354389 -398021 2566593 4363448
30706D363448M982j174460q23462k03260k063156n810010o055165j0976O441390
$$ 4363448 4368430 3193970 2370508 2167248 104092 -5705918 -11761083 -11772059 -5330669
30697e330669N914430P14083n20041L316235M101053j623490o239718l143190
$$ -5330669 583761 1297844 777803 4094038 8195091 6571601 331883 -2811307
30689b811307K629286K578338k138259l489371P42790M654221L622862l70366
$$ -2811307 -182021 2396317 258058 -3231313 -2488523 2165698 5788560 5418194
30681E418194l173240l384933k070021q82345r26135j378790K9311L230732M446690
$$ 5418194 2244954 -1139979 -3210000 -4092345 -5018480 -6397270 -6367959 -3137227 1309463
30672A309463J399761k370963k200285P07299J564629j88062p27753R16027J198200
$$ 1309463 2709224 338261 -1862024 -1154725 409904 221842 -505911 410116 1608316
30663A608316j391009l404435k082783N57666J750108K150225L039993K797360
$$ 1608316 217307 -3187128 -5269911 -4712245 -2962137 -811912 2228081 5025441
30655E025441j87376l491267l495473r24711K44859j077520j784681Q0908K109200
$$ 5025441 4838065 1346798 -2148675 -3073386 -2828527 -3906047 -5690728 -5609820 -3500620
30646c500620J433563n89647k95466K632288M259159J798414k261462l168490
$$ -3500620 -2067057 -2656704 -2952170 -319882 3939277 5737691 3476229 307739
30638C07739m7496K980691J869334k778297o667714o177489j435451L796723N110927
$$ 307739 260243 3240934 5110268 2331971 -4335743 -10513232 -11948683 -8151960 -3041033
30629c041033J716578k153136j866394J588683K952907N65401j011490J639363
$$ -3041033 -1324455 -3477591 -5343985 -3755302 -802395 -236994 -1248484 390879
30621C90879M927620L804568j43768j649813p44605k111106n710065n394542Q78901
$$ 390879 5318499 9123067 8979299 7329486 6584881 4473775 -1236290 -6630832 -5751931
30612e751931O151621M091393j591873k818059J182204L877372J511325k744301
$$ -5751931 399690 4491083 2899210 81151 1263355 5140727 6652052 3907751
30604C907751m684357l875414j591321J485983L764974K828344o53825k243210
$$ 3907751 -776606 -4652020 -6243341 -4757358 -992384 1835960 1182135 -1061075
30596a061075L97644L648077L045994l4900q24068J062345J150716k164118m419942
$$ -1061075 -663431 2984646 6030640 5995740 5171672 6234017 7384733 5220615 800673
30587H00673k041596J632711J256258k324123l679822j384103M72863k83441o17448
$$ 800673 -1240923 391788 1648046 -676077 -4355899 -5740002 -5267139 -5550580 -6168028
30578f168028J486088K820787P02221j594762j28603K486438J195146k501159
$$ -6168028 -4681940 -1861153 -1158932 -2753694 -2882297 -395859 799287 -1701872
30570a701872k632623J008415K290827p37874k470422M51404L294104J583872
$$ -1701872 -4334495 -3326080 -1035253 -1773127 -4243549 -3792145 -498041 1085831
30562A085831j193679n3767K626407J577580j885825k298337M77257J767074P49497
$$ 1085831 -107848 -161615 2464792 4042372 2156547 -141790 335467 2102541 2852038
30553B852038Q92914K039633O7731m415701n030136n2660L449511K04579m769469
$$ 2852038 3744952 5784585 5852316 1436615 -3593521 -3646181 -196670 7909 -4761560
30544d761560l789200J963644M773819J717205k325595k325926J010878L485051
$$ -4761560 -8550760 -6587116 -1813297 -96092 -2421687 -4747613 -3736735 -251684
30536b51684K381395j341572m100356l022487Q07256L391307K744238Q30097k69790
$$ -251684 2129711 788139 -3312217 -6334704 -5527448 -2136141 608097 1438194 1168404
30527A168404j240142k811970l267712j424038N03351J47224j075431m76343J457849
$$ 1168404 -71738 -2883708 -6151420 -7575458 -7072107 -6924883 -8000314 -8476657 -7018808
30518g018808K486230K612490L053208K846009M24386k537783k849528q36385
$$ -7018808 -4532578 -1920088 1133120 3979129 4403515 1865732 -983796 -1820181
30510a820181M1032j565129l264717k567530M21552L685559M728431K380601j088039
$$ -1820181 -1779149 -3344278 -6608995 -9176525 -8754973 -5069414 -340983 2039618 951579
30501I51579j747048J94733j15707l865144m600117J972644Q900837O694391j966921
$$ 951579 -795469 -600736 -716443 -4581587 -9181704 -7209060 1691777 8386168 6419247
30492F419247n709139j433685K549696J170195m95739J696736L283567K42346
$$ 6419247 710108 -723577 1826119 2996314 2500575 4197311 7480878 7723224
30484G723224k995547j485847J386417M75792j644377J16137L276334J540203
$$ 7723224 4727677 3241830 4628247 5104039 3459662 3575799 6852133 8392336
30476H392336m166843o768903l789751M95830K916266M225145M182201R50426
$$ 8392336 4225493 -2543410 -6333161 -5837331 -2921065 1304080 5486281 6436707
30468F436707l488516l776504Q11451M116884J539945l490093m527698n78853
$$ 6436707 2948191 -828313 -16862 4100022 5639967 2149874 -2377824 -2956677
30460b956677L613325M107980J706531m08204q64323q59416j365477j340929N4724
$$ -2956677 656648 4764628 6471159 6062955 5198632 4339216 2973739 1632810 1687534
30451A687534R62116p69179l407677l217311n57823K85749j728434k482417K1580
$$ 1687534 2649650 1880471 -1527206 -4744517 -5302340 -5016591 -6745025 -9227442 -9205862
30442i205862J932125M48419r42368J261827L973812K831194l884L21431K932401
$$ -9205862 -7273737 -6825318 -7767686 -6505859 -2532047 299147 295263 616694 3549095
30433C549095L236200R25021o05758r14876k034544k915854r61848K084834K226927
$$ 3549095 6785295 7710316 7104558 6189682 4155138 1239284 277436 2362270 4589197
30424D589197J1781j111578j551711l544147m209124P14111P051017N869957k172469
$$ 4589197 4600978 3489400 1937689 -1606458 -5815582 -5101471 1949546 7819503 5647034
30415E647034o196286j387632L882367J619423m020669m642591l22276K455808
$$ 5647034 -549252 -1936884 1945483 3564906 -455763 -5098354 -5420630 -2964822
30407b964822R40673k038077l451220k477941K99699K809665K776913R87172L78332
$$ -2964822 -2024149 -4062226 -7513446 -9991387 -9691688 -6882023 -4105110 -3117938 -2739606
30398b739606J067819N70488n23706R58692L470603J258749n272272p683823k204394
$$ -2739606 -1671787 -1101299 -1625005 -666313 2804290 4063039 -1209233 -8893056 -11097450
30389a1097450L568950K375527j677792r20710L357251M398844J323321j334103
$$ -11097450 -7528500 -5152973 -6830765 -7751475 -4394224 4620 1327941 -6162
30381f162k062720k468560j668494J683890L963294Q43579m533514n138154p90843
$$ -6162 -2068882 -4537442 -6205936 -4522046 -558752 284827 -4248687 -9386841 -10177684
30372a0177684K009020N24180j222521k91248J165192J065477P95948J675431
$$ -10177684 -8168664 -7644484 -8867005 -9158253 -7993061 -6927584 -6131636 -4456205
30364d456205K462060J886677M38817r26502j270461L89015K902913K703094q68449
$$ -4456205 -1994145 -107468 331349 -595153 -1865614 -1476599 1426314 4129408 3260959
30355C260959k774681M77934L987350J174589n196697o390478q98196L911063
$$ 3260959 486278 964212 4951562 6126151 929454 -5461024 -6359220 -2448157
30347b448157L475276J128207J63308j063782l354841l309663M90403L895502
$$ -2448157 1027119 2155326 2318634 1254852 -2099989 -5409652 -4919249 -1023747
$$ [...]
##END NTUPLES=NMR SPECTRUM
##END=
