##TITLE=31Pdec_LR-746-R2-H-CHL
 CDCl3, 24 sc
 16.3.2022
##JCAMPDX= 6.0         $$ Bruker NMR JCAMP-DX V2.0
##DATA TYPE= NMR SPECTRUM
##DATA CLASS= NTUPLES
##ORIGIN= UXNMR, Bruker Analytische Messtechnik GmbH
##OWNER= root
$$ XWIN-NMR		Version 3.5
$$ Wed Mar 16 12:42:11 2022 Russian Standard Time (UT+4h)  she@DPX200
##.OBSERVE FREQUENCY= 81.013821
##.OBSERVE NUCLEUS= ^31P
##.ACQUISITION MODE= SIMULTANEOUS
##.ACQUISITION SCHEME= undefined
##.AVERAGES= 24
##.DIGITISER RES= 16
##SPECTROMETER/DATA SYSTEM= spect
##.PULSE SEQUENCE= zgpg30
##.SOLVENT NAME= CDCl3
##.SHIFT REFERENCE= (INTERNAL, CDCl3, 0, 248.564)
##AUDIT TRAIL= $$ (NUMBER, WHEN, WHO, WHERE, WHAT)
$$ ##TITLE= Audit trail, XWIN-NMR		Version 3.5
$$ ##JCAMPDX= 5.01
$$ ##ORIGIN= Bruker BioSpin GmbH
$$ ##OWNER= she
$$ F:/spectra/data/she/nmr/P31/1/pdata/1/auditp.txt
$$ ##AUDIT TRAIL=  $$ (NUMBER, WHEN, WHO, WHERE, WHAT)
(   1,<2022-03-16 12:40:36.42 +0400>,<she>,<DPX200>,
      <created by zg, POWCHK disabled, PULCHK disabled
       configuration hash MD5:
       00 E9 B6 7A A2 85 ED C7 34 08 36 98 17 FE 4E 26
       data hash MD5: 32K
       C0 F9 28 A2 6D 98 DE D8 75 9F EF 07 D3 48 F8 5F>)
(   2,<2022-03-16 12:40:38.78 +0400>,<she>,<DPX200>,
      <Start of raw data processing
       efp BC_mod = 2 LB = 1 FT_mod = 6 PKNL = 1 PHC0 = -9221.791 PHC1 = 195.6757 SI = 64K 
       data hash MD5: 64K
       8B C1 A0 76 6C 06 D7 96 BE A1 7D 1A 50 3C 65 3E>)
(   3,<2022-03-16 12:41:01.89 +0400>,<she>,<DPX200>,
      <pk PHC0 = 20.42769 PHC1 = -41.60001 
       data hash MD5: 64K
       D2 9A 4C 9A E3 05 0B C0 20 7A E6 96 D6 C3 99 2F>)
(   4,<2022-03-16 12:41:26.26 +0400>,<she>,<DPX200>,
      <pk PHC0 = 18.84591 PHC1 = -41.39998 
       data hash MD5: 64K
       F1 1F 6F 1F FB 89 45 A0 A5 A0 9C 65 5E 84 E9 43>)
$$ ##END=
$$ 
$$ hash MD5
$$ 2C B2 ED 96 9C A5 BC DC 99 50 3A 3F 93 64 F9 9E
##$RELAX= 
##$RELAX= 
##$RELAX= 
##$RELAX= 
##$RELAX= 
##$RELAX= 
##$RELAX= 
##$RELAX= 
$$ Bruker specific parameters
$$ --------------------------
##$DU= <F:/spectra>
##$EXPNO= 1
##$NAME= <P31>
##$PROCNO= 1
##$TYPE= <nmr>
##$USER= <she>
##$AMP= (0..31)
100 100 100 100 100 100 100 100 100 100 100 100 100 100 100 100 100 100 
100 100 100 100 100 100 100 100 100 100 100 100 100 100 
##$AQSEQ= 0
##$AQ_mod= 1
##$AUNM= <au_zg>
##$AUTOPOS= <>
##$BF1= 81.014009
##$BF2= 200.13
##$BF3= 200.13
##$BF4= 200.13
##$BF5= 200.13
##$BF6= 200.13
##$BF7= 200.13
##$BF8= 200.13
##$BYTORDA= 1
##$CFDGTYP= 0
##$CFRGTYP= 5
##$CHEMSTR= <none>
##$CNST= (0..31)
1 1 145 1 1 1 1 1 1 1 1 1 1 1 1 1 1 1 1 1 1 1 1 1 1 1 1 1 1 1 1 1 
##$CPDPRG= <waltz16>
##$CPDPRG1= <>
##$CPDPRG2= <waltz16>
##$CPDPRG3= <>
##$CPDPRG4= <mlev>
##$CPDPRG5= <mlev>
##$CPDPRG6= <mlev>
##$CPDPRG7= <mlev>
##$CPDPRG8= <mlev>
##$CPDPRGB= <>
##$CPDPRGT= <>
##$D= (0..31)
0 1 0 0 0 0 0 0 0 0 0 0.03 2e-05 3e-06 0 0 0 0 0 0 0 0 0 0 0 0 0 0 0 0 
0 0 
##$DATE= 1647420035
##$DBL= (0..7)
120 120 120 11 120 120 24 19 
##$DBP= (0..7)
150 150 150 150 150 150 150 150 
##$DBP07= 0
##$DBPNAM0= <>
$$ [...]
##$SUBNAM2= <"">
##$SUBNAM3= <"">
##$SUBNAM4= <"">
##$SUBNAM5= <"">
##$SUBNAM6= <"">
##$SUBNAM7= <"">
##$SUBNAM8= <"">
##$SUBNAM9= <"">
##$SW= 501.771253377433
##$SWIBOX= (0..15)
0 1 3 0 0 0 0 0 0 0 0 0 0 0 0 0 
##$SW_h= 40650.406504065
##$TD= 32768
##$TD0= 1
##$TE= 0
##$TE2= 300
##$TE3= 300
##$TEG= 300
##$TL= (0..7)
0 120 53 12 22 120 120 120 
##$TP= (0..7)
150 150 150 150 150 150 150 150 
##$TP07= 0
##$TPNAME0= <>
##$TPNAME1= <>
##$TPNAME2= <>
##$TPNAME3= <>
##$TPNAME4= <>
##$TPNAME5= <>
##$TPNAME6= <>
##$TPNAME7= <>
##$TPOAL= (0..7)
0.5 0.5 0.5 0.5 0.5 0.5 0.5 0.5 
##$TPOFFS= (0..7)
0 0 0 0 0 0 0 0 
##$TUNHIN= 0
##$TUNHOUT= 0
##$TUNXOUT= 0
##$USERA1= <user>
##$USERA2= <user>
##$USERA3= <user>
##$USERA4= <user>
##$USERA5= <user>
##$V9= 5
##$VALIST= <valist>
##$VCLIST= <CCCCCCCCCCCCCCC>
##$VD= 0
##$VDLIST= <DDDDDDDDDDDDDDD>
##$VPLIST= <PPPPPPPPPPPPPPP>
##$VTLIST= <TTTTTTTTTTTTTTT>
##$WBST= 1024
##$WBSW= 4
##$XGAIN= (0..3)
0 0 0 0 
##$XL= 0
##$YL= 0
##$YMAX_a= 5749
##$YMIN_a= -7086
##$ZGOPTNS= <>
##$ZL1= 120
##$ZL2= 120
##$ZL3= 120
##$ZL4= 120
##$ABSF1= 0
##$ABSF2= 0
##$ABSG= 0
##$ABSL= 0
##$ALPHA= 0
##$AQORDER= 0
##$ASSFAC= 0
##$ASSFACI= 0
##$ASSFACX= 0
##$ASSWID= 0
##$AUNMP= <proc_1d>
##$AZFE= 0.1
##$AZFW= 0.5
##$BCFW= 0
##$BC_mod= 2
##$BYTORDP= 0
##$COROFFS= 0
##$CY= -3
##$DATMOD= 1
##$DC= 0
##$DFILT= <>
##$DTYPP= 0
##$F1P= 0
##$F2P= 0
##$FCOR= 1
##$FTSIZE= 65536
##$FT_mod= 6
##$GAMMA= 0
##$GB= 0
##$INTBC= 1
##$INTSCL= 5.30512e-09
##$ISEN= 30
##$LB= 1
##$LEV0= 0
##$LPBIN= 0
##$MAXI= 10000
##$MC2= 0
##$MEAN= 0
##$ME_mod= 0
##$MI= 50
##$NCOEF= 0
##$NC_proc= -4
##$NLEV= 6
##$NOISF1= 182.463
##$NOISF2= 159.3651
##$NSP= 0
##$NTH_PI= 0
##$NZP= 0
##$OFFSET= 248.5645
##$PC= 4
##$PHC0= -9182.518
##$PHC1= 112.6757
##$PH_mod= 1
##$PKNL= yes
##$PPARMOD= 0
##$PSCAL= 0
##$PSIGN= 0
##$REVERSE= no
##$SF= 81.014009
##$SI= 65536
##$SIGF1= 159.3651
##$SIGF2= -187.1042
##$SINO= 113.3802
##$SIOLD= 16384
##$SREGLST= <1H.CDCl3>
##$SSB= 0
##$STSI= 65536
##$STSR= 0
##$SW_p= 40650.406504065
##$SYMM= 0
##$S_DEV= 0
##$TDeff= 32768
##$TDoff= 0
##$TI= <>
##$TILT= no
##$TM1= 0
##$TM2= 0
##$TOPLEV= 0
##$USERP1= <user>
##$USERP2= <user>
##$USERP3= <user>
##$USERP4= <user>
##$USERP5= <user>
##$WDW= 1
##$XDIM= 65536
##$YMAX_p= 275489881
##$YMIN_p= -24264671
$$ End of Bruker specific parameters
$$ ---------------------------------
##NTUPLES= NMR SPECTRUM
##VAR_NAME=  FREQUENCY,     SPECTRUM/REAL,   SPECTRUM/IMAG
##SYMBOL=    X,             R,               I
##VAR_TYPE=  INDEPENDENT,   DEPENDENT,       DEPENDENT
##VAR_FORM=  AFFN,          ASDF,            ASDF
##VAR_DIM=   65536,         65536,           65536
##UNITS=     HZ,            ARBITRARY UNITS, ARBITRARY UNITS
##FACTOR=    0.620285442955139, 1,           1
##FIRST=     20137.2065510759, 0,            0
##LAST=      -20513.1999529892, 0,           0
##MIN=       -20513.1999529892, -24264671,   0
##MAX=       20137.2065510759, 275489881,    0
$$ Real data points
##PAGE= N=1
##DATA TABLE= (X++(R..R)), XYDATA
$$ [...]
##PAGE= N=2
##DATA TABLE= (X++(I..I)), XYDATA
38630D7838J36676j1426j19990n9776J19836K59507K06514q991j45106n2912P8519
38619D50689J1021j22720k4830K13868J95719j19682l00279j24275Q5068L3253
38609B97832p8577K4784J98793J89577R8444J05471L2894l09497n84028l23700
38599c48007K47751M24493O0557k24425j7665L16262L09997R5406L2393O6222
38589I62984n8286k28687j31943J51355K18501j1874j76410n2221J25647P2416
38579H71482j32575k27202j44744k3917K0940j2876o7120n9676M1769J28060N7091
38568D51232r7278q6766J25791K36477L3788k35787j98800Q3765K09486M2824
38558E64732j23055p1569K0710n2409j45070j7884K19689K54754P2515k7580O7614
$$ plain form
38630 47838 184514 173088 53098 -6678 113158 372665 579179 570188 425082 372170 450689
38619 450689 461710 338990 314160 528028 723747 604065 303786 179511 264579 297832
38609 297832 219255 244039 442832 632409 730853 836324 869218 559721 -24307 -348007
38599 -348007 -100256 324237 384794 160369 142704 458966 768963 864369 896762 962984
38589 962984 904698 676011 544068 695423 913924 902050 725640 673419 799066 871482
38579 871482 738907 511705 366961 343044 363984 351108 283988 224312 266081 394141 451232
38568 451232 353954 267188 392979 629456 663244 427457 228657 312422 521908 564732
38558 564732 441677 370108 390818 338409 193339 175455 395144 649898 722413 694833 762447
38547G62447J01351j09032l29347k42235N7713J87365L0447j17293n763K13784
38537E49437K30170N597k10227k19963o2991J14001K15239K08616J10886L873
38527I44638k7542q758m2403j38187j79988j07477j9797k1920o3959l3744N9292
38516C60155J01051L8512o0885r5902j9162J27804K24552J75051M0867j6077L0833
38505I06799K4570j06301j93704r5601M2775J0063j09902o4978J38786K26858
38495G79365P9736j06197j37118o3383k6169o2283j32915j76405r8034J09511
38485A66108K33178O2463k43121k95580l6647J67836R3844k8402N1777J94849
38475C66305J53463q994p3895l1977j1505j5728J0106J5548j8736K1712J17706
$$ plain form
38547 762447 863798 754766 425419 183184 240897 428262 458709 341416 335653 549437
38537 549437 779607 785204 574977 355014 292023 406024 621263 829879 940765 944638
38527 944638 917096 908338 865935 727748 547760 440283 420486 398566 334607 300863 360155
38516 360155 461206 499718 438833 342931 323769 451573 676125 851176 892043 875966 906799
38505 906799 931369 825068 631364 535763 578538 588601 478699 413721 552507 779365
38495 779365 859101 752904 615786 552403 526234 463951 331036 154631 56597 166108
38485 166108 399286 461749 218628 -76952 -113599 54237 148081 119679 171456 366305
38475 366305 519768 510774 436879 404902 393397 377669 387775 403323 384587 406299 524005
38464E24005N237l60262n13605q6157N20240N88655J01627k62300j41378Q4968
38454D61030K0742j51015r1622R7711Q7433j18668k04179k8807J93161K05068
38444D70854J7515j37432r1023O7815J20270L2249J92R7547Q3348k10078m89177
38433c7920l51654P8750K87685J25876k2649R2225K19959J10842m1768L1675J93705
38422F86726J38311j02856k37957j67892n2968j649L8927J09745J65957J67378
38412G43722J05757k1310j62923k14882j58666j00992q9764k7283J25216K12714
38402D11589J03570r4177j89583j61074r9640k2845Q7029J62948J37368O4244
38392C99429J9589k1834q0623o7370O2421J68128J08665l7126r9928o3692j4458
$$ plain form
38464 524005 529242 168980 -344625 -430782 89458 678113 779740 517440 376062 461030
38454 461030 481772 330757 239135 336846 424279 305611 101432 72625 265786 470854
38444 470854 488369 350937 259914 327729 447999 480248 480440 577987 661335 451257 -37920
38433 -37920 -389574 -310824 -23139 102737 80088 172313 392272 503114 461346 493021 686726
38422 686726 825037 722181 484224 316332 263364 261715 300642 410387 576344 743722
38412 743722 849479 828169 665246 450364 291698 190706 100942 73659 198875 411589
38402 411589 515159 420982 231399 70325 -29315 -52160 34869 197817 335185 399429
38392 399429 419018 397184 316561 249191 311612 479740 588405 551279 451351 387659 373201
38381C73201L7452J00255Q1443o9203j97703j39744J5926P9381P8197J64772K75881
38370G99858J85529j02614l07483k72423j54802j22034r6277N0105K24856K31949
38360D36664P6419k1887P0976K06352J31230j68215l99926l07685l808J76024
38350A96144J12726L659R304M7117L1365N3877J48800J30547q3691k17895k6770
38339D05183K38223J44727k33548l76777p9130K70470K77838M2430j15166j19276
38329D54974r7129q4956k7395M0231K0092p5370j17091j7867J62768K55040J31525
38318F44822j12066j83741N8003L38776K65755j15178l25592r4547K72146L19680
38308A068058K3315k67205l10453j74277l0830L9101M1888J8414J4910L0172L525
$$ plain form
38381 373201 410653 510908 592351 523148 325445 185701 201627 281008 359205 523977 799858
38370 799858 985387 882773 575290 302867 148065 26031 -70246 -20141 204715 436664
38360 436664 513083 491196 562172 768524 899754 731539 331613 23928 20120 196144
38350 196144 308870 312529 321833 368950 400315 454192 602992 733539 649848 431953 405183
38339 405183 643406 788133 554585 177808 98678 369148 646986 689416 574250 454974
38329 454974 357845 272889 245494 285725 305817 230447 113356 95489 258257 513297 644822
38318 644822 532756 349015 407018 745794 1011549 896371 570779 476232 748378 1068058
38308 1068058 1091373 824168 513715 339438 308608 347709 389597 408011 422921 453093 456618
38297D56618q9998j68611j28685K3504J66181J73827L5972j02660o2176J38059
38287D42031K35061M9895k15622k26707j7486N0207j34624k41575l9374K11258
38277A13064J74267k4687k7290J68414K36054O6414r5228p6116r32r485l6546
38266D87929J0156Q1908J18236J49759J60849L8395k13038l76081k89853p6406
38256I1854M7752N8005O2863Q0014N8425L7188Q0129J05334n791j51030r8637
38245C66106J25899J96961m0669k84475j78674J44091K20212p4707l29513j83795
38235c8564J59456K41904L289j80759p9374R7281Q1138n2405o9535L2541Q4898
38224B79870Q3707J67857K82145J80360j50934l61284k01317J12670K22613J30188
$$ plain form
38297 456618 366620 198009 69324 92828 259009 432836 468808 366148 303972 442031
38287 442031 677092 726987 511365 284658 267172 317379 182755 -58820 -98194 113064
38277 113064 287331 262644 235354 403768 639822 706236 611008 534892 533960 524475 487929
38266 487929 498085 579993 698229 847988 1008837 1047232 834194 458113 168260 91854
38256 91854 139606 197611 260474 340488 398913 436101 516230 621564 615773 464743 366106
38245 366106 492005 688966 648297 363822 185148 329239 549451 474744 145231 -38564
38235 -38564 120892 362796 366085 185326 105952 203233 284371 231966 162431 194972 279870
38224 279870 363577 531434 813579 993939 843005 481721 280404 393074 615687 745875
38214G45875R0434J29083K1036k47689l55584j18511J95444K27199L226j73150
38204E17363j63989q6211m1802r055J5264q353k9068M6224J45235Q5867j01414
38193C70061j35815J03634L37077K46344o7089k18511o5501J41140J39328k8182
38183H22486j54832j58908j07259m9651L0033J19613J51833J02070L9685K9127
38173H24197K2504p1738k14946k32596m8389J58784J60671P949j9320J72127L08037
38162A067280J15138k67046m39435k55398K3587J00440j5717j14172p6062N9680
38152A98295K24786L62718L69402J51044j99197l90944k22370J45807L19913J16673
38142A076127k20976l28804j50352P1472J61623J64405J23009l7419k82015l49932
$$ plain form
38214 745875 836309 965392 986428 738739 383155 264644 460088 687287 690513 517363
38204 517363 353374 267163 225361 216306 231570 223217 194149 240373 385608 471475 370061
38193 370061 234246 337880 674957 921301 854212 635701 570200 711340 850668 822486
38183 822486 667654 508746 401487 351836 381869 501482 653315 755385 795070 824197
38173 824197 846701 774963 560017 327421 279032 437816 598487 606436 587116 759243 1067280
38162 1067280 1182418 915372 475937 220539 244126 344566 328849 214677 138615 198295
38152 198295 423081 785799 1155201 1306245 1107048 716104 493734 639541 959454 1076127
38142 1076127 855151 526347 375995 447467 609090 773495 896504 859085 577070 227138
38132B27138q9499K40896K71638L6711r8536N604J02751J5547q0372M140J29915
38121G65933P8402n9298m0813R6106Q3169j17520k16571l6802K14464K52088R2529
38110A111687m5526p7018q7824j10372o8803M4617J07647M1249o8242r0590k2339
38099G34486L4914K2884j7960k9588j5261k1956p2386j33904j50225r4323J1223
38088B67904J13599J55031R7101l3592j22654o2183R4637J53561L0302j02450
38078E91256n0474Q6778L9038j94699k74438J696L64155M11528J31690j44552
38068I61978k10574j45882n1204R4098K54982K69367P7180j49803k28888j85878
38058F85376j41499r9002J9256J92033K79035J69494r7624l35297l33997o9149
$$ plain form
38132 227138 137639 378535 650173 686884 588348 593952 696703 712250 631878 636018 765933
38121 765933 844335 785037 744224 840330 923499 805979 589408 552606 767070 1019158 1111687
38110 1111687 1066161 989143 901319 790947 722144 766761 874408 915657 847415 756825 734486
38099 734486 769400 792284 774324 744736 729475 707519 635133 501229 351004 256681 267904
38088 267904 381503 536534 633635 600043 477389 415206 509843 663404 693706 591256
38078 591256 540782 627560 666598 471899 197461 199157 563312 974840 1106530 961978
38068 961978 751404 605522 554318 648416 903398 1172765 1249945 1100142 871254 685376
38058 685376 543877 444875 464131 656164 935199 1104693 1007069 671772 337775 268626
38048B68626K15197K43375L9175j15008o2176O3141R6595O3444L5697k6060j39069
38037F82937j81313p6563N2295P8565O4605Q4822L6509j43155k43224n4762K42669
38026E43385K96285J08319p26O5966N8265j35827k57102r9167J35365J33411p6214
38015G71960k02266j04573P3756J30478J4422j59672k24065j22366J1038J2456
38005B01168o9971l4800J53143K86670K33825J38486J69368K33216J21497j51812
37995A280790l39716k62847P23K11832J90297j9455j62805l3097K49692L37919
37985A453333R0772k37919l41988k34272j30026j03666o3722J2802L6808j3587
37975D68535m3534R605R8282J44351J08034m875j22906j35304k5125P7871O9440
$$ plain form
38048 268626 483823 727198 766373 651365 589189 652330 748925 812369 848066 822006 682937
38037 682937 501624 425061 477356 555921 620526 705348 741857 598702 355478 300716 543385
38026 543385 839670 947989 947263 1013229 1071494 935667 678565 579398 714763 848174 771960
38015 771960 569694 465121 538877 669355 683777 524105 300040 177674 188712 201168
38005 201168 131197 96397 249540 536210 770035 908521 1077889 1311105 1432602 1280790
37995 1280790 941074 678227 678950 890782 1081079 1061624 898819 865722 1115414 1453333
37985 1453333 1544105 1306186 964198 729926 599900 496234 432512 445314 482122 468535
37975 468535 425001 434606 532888 677239 785273 780398 657492 522188 497063 574934 644374
37964F44374J8823K6998L0466q2242k24084j88394L3960K15568J99049O8676j9802
37953G23392j4327O9132J84930K03443N97l07453l99602j55889J29048J16008
37943E49279j15018j89291K9603K69660K46489J8252j59382j75144j08531l0417
37933C35500O0258J17382M6952j15913j77928m1830J27315J32029M1792O2760
37923E88317J59800P6710k12927l59596j20355K39524K86549J5991j89174j29107
37913C55732N251K0178L593J01075K47438K79837J59928m0883k34377k97368j35675
37902D64729J15414J47632j02646k87618j11568K17611K74919K5183j79492j48182
37892D15982m8168l0175j926J09658J66094O1227o6373m9746N1020Q6523N9281
$$ plain form
37964 644374 663197 690195 720661 638419 414335 225941 259901 475469 674518 743194 723392
37953 723392 709065 778197 963127 1166570 1167167 859714 460112 304223 433271 549279
37943 549279 434261 244970 274573 544233 790722 808974 649592 474448 365917 335500
37933 335500 395758 513140 560092 444179 266251 224421 351736 483765 525557 588317
37923 588317 748117 824827 611900 252304 131949 371473 658022 674013 484839 355732
37913 355732 360983 381161 384754 485829 733267 1013104 1173032 1132149 897772 600404 464729
37902 464729 580143 727775 625129 337511 225943 443554 718473 743656 564164 415982
37892 415982 367814 337639 335713 445371 611465 672692 606319 556573 607593 694116 753397
37881G53397M5436R071j07853k10842j66061j6609R6671J57464K21451K10460
37871I92585r67l02253l93368j74847J05968J82849Q1970M403L0117O9017M0861
37860F36335j5109j5464L6833L2082j03425k52648k00374N6002K23048R1643j19020
37849C69903l9853K81637M00319J13483k27101k11389O9424K06798O4782j00126
37839I27877p6604J1768n0603k09407j98629N2613K37910M3155l62819m48714
37829g3453k5358M23650L54304j02454l69350k45857m6667M1212J89127L96293
37819E41447L09649j24444l53320n940M41191L26165j92275m03081j20532J55801
37809E74661R9362o4163j02691j17242j74374j04109J24297K45523J25391k7796
$$ plain form
37881 753397 798833 807904 700051 489209 323148 306539 403210 560674 782125 992585
37871 992585 991618 689365 295997 121150 227118 409967 491937 496340 526457 595474 636335
37860 636335 621226 605762 642595 674677 571252 318604 118230 174232 397280 488923 369903
37849 369903 330050 611687 1012006 1125489 898388 686999 756423 963221 1028003 927877
37839 927877 851273 863041 812438 603031 404402 457015 694925 738080 375261 -73453
37829 -73453 -98811 324839 679143 576689 207339 -38518 -85185 -43973 145154 541447
37819 541447 851096 726652 373332 367392 808583 1134748 942473 539392 418860 574661
37809 574661 674023 609860 507169 389927 215553 111444 235741 481264 606655 578859
37799E78859o2959j14149k27827j66678J41520L30549J07013k61169l15937l5293
37789b6071K46069L38421K82389J05253j59711l23368k30214k1828N6997J9763
37779B87700M2883J19464J01012M441j6758M2391N5271J7465J8467J6306p9036
37768F09606j52604l0159J50175O3544k63484l94724r1186L25346L97241R8618
37758G12373k11189k47851l8760K03226K89506J77973j7314j42870j45249o5842
37748E14003N4370J71715J93796P6142o4245q3527l6763r9148k70576l45944k03313
37737i3490M8070K30792K51236R1671j57328k54363k7185L25814L95066R4088
37727I04371k07691j88790L2994J58270J22982O3735M9087N4001P2875P7119k0473
$$ plain form
37799 578859 515900 401751 173924 7246 148766 479315 586328 325159 9222 -26071
37789 -26071 219998 558419 840808 946061 786350 462982 232768 210940 267937 287700
37779 287700 330583 450047 551059 555500 538742 581133 636404 653869 672336 688642 609606
37768 609606 457002 426843 577018 640562 377078 -17646 -108832 216514 613755 712373
37758 712373 501184 253333 214573 417799 707305 885278 867964 725094 579845 514003
37748 514003 568373 740088 933884 1010026 945781 862254 825491 726343 455767 109823 -93490
37737 -93490 -45420 185372 436608 528279 370951 116588 89403 415217 810283 904371
37727 904371 696680 507890 540884 699154 822136 885871 934958 988959 1061834 1138953 1118480
37716A118480j97672k57393j06915M4377k1374j73553j26354R8242J84390r767
37706E52461k54783k70316n0843J88483K56959J41985J0300M2254J83974J55989
37696I56463j47723l97458k17184K38049M17747J13682k69056k91823k6654J69432
37686E45475J69261J13672J04767J20595J41669J40581K3620k08880l27416j37258
37676F86086J76080K29502l1493k56362j85531L9220J55075J17555J2382j42315
37666H00199l00179k77005J0562L11266L04682L7984j57748j45397q9301q0161
37656D14902J8352K37483L25865J14462j69883k04863k5771Q2569L0823j9180
37646H04759J6674M9073M7969R6999J70246J07181j08367k65307k17423o4942
$$ plain form
37716 1118480 920808 663415 556500 600877 579503 405950 279596 377838 562228 552461
37706 552461 297678 27362 -23481 165002 421961 563946 574246 616500 800474 956463
37696 956463 808740 411282 194098 432147 849894 963576 694520 402697 376043 545475
37686 545475 714736 828408 933175 1053770 1195439 1336020 1359640 1150760 823344 686086
37676 686086 862166 1091668 1060175 803813 618282 657502 812577 930132 942514 800199
37666 800199 500020 223015 233577 544843 849525 887509 729761 584364 495063 414902
37656 414902 433254 670737 996602 1111064 941181 736318 710547 793116 823939 804759
37646 804759 821433 870506 918475 1015474 1185720 1292901 1184534 919227 701804 636862
37636F36862M1994Q0807M7757j00055k64381k04674J00817L14766J86809o1691
37626G79011o8536J26569J91564L9577r5674q2698m3712n9886m4539K3170J9146
37615G83992q6356j52068j00277l645J01454K35004K80011Q1160k02228j99957
37605G37090R2777K29278q743k50374j39753Q9713L6164k01914k43946p5614K2398
37594B87076K9192J38673K53248Q0894k61418l02595K9345K48048Q0950j11616
37584D71797L6204K98746K54877m8334k20529j12837P4770J50518J08377K4029
37574A037618j9475K2710N8438n9066k52638k43643J5979K08847J39869M8313
37564I56952J57247K32575j2058l28594k47134J57616L30873O0212k53320k31232
$$ plain form
37636 636862 678856 759663 807420 707365 442984 238310 339127 653893 840702 779011
37626 779011 710475 837044 1028608 1068185 972511 889813 846101 786215 741676 764846 783992
37615 783992 697636 545568 445291 441646 543100 778104 1058115 1139275 937047 737090
37605 737090 829867 1059145 1050402 800028 660275 749988 786152 584238 340292 264678 287076
37594 287076 316268 454941 708189 789083 527665 225070 254415 502463 583413 471797
37584 471797 508001 806747 1061624 1013290 792761 679924 754694 905212 1013589 1037618
37574 1037618 1018143 1040853 1099291 1040225 787587 543944 559923 768770 908639 956952
37564 956952 1114199 1346774 1334716 1006122 758988 916604 1247477 1307689 1054369 823137
37554H23137O675J52959J36221M4912q3721j99252j82774l7631L9665o5698j95441
37543D39052j42951O5209K40755K70366J69295M687j30234j49981o8531O804J2858
37532G17329j5752l9556n2901k6594N7480J11296L2420j00130r5911N5966J56662
37521H00309J05965L6940N8923O8892m7042j86030j63391J8303J69428J35585
37511I97882n8152k42409k52118r4598M4084M0949J7532J26448K40350J11075
37501I31043j83568k70542l1191J96406J13339j26913k03282q4953L2963O9786
37491D43088Q9925J13585J11185J01152R1345K3471r0917j16548j5015M9321j4646
37480G85946l9052J02370K11247O2755j76179j59692R7666K39405J01768j02306
$$ plain form
37554 823137 829812 982771 1118992 1163904 1080183 880931 698157 660526 700191 634493 439052
37543 439052 296101 361310 602065 872431 1041726 1046413 916179 766198 697667 704471 717329
37532 717329 701577 662021 609120 582526 640006 751302 783722 683592 587681 643647 800309
37521 800309 906274 943214 1002137 1071029 1023987 837957 674566 692869 862297 997882
37511 997882 939730 697321 445203 350605 394689 435638 453170 579618 819968 931043
37501 931043 747475 476933 445742 642148 755487 628574 425292 340339 373302 443088
37491 443088 533013 646598 757783 858935 950280 973751 882834 766286 751271 800592 785946
37480 785946 746894 849264 1060511 1123266 947087 787395 885061 1124466 1226234 1123928
37470A123928j66860j47602j38653o6389J35172L21989K81478Q53l11454m37057
37460E95405l36073j55841o0218l6390P0422K89230M05613K32520r6535k68565
37450F39568j71277L0727J58320J81188J34239M6613k4124k5921J028j5412m1957
37439I12992Q176R4897O9739j01159k58862k38279m7496J63719K48975J72160
37429A024862K1510q6581j32157j65002j54325n076K21835K87050R6653j24184
37419I84585j45775m8712j9457j1928J09576K30517J23627j37840k40077r5527
37409G48989O1633O2824j1845o8487j18801j15646L2030K10967J70346p1166j87152
37398G13692l3581J26511N5108r1719m9898J26257J71843K78k22936k93059j15302
$$ plain form
37470 1123928 957068 809466 670813 604424 739596 1061585 1343063 1343916 1032462 595405
37460 595405 259332 103491 43273 6883 77305 366535 772148 1004668 908133 639568
37450 639568 468291 499018 657338 838526 972765 1019378 995254 969333 970361 954949 912992
37439 912992 921168 1016065 1085804 984645 725783 487504 440008 603727 852702 1024862
37429 1024862 1046372 959791 827634 662632 508307 503231 725066 1012116 1108769 984585
37419 984585 838810 790098 770641 758713 868289 1098806 1222433 1084593 844516 748989
37409 748989 810622 873446 861601 793114 674313 558667 590697 801664 972010 900844 713692
37398 713692 680111 806622 861730 770011 720113 846370 1018213 1018491 795555 502496 387194
37387C87194K29556M60805L15920q1491k76707o3989K12655J49779j45203k59586
37377I28933r0021P9946N1755n7423p8090k8109k1112r9984k10155k37166q4747
37366A53827J82345L31034K28253M5078K5264J21675Q4085j17963k17551n5886
37356G80161J64635J67375j5062j10907N968J58930J15480j07862k62089j75424
37346G21205L1543J08735R513o8386J0334J31150J38821P9897P6594P4976o3917
37335A250465k67568k86039o2177J46237J21417k560N5653K94759L96368J51259
37325A797814k23359l17827m6969K17314J14648k16121l04765R506L38385K60931
37315A629557j15589l24685j65617R3220J33767k5914j53887j41205p8499p2031
$$ plain form
37387 387194 616750 1077555 1393475 1311984 1035277 971288 1183943 1333722 1188519 928933
37377 928933 838912 918858 970613 913190 835100 806991 785879 685895 475740 238574 153827
37366 153827 336172 667206 895459 940537 965801 1087476 1171561 1053598 836047 780161
37356 780161 944796 1112171 1097109 986202 992170 1151100 1266580 1158718 896629 721205
37346 721205 752748 861483 870996 802610 812944 944094 1082915 1162812 1239406 1314382 1250465
37335 1250465 982897 696858 634681 780918 902335 899775 955428 1250187 1646555 1797814
37325 1797814 1574455 1256628 1209659 1426973 1541621 1325500 1020735 1030241 1368626 1629557
37315 1629557 1513968 1189283 1023666 1116886 1250653 1224739 1070852 929647 851148 779117
37305G79117j06260q9491K1713J59328K01778R9948o9538j87750j93911q7234
37295E27700R6565K54935K50568P6375p5869l3399J20969J66491N6058n4123o8313
37284A317957n7901q2060q8746n1195k8874k0643O7482K16297K39864O9533q6791
37273A494923m5028N4255l0022k31637k61661n8014J21290Q3287n9678j03161
37263I64554m209J56123K81830K51229j4763l61231m58276k00965J07527J42982
37253H64801j6747o3088P4317J88989J61365P8672n174j39759k51203j38557J66474
37242I20090L03303N8842k68351k45920Q7992K97623J69481n4270r9073k2109
37232A147608k2633j07920j28778k5276J20574K03745J54490l6167k36796k23516
$$ plain form
37305 779117 672857 583366 605079 764407 966185 1066133 996595 808845 614934 527700
37295 527700 624265 879200 1129768 1206143 1130274 1096875 1217844 1384335 1440393 1386270 1317957
37284 1317957 1260056 1177996 1089250 1038055 1009181 988538 1056020 1272317 1512181 1581714 1494923
37273 1494923 1449895 1504150 1474128 1242491 980830 922816 1044106 1127393 1067715 964554
37263 964554 960345 1116468 1398298 1649527 1634764 1273533 815257 614292 721819 864801
37253 864801 848054 784966 859283 1048272 1209637 1288309 1283135 1143376 892173 753616 920090
37242 920090 1223393 1282235 1013884 767964 855956 1153579 1323060 1268790 1169717 1147608
37232 1147608 1124975 1017055 888277 863001 983575 1187320 1341810 1305643 1068847 845331
37222H45331M5653K92749K32642m3306k02511j45621q6870j40935j31740N2055
37212G17447J91357P0189j28008o8765J94966K74138L1181k16212j72270M0672
37202I34695J20520k06j60783k26926j54296O7253L40025M32405K21911j02677
37192A471921k53650j90274q5110k9211K3916P7050P4480M9691P9555J03563Q88
37181A322819j59755j79604n2446K1681j4103J6193J67180K09158n269k46079
37171A079775k09415M1488J85547J08974J8265R0488K13143J55194r8119k83570
37161A301770j63167J50682K83248O6874k16468k16531l216Q5352n104j11J78843
37150A462172K37535j627k85029l13206j45733O055J14592K10456J80726j9047
$$ plain form
37222 845331 890984 1183733 1416375 1373069 1170558 1024937 938067 797132 665392 717447
37212 717447 908804 978993 850985 782220 977186 1251324 1282505 1066293 894023 934695
37202 934695 1055215 1055009 894226 667300 513004 580257 920282 1352687 1574598 1471921
37192 1471921 1218271 1027997 942887 913676 937592 1014642 1089122 1138813 1218368 1321931 1322819
37181 1322819 1163064 983460 931014 952695 938592 954785 1121965 1331123 1325854 1079775
37171 1079775 870360 911848 1097395 1206369 1224634 1315122 1528265 1683459 1585340 1301770
37161 1301770 1138603 1289285 1572533 1639407 1422939 1206408 1203192 1288544 1283440 1283329 1462172
37150 1462172 1699707 1698080 1413051 1099845 954112 960167 1074759 1285215 1465941 1446894
37140A446894j74632j26639n9390j73639k98544j84292L1681O3951J0739J76706
37130G12835M65868M58651J00356j70967p5753J46516J57657m8836k67338l34114
37120A144875j69643J47547K99206M6306l23924k60367K43090N35795K08185l19619
37110A551451m13812q2440J69651J06744l3842j5494Q6156Q0428o6013k20051
37100A162778k38076j09571K6671N3041M0467J18402K08164J11994j08480j30617
37090A134773J41345L77173K92544N3177l2047J0644n5311k35216l05030j82864
37080A199188j7373P0601R8682Q3569J067r6955r2392M3357K11564L01179K59928
37069B062415R3003j18076k44204k38706j78173j11914J6421K01955K71395R9509
$$ plain form
37140 1446894 1272262 1145623 1086233 912594 614050 429758 461439 525390 536129 712835
37130 712835 1178703 1637354 1737710 1566743 1490990 1637506 1795163 1746327 1478989 1144875
37120 1144875 975232 1122779 1421985 1468291 1144367 884000 1127090 1662885 1871070 1551451
37110 1551451 1137639 1055199 1224850 1331594 1297752 1282258 1368414 1448842 1382829 1162778
37100 1162778 924702 815131 841802 894843 935310 1053712 1261876 1373870 1265390 1134773
37090 1134773 1276118 1653291 1945835 1999012 1966965 1977609 1922298 1687082 1382052 1199188
37080 1199188 1181815 1252416 1351098 1434667 1435734 1338779 1246387 1289744 1501308 1802487 2062415
37069 2062415 2155418 2037342 1793138 1554432 1376259 1264345 1280766 1482721 1754116 1853625
37059A853625j65412k61350j34767M9088J57927J93725J77176Q9286n7792j90122
37049A711384k26149j31994L2806J16199K7187r4521k6936J73708J91140n8886
37039A713938k22942j7692K99400K83027m4030k55256j61028j195J2176k6338
37029A580060Q646L5359m1659j36489j36966p2407N159J29020K70102K60723L9738
37018A941286j73746j49443J9552O4076m9864r4935L5746J59193R4317o9118j25639
37007A651425m6389L8077O5829Q6074J03942N2154o1857j27764r5914m0755j4412
36996A610410K5532Q1048O3287k7942m1923O9754J12490m6263j96905p3953J99198
36985A774733K65622P8705m9028M4487J53158P7651r3029j96706k15400j44605
$$ plain form
37059 1853625 1688213 1426863 1292096 1341184 1499111 1692836 1870012 1959298 1901506 1711384
37049 1711384 1485235 1353241 1386047 1502246 1529433 1434912 1407976 1581684 1772824 1713938
37039 1713938 1490996 1473304 1772704 2055731 2011701 1756445 1595417 1594222 1606398 1580060
37029 1580060 1588706 1624065 1582406 1445917 1308951 1236544 1241703 1370723 1640825 1901548 1941286
37018 1941286 1767540 1618097 1637649 1701725 1651861 1556926 1592672 1751865 1846182 1777064 1651425
37007 1651425 1605036 1643113 1708942 1795016 1898958 1951112 1889255 1761491 1665577 1624822 1610410
36996 1610410 1635942 1716990 1780277 1752335 1710412 1780166 1892656 1846393 1649488 1575535 1774733
36985 1774733 2040355 2119060 2070032 2114519 2267677 2345328 2252299 2055593 1840193 1695588
36975A695588P4835L29188L14640l2562l31445k37476P2660J78845J9451j02879
36965A980845l2412N3630o611j00629l9355J48788K45617J16992j16350k05951
36955B044564o5781J26808J76848J25982J19456J14497l2776k25100j80748J14567
36945B318317L28909K65148J07395M7060j954j16997j37324J3178R3505m8088
36935B869149j36673Q4280L39969K03937k00614l58926j19958J76294K80729K81971
36925C420158K57592J24595p6808j35304j6165O4884P099m2733p084j1662r0923
36914C493649o2391J56429L64736L70709K53432J85319J76571J37701N5219n607
36904E125767L1706K25829N29793P34485O69155M48519L26753L34986K98190J57909
$$ plain form
36975 1695588 1770423 2099611 2414251 2381689 2050244 1812768 1885428 2064273 2083724 1980845
36965 1980845 1948433 2002063 1995452 1894823 1855468 2004256 2249873 2366865 2250515 2044564
36955 2044564 1978783 2105591 2282439 2408421 2527877 2642374 2609598 2384498 2203750 2318317
36945 2318317 2647226 2912374 3019769 3066829 3064875 2947878 2810554 2823732 2917237 2869149
36935 2869149 2732476 2816756 3156725 3360662 3160048 2801122 2681164 2857458 3138187 3420158
36925 3420158 3677750 3802345 3725537 3590233 3574068 3638952 3646051 3603318 3596234 3584572 3493649
36914 3493649 3431258 3587687 3952423 4323132 4576564 4761883 4938454 5076155 5131374 5125767
36904 5125767 5157473 5383302 5913095 6647580 7316735 7765254 8092007 8426993 8725183 8883092
36894H883092n2816n38856j594199k959742l746394l320598k029749p74969o8168
36885f202399K14239L45798M00819L69079L16708L32956M31091N34691N21921
36876b735097L37380J06399M0902J68958K81264K31118J43202J95896L29247L40526
36866e60205J89084L6543J7066J01525J73787J47936L5389l9485N5270K74974
36856D31884L97335K84835O4278m9839k4691J6536J7718M1751J20670J81313J37964
36845A619754j6494k17718l78030m40378m27945m20294m50131m61685l98158k72268
36835a863347j16749N7853K04567K31269J36194O7947J33305K09393R8297j50949
36825i92220k45617k7420K93949L90443K08809j3077p4370l231Q5918J56404J84461
$$ plain form
36894 8883092 8830276 8291420 6697221 3737479 -8915 -3329513 -5359262 -6134231 -6202399
36885 -6202399 -5988160 -5642362 -5241543 -4872464 -4555756 -4222800 -3791709 -3257018 -2735097
36876 -2735097 -2397717 -2291318 -2250416 -2081458 -1800194 -1569076 -1425874 -1229978 -900731 -560205
36866 -560205 -371121 -334578 -317512 -215987 -42200 105736 141125 101640 156910 431884
36856 431884 829219 1114054 1178332 1128493 1103802 1120338 1138056 1179807 1300477 1481790 1619754
36845 1619754 1603260 1385542 1007512 567134 139189 -281105 -731236 -1192921 -1591079 -1863347
36835 -1863347 -1980096 -1922243 -1717676 -1486407 -1350213 -1282266 -1148961 -939568 -841271 -992220
36825 -992220 -1237837 -1265257 -971308 -580865 -372056 -385133 -459503 -462734 -376816 -220412 -35951
36814c5951Q3740j42688k76719j24276J61212K35830N6230o1524M8094J41864
36804H5812O429j45776k8174K01441J73634o3143r3266J82996L64526J72164j40171
36793G16472k10480q0582j2651l8592J380J18172J64125Q9373l5487j91151l71275
36782A49304m25320k00070J53699K68699L3577k24863j50233J94384M20091K79945
36772D99213p4456k82850j51192J60909L06975J27662j58279k09406M964J64628
36762C88168M5727j57170j16254J37505K50026O3004j61160j29466R0953K43024
36752F54357K63622K64802K40655O8856k06150l48667k48247n6210N9511J05316
36742G97845J30637R9030M701m7467n739K6720k0746l7850Q3800K43238K62366
$$ plain form
36814 -35951 47789 -94899 -371618 -495894 -334682 -98852 -42622 -104146 -56052 85812
36804 85812 92241 -53535 -81709 119732 293366 230223 136957 319953 684479 856643 716472
36793 716472 505992 425410 412759 374167 375547 493719 657844 747217 711730 520579 149304
36782 149304 -276016 -476086 -322387 -53688 -20111 -244974 -395207 -200823 219268 499213
36772 499213 424757 141907 -9285 151624 458599 586261 427982 218576 223540 388168
36762 388168 433895 276725 160471 297976 548002 611006 449846 320380 411333 654357
36752 654357 917979 1182781 1423436 1492292 1286142 937475 689228 633018 692529 797845
36742 797845 928482 1027512 1032213 984746 979007 1005727 984981 947131 1030931 1274169 1536535
36731A536535J31290k1197j11435j16660k774K07758L63920L19726Q3075k55574
36721B134664o17978q49244p22406k48945J65245J50467j28913k02504L0832J96696
36711i2086N3258j46784o9213K01360L20917J86492J4060k6143J464J2467Q2071
36700E37863K67550L98853K66724j8828j08922Q0528K07659K2094k09363r9224
36690A344934K26569L03431N2923j48623j57005k81174o29190p57693l37488K37343
36680a45973L53258K0943k33073j40411P8372J60854Q7544m9458j51278j11307
36670a30529N7258J64935J07445L5716P1648Q3652r695m495J89465K39007q3003
36659G21404l74410j68374K40910K06778j97579k72524J54018M49986K14915j36091
$$ plain form
36731 1536535 1667825 1646628 1535193 1418533 1415759 1623517 1987437 2307163 2390238 2134664
36721 2134664 1516686 667442 -54964 -303909 -138664 11803 -117110 -319614 -288782 -92086
36711 -92086 -38828 -185612 -254825 -53465 267452 453944 468004 441861 443325 455792 537863
36700 537863 805413 1204266 1470990 1452162 1343240 1423768 1631427 1653521 1444158 1344934
36690 1344934 1571503 1874934 1927857 1779234 1622229 1341055 711865 -45828 -383316 -145973
36680 -145973 207285 228228 -4845 -145256 -66884 93970 181514 132056 -19222 -130529
36670 -130529 -73271 91664 199109 234825 306473 390125 380430 375935 565400 804407 721404
36659 721404 346994 178620 419530 626308 428729 156205 310223 760209 975124 839033
36649H39033j13618J43343K60954K10526J23196m0785k66899k99728l7846K01032
36639A019208J31520q5436j81432k13061l19465l50473j22478J83923K63153J51768
36629D77227J07589J67459J64397P6055L4539N8033N2646K3158L2222J0609j47004
36618A056930l39926l48593j49988N3195J13766P8367M7156N3205R5656J58787
36608H18555J70236N3242j29840j74434L2383L01431K94127m2206l22004j90935
36598H10555J48852J97396p0408j33134K23332M88821K28190j80769j55833J32061
36588A689063J04661j83250j59177K06882L19195J2111j61231Q0174K76593R6200
36578B281221p9819J05862L30054J93283r0612j64585j87032m35984o89543o14328
$$ plain form
36649 839033 725415 868758 1129712 1340238 1463434 1422649 1155750 856022 818176 1019208
36639 1019208 1150728 1065292 883860 670799 351334 861 -121617 62306 325459 477227
36629 477227 584816 752275 916672 992727 1027266 1085299 1137945 1161103 1193325 1203934 1056930
36618 1056930 717004 368411 218423 271618 385384 463751 510907 564112 659768 818555
36608 818555 988791 1042033 912193 737759 770142 1071573 1365700 1323494 1001490 810555
36598 810555 959407 1156803 1086395 953261 1176593 1665414 1893604 1712835 1557002 1689063
36588 1689063 1793724 1610474 1451297 1658179 1977374 1989485 1828254 1908428 2185021 2281221
36578 2281221 2201402 2307264 2637318 2830601 2739989 2575404 2388372 1952388 1262845 648517
36568F48517m14931m73374o27781m39020K7545K92913K08097N9099K3515K2651
36558f72769M1656J41111K12587J22546O766M9613J15098p409j62944p7015J24030
36547a06730J15757m5135m9121P9053N9569n5792N5183L50945M21533J71099l4428
36536I61933L996N4860m8111j26483l7035R2844J60648K24135K28294K5541k18469
36525A322153j27738K04748J74100m17932r22584p26403j27001J65534M5873m0385
36515d49635O4699Q4306m5997P87L30455N33105K64283k19577l99406j56707J75785
36504A82098K96920K07374M9178q4519j49978j32796q0017m8650m486J23082K80787
36493F38993L16764J93737M3663k9405n7386p0910k6439M7977K5175q3559p2911
$$ plain form
36568 648517 233586 -239788 -867569 -1306589 -1279044 -986131 -778034 -718935 -695420 -672769
36558 -672769 -631113 -490002 -277415 -154869 -148103 -98490 16608 9199 -153745 -230760 -106730
36547 -106730 9027 -36108 -85229 -6176 53393 -2399 52784 403729 825262 996361 961933
36536 961933 965929 1020789 972678 846195 809160 902004 1062652 1286787 1515081 1540622 1322153
36525 1322153 1194415 1399163 1573263 1155331 232747 -493656 -620657 -455123 -409250 -449635
36515 -449635 -384936 -300630 -346627 -345840 -15385 517720 782003 562426 163020 6313 182098
36504 182098 479018 686392 735570 651051 501073 368277 288260 239610 235124 358206 638993
36493 638993 955757 1149494 1193157 1163752 1106366 1035456 1009017 1056994 1082169 998610 925699
36482I25699J07504J78908m9169l11123k61761l3136j0890j82051j83388L0484
36472B11077Q8467j31993k44883K4802L87957M36333K03248j2726j09670j64668
36462F87944j60142k5496J64773K60648K24851J18966R824l4002m225m6424k74909
36451I21808m77619l15441J21493L25219P3574k55723k65526n4370R3183J59383
36441C25981K28144J93987j5609j83315r8749J04352J95770J99258K12942J41222
36431A303983p4369k06383p0649J16829O5734j06082p9846J40818K73089J97925
36421A561049M2612o8630q3458K0583J23280M963k80346l51354q3493R3680j51126
36410H27760m47049k54952K65346M79075K13019q6724p4842J24365K68052K64649
$$ plain form
36482 925699 1033203 1212111 1162942 851819 590058 556922 546032 363981 180593 211077
36472 211077 299544 167551 -77332 -52530 335427 771760 975008 962282 852612 687944
36462 687944 527802 502306 667079 927727 1152578 1271544 1281368 1247366 1243141 1196717 921808
36451 921808 444189 128748 250241 575460 649034 393311 127785 73415 166598 325981
36441 325981 554125 748112 732503 549188 450439 554791 750561 949819 1162761 1303983
36431 1303983 1229614 1023231 952582 1069411 1135145 1029063 949217 1090035 1363124 1561049
36421 1561049 1603661 1535031 1451573 1472156 1595436 1600399 1320053 968699 885206 978886 827760
36410 827760 380711 125759 391105 870180 1083199 996475 921633 1045998 1314050 1578699
36400A578699O9603k87706n41107m10660k2546K07088J18670n4816q9940j2495
36390E54790P6176J43812J69797J41744J04104P4836J032q3900m0686Q7999L0558
36379A260262k52576l66417n2515L36340L22951Q958j44826k9227Q4761O9095
36369A236806K6659l2460j64412k30042o6890J65986J93129N8242j5679m5263
36359A126076j57918k11238j284K78605K60284r701j54932n5519Q6785J64103
36349A325261J98044Q3445k24870l87720o1805M75557O06867K32638j63111k64112
36339A820194k12942j63468p2005K1850k0327j24416q8631L2923L9280K331J21147
36328A355936K47847P5451k63975l34833j01190N9385L3683R0733K90210L43588
$$ plain form
36400 1578699 1648302 1360596 819489 408829 386283 593371 712041 657225 567285 554790
36390 554790 630966 774778 944575 1086319 1190423 1265259 1266291 1182391 1141705 1229704 1260262
36379 1260262 1007686 641269 588754 925094 1248045 1257003 1112177 1082950 1167711 1236806
36369 1236806 1263465 1231005 1066593 836551 769661 935647 1128776 1187018 1171339 1126076
36359 1126076 968158 756920 755636 1034241 1294525 1284824 1129892 1074373 1161158 1325261
36349 1325261 1523305 1606750 1381880 994160 932355 1407912 2014779 2247417 2084306 1820194
36339 1820194 1607252 1443784 1371779 1393629 1373302 1248886 1160255 1193178 1232458 1234789 1355936
36328 1355936 1603783 1679234 1415259 1080426 979236 1038621 1072304 1163037 1453247 1796835
36318A796835J53608j9222j4867N5301J23688K03254J42820j63963l94512j73123
36308A709819K48753L05026L1626l5028J56236R1996l10175m67964j38202J33093
36298A725180p9730m07786l38476K3027K58961K55307J49024K7925l6394K2084
36288A599122P8662l5238j52775J7938L04471K54203p4485j65499N0235R4517
36278A971151j22026j03099K39204K83874j86101m42423K9248O10920N14039J2494
36268B807281r8144K08811L08037N5599m1349K48003M75768J75343n14209j029691
36258B595449r81573n27097k17089l89310p30327o72554j87724K04307K33655
36249f72263J81611K63076K66408N9584o9582R0955K91417K61737J30980R8010
$$ plain form
36318 1796835 1950443 1931221 1916354 1971655 2095343 2298597 2441417 2277454 1882942 1709819
36308 1709819 1958572 2263598 2295224 2260196 2416432 2508428 2198253 1730289 1592087 1725180
36298 1725180 1645450 1237664 899188 922215 1181176 1436483 1585507 1613432 1577038 1599122
36288 1599122 1677784 1642546 1489771 1507709 1812180 2066383 1991898 1826399 1876634 1971151
36278 1971151 1849125 1746026 1985230 2269104 2083003 1640580 1669828 2280748 2794787 2807281
36268 2807281 2709137 2917948 3225985 3281584 3240235 3488238 3964006 4139349 3625140 2595449
36258 2595449 1613876 1086779 869690 480380 -249947 -922501 -1110225 -905918 -672263
36249 -672263 -490652 -227576 38832 98416 28834 119789 411206 672943 803923 901933
36239I01933R0254M5193J06518K43519J31205k66005m70985k24130N1102n7223
36229E51381k66614j20781K24213L04381J26626P1068K22605L25576K74665J99349
36219A912469J48733O3540j6376j1181K0301k0027j13305k18477l38829l79810
36209A047038j97864R6106J91906N2763k1407Q8234J53315O8083M043m6216l16337
36198A119664o54703n09701J46748N37269J71785l90934m13494m6086J08715J6526
36188H5789Q3147L33318M20686K74958J35892P4885l489k3779J20181K25335K9695
36177A756618l14151m18665k04786P7044K30638K11346J6162k23101k30580M4032
36167I44557K61182J63807m2011n7603M2393K9481o2976o8651o05M7145Q1186
$$ plain form
36239 901933 992187 1037380 1143898 1387417 1518622 1252617 781632 557502 608604 551381
36229 551381 284767 163986 388199 692580 819206 890274 1112879 1438455 1713120 1912469
36219 1912469 2061202 2124742 2108366 2097185 2117486 2097459 1984154 1765677 1426848 1047038
36209 1047038 849174 945280 1137186 1189949 1168542 1256776 1410091 1478174 1482217 1436001 1119664
36198 1119664 464961 -44740 102008 639277 811062 420128 6634 -39452 69263 85789
36188 85789 168936 502254 922940 1197898 1333790 1408675 1405186 1381407 1501588 1726923 1756618
36177 1756618 1442467 1023802 819016 896060 1126698 1338044 1354206 1131105 900525 944557
36167 944557 1205739 1369546 1327535 1269932 1312325 1341806 1278830 1210179 1209574 1256719 1337905
36156A337905P5798n9521k02874p6459K38015K91041k963j45714J32283L92575
36146A980086K11695j54967k77692k04634j33164N4043L96694M98633J35614k38796
36136B267512j76494M2671q426q8629K12518N78917L99054j76452m28671j75214
36126B446786Q1427M3904m0934N6421K35430L47023L32671J22677k07344l10490
36116C107571j2392L04204K16583m1136O2870M37260L92836l66920j230115j298959
36106A571802l56968P98362R93504j11936j451987j616780n43268M46701M35839
36097A65269m4461j17310J57604K54919J97151K86942L74487J97676M797P9582
36087A556656R4936k86287o25170l60536J69864K51326k4561k1981K86141L71050
$$ plain form
36156 1337905 1413703 1354182 1151308 1074849 1312864 1603905 1600942 1455228 1587511 1980086
36146 1980086 2191781 2036814 1759122 1554488 1421324 1475367 1872061 2370694 2506308 2267512
36136 2267512 2091018 2133689 2125263 2036634 2249152 2828069 3227123 3050671 2622000 2446786
36126 2446786 2528213 2572117 2531183 2587604 2823034 3170057 3502728 3625405 3418061 3107571
36116 3107571 3095179 3399383 3615966 3574830 3637700 4074960 4467796 4100876 2870761 1571802
36106 1571802 1214834 2013196 3006700 2894764 1442777 -174003 -717271 -270570 165269
36097 165269 120808 3498 161102 416021 613172 900114 1274601 1472277 1477074 1556656
36087 1556656 1651592 1365305 740135 379599 549463 800789 776228 754247 1040388 1411438
36077A411438J49120J5918L0125o9925j76103J6442K87290J83260j11375n1359
36067A684831K66948K68387n2478j66094j9221o8971l18017k63264J32918L36634
36057A801673K05197J66692L20336K52945p7141j64855R1053J23918k92088n71980
36047A855750k69210J90960J85973k25307n29989m76454k04201O2110J91847K00803
36037I82282K16963K50552J11780k07810l20860P529L77300L08102j0597r8328
36027A616913j5496j30354l10610j33284K56934L13211L5023n1627J62475K39484
36017A982669L4568r5204J0926J06103P5179M5144k7396k37983k98308P6355M79991
36006B152044L14218j61753j79870K31151K93358j55924m07649j32736J58370
$$ plain form
36077 1411438 1560558 1576476 1606601 1536676 1360573 1377015 1664305 1847565 1736190 1684831
36067 1684831 1951779 2220166 2167688 2001594 1982373 1913402 1595385 1332121 1465039 1801673
36057 1801673 2006870 2173562 2493898 2746843 2669702 2504847 2595900 2719818 2427730 1855750
36047 1855750 1586540 1777500 1963473 1738166 1208177 731723 527522 589632 781479 982282
36037 982282 1199245 1449797 1561577 1353767 1032907 1040436 1417736 1725838 1715241 1616913
36027 1616913 1601417 1471063 1160453 1027169 1284103 1597314 1632337 1580710 1743185 1982669
36017 1982669 2017237 1922033 1932959 2039062 2114241 2159385 2131989 1894006 1595698 1672053 2152044
36006 2152044 2466262 2304509 2124639 2355790 2649148 2493224 2085575 1952839 2111209
35997B111209J49908J90732M02703L15922j76318m24132q1539K79452J48182j08017
35987B808102J1522K75027K32298K8708O4401K58058K31051o8092l83942n54127
35977B903006n46114l46332q4911j5833j62857k47171j12786O9050J28150J10768
35967A694970P9420J5688k1775M7947J18451N8804M970J25618K44203J30849j9983
35956B479162P3598J84156n3698l77504k45486J84138K43666j14779k42163Q6706
35946B217796L32765J50881j08277j01389J2537M6075J19151K60335K33301m798
35936C158377j60930q8453L7905J07678J76543J72693j1716j72499m7598J68864
35926C340864J13533q5753m5823J43190J02385q8449n2393J37338J26709K1230
$$ plain form
35997 2111209 2261117 2451849 2854552 3170474 2994156 2570024 2488485 2767937 2916119 2808102
35987 2808102 2819624 3094651 3326949 3355657 3420058 3678116 3909167 3841075 3457133 2903006
35977 2903006 2356892 2010560 1925649 1909816 1746959 1499788 1387002 1456052 1584202 1694970
35967 1694970 1774390 1790078 1768303 1816250 1934701 1993505 1998475 2124093 2368296 2499145 2479162
35956 2479162 2552760 2736916 2683218 2305714 2060228 2244366 2488032 2373253 2131090 2217796
35946 2217796 2550561 2701442 2593165 2491776 2504313 2550388 2669539 2929874 3163175 3158377
35936 3158377 2997447 2908994 2946899 3054577 3231120 3403813 3392097 3219598 3172000 3340864
35926 3340864 3454397 3368644 3322821 3466011 3568396 3479947 3427554 3564892 3691601 3712831
35916C712831J61249L54309J87480j03203l747K50446L7925m42341m37297J0695
35906C728347J53289q6214n6052K89688K85152j02032j22276L37755M76972L3960
35896D938589k34658P5787L67206K10774M0844J88366K72303N5538o0498J31436
35886E985687K13866m9026l27548m43601n86968o21854j78817L77682J89109o45077
35876C913453j020421n30108j3741n2780j56566J01454L43244K91903K85185M02329
35866C563952J93757k77626k82168K57894M99959J62468q056K79347K90321k33811
35856D446037m27683J09740M65889R748m78160k12957K82032K67583O5072K10897
35846D738198L61950Q6083j69029R3052M35139K77893q0708j05727L4331k8976
$$ plain form
35916 3712831 3874080 4228389 4415869 4312666 4308919 4559365 4597290 4154949 3717652 3728347
35906 3728347 3881636 3795422 3739370 4029058 4314210 4212178 4089902 4427657 4904629 4938589
35896 4938589 4703931 4779718 5146924 5357698 5398542 5586908 5859211 5914749 5854251 5985687
35886 5985687 6199553 6150527 5822979 5379378 4792410 4170556 3991739 4369421 4558530 3913453
35876 3913453 2893032 2362924 2349183 2296403 2139837 2241291 2584535 2876438 3161623 3563952
35866 3563952 3757709 3480083 3197915 3455809 3955768 4118236 4110180 4389527 4679848 4446037
35856 4446037 4018354 4128094 4593983 4603731 4125571 3912614 4194646 4462229 4527301 4738198
35846 4738198 5100148 5186231 5017202 5110254 5545393 5823286 5742578 5636851 5671182 5642206
35836E642206j07067O3893K28685J24504m5853j23828k72056l89907q8039M50429
35826E482967N33267J50025K7258K58077J28483l94472m14650K23454N04378M1266
35816F540053k13062K64075O09094J98818k32246k964L49319K22344j8649k1629
35806G695153j89915o23467o01027P9084N23162K55738j1107J82730K48073j05818
35796G452606j98904K18165L84313L8433m8010L18002K98961j91561j15690O04476
35786H760791O56375k21935n33087L07028Q36559J92790l93170r9L69587m6253
35776I928586k63851L20037N50970j99390o15584J26605P66592L79387N4428N38704
35766A1586484O56797j91971n11649M58453J016005R3754o14228K13014J013699
$$ plain form
35836 5642206 5535139 5599032 5827717 5952221 5906368 5782540 5510484 5120577 5032538 5482967
35826 5482967 6016234 6166259 6193517 6451594 6580077 6185605 5770955 5994409 6498787 6540053
35816 6540053 6326991 6591066 7200160 7398978 7166732 7163768 7513087 7735431 7716782 7695153
35806 7695153 7505238 6881771 6280744 6359828 6882990 7138728 7127621 7310351 7558424 7452606
35796 7452606 7253702 7471867 7856180 7894613 7846603 8164605 8463566 8272005 8156315 8760791
35786 8760791 9417166 9195231 8662144 8969172 9805731 9998521 9605351 9605252 9974839 9928586
35776 9928586 9664735 9984772 10535742 10336352 9720768 9847373 10613965 10993352 11047780 11586484
35766 11586484 12243281 12051310 11539661 11998114 13014119 13107873 12493645 12706659 13720358
35757A3720358L31140m30745K11545R64957L65015l64443K00562Q89515L84332
35748A6272236j10451N97093J131801L18214k69122O41216J346057M71415j83716
35739B0214743Q30156J589590N48275k38860Q99021J812696P65185M6313J390912
35730B7858031K174384N42972l93659J652496L248172J547048P4083K099691M012136
35721D2815354K237944O64830L267891N776625L683693J710933M966754Q063338
35713G3187362N165259K801320P923656J1990464N808524J253717J2237063J9288925
35705A39656290j2553786p4350309j07295546p4898901j2389026K0653501J3808442
35698a07369335K161364O364559J2659788Q360085K621861M792760P992984M863868
$$ plain form
35757 13720358 14051498 13620753 13832298 14797255 15162270 14797827 14998389 15887904 16272236
35748 16272236 16161785 16758878 17890679 18208893 17939771 18580987 19927044 20398459 20214743
35739 20214743 21044899 22634489 23182764 22943904 23842925 25655621 26420806 26467119 27858031
35730 27858031 30032415 30575387 30181728 31834224 35082396 36629444 36703527 38803218 42815354
35721 42815354 45053298 45718128 48986019 54762644 58446337 60157270 65124024 73187362
35713 73187362 78352621 81153941 89077597 101068061 106876585 108130302 120367365 139656290
35705 139656290 127102504 52752195 -54543351 -129442252 -141831278 -121177777 -107369335
35698 -107369335 -105207971 -98843412 -86183624 -77823539 -75201678 -70408918 -62415934 -57552066
35690e7552066J048205K763066N304024L265755N83367J918162L801858K113413
35682c6754216K369J227326K909591J535229k92879P39864K304633J274303k80025
35673b7333805N79109J993909J172401k71396K68867J406361P91945k90831L01817
35664b1381623J321719P28734l07183J70291J115108P03733j19737K91759J004211
35655a6472988M89245k98445J32421Q62661M36230l03035K7579O62940L54039
35646a4109353j36289L23259Q97611M62693j45564J77010O16450J37951l85366
35637a2161598R8643O94028K89832k82528O8414N37971O2679n25647j02814N60063
35627a0760957L12782j85500J22848N76302J85870k88232K10050Q48714L58351
$$ plain form
35690 -57552066 -56503861 -53740795 -48436771 -45171016 -44587649 -42669487 -38867629 -36754216
35682 -36754216 -36751847 -35524521 -32614930 -31079701 -31372580 -30632716 -28328083 -27053780 -27333805
35673 -27333805 -26754696 -24760787 -23588386 -23859782 -23590915 -22184554 -21392609 -21683440 -21381623
35664 -21381623 -20059904 -19331170 -19638353 -19468062 -18352954 -17649221 -17768958 -17477199 -16472988
35655 -16472988 -15983743 -16282188 -16149767 -15287106 -14850876 -15153911 -15126332 -14463392 -14109353
35646 -14109353 -14245642 -13922383 -13024772 -12562079 -12707643 -12530633 -11914183 -11776232 -12161598
35637 -12161598 -12062955 -11368927 -11079095 -11361623 -11293209 -10755238 -10692559 -11218206 -11321020 -10760957
35627 -10760957 -10448175 -10633675 -10510827 -9934525 -9748655 -10036887 -9826837 -8978123 -8619772
35618h619772n45641l87074M68095N90026j520j68098K04301L07344Q2063Q3039
35608g987237K01914J7579j54649J12017L55936O8327k58032q7024P1123k88988
35598g949034n37842p8536M01013J48244k34886M9709M69813K20296k04605K1373
35588g694455M57051K68631j61631j3569L74835J94752k57844j67702K64078K78146
35578f457708k0960k9641J22384l0595k10986O6521M20378K26988k14886k42557
35568f371062M075J8195o5931Q9908K11154M517j10715J88484L48750o5571m28435
35557f176631j22881L10589J74974j20947N6645L16739Q8294j58391J87366N90223
35547d854020L07605j84026o8419K70193J1611m99498l95117Q4280R0027k25463
$$ plain form
35618 -8619772 -9165413 -9552487 -9084392 -8494366 -8495886 -8663984 -8459683 -8152339 -8070276 -7987237
35608 -7987237 -7785323 -7767744 -7922393 -7810376 -7454440 -7386113 -7644145 -7731169 -7660046 -7949034
35598 -7949034 -8486876 -8565412 -8164399 -8016155 -8251041 -8201332 -7731519 -7511223 -7715828 -7694455
35588 -7694455 -7237404 -6968773 -7130404 -7143973 -6769138 -6574386 -6832230 -6999932 -6735854 -6457708
35578 -6457708 -6478668 -6508309 -6385925 -6416520 -6627506 -6560985 -6140607 -5913619 -6128505 -6371062
35568 -6371062 -6366987 -6348792 -6414723 -6324815 -6113661 -6109144 -6219859 -6031375 -5682625 -5748196 -6176631
35557 -6176631 -6299512 -5988923 -5813949 -5934896 -5878251 -5561512 -5473218 -5631609 -5444243 -4854020
35547 -4854020 -4546415 -4730441 -4798860 -4528667 -4517056 -5016554 -5411671 -5327391 -5237364 -5462827
35537e462827q4124L73237L78507J0904k9454J91637M4710l52621l41221J4903
35527e256349J17677J5031J72353L75397J06889k89441r4975M18768M03766m6495
35517d077379j19229J89883J36666l01757l80133K640J52256r6509j45951J55709
35507d483804K45667m4253j93499J687J19987p019k7376J55247J89016k851q8977
35496d136175l790j0409p4534P2074K68078J02441k71770k98910K1715J39470
35486d191810q0525j85279K3663K18221J86819R2767M6864L21K8374J78696J77924
35475c503965j42334l57996m0611M31483L89743m2193j91818L5473J31468l6373
35465c327123q9198O0625R4279k1058J1284J58066P9112j79018k06400L9960J83701
$$ plain form
35537 -5462827 -5546951 -5173714 -4795207 -4784303 -4813757 -4622120 -4577410 -4930031 -5271252 -5256349
35527 -5256349 -5138672 -5123641 -4951288 -4575891 -4469002 -4758443 -4853418 -4434650 -4030884 -4077379
35517 -4077379 -4196608 -4006725 -3870059 -4171816 -4551949 -4549309 -4397053 -4493562 -4639513 -4483804
35507 -4483804 -4238137 -4282390 -4475889 -4474202 -4354215 -4361234 -4388610 -4233363 -4044347 -4047198 -4136175
35496 -4136175 -4139965 -4150374 -4224908 -4152834 -3884756 -3782315 -4054085 -4352995 -4331280 -4191810
35486 -4191810 -4272335 -4457614 -4433951 -4215730 -4028911 -3936144 -3889280 -3888959 -3860585 -3681889 -3503965
35475 -3503965 -3646299 -4004295 -4044906 -3613423 -3223680 -3265873 -3457691 -3422218 -3290750 -3327123
35465 -3327123 -3416321 -3355696 -3261417 -3282475 -3271191 -3113125 -3034013 -3213031 -3419431 -3379471 -3195770
35454c195770J05756N0735P9998J7807j02717j11506j21282l01222l87811n4098
35444d020110L92272L67918m4570k14172M4977K81438J90995l7346j68086j65370
35434c372054j4444K25647K82021K4305k10758r1776J65374J95843R3717R5567
35424b606558M5427k13776l22703K3446L76334J67586l15093l85106o5121R2602
35414c202962n92j0615M4702p7942j81655N5211L34016J68177j89984j50134J46747
35403c065031J14526j56880q1915K88745L50726N1183j03510m7171j38424k47450
35393c035201O6586N27177M08977j67196l47570L368J47090j22796j58563K14125
35383b464003K91524j84198m68894j06478K89177J41243j53938n5210J83770R5562
$$ plain form
35454 -3195770 -3090014 -3039279 -2959281 -2941474 -3044191 -3155697 -3276979 -3578201 -3966012 -4020110
35444 -4020110 -3627838 -3259920 -3304490 -3518662 -3473685 -3192247 -3001252 -3038598 -3206684 -3372054
35434 -3372054 -3386498 -3160851 -2878830 -2854525 -3065283 -3157059 -2991685 -2795842 -2702125 -2606558
35424 -2606558 -2561131 -2774907 -3097610 -3074164 -2697830 -2530244 -2845337 -3230443 -3295564 -3202962
35414 -3202962 -3203554 -3214169 -3169467 -3247409 -3429064 -3373853 -3039837 -2871660 -3061644 -3211778 -3065031
35403 -3065031 -2950505 -3107385 -3189300 -2900555 -2549829 -2498646 -2602156 -2649327 -2787751 -3035201
35393 -3035201 -2968615 -2441438 -2032461 -2199657 -2547227 -2543859 -2396769 -2519565 -2678128 -2464003
35383 -2464003 -2172479 -2356677 -2825571 -2932049 -2642872 -2501629 -2655567 -2710777 -2527007 -2431445
35373b431445j49742j41787M3620R6936K7602r551n7213j48492j27437L1198R8814
35362b767497L035m4938J6166k936q7843J6742K61139K57818n8301k87808k25015
35351b919438r9207m0467R6757K53974J49284j16994r7641J96796K27502j27803
35341b477237k91101N3200M16709L10977l5625j80944j40232j34675j38240p2164
35331b689332n9370j51701j55128J6918J66343J73237J56777J36799l0597k47217
35321b683271j81798J52445L08430P5850k12216k16497p280J98186K98721K15308
35311b052122m6560k04576j7892K31467R6402k62936k87530N0948K36794J16680
35301b139325M8998J12369m394k25899q3996L40364L76195r0481l52393q1615
$$ plain form
35373 -2431445 -2581187 -2722974 -2679354 -2582418 -2554816 -2564367 -2621580 -2770072 -2897509 -2866311 -2767497
35362 -2767497 -2764462 -2809400 -2793234 -2796170 -2884013 -2867271 -2606132 -2348314 -2406615 -2694423 -2919438
35351 -2919438 -3018645 -3059112 -2962355 -2708381 -2559097 -2676091 -2773732 -2576936 -2349434 -2477237
35341 -2477237 -2768338 -2715138 -2298429 -1987452 -2023077 -2204021 -2344253 -2478928 -2617168 -2689332
35331 -2689332 -2748702 -2900403 -3055531 -3038613 -2872270 -2699033 -2542256 -2405457 -2436054 -2683271
35321 -2683271 -2865069 -2712624 -2404194 -2328344 -2540560 -2757057 -2764337 -2566151 -2267430 -2052122
35311 -2052122 -2098682 -2303258 -2321150 -2089683 -1993281 -2256217 -2543747 -2492799 -2256005 -2139325
35301 -2139325 -2090327 -1977958 -1982352 -2208251 -2292247 -1951883 -1575688 -1666169 -2018562 -2100177
35291b100177J51311l0212j53508J29231L26924K9004k82652q0200K62412J50318
35281a597549k02074k19932L7018J10096o439J4785J53353J41746J1790k7877
35271a585083k9450j28505j90713q5295p923j00092j07174J26531K32847p0247
35261a945104l47212o3468M81313N33031P779m38686l85929p5294J37442K05134
35251a890994J91614R6325j5551k7600J5010m0349j64259j49918N6581K30833
35241a698308J46109j30327k84887j09894K11136K84635L9025j32057M6859K70888
35231a356821J37116j61956j49066J06662J11240j58753j94828J32525L22315
35222a211566R4699j86085j96225j17367j26925m5895J76384K18720k4151j76948
$$ plain form
35291 -2100177 -1948866 -1979078 -2132586 -2003355 -1676431 -1647427 -1930079 -2010279 -1747867 -1597549
35281 -1597549 -1799623 -2019555 -1982537 -1872441 -1878880 -1864095 -1710742 -1568996 -1557206 -1585083
35271 -1585083 -1614533 -1743038 -1933751 -2019046 -2026969 -2127061 -2234235 -2107704 -1874857 -1945104
35261 -1945104 -2292316 -2355784 -1874471 -1341440 -1333661 -1772347 -2158276 -2233570 -2096128 -1890994
35251 -1890994 -1699380 -1603055 -1618606 -1646206 -1631196 -1671545 -1835804 -1985722 -1929141 -1698308
35241 -1698308 -1552199 -1682526 -1967413 -2077307 -1866171 -1581536 -1542511 -1674568 -1627709 -1356821
35231 -1356821 -1219705 -1381661 -1530727 -1424065 -1312825 -1471578 -1666406 -1533881 -1211566
35222 -1211566 -1116867 -1302952 -1499177 -1616544 -1743469 -1789364 -1612980 -1394260 -1418411 -1595359
35212a595359m4606M3687j01452j42209J02915K19646p1366l40943j54459J91626
35202a892520K10822J5981k0592M5294k5103j16691m6279j1448j90472k70476
35192b301484M1780M00019L20936j7662j05493N9260R5784k4318r463J37827J37335
35181a265479l0151j17481o6140k9987m6483n6895j01514j62324l9156K80648
35171a634962M24614J78855j10817r7171q716j76599l74954k21568R8318J46745
35161a776255k628K7400J72336P2561j94384k11740L5902J68924J04130J13461
35151a490293K16661J29559j53437k92040j72064l9255j4579M8103J72460J76081
35141a418804L4860n9978l9074k614L6992J09548O7957j94205m02419k11055K19756
$$ plain form
35212 -1595359 -1639965 -1596278 -1697730 -1839939 -1737024 -1517378 -1588744 -1929687 -2084146 -1892520
35202 -1892520 -1681698 -1665717 -1686309 -1641015 -1666118 -1782809 -1829088 -1840536 -2031008 -2301484
35192 -2301484 -2259704 -1859685 -1538749 -1556411 -1661904 -1602644 -1506860 -1531178 -1540641 -1402814 -1265479
35181 -1265479 -1295630 -1413111 -1479251 -1509238 -1555721 -1612616 -1714130 -1876454 -1915610 -1634962
35171 -1634962 -1210348 -1031493 -1142310 -1239481 -1248197 -1424796 -1799750 -2021318 -1923000 -1776255
35161 -1776255 -1778883 -1751483 -1579147 -1506586 -1700970 -1912710 -1876808 -1707884 -1603754 -1490293
35151 -1490293 -1273632 -1144073 -1297510 -1589550 -1761614 -1800869 -1815448 -1767345 -1594885 -1418804
35141 -1418804 -1383944 -1443922 -1482996 -1485610 -1448618 -1339070 -1271113 -1465318 -1867737 -2078792 -1859036
35130a859036L98237J96674n9266j36613r0531K6079J95117K24308l7484l20690
35120a463205k34819R8208J99220j1519j36175N625J37157O1851n9251q8252j18393
35109a609553j70948r4205J06487K08665J45815Q8182Q5586M812j18850p5341
35099a429350R1885P2865j72150k79592n1420K29822K50750Q6366m1121j14582
35089a356527k00504k18728o4624J90218L73775L72753J59627j75526l93020l01687
35079a614243j5398J80886K00528J58542O6906j42933l09430j50746K35405L76601
35069a013882Q8186k30663j78997Q8507J64905O627p9388N9480K33769K19208
35059f42248L2296j46501j97536j53585j17267j30998j41711q5993L1344J59582
$$ plain form
35130 -1859036 -1460799 -1264125 -1323391 -1460004 -1550535 -1524456 -1329339 -1105031 -1142515 -1463205
35120 -1463205 -1698024 -1599816 -1400596 -1412115 -1548290 -1542665 -1405508 -1343657 -1402908 -1491160 -1609553
35109 -1609553 -1780501 -1874706 -1768219 -1559554 -1413739 -1325557 -1239971 -1235159 -1354009 -1429350
35099 -1429350 -1337465 -1264600 -1436750 -1716342 -1767762 -1537940 -1287190 -1200824 -1241945 -1356527
35089 -1356527 -1557031 -1775759 -1840383 -1650165 -1276390 -903637 -744010 -919536 -1312556 -1614243
35079 -1614243 -1629641 -1448755 -1248227 -1089685 -1022779 -1165712 -1475142 -1625888 -1390483 -1013882
35069 -1013882 -925696 -1156359 -1335356 -1246849 -1081944 -1075317 -1154705 -1095225 -861456 -642248
35059 -642248 -609952 -756453 -953989 -1107574 -1224841 -1355839 -1497550 -1583543 -1552199 -1392617
35049a392617K45843K32865R6443p3834j33114p5465m9014j09378j09103N5768
35039a311606K35803K11589j9226k65356l56889k45459j2387J43496P5084q7421
35029a632372o4279J61847L03578K15860Q8474P1413M2941p2360j02272L3462
35019i53708J27335O9614O2913J84641J46946j72762l93868k34381j8697j03867
35009a285834k29923j5732K97727K64242N2069J11938K97375J19221k98801l65747
34999a053465n4186P0046j29734j69605J04516K28531J1564r9954J20417K15888
34989g55982j31343m80533l38357N5960J76294J7269n6529M9632J45897J56102
34979a161590J30634L8496j32240k30239j51398k1737K5840N0146J07768J05642
$$ plain form
35049 -1392617 -1146774 -913909 -817466 -891300 -1024414 -1099879 -1148893 -1258271 -1367374 -1311606
35039 -1311606 -1075803 -864214 -883440 -1148796 -1505685 -1751144 -1763531 -1620035 -1544951 -1632372
35029 -1632372 -1696651 -1534804 -1231226 -1015366 -926892 -855479 -812538 -884898 -987170 -953708
35019 -953708 -826373 -756759 -693846 -509205 -362259 -535021 -928889 -1163270 -1181967 -1285834
35009 -1285834 -1515757 -1531489 -1233762 -969520 -917451 -805513 -508138 -388917 -687718 -1053465
34999 -1053465 -1107651 -1037605 -1167339 -1336944 -1232428 -1003897 -992333 -1092287 -971870 -755982
34989 -755982 -887325 -1367858 -1706215 -1650255 -1473961 -1456692 -1513221 -1463589 -1317692 -1161590
34979 -1161590 -1030956 -992460 -1124700 -1354939 -1506337 -1528074 -1502234 -1452088 -1344320 -1238678
34969a238678J6904j8216K9490j2825j67496j85745K3529J80987Q6959m6944J8150
34958a313885J49488J20952n61n1964q6377j76581j66476M9342K35160J46400
34948a094502o2479j07257l7546n6851q2401Q0601K67071J32515k37430l71419
34938a569698j19406J24517M4658j43868r8411J01323J23980n8301j31995M4503
34928a682698J97021M7140k40995k67438K5971K66512J92933P367R437J18401
34918a326349N0461j67545k07314N2368L34422L37447O8407k41930l56310j58506
34908a614849K20397M14576K02222j52202k11700J1586J00466r3643k39400r2622
34898a455169J44732K18453J84681J41712k4930l19585l92850j3441M48533M33046
$$ plain form
34969 -1238678 -1221774 -1239990 -1210500 -1223325 -1390821 -1576566 -1553037 -1372050 -1285091 -1332035 -1313885
34958 -1313885 -1164397 -1043445 -1044006 -1095970 -1182347 -1358928 -1525404 -1476062 -1240902 -1094502
34948 -1094502 -1156981 -1264238 -1301784 -1358635 -1441036 -1360435 -1093364 -960849 -1198279 -1569698
34938 -1569698 -1689104 -1564587 -1519929 -1663797 -1762208 -1660885 -1536905 -1595206 -1727201 -1682698
34928 -1682698 -1485677 -1438537 -1679532 -1946970 -1920999 -1654487 -1461554 -1454187 -1444750 -1326349
34918 -1326349 -1275888 -1443433 -1650747 -1598379 -1263957 -926510 -858103 -1100033 -1456343 -1614849
34908 -1614849 -1394452 -979876 -777654 -929856 -1141556 -1129970 -1029504 -1123147 -1362547 -1455169
34898 -1455169 -1310437 -1091984 -907303 -765591 -790521 -1110106 -1502956 -1516397 -1067864 -634818
34888f34818l0911l55484j80888K15505L55089J33748j57061k29396q7324N6767
34878i14773P3010M0471N6077M7021p1321j59094k8714J91737J82612o9959k43507
34867h96440k00391j54296j99440j02120K15717M05022K22722l4060r155J27557
34857f24884K6655j85257j26265J34043J54618j35202l20052j79833J6314K7746
34847a212117j816R3244J72183P6222o0238n4911M023m7105j26258n8857Q6610
34836a129020J03933J1366K0617J54623J71935n6192l13881l12215n2169K11954
34826a189049K80049J55615m4156j90455j80549j2313J57010J42636l2628j37612
34816a051452l2970J22656P4282j72399l23535j47984K31043M53796L11847l1260
$$ plain form
34888 -634818 -665729 -1021213 -1202101 -986596 -631507 -497759 -654820 -884216 -971540 -914773
34878 -914773 -841763 -801292 -745215 -698194 -769515 -928609 -957323 -765586 -582974 -652933 -896440
34867 -896440 -1096831 -1251127 -1450567 -1552687 -1336970 -931948 -709226 -743286 -752441 -624884
34857 -624884 -598229 -783486 -909751 -775708 -621090 -756292 -1076344 -1256177 -1239863 -1212117
34847 -1212117 -1213933 -1120689 -948506 -872284 -932522 -987433 -983410 -1030515 -1156773 -1215630 -1129020
34836 -1129020 -1025087 -1013721 -993104 -838481 -666546 -722738 -1036619 -1348834 -1401003 -1189049
34826 -1189049 -909000 -753385 -797541 -987996 -1168545 -1180858 -1023848 -881212 -913840 -1051452
34816 -1051452 -1084422 -961766 -887484 -1059883 -1383418 -1531402 -1300359 -846563 -534716 -565976
34806e65976k33982j61092P525O7052M6772O3085O0680o3751j66849j3558K66539
34795f93555K56358r9841l23213j05226K02855J50682j07599j30134N3547N0270
34785g45856j66923k26873n3814p700k10016k71379O7700M66072M58763R2883
34775e97143k08608k05121j1921J35416J04173m5300j06368K2642J52235O5553
34765f94442j03910p4452P2024J6410j73059r0750K36959K59953j68025m18002
34755a137294o2416L80546K56885j77587k31050P3446J26646j70713k73611K9023
34745a186125K76558J49755m6653J6336J63926J13071m2542p7391k3057m686K3483
34734f37325R7279O5405j29464k50800j41685m1113j84018l20165o6433L96328
$$ plain form
34806 -565976 -799958 -961050 -953525 -886473 -839701 -776616 -715936 -779687 -946536 -960094 -693555
34795 -693555 -437197 -537038 -860251 -965477 -762622 -611940 -719539 -849673 -796126 -745856
34785 -745856 -912779 -1139652 -1193466 -1201166 -1411182 -1682561 -1614861 -1148789 -690026 -597143
34775 -597143 -805751 -1010872 -1022793 -887377 -783204 -828504 -934872 -912230 -759995 -694442
34765 -694442 -798352 -872804 -800780 -784370 -957429 -1048179 -811220 -551267 -719292 -1137294
34755 -1137294 -1199710 -819164 -562279 -739866 -970916 -897470 -770824 -941537 -1215148 -1186125
34745 -1186125 -909567 -759812 -806465 -790129 -626203 -513132 -555674 -633065 -656122 -660808 -637325
34734 -637325 -540046 -474641 -604105 -854905 -996590 -1037703 -1221721 -1541886 -1608319 -1211991
34724a211991M70420N623m43799l76739K5108K66799K34427J84893K18676J54713
34714d71870o8563k17996j28624J2586m4715k04069j58253J22951L14682K00322
34704f43549k8222p4280M6003R8685L0997J3988R6972R2596q9337k27129j03878
34693g87154J22527J28355p2981j46497J7606J09188q6807k90528j41414K08144
34683i39561L03999Q5589p4830l1092p1344l15911l92906l6916L80114L49146
34673g43712j0090j62065K0370J50917J7295j20916j9772J75891K17930J12361
34663c61791J9975J2495N4015O4175m9707k54692l11160o8045K11382J48314j51659
34652f86698k14301M2830J57657r8774l06304q4333K55020J98073j51247k62192
$$ plain form
34724 -1211991 -741571 -735948 -1179747 -1556486 -1531378 -1264579 -1030152 -845259 -626583 -471870
34714 -471870 -540433 -758429 -887053 -874467 -919182 -1123251 -1281504 -1158553 -843871 -643549
34704 -643549 -671771 -746051 -700048 -601363 -570366 -556378 -459406 -366810 -456147 -683276 -787154
34693 -787154 -664627 -536272 -609253 -755750 -738144 -628956 -715763 -1006291 -1147705 -939561
34683 -939561 -635562 -549973 -624803 -655895 -727239 -1043150 -1436056 -1472972 -1092858 -743712
34673 -743712 -753802 -915867 -895497 -744580 -727285 -848201 -867973 -692082 -474152 -361791
34663 -361791 -341816 -329321 -275306 -211131 -260838 -515530 -826690 -894735 -683353 -535039 -686698
34652 -686698 -900999 -858169 -700512 -799286 -1105590 -1189923 -934903 -736830 -888077 -1150269
34642a150269o190K20498J46877o7196k04407k58962k40216n6788K52423M29705
34632i34525L07951M3200r4441m0405O2216Q5020L2204k1480l1465j2881J2579
34621e92027P2893J97677L10854K58489n309l28141n05283m57138k38080L5141
34611a250924K21546K27815J05426P20j5579K1071Q4753J47218P7968k07441m85995
34600a073422m08643k0619K23653J04586n5761M8798K09800J00522j40143j50332
34590a161561L6367P4062j04304k20217j29567L4211J75824L10939L32786R7818
34580e53642k32567l14550j21611N0024R7396K07672L75866L02873n7507l07192
34570e53238k04929m2595j23295k53561j32055Q0881K5593k40504l36641j47213
$$ plain form
34642 -1150269 -1156459 -935961 -789084 -856280 -1060687 -1319649 -1559865 -1616653 -1364230 -934525
34632 -934525 -626574 -583374 -677815 -718220 -656004 -570984 -538780 -560260 -591725 -604606 -592027
34621 -592027 -519134 -321457 -10603 247886 242577 -85564 -590847 -1047985 -1286065 -1250924
34611 -1250924 -1029378 -801563 -696137 -695417 -710996 -689925 -605172 -457954 -379986 -587427 -1073422
34600 -1073422 -1482065 -1502684 -1279031 -1174445 -1230206 -1181408 -971608 -871086 -1011229 -1161561
34590 -1161561 -1125194 -1051132 -1155436 -1375653 -1505220 -1471009 -1295185 -984246 -651460 -553642
34580 -553642 -786209 -1100759 -1222370 -1172346 -1074950 -867278 -491412 -188539 -246046 -553238
34570 -553238 -758167 -800762 -924057 -1177618 -1309673 -1228792 -1203199 -1443703 -1780344 -1927557
34560a927557R6108K44372L46998L74905K22783Q669R30J80461K18801p675k10064
34549d51269j42870L0177L3506r4439j21449j4968L9709m7732j59208j70949j12687
34538a212179q5608j08951r5351L1990K09931K65083J21908p3446j34033p4977
34528a155633k8017J5530J41539K25682L4240l18528l76380Q099L76243L02407
34518g74818J1369l0344J26556O8010k15688k89657k0713J91785Q1864q3189j0702
34507i45527J40074J04448j0417M0435J75032J27485r5014k37501j89892o5042
34497i55919M6460J38774J60239N7483q0565j16344o1415j9864q513K180l5112
34486h72596j40466j75109j7512K07502K74721J60060O851j18749k28394k51188
$$ plain form
34560 -1927557 -1831449 -1587077 -1240079 -865174 -642391 -633722 -632792 -452331 -233530 -241205 -451269
34549 -451269 -594139 -563962 -530456 -624895 -746344 -761312 -721603 -769335 -928543 -1099492 -1212179
34538 -1212179 -1297787 -1406738 -1502089 -1470099 -1260168 -995085 -873177 -946623 -1080656 -1155633
34528 -1155633 -1183650 -1168120 -1026581 -800899 -766659 -1085187 -1461567 -1453468 -1077225 -774818
34518 -774818 -763449 -793793 -667237 -599227 -814915 -1104572 -1125285 -933500 -851636 -934825 -945527
34507 -945527 -805453 -701005 -711422 -670987 -495955 -368470 -463484 -700985 -890877 -955919
34497 -955919 -909459 -770685 -610446 -552963 -633528 -749872 -811287 -831151 -839664 -837484 -872596
34486 -872596 -1013062 -1188171 -1205683 -998181 -723460 -563400 -556549 -675298 -903692 -1154880
34476a154880j04748J17554K34009K09838J36563N2348m0700p5706k6210m872
34466f56804o7002n9028J13382K38328J06087r9673o8965J03037N4370k30897
34456e67165l70540j75278R4909J56499O1446J2473O3307J11711M1694j52891
34446g23835k85378j23649K34962L49858M5642k32710m5780L28379L11339o2245
34436b03417k56452j33259o2043j49729p6087J99964K68901M524j81554o7840
34426f56992J7582j40638k29080j1278K04623J04715j11527j48132r4551j00571
34416a165849j6890K31715L40540J10470j60422j70945q9289j30035j10023J19668
34406a041060K53558N2073j54978k8510J53385K6722j39398N4393L14353J24958
$$ plain form
34476 -1154880 -1259628 -1142074 -908065 -698227 -561664 -509316 -550016 -625722 -651932 -656804
34466 -656804 -723806 -782834 -669452 -431124 -325037 -424710 -493675 -390638 -336268 -567165
34456 -567165 -937705 -1112983 -1018074 -861575 -800129 -787656 -724349 -612638 -570944 -723835
34446 -723835 -1009213 -1132862 -897900 -548042 -502400 -735110 -780890 -452511 -141172 -203417
34436 -203417 -459869 -593128 -655171 -804900 -880987 -681023 -412122 -407598 -589152 -656992
34426 -656992 -639410 -780048 -1009128 -1020406 -815783 -711068 -822595 -970727 -1065278 -1165849
34416 -1165849 -1182739 -951024 -610484 -500014 -660436 -831381 -920670 -1050705 -1160728 -1041060
34406 -1041060 -787502 -735429 -890407 -918917 -765532 -738810 -878208 -823815 -509462 -384504
34396c84504k63128j85731K69979L55665j08735m71168l18885p911P6112N7547
34386i80759J03819O2652j13946j25938J58010L88424K61698k0259j17577n0697
34376d34573m0948j21058j72650j55970r8961j7026L0623k9375j30001j24877
34366a294816k6040L5581O7859J63500K22448O7960j67329j55022R6682K27563
34356g61614J02783k4442k3216q7602k56985k15960J49584M27037K59076r7746
34346e29085j78776K324Q0214m3745j26817m3477N0272J4306q6596j20881l9126
34335a021387J19496K48257K34283R1529l4275o1408n5649n0810L1752J63732
34325c34480J24925j56371l66158j86117K04709L21153L1686k83591k82268p7752
$$ plain form
34396 -384504 -647632 -833363 -563384 -207719 -316454 -787622 -1106507 -1114418 -1038306 -980759
34386 -980759 -876940 -814288 -928234 -1054172 -896162 -507738 -246040 -266299 -383876 -434573
34376 -434573 -475521 -596579 -769229 -925199 -1024160 -1041186 -1010563 -1039938 -1169939 -1294816
34366 -1294816 -1320856 -1285275 -1217416 -1053916 -831468 -763508 -930837 -1085859 -989177 -761614
34356 -761614 -658831 -683273 -706489 -794091 -1051076 -1267036 -1117452 -690415 -431339 -529085
34346 -529085 -707861 -705537 -625323 -669068 -795885 -839362 -789090 -774784 -861380 -982261 -1021387
34335 -1021387 -901891 -653634 -419351 -327822 -362097 -423505 -479154 -529964 -498212 -334480
34325 -334480 -209555 -365926 -732084 -918201 -713492 -392339 -360653 -644244 -926512 -1004264
34315a004264K6455r642J3000J71871L10600K80863J25457k5649j19230j69201
34305c99740j71208j14054k7571N6321J44832K11637J50348p5119k80026k27138
34295g31718M2666K15428R5687j52272k33995p7558J31544J85275N3386r6455
34285e68012o1397J48141K63777Q8150j95808k45988m1242J28728J36306J40908
34275b06437J91523R2605j79768l07941j20361Q3356j3259k48003k62114m8162
34265a018561J18145J20161O0186J4545L737P6186J88344J61684k6968j22026
34255d24567J4331J34143K752k06128k28642j42713j22890n3468J89617L41899
34245d95666J25233j97973j69021J30848K26196J5560j52614j12703n4137o9174
$$ plain form
34315 -1004264 -977809 -987451 -974451 -802580 -491980 -211117 -85660 -111309 -230539 -399740
34305 -399740 -570948 -685002 -712573 -656252 -511420 -299783 -149435 -224554 -504580 -731718
34295 -731718 -689052 -473624 -377937 -530209 -764204 -841762 -710218 -524943 -471557 -568012
34285 -568012 -629409 -481268 -217491 -129341 -325149 -571137 -612379 -483651 -347345 -206437
34275 -206437 -14914 77691 -102077 -410018 -530379 -447023 -460282 -708285 -970399 -1018561
34265 -1018561 -900416 -780255 -720069 -705524 -701787 -625601 -437257 -275573 -302541 -424567
34255 -424567 -410236 -276093 -273341 -479469 -708111 -850824 -973714 -1027182 -837565 -495666
34245 -495666 -370433 -568406 -737427 -606579 -380383 -364823 -517437 -630140 -684277 -753451
34235g53451l0054O3191O8430M0556J44882K48520O2163l08317m23019j56320
34225a043419J54589K42671J74820O5155o1304j03902K2473J46230O4551p1387
34215d09523o539J22090K6577j53589q8500P2711o8575l60340k65702J88348L92095
34204e50947J38925j28009j42522j17297j09666J02505L58607J83745k74006k79305
34194h17970K36911M25147p6813m83992j82732K55499J20999k35913j30417K42360
34184f46921K65333K4253J7188J51012k5236l67008l23226Q3728K93272J33968
34174c93637k2177J8225N6371j1089o2414q0436j28781q8071J34360K82774R9310
34163a95565j94333k31165r5373q8454j43313j6071J70588J45588K5709N5628
$$ plain form
34235 -753451 -783505 -720314 -651884 -611328 -466446 -217926 -155763 -464080 -887099 -1043419
34225 -1043419 -888830 -646159 -471339 -406184 -467488 -571390 -548917 -402687 -338136 -409523
34215 -409523 -416062 -293972 -267395 -420984 -509484 -436773 -505348 -865688 -1131390 -943042 -550947
34204 -550947 -412022 -540031 -682553 -799850 -909516 -807011 -448404 -264659 -538665 -817970
34194 -817970 -581059 -155912 -232725 -716717 -899449 -643950 -522951 -758864 -889281 -646921
34184 -646921 -381588 -357335 -340147 -189135 -214371 -581379 -904605 -820877 -527605 -393637
34174 -393637 -415814 -397589 -341218 -352307 -414721 -495157 -623938 -712009 -577649 -294875 -195565
34163 -195565 -389898 -621063 -716436 -804890 -948203 -964274 -793686 -648098 -622389 -566761
34153e66761O6585j71326l26640K4676N22862M39600j41975m16382j13181J95613
34143d86929J30926m905K9223p772k19936k57805K3481K21891P6562p3104Q8725
34132d79643K87688J51597j56330k43284j03269j1399m1265n5520q955L5783O7767
34121e56830R1393N7304k5569n6001j8093k1398r3678j27977q6373m4434m743
34110h86399R8703J99520J63281N1444L7434P8270r646j76390k06276j30207j51636
34099i31902j82198N1525M03229L70723r6790m17609k30560J05225J56385N3620
34089g18352J08535K27249J42242q2598j87742j34723n7547p441j2936j57278
34079h80591l55998l32043m8273J54976J08015J17795L94676N75016K68652k47548
$$ plain form
34153 -566761 -500176 -671502 -998142 -973466 -450604 -11004 -152979 -569361 -682542 -486929
34143 -486929 -356003 -360908 -331685 -339457 -559393 -817198 -793717 -571826 -495264 -568368 -479643
34132 -479643 -191955 -40358 -196688 -439972 -543241 -554640 -595905 -651425 -660380 -624597 -556830
34121 -556830 -465437 -408133 -433702 -489703 -507796 -529194 -622872 -750849 -837222 -881656 -886399
34110 -886399 -787696 -588176 -424895 -373451 -336017 -257747 -267393 -443783 -650059 -780266 -931902
34099 -931902 -1114100 -1062575 -659346 -288623 -385413 -803022 -1033582 -928357 -771972 -718352
34089 -718352 -609817 -382568 -240326 -322924 -510666 -645389 -702936 -710377 -723313 -880591
34079 -880591 -1236589 -1568632 -1616905 -1461929 -1353914 -1236119 -841443 -266427 2225 -245323
34069b45323m03898j72607J238n6348j06942k2684N6123P1182J02193P5974j45602
34058h46694l74908k41146K06754M62539K54430r9346j86818k5293J09204J11341
34048f29937P9431Q2656R1850O7832P844m6541k3689P6458J20723J0629j26485
34037b89229q5767J01883K02927J21166p856p4983j23246j71799j39478k3497
34027d89879M2457n665p2225q7042r5511r3692J6165J98487K24270p254k61035
34016f30924k52489o287K31959L13646K46872O0848j87313l43841k89125j02506
34006i59160M9996J29868J75588J31854n1768k05210q3253K47793M18538K37881
33996I2127m9893j13702M1517J59404J00323n8787k09409l08796l16870k00315
$$ plain form
34069 -245323 -649221 -821828 -820590 -876938 -983880 -1006564 -950441 -879259 -777066 -701092 -846694
34058 -846694 -1221602 -1462748 -1255994 -793455 -539025 -638371 -825189 -850482 -741278 -629937
34048 -629937 -550506 -467850 -376000 -308168 -300324 -346865 -370554 -294096 -173373 -162744 -289229
34037 -289229 -374996 -273113 -70186 50980 43124 -31859 -155105 -326904 -466382 -489879
34027 -489879 -447422 -453087 -525312 -612354 -707865 -801557 -785392 -586905 -362635 -369889 -630924
34016 -630924 -883413 -889700 -657741 -344095 -97223 -36375 -223688 -567529 -856654 -959160
34006 -959160 -909164 -779296 -603708 -471854 -523622 -728832 -812085 -564292 -145754 92127
33996 92127 42234 -71468 -29951 129453 229776 170989 -38420 -347216 -664086 -864401
33986h64401k0051J00842J19442R8459Q5990O3313K5416J3674K8612k260j05211
33975d56175j74348r4565P3896J35548J4413j23554r0840M2766M5682r9604j28018
33964h54799Q2459K35239K7071l12851k78215J32979L36459J5655l73034k62823
33954a251860K03670M43609K86819O7956j4186r8583k09538j25614J53294K63353
33944b81080K6739k34283j94722q718J2157p3144O988K25438K81956Q4474j23224
33933b77419j39392n6157o2859j66578k00550m8511J93038K96472J72842M956
33923b84158J284Q0680O761j93213k34645n1524O8007l4046j07098O4167K54296
33912d29489J62366p2109j08690J1513m7557l13306m10479j24532K77633M00505
$$ plain form
33986 -864401 -884452 -783610 -664168 -565709 -479719 -416406 -390990 -377316 -348704 -350964 -456175
33975 -456175 -630523 -725088 -651192 -515644 -501231 -624785 -715625 -672859 -627177 -726781 -854799
33964 -854799 -772340 -537101 -510030 -822881 -1101096 -968117 -631658 -616003 -989037 -1251860
33954 -1251860 -1048190 -604581 -317762 -249806 -263992 -362575 -572113 -697727 -544433 -281080
33944 -281080 -254341 -488624 -683346 -692064 -679907 -753051 -746063 -520625 -238669 -154195 -277419
33933 -277419 -416811 -472968 -535827 -702405 -902955 -951466 -758428 -461956 -289114 -284158
33923 -284158 -282874 -202194 -195433 -388646 -623291 -674815 -606808 -640854 -747952 -683785 -429489
33912 -429489 -267123 -339232 -447922 -436409 -483966 -797272 -1207751 -1332283 -1054650 -654145
33902f54145J70045j56100k77311j08013J49687K12922O8143j2228R3672J39082
33892c74246m9793j90199J4581K71284O4289m55077n53530L253N39582M18918
33882c10938q3034k57991K8015K83741J80999p4067j64052q1415p821p954L291
33871d91226Q8247J93273K10294R1603r1382k02864j68576m2313N6875O0833M166
33860b91070k8039k816K3957K687j1188N6387J31880O8843q1189p7652J19722
33849h8478J95157p8552m28946m11402l5957K60526K27849M6269o6736j35961
33839e16231j95688j07692J69194L66931K27891j02630k56479j39815J20o378
33829e60777k5568Q9769K01143Q9090j45080j61998R0097K23161k8505l48131
$$ plain form
33902 -654145 -484100 -640200 -917511 -1025524 -875837 -662915 -594772 -607000 -513328 -374246
33892 -374246 -424039 -614238 -599657 -328373 -264084 -719161 -1272691 -1269438 -729856 -310938
33882 -310938 -393972 -651963 -623948 -340207 -159208 -233275 -397327 -478742 -486563 -494517 -491226
33871 -491226 -402979 -209706 588 92191 809 -202055 -370631 -412944 -356069 -295236 -291070
33860 -291070 -319109 -321925 -297968 -295281 -306469 -250082 -118202 -49359 -130548 -208200 -88478
33849 -88478 106679 28127 -400819 -812221 -848178 -587652 -359803 -313534 -380270 -516231
33839 -516231 -711919 -819611 -650417 -283486 -55595 -158225 -414704 -554519 -554399 -560777
33829 -560777 -586345 -496576 -295433 -206343 -351423 -513421 -423324 -200163 -228668 -576799
33819e76799k70062R2878K05286m4032j82031L2954J94271l7593l09740j45817
33809a040685K51744L43783J28471M3292J49042Q3454j92398k73008m1851R8390
33799d49766p0745k20150q4198Q6771K8195m5521J34028L42191K08849j39885
33789b10231k61460p2947R9259Q1810M5334J08273J25692m948j10102K675K13214
33778A6569K11480q2743l80382l66717r3372J03329N7943l8077J0790Q0571k7518
33767e08127j87728j14141J45165K35300M4140j24187k9866J64895J96005O4952
33757a13592p7726j86849k60392k11868j6155J52430J23166k1912o3827N5198
33747f21527J79020J42996m4758j99858j39160P9370J64826k6899k34066j42786
$$ plain form
33819 -576799 -846861 -753983 -548697 -592729 -774760 -741806 -547535 -585128 -894868 -1040685
33809 -1040685 -788941 -445158 -316687 -273395 -124353 -40899 -233297 -506305 -548156 -449766
33799 -449766 -520511 -740661 -824859 -738088 -709893 -755414 -621386 -279195 -70346 -210231
33789 -210231 -471691 -544638 -445379 -363569 -318235 -209962 -84270 -89218 -199320 -196645 16569
33778 16569 228049 145306 -235076 -601793 -695165 -591836 -533893 -571970 -561180 -480609 -508127
33767 -508127 -695855 -809996 -664831 -429531 -385391 -509578 -539444 -374549 -178544 -113592
33757 -113592 -191318 -378167 -638559 -850427 -866582 -714152 -590986 -612898 -676725 -621527
33747 -621527 -442507 -299511 -344269 -544127 -683287 -603917 -439091 -465990 -700056 -842842
33737h42842J11043J40021m8333m9399K32529L67049R2190k33044j93153M8667
33727c75272P5466j11251j79065m1535P9485P5488N1013M1175l2063j29007j11425
33716f56991K774O1439N3801J13966K36008K31243K3835k12472k81098j77191
33706f04686k6436O4902N8967j0988n3852q609P5640J05441O2800m598o7097j06660
33694e15176p4590M7466J72382J83827P7285m0386p7265l1177L9770P1518K9908
33683a16438o7818j53682j37466K5592K32012K34719q6793m41955l63953J41444
33673g34338M72851K16811k38952k74778L1138R7244j67294k33223J16365L95202
33663c18974K03613j67318k59332r7024N0318J43537K32118J99403K2155m6236
$$ plain form
33737 -842842 -731799 -591778 -640111 -689510 -456981 -89932 2258 -230786 -423939 -375272
33727 -375272 -299806 -411057 -590122 -631657 -552172 -476684 -425671 -384496 -416559 -545566 -656991
33716 -656991 -654217 -592778 -538977 -425011 -189003 42240 66075 -146397 -427495 -604686
33706 -604686 -631122 -566220 -507253 -518241 -572093 -580702 -505062 -399621 -336821 -341419 -408516 -515176
33694 -515176 -589766 -542300 -369918 -186091 -108806 -149192 -226457 -257634 -217864 -146346 -116438
33683 -116438 -184256 -337938 -475404 -449812 -217800 16919 -69874 -511829 -875782 -734338
33673 -734338 -261487 -44676 -283628 -558406 -527268 -430024 -597318 -830541 -714176 -318974
33663 -318974 -115361 -282679 -542011 -639035 -588717 -445180 -213062 -13659 8496 -37740
33653c7740R5482J35239j13669k92509n9862K85304K55490n6572k11665j68658
33643a69160k05133k88457j46447J39670K12349N8791o611N9422J3143j17608
33633d50041n1883J41288O8265k65106l57489j0122L43125L24655J14071J0706
33623a32531j8768p3732m7807P3624N3873j52999k07128M1642K02219l1465l00115
33612e93187j27494K67297K92322o7633k48379k3254J86844M9009j75089j28136
33602e67700N5290L3393j30508o7736K58459M25112J61973k26705k79950k0464
33592c58836J28252m571j22947P352J64078N5524j59700j13472J40208J66874
33582i7238j52909l96498k30876R2890J46417m5128j20191K3936J27220M2388
$$ plain form
33653 -37740 57742 192981 79312 -213197 -273059 12245 267735 211163 -502 -169160
33643 -169160 -374293 -662750 -809197 -669527 -457178 -398387 -404998 -345576 -332433 -450041
33633 -450041 -501924 -360636 -292371 -557477 -914966 -925088 -581963 -257308 -143237 -132531
33623 -132531 -151299 -225031 -272838 -199214 -145341 -298340 -505468 -463826 -261607 -293072 -593187
33612 -593187 -720681 -453384 -161062 -228695 -477074 -500328 -313484 -264475 -439564 -567700
33602 -567700 -512410 -479017 -609525 -677261 -418802 6310 168283 -58422 -338372 -358836
33592 -358836 -230584 -235155 -358102 -350750 -186672 -131148 -290848 -404320 -264112 -97238
33582 -97238 -250147 -646645 -877521 -784631 -638214 -683342 -803533 -779597 -652377 -609989
33572f09989l4270Q3309K53942K33152M5832q2536q1537q6210j37408q6104J03876
33561c97943J95033K5120j65786n7729K01641J59430k07210l57003J3495M39583
33551a51369L29585j53393l34290k5050K46795O9693k77952l14269n0932J24344
33541e36838N5078m5227k496Q6865R4537P9978J24033J12910r1985l33489k73263
33530g29897J07077L76521K12596j25229j68127O8110J48036p2990k56059j81582
33520f21544q0061j43743j40453J49013M58642M08918J00588p7273m4396j9646
33510i955o0461l5413L5532J6963l3299K7712Q8684n1122k53841k08856K7187
33499d56869J13386J8206L4109J83515J48255j10016k03465K3084K00399N3121
$$ plain form
33572 -609989 -644259 -560950 -307008 -73856 -28024 -110560 -192097 -278307 -415715 -501819 -397943
33561 -397943 -202910 -177790 -343576 -401305 -199664 -40234 -247444 -604447 -590952 -151369
33551 -151369 178216 24823 -309467 -334517 -87722 -18029 -295981 -610250 -661182 -536838
33541 -536838 -481760 -526987 -529483 -442618 -348081 -268103 -144070 -31160 -123145 -456634 -729897
33530 -729897 -622820 -246299 -33703 -158932 -327059 -258949 -110913 -183903 -439962 -621544
33520 -621544 -701605 -845348 -985801 -836788 -378146 30772 131360 54087 9691 -9955
33510 -9955 -70416 -105829 -70297 -53334 -86633 -58921 29763 -21359 -275200 -484056 -456869
33499 -456869 -343483 -325277 -291168 -107653 40602 -69414 -272879 -249795 -49396 3725
33489C725j61720j36850r993l2018j10154n6983J7122n3182j18696J4637J70142
33478d73970O8790j55505j35434J33166K89592J71708o503o6535r7600j85870
33468d58161k11420o7340J19941J48933J3311j10173r1757K0859Q9234M7941m0879
33457e39511q4790o6377j7141N7622J48878J88436J30852M6787J2583l0421j46037
33446b99119k11523q0711J22157J52051N2884Q0269K07991J20996j98780l22905
33436c76690l1280L00097K76745P7556P4736J72864J1107l57711m93894k30057
33426e76527J33180L03668K92873J99177M3309j06247j32807o9697o0188r3225
33416f6484l6589N6868j3217j98966j88059Q9359K70776Q5149k22664k62592o8791
$$ plain form
33489 3725 -157995 -294845 -304838 -336856 -447010 -503993 -486871 -540053 -658749 -644112 -473970
33478 -473970 -405180 -560685 -696119 -562953 -273361 -101653 -108156 -174691 -272291 -458161
33468 -458161 -669581 -736921 -616980 -468047 -454736 -564909 -656666 -635807 -546573 -498632 -539511
33457 -539511 -624301 -690678 -707819 -650197 -501319 -312883 -182031 -135244 -122661 -153082 -299119
33446 -299119 -510642 -591353 -469196 -317145 -264261 -183992 23999 144995 -53785 -376690
33436 -376690 -407970 -107873 168872 246428 321164 494028 505135 147424 -346470 -576527
33426 -576527 -443347 -139679 153194 352371 395680 289433 156626 86929 26741 -66484
33416 -66484 -103073 -46205 -59422 -258388 -446447 -357088 -86312 -1163 -223827 -486419 -555210
33405e55210K5517n7587p1571R2070K15267J18002o0221r9285k5612j2609p5878
33394e07117p2821L9295J35456J23889N7533J0342k0555m1530k0221K0858r593
33383b84464j15660j60315n5166J03938J78246J47444M3473j30311k97035k86989
33373h56839p8212J01178Q6009J5377N9136J13879M3593j747J27567J86497j01343
33362c04905m35973k70787K85509N24121J84982j87677j46354L9709N400o6720
33352c72695R6366K47857M0125k92043k56825J05029L09863J72363m9839j58391
33342a58190j90312j54918k8051M2043p5509j67523M7703L86522L86980O538l10510
33331b15227k79359o7253Q9981J49742R5377q1969j70628Q2959M96023N55207
$$ plain form
33405 -555210 -529693 -587280 -658851 -566781 -351514 -233512 -293733 -393018 -418630 -431239 -507117
33394 -507117 -579938 -540643 -405187 -281298 -223765 -213423 -233978 -275508 -295729 -274871 -284464
33383 -284464 -400124 -560439 -615605 -511667 -333421 -185977 -142504 -272815 -569850 -856839
33373 -856839 -935051 -833873 -747864 -732487 -673351 -559472 -515879 -517626 -390059 -203562 -304905
33362 -304905 -740878 -1011665 -726156 -202035 -17053 -204730 -351084 -311375 -305975 -372695
33352 -372695 -276329 -28472 11653 -280390 -537215 -432186 -122323 50040 201 -158190
33342 -158190 -348502 -503420 -531471 -489428 -564937 -732460 -684757 -298235 88745 95283 -215227
33331 -215227 -494586 -561839 -471858 -322116 -226739 -308708 -479336 -396377 99646 654853
33321F54853J18000l72222m96548l16161r3838N7410R1878l5657j81734r7503
33311f71522J53250K18528L2001o2777O4153P3108j97175l31314l136M03681L58539
33300C7336K2276n7448J50401J86321p5644k53413j42743j6184r4471j88694q1514
33289e13777R5699J06281k0480q3598j8740O3649O0449j2628m6630M2121J70689
33278a56965J38694p4120j85132J8701L06522K80114m7621k74174j94257k2797
33268b11035J4860k6570l8510o2333j18256r3994M5228J62899J86751K00706K02121
33257B61867N1075k11328l08356j58068k7948o0743j9882K17005L17594N0215
33247A11431j97436J4936L88507K96064j87123l73187o5535J66611k6034k26632
$$ plain form
33321 654853 772853 400631 -95917 -412078 -505916 -448506 -356628 -392285 -574019 -671522
33311 -671522 -518272 -299744 -267743 -330520 -266367 -193259 -390434 -721748 -724884 -321203 37336
33300 37336 59612 2164 152565 338886 263242 9829 -132914 -149098 -243569 -432263 -513777
33289 -513777 -418078 -311797 -332277 -415875 -434615 -370966 -310517 -323145 -369775 -327654 -156965
33278 -156965 -18271 -92391 -277523 -258822 47700 327814 280193 6019 -188238 -211035
33268 -211035 -196175 -222745 -261255 -323588 -441844 -535838 -490610 -327711 -140960 59746 261867
33257 261867 312942 101614 -206742 -364810 -392758 -453501 -473383 -256378 61216 111431
33247 111431 -86005 -71069 317438 613502 426379 53192 -12343 154268 128234 -98398
33237i8398k5742K75411K07515q6202j48611K5822O9639r4978j87828r0559J8425
33226a35506L5297M6134O1021j4879j18421o3862J15457J66495J4887j23602r7667
33215a14646q905L6193R0812J78358J91128R6862J3106l2569j61282l34962k82268
33204c28173O4405L35257K03302j28123k37272r7770o735k7529N4193K32444K03603
33193B67602r2374k74592q5394K04290K35594R7672P0013Q8401q2337k97960j77658
33182d6743K12687L47416L4484k72627j81469Q0421J33652N4990R3316J27349
33172E83476p4405k99145j70745J57678J95837n5185j05481J48731K25151q7957
33162E17955l30750j44821J41142J14342m0910M4419K40856J84160p7910k22974
$$ plain form
33237 -98398 -124140 151271 358786 272584 123973 149795 219434 124456 -63372 -153931 -135506
33226 -135506 -100209 -54075 6946 -7933 -126354 -190216 -74759 91736 106623 -16979 -114646
33215 -114646 -123551 -87358 3454 181812 372940 469802 482908 450339 289057 -45905 -328173
33204 -328173 -263768 71489 274791 146668 -90604 -188374 -195109 -222638 -168445 63999 267602
33193 267602 175228 -99364 -184758 19532 255126 352798 422811 511212 428875 130915 -46743
33182 -46743 165944 513360 547844 275217 93748 174169 307821 362811 456127 583476
33172 583476 509071 209926 39181 196859 392696 337511 232030 380761 605912 517955
33162 517955 187205 42384 183526 297868 256958 301377 542233 726393 648483 425509
33152D25509k07099j89845j17406J22707L13101J82362p3987n8073J65712J97720
33142G60701P550m3341J34294K19370O4379p8105j1997J39843K17515K06021R8410
33131A714640p6797j12750J22001L51726K27550r8457j97358m9544K5527P799
33121A914337J26740K66361J17157j27828J2913M20730N29578L51412L93608N48027
33111D553035K40472j90066K47261J077310K33695k807437n316230m462998j174053
33102g599011J101606R18732N1089K47927R36961Q40627J31461j82066N7523K35122
33092c260029J32359N7997J25742J45909P7076O1201J25092J90646K32447K00027
33082a911533O041k28309k03753R8539L07667K05475L8718P1473J72862J13388
$$ plain form
33152 425509 218410 28565 -88841 33866 346967 529329 455342 397269 562981 760701
33142 760701 768251 724910 859204 1078574 1142953 1064848 1052851 1192694 1410209 1616230 1714640
33131 1714640 1637843 1525093 1647094 1998820 2226370 2127913 1930555 1881011 1906538 1914337
33121 1914337 2041077 2307438 2424595 2296767 2309680 2730410 3259988 3611400 4005008 4553035
33111 4553035 4793507 4603441 4850702 5928012 6161707 3354270 -1961960 -6424958 -7599011
33102 -7599011 -6497405 -5578673 -5527584 -5279657 -4342696 -3502069 -3370608 -3552674 -3495151 -3260029
33092 -3260029 -3127670 -3069673 -2943931 -2798022 -2720946 -2659745 -2534653 -2344007 -2111560 -1911533
33082 -1911533 -1905492 -2133801 -2337554 -2239015 -1931348 -1725873 -1687155 -1615682 -1442820 -1329432
33072a329432l6949q2830j8836O9688J74548K28561P5429k14685k93164l2488
33062a460158K16301J32410r0073p1751J75776L27807K28060l479k08157k82056
33052a035320j65495L9069Q4684q0723j68813L3988K97830K63010l8757k63911
33042a034438k39073p8490R2431K41518K94177J64653n1022j17996N2185K83604
33032c92451L27522J03283k29617l92889k44596M5221J61434J5666j72214j93275
33022i71916q5510K899O810o8975j73010j57043Q2180L47032K93044n5193k47935
33011a027617m3451K19254J38222j44539j90104P6161L05170K36463k6306k11971
33001f68718j43685J35815L52274K32173j27793l17818j78290j9315o9783p5771
$$ plain form
33072 -1329432 -1366381 -1449211 -1468047 -1398359 -1223811 -995250 -919821 -1134506 -1427670 -1460158
33062 -1460158 -1243857 -1111447 -1201520 -1273271 -1097495 -769688 -541628 -545107 -753264 -1035320
33052 -1035320 -1200815 -1161746 -1077062 -1157785 -1326598 -1292610 -994780 -731770 -770527 -1034438
33042 -1034438 -1273511 -1352001 -1259570 -1018052 -723875 -559222 -610244 -728240 -676055 -392451
33032 -392451 -64929 38354 -191263 -584152 -828748 -783527 -622093 -606427 -778641 -971916
33022 -971916 -1057426 -1054527 -1047717 -1116692 -1289702 -1446745 -1364565 -1017533 -724489 -779682 -1027617
33011 -1027617 -1071068 -851814 -713592 -858131 -1048235 -972074 -666904 -430441 -456747 -668718
33001 -668718 -812403 -676588 -324314 -92141 -219934 -537752 -716042 -735357 -805140 -880911
32991h80911J91851L94306J18980l40425l35445J10071L01681m5634l96460k71555
32981a153541O4320J30837l1247p0414O1617J33787P3693P403j6107l6506k3010
32970h59168L6638O877j75024k74399n4938K92601L54574J03280n1698J13885
32960e07372L04954J68445j79174l39356j94010m759J0984n4789k4700P4077Q8327
32949f57373M299l3423L9402R5564R112j35401j35171N0005K15649J58871n5695
32938d44161j59397j0039K19194K37515j6733l05737l65391j66988J11421K80251
32928f20065K54564P2742j11387j30580K692P7862l1096j60771r3871R5162J55454
32917d89294O4465L4317J02149L9983k10481l30905q1886K74962K99277k3300
$$ plain form
32991 -880911 -689060 -294754 -175774 -516199 -851644 -741573 -439892 -485526 -881986 -1153541
32981 -1153541 -1089221 -958384 -989631 -1060045 -998428 -864641 -790948 -783545 -799652 -836158 -859168
32970 -859168 -822530 -815653 -990677 -1265076 -1320014 -1027413 -672839 -569559 -621257 -507372
32960 -507372 -202418 -33973 -213147 -552503 -746513 -751272 -740288 -795077 -819777 -745700 -657373
32949 -657373 -653074 -686497 -647095 -551531 -542419 -677820 -812991 -762986 -547337 -388466 -444161
32938 -444161 -603558 -613597 -394403 -156888 -173621 -479358 -844749 -1011737 -900316 -620065
32928 -620065 -365501 -292759 -404146 -534726 -532034 -454172 -485268 -646039 -739910 -644748 -489294
32917 -489294 -424829 -390512 -288363 -248380 -458861 -789766 -871652 -596690 -297413 -320713
32907c20713k87890k22972K6112J68252J06171l9200j00036j3648J22666J50608
32897d10650M3457o3495p3018l4621P946R9861J92027R3382j96913l30025o4852
32886g36901K96791K85134n2015k42508j11546L7606J399k8469J02294K04305
32876b43910J08067j4957K9430J08048K4966j08755q8745Q13m3252j50867j14546
32865d93708j914m7283j87261j14384J76197K99924O6689k10541j88453K5280
32855f75454J11723K8229l2711j9518m9166j19831q4470P0227J56464N9877r7588
32844f52218j40497m7345Q8404J85254K00326J32083M8160J8006m807j08462k14348
32833d95444j30668J10604J90108n8745l40261k70137P7043K83959J84477K0428
$$ plain form
32907 -320713 -608603 -831575 -805463 -637211 -531040 -570240 -670276 -683924 -561258 -410650
32897 -410650 -367193 -430688 -503706 -538327 -530381 -430520 -238493 -145111 -342024 -672049 -736901
32886 -736901 -440110 -154976 -206991 -449499 -561045 -523439 -522040 -550509 -448215 -243910
32876 -243910 -135843 -150800 -121370 -13322 11644 -97111 -185856 -185043 -228295 -379162 -493708
32865 -493708 -495622 -542905 -730166 -844550 -668353 -368429 -301740 -512281 -700734 -675454
32855 -675454 -563731 -535502 -568213 -587731 -636897 -756728 -841198 -770971 -614507 -554630 -652218
32844 -652218 -792715 -840060 -751656 -566402 -366076 -233993 -185833 -167827 -172634 -281096 -495444
32833 -495444 -626112 -515508 -325400 -384145 -724406 -994543 -917500 -633541 -449064 -428636
32823d28636k352J8535m2465r5926l8791L7556K6810k389J7223j6704j49652j74165
32811h50956N3214K60513Q8814l00154l55402O8951M52548L31960m9831j25947
32801d26290J70785L51110J09882k44437k57848K1027J35280j10564l70354k49597
32791h71006J44506L68117K44112K4542m7169m0668r4546j36549n5716M3684J0938
32780d09755o4354k731J20997P6424j17250j85724k3352J60569J86468J35469
32770a23239J32054J24453J7920j41140k34421k01818m4605J53901J92939m4124
$$ plain form
32823 -428636 -430988 -412453 -454918 -550844 -589635 -552079 -525269 -527658 -510435 -527139 -676791 -850956
32811 -850956 -797742 -537229 -448415 -748569 -1103971 -1035020 -582472 -250512 -300343 -426290
32801 -426290 -255505 95605 205487 -38950 -296798 -275771 -140491 -251055 -621409 -871006
32791 -871006 -726500 -358383 -114271 -89729 -136898 -177566 -272112 -408661 -464377 -420693 -409755
32780 -409755 -474109 -476840 -355843 -279419 -396669 -582393 -605745 -445176 -258708 -123239
32770 -123239 8815 133268 151188 10048 -224373 -426191 -470796 -316895 -123956 -168080
$$ [...]
##END NTUPLES=NMR SPECTRUM
##END=
