##TITLE=31Pdec_LR-746-R2-H-BZL
 CDCl3, 24 sc
 16.3.2022
##JCAMPDX= 6.0         $$ Bruker NMR JCAMP-DX V2.0
##DATA TYPE= NMR SPECTRUM
##DATA CLASS= NTUPLES
##ORIGIN= UXNMR, Bruker Analytische Messtechnik GmbH
##OWNER= root
$$ XWIN-NMR		Version 3.5
$$ Wed Mar 16 12:35:03 2022 Russian Standard Time (UT+4h)  she@DPX200
##.OBSERVE FREQUENCY= 81.013821
##.OBSERVE NUCLEUS= ^31P
##.ACQUISITION MODE= SIMULTANEOUS
##.ACQUISITION SCHEME= undefined
##.AVERAGES= 24
##.DIGITISER RES= 16
##SPECTROMETER/DATA SYSTEM= spect
##.PULSE SEQUENCE= zgpg30
##.SOLVENT NAME= CDCl3
##.SHIFT REFERENCE= (INTERNAL, CDCl3, 0, 248.564)
##AUDIT TRAIL= $$ (NUMBER, WHEN, WHO, WHERE, WHAT)
$$ ##TITLE= Audit trail, XWIN-NMR		Version 3.5
$$ ##JCAMPDX= 5.01
$$ ##ORIGIN= Bruker BioSpin GmbH
$$ ##OWNER= she
$$ F:/spectra/data/she/nmr/P31/1/pdata/1/auditp.txt
$$ ##AUDIT TRAIL=  $$ (NUMBER, WHEN, WHO, WHERE, WHAT)
(   1,<2022-03-16 12:33:59.39 +0400>,<she>,<DPX200>,
      <created by zg, POWCHK disabled, PULCHK disabled
       configuration hash MD5:
       00 E9 B6 7A A2 85 ED C7 34 08 36 98 17 FE 4E 26
       data hash MD5: 32K
       4F 0A 10 73 07 91 FA 93 9C 11 4A DC 11 A2 1F 6E>)
(   2,<2022-03-16 12:34:03.45 +0400>,<she>,<DPX200>,
      <Start of raw data processing
       efp BC_mod = 2 LB = 1 FT_mod = 6 PKNL = 1 PHC0 = -9210.937 PHC1 = 162.6757 SI = 64K 
       data hash MD5: 64K
       77 7B 2B 1D 8B BF CC 17 26 6B 43 D8 43 FB 88 08>)
(   3,<2022-03-16 12:34:19.56 +0400>,<she>,<DPX200>,
      <pk PHC0 = -10.85493 PHC1 = 33 
       data hash MD5: 64K
       14 78 2A 35 91 FC 68 3E 75 17 B0 4A F6 99 D6 1E>)
(   4,<2022-03-16 12:34:22.79 +0400>,<she>,<DPX200>,
      <abs ABSG = 5 
       data hash MD5: 64K
       B1 B6 63 1B D5 E9 B9 95 6A B1 D9 9F C0 12 D0 C5>)
$$ ##END=
$$ 
$$ hash MD5
$$ 74 D8 2D 8C 3B 37 1F B2 54 0C E8 FD ED C7 9B 78
##$RELAX= 
##$RELAX= 
##$RELAX= 
##$RELAX= 
##$RELAX= 
##$RELAX= 
##$RELAX= 
##$RELAX= 
$$ Bruker specific parameters
$$ --------------------------
##$DU= <F:/spectra>
##$EXPNO= 1
##$NAME= <P31>
##$PROCNO= 1
##$TYPE= <nmr>
##$USER= <she>
##$AMP= (0..31)
100 100 100 100 100 100 100 100 100 100 100 100 100 100 100 100 100 100 
100 100 100 100 100 100 100 100 100 100 100 100 100 100 
##$AQSEQ= 0
##$AQ_mod= 1
##$AUNM= <au_zg>
##$AUTOPOS= <>
##$BF1= 81.014009
##$BF2= 200.13
##$BF3= 200.13
##$BF4= 200.13
##$BF5= 200.13
##$BF6= 200.13
##$BF7= 200.13
##$BF8= 200.13
##$BYTORDA= 1
##$CFDGTYP= 0
##$CFRGTYP= 5
##$CHEMSTR= <none>
##$CNST= (0..31)
1 1 145 1 1 1 1 1 1 1 1 1 1 1 1 1 1 1 1 1 1 1 1 1 1 1 1 1 1 1 1 1 
##$CPDPRG= <waltz16>
##$CPDPRG1= <>
##$CPDPRG2= <waltz16>
##$CPDPRG3= <>
##$CPDPRG4= <mlev>
##$CPDPRG5= <mlev>
##$CPDPRG6= <mlev>
##$CPDPRG7= <mlev>
##$CPDPRG8= <mlev>
##$CPDPRGB= <>
##$CPDPRGT= <>
##$D= (0..31)
0 1 0 0 0 0 0 0 0 0 0 0.03 2e-05 3e-06 0 0 0 0 0 0 0 0 0 0 0 0 0 0 0 0 
0 0 
##$DATE= 1647419638
##$DBL= (0..7)
120 120 120 11 120 120 24 19 
##$DBP= (0..7)
150 150 150 150 150 150 150 150 
##$DBP07= 0
##$DBPNAM0= <>
##$DBPNAM1= <>
$$ [...]
##$SUBNAM3= <"">
##$SUBNAM4= <"">
##$SUBNAM5= <"">
##$SUBNAM6= <"">
##$SUBNAM7= <"">
##$SUBNAM8= <"">
##$SUBNAM9= <"">
##$SW= 501.771253377433
##$SWIBOX= (0..15)
0 1 3 0 0 0 0 0 0 0 0 0 0 0 0 0 
##$SW_h= 40650.406504065
##$TD= 32768
##$TD0= 1
##$TE= 0
##$TE2= 300
##$TE3= 300
##$TEG= 300
##$TL= (0..7)
0 120 53 12 22 120 120 120 
##$TP= (0..7)
150 150 150 150 150 150 150 150 
##$TP07= 0
##$TPNAME0= <>
##$TPNAME1= <>
##$TPNAME2= <>
##$TPNAME3= <>
##$TPNAME4= <>
##$TPNAME5= <>
##$TPNAME6= <>
##$TPNAME7= <>
##$TPOAL= (0..7)
0.5 0.5 0.5 0.5 0.5 0.5 0.5 0.5 
##$TPOFFS= (0..7)
0 0 0 0 0 0 0 0 
##$TUNHIN= 0
##$TUNHOUT= 0
##$TUNXOUT= 0
##$USERA1= <user>
##$USERA2= <user>
##$USERA3= <user>
##$USERA4= <user>
##$USERA5= <user>
##$V9= 5
##$VALIST= <valist>
##$VCLIST= <CCCCCCCCCCCCCCC>
##$VD= 0
##$VDLIST= <DDDDDDDDDDDDDDD>
##$VPLIST= <PPPPPPPPPPPPPPP>
##$VTLIST= <TTTTTTTTTTTTTTT>
##$WBST= 1024
##$WBSW= 4
##$XGAIN= (0..3)
0 0 0 0 
##$XL= 0
##$YL= 0
##$YMAX_a= 3439
##$YMIN_a= -4861
##$ZGOPTNS= <>
##$ZL1= 120
##$ZL2= 120
##$ZL3= 120
##$ZL4= 120
##$ABSF1= 248.5645
##$ABSF2= -253.2056
##$ABSG= 5
##$ABSL= 3
##$ALPHA= 0
##$AQORDER= 0
##$ASSFAC= 0
##$ASSFACI= 0
##$ASSFACX= 0
##$ASSWID= 0
##$AUNMP= <proc_1d>
##$AZFE= 0.1
##$AZFW= 0.5
##$BCFW= 0
##$BC_mod= 2
##$BYTORDP= 0
##$COROFFS= 0
##$CY= -3
##$DATMOD= 1
##$DC= 0
##$DFILT= <>
##$DTYPP= 0
##$F1P= 0
##$F2P= 0
##$FCOR= 1
##$FTSIZE= 65536
##$FT_mod= 6
##$GAMMA= 0
##$GB= 0
##$INTBC= 1
##$INTSCL= 5.30512e-09
##$ISEN= 30
##$LB= 1
##$LEV0= 0
##$LPBIN= 0
##$MAXI= 10000
##$MC2= 0
##$MEAN= 0
##$ME_mod= 0
##$MI= 50
##$NCOEF= 0
##$NC_proc= -7
##$NLEV= 6
##$NOISF1= 182.463
##$NOISF2= 159.3651
##$NSP= 0
##$NTH_PI= 0
##$NZP= 0
##$OFFSET= 248.5645
##$PC= 4
##$PHC0= -9221.791
##$PHC1= 195.6757
##$PH_mod= 1
##$PKNL= yes
##$PPARMOD= 0
##$PSCAL= 0
##$PSIGN= 0
##$REVERSE= no
##$SF= 81.014009
##$SI= 65536
##$SIGF1= 159.3651
##$SIGF2= -187.1042
##$SINO= 113.3802
##$SIOLD= 16384
##$SREGLST= <1H.CDCl3>
##$SSB= 0
##$STSI= 65536
##$STSR= 0
##$SW_p= 40650.406504065
##$SYMM= 0
##$S_DEV= 0
##$TDeff= 32768
##$TDoff= 0
##$TI= <>
##$TILT= no
##$TM1= 0
##$TM2= 0
##$TOPLEV= 0
##$USERP1= <user>
##$USERP2= <user>
##$USERP3= <user>
##$USERP4= <user>
##$USERP5= <user>
##$WDW= 1
##$XDIM= 65536
##$YMAX_p= 485972806
##$YMIN_p= -203070599
$$ End of Bruker specific parameters
$$ ---------------------------------
##NTUPLES= NMR SPECTRUM
##VAR_NAME=  FREQUENCY,     SPECTRUM/REAL,   SPECTRUM/IMAG
##SYMBOL=    X,             R,               I
##VAR_TYPE=  INDEPENDENT,   DEPENDENT,       DEPENDENT
##VAR_FORM=  AFFN,          ASDF,            ASDF
##VAR_DIM=   65536,         65536,           65536
##UNITS=     HZ,            ARBITRARY UNITS, ARBITRARY UNITS
##FACTOR=    0.620285442955139, 1,           1
##FIRST=     20137.2065510759, 0,            0
##LAST=      -20513.1999529892, 0,           0
##MIN=       -20513.1999529892, -203070599,  0
##MAX=       20137.2065510759, 485972806,    0
$$ Real data points
##PAGE= N=1
##DATA TABLE= (X++(R..R)), XYDATA
$$ [...]
35773D634913J776399K78832j769674r62993J934181K510133l11578k404622j076960
$$ 4634913 6411312 6690144 4920470 3957477 5891658 8401791 8090213 5685591 4608631
35764D608631R64959O71734n39096j66089Q23184M78442q1765R40331J942802
$$ 4608631 5573590 6245324 5706228 5540139 6363323 6841765 6760000 7700331 9643133
35755I643133L76640k409334k886495q29107P82033O13025R1741J41636K36024
$$ 9643133 10019773 7610439 4723944 3894837 4676870 5289895 5381636 5523272 5759296
35746E759296M42851J269603J783136Q74725j32024P09680K200507J553998p84919
$$ 5759296 6202147 7471750 9254886 10129611 9997587 10707267 12907774 14461772 13676853
35737A3676853j748185q29164m50208r94743n4344K494217L319469J196392o34651
$$ 13676853 11928668 11099504 10649296 9654553 9600209 12094426 15413895 16610287 15975636
35728A5975636J52390J341144O04383k67079J123370L243260L281751J861281
$$ 15975636 16128026 17469170 18073553 17806474 18929844 22173104 25454855 27316136
35720B7316136J410731J802298J336900N87703J476075L387623L810352K512777
$$ 27316136 28726867 30529165 31866065 32453768 33929843 37317466 41127818 43640595
35712D3640595J849429K889072M083994M014292K990513J628224K9011j173351
$$ 43640595 45490024 48379096 52463090 56477382 59467895 61096119 61125130 59951779
35704E9951779q10721J117804K864836K439933o93134m882574o899491m730216
$$ 59951779 59141058 60258862 63123698 65563631 64870497 59987923 53088432 48358216
35696D8358216o52300L78708l103724o691430o011189k665325j191252k176339
$$ 48358216 47705916 48084624 44980900 38289470 32278281 29612956 28421704 26245365
35688B6245365k475752j116745m36898j361310j847212p91517K50619K11183m7681
$$ 26245365 23769613 22652868 22215970 20854660 19007448 18215931 18466550 18677733 18630052
35679A8630052l98005k066167m353243m300507j402285P18993l89720k093903
$$ 18630052 18232047 16165880 11812637 7512130 6109845 6828838 6439118 4345215
35671D345215q31662K287728L253745J003012j603114k031658p72109J91017j38524
$$ 4345215 3513553 5801281 9055026 10058038 8454924 6423266 5651157 5842174 5703650
35662E703650j031696j042433J53572J049086L57707p22969k30609R78896L01442
$$ 5703650 4671954 3629521 3783093 4832179 5189886 4466917 4236308 5215204 5516646
35653E516646j780104j666207J348337L088670Q92555j888926j208731J191091
$$ 5516646 3736542 2070335 3418672 6507342 7399897 5510971 4302240 5493331
35645E493331R37011j718752k614045m41871J847812K059887R91832l72988k032286
$$ 5493331 6430342 4711590 2097545 1655674 3503486 5563373 6555205 6182217 4149931
35636D149931k977732j653836R49811J902870P17616K8846J088924J688471j17678
$$ 4149931 1172199 -481637 468174 2371044 3088660 3117506 4206430 5894901 5777223
35627E777223k823754l583499j717669J047610K497558J553608o72478j447431
$$ 5777223 2953469 -630030 -2347699 -1300089 1197469 2751077 2078599 631168
35619F31168M30615K581284K180215K26835k39854O42541L591k260192k898419
$$ 631168 1061783 3643067 5823282 6050117 5810263 6452804 6456395 4196203 1297784
35610A297784r98640L13082n65965j000152P13165J889094L43071j317233k19960
$$ 1297784 299144 612226 46261 -953891 -240726 1648368 1991439 674206 454246
35601D54246J455299L27094j794323o86170K750159L383352K9891k668905j542808
$$ 454246 1909545 2236639 442316 -243854 2506305 5889657 5919548 3250643 1707835
35592A707835P05077M40027j357532j348868P35426J960686O16034j649853k271863
$$ 1707835 2412912 2852939 1495407 146539 881965 2842651 3458685 1808832 -463031
35583d63031q47575Q45664J277015P78899M99753M86356j00215j102546j254004
$$ -463031 -1310606 -464942 812073 1590972 2090725 2577081 2476866 1374320 120316
35574A20316k62759O42393Q42470J147670J610510P20610j726970l187312j850581
$$ 120316 -142443 499950 1342420 2490090 4100600 4821210 3094240 -93072 -1943653
35565a943653M59313J234662J063064J562412J594383o65700l309623k751862
$$ -1943653 -1484340 -249678 813386 2375798 3970181 3304481 -5142 -2757004
35557b757004L04062J481579m31599j799422l01573J635563J390933J37615j38071
$$ -2757004 -2452942 -971363 -1402962 -3202384 -3503957 -1868394 -477461 -339846 -477917
35548d77917j38105r48735j197288L13198J521449Q5240k328006k263535J49952
$$ -477917 -616022 -1564757 -2762045 -2448847 -927398 -842158 -3170164 -5433699 -5283747
35539e283747J575266O74336m80672k84660K81146R0293k40047M2789M15058M06478
$$ -5283747 -3708481 -3034145 -3514817 -3799477 -3518331 -3428038 -3668085 -3625296 -3210238 -2803760
35529b803760O83546J654076K304566J601617J34153o70437l46355L50694M47558
$$ -2803760 -2120214 -466138 1838428 3440045 3574198 2903761 2557406 2908100 3355658
35520C355658m80137j893940k283891n31147K170419K937277P40260j813620j715791
$$ 3355658 2875521 981581 -1302310 -1833457 336962 3274239 4014499 2200879 485088
35511D85088L68975J289499J96547m62684P67143J811934M94880j720759j940359
$$ 485088 854063 2143562 2340109 1877425 2644568 4456502 4951382 3230623 1290264
35502A290264l90010K00796q27816j321968l97448k834j219041j966088l83705
$$ 1290264 900254 1101050 273234 -1048734 -1446182 -1449016 -2668057 -4634145 -5017850
35493e017850J870836K125987P31838k0322K71596J50788n96335o75619R4076
$$ -5017850 -3147014 -1021027 -289189 -309511 -37915 112873 -483462 -1159081 -1065005
35484a065005M64961J13984l3583R2302l36317q24941J00322J831801J744161
$$ -1065005 -600044 -486060 -519643 -427341 -763658 -1588599 -1488277 343524 2087685
35475B087685o19374k162315p36058J451087J298145k74836L6104K293553K788897
$$ 2087685 1468311 -694004 -1430062 21025 1319170 1044334 1080438 3373991 6162888
35466F162888k79695l570889k968958N55293K111830k82844k814673j302707K564568
$$ 6162888 5883193 2312304 -656654 -101361 2010469 1727625 -1087048 -2389755 174813
35457A74813L420348Q1897k503133n02312L060837K780544j320909m363291l824348
$$ 174813 3595161 3677058 1173925 671613 3732450 6512994 5192085 828794 -2995554
35448b995554j916112p63221M39236K216598K651715O76832j351799q80390J079067
$$ -2995554 -4911666 -5674887 -5235651 -3019053 -367338 309494 -1042305 -1922695 -843628
35439h43628J744708N14016j044785j773019j441497P0443K092471K750947J223875
$$ -843628 901080 1415096 370311 -1402708 -2844205 -2773762 -681291 2069656 3293531
35430C293531n68918m61324P67912P75767o72279j728120j595801j225733j014396
$$ 3293531 2724613 2263289 3031201 3806968 3134689 1406569 -189232 -1414965 -2429361
35421b429361j63693J322483K033401J217676n2952m47446J9352M68506L63962
$$ -2429361 -2593054 -1270571 762830 1980506 1927554 1480108 1499460 1967966 2331928
35412B331928j58831n53228l32765K32939J81437p31128j252562l11672J074825
$$ 2331928 2173097 1619869 1287104 1520043 1701480 970352 -282210 -593882 480943
35403D80943R86370n65748j557802q18253N56157J073196P49395M27296L01476
$$ 480943 1467313 901565 -656237 -1474490 -918333 154863 904258 1331554 1633030
35394A633030M9768k70556l63818l44903m66058m42005J30213O80794n1930k067543
$$ 1633030 1682798 1412242 1048424 703521 237463 -204542 -74329 606465 554535 -1513008
35384a513008l177008j284973K438744M204050K206891q51514j348879L96229
$$ -1513008 -4690016 -5974989 -3536245 667805 2874696 2023182 674303 1070532
35376A070532J159359L0310m85507R31798J919387K77314k253282k537012o91474
$$ 1070532 2229891 2260201 1774694 2706492 4625879 4903193 2649911 112899 -578575
35367e78575M83105k06580j214673j088069j29841Q38071J454661J337340K31435
$$ -578575 -95470 -302050 -1516723 -2604792 -2734633 -1896562 -441901 895439 1126874
35358A126874j069399j276427l13245O40654Q78734Q15068Q41840O85326J45694
$$ 1126874 57475 -1218952 -1532197 -891543 -12809 802259 1644099 2329425 2475119
35349B475119m21910o29177m86149k63211k86824o25378p43993j25039N39173
$$ 2475119 2053209 1424032 937883 674672 387848 -237530 -981523 -1106562 -567389
35340e67389j7965j264746q48614J801840L684500K098569j170793k164770k90955
$$ -567389 -585354 -1850100 -2698714 -896874 2787626 4886195 3715402 1550632 1259677
35331A259677J389068J017264m6320l51390m33870p91048m65984Q77815J579831
$$ 1259677 2648745 3666009 3619689 3268299 2834429 2043381 1577397 2455212 4035043
35322D035043L41235j569308k042809r49494J50045K47794l82992j074444j363056
$$ 4035043 4376278 2806970 764161 -185333 -35288 212506 -170486 -1244930 -2607986
35313b607986j092428n34370l8389N78765J565499K222619J596837L07941J03338
$$ -2607986 -3700414 -4234784 -4273173 -3694408 -2128909 93710 1690547 1998488 2101826
35304B101826J100116J203652p52740k896610k738727n02024J466880J718736
$$ 2101826 3201942 4405594 3652854 756244 -1982483 -2484507 -1017627 701109
35296G01109O50225q29143j959972j876936l28311J363798J487874K49583m15798
$$ 701109 1351334 522191 -1437781 -3314717 -3643028 -2279230 -791356 -541773 -957571
35287i57571L41933J013971P3961j507884j437458O10106K358974J968054M07814
$$ -957571 -615638 398333 472294 -1035590 -2473048 -1862942 496032 2464086 2871900
35278B871900k08362K61326J56640r68671j472767l80610Q55183O87834L4817
$$ 2871900 2663538 2924864 3081504 2112833 640066 259456 1114639 1802473 1837290
35269A837290O01113J719215J236000q14634j950904j022276J18097k90722j182268
$$ 1837290 2438403 4157618 5393618 4578984 2628080 1605804 1723901 1433179 250911
35260B50911n75986J167181J829262N31913j111641j127930M69323J740811R76831
$$ 250911 -325075 842106 2671368 3203281 2091640 963710 1433033 3173844 4150675
35251D150675j235020k321901o53084K120028K773816N95548j760479k048330
$$ 4150675 2915655 593754 -59330 2060698 4834514 5430062 3669583 1621253
35243A621253j307965j594670k361298j407452J120616K324503Q10416r13394
$$ 1621253 313288 -1281382 -3642680 -5050132 -3929516 -1605013 -794597 -1707991
35235a707991P2020K670609L082058J66971k830530k639960j29351J374539O43333
$$ -1707991 -1635971 1034638 4116696 4283667 1453137 -1186823 -1316174 58365 701698
35226G01698n65335o64070j24785P4093J10J1600o2867j72752J98730P60450L74245
$$ 701698 136363 -527707 -652492 -578399 -578289 -566689 -629556 -802308 -603578 156872 531117
35215E31117p86276p63015J109409K442534J151777r52062o21504J664053K103251
$$ 531117 -255159 -1018174 91235 2533769 3685546 2733484 2111980 3776033 5879284
35206E879284p82023l894207l915705j509964L14850L51681n0467M10939J239605
$$ 5879284 5097261 1203054 -2712651 -4222615 -3907765 -3556084 -3606551 -3195612 -1956007
35197a956007J152377M3142o45537K54033J782514J826416J71188q57258K63167
$$ -1956007 -803630 -760488 -1406025 -1151992 630522 2456938 2628126 1770868 2034035
35188B034035J827296J475245k08579r43044n73091q56831j847045j551966M14999
$$ 2034035 3861331 5336576 5127997 4184953 3611862 2755031 907986 -643980 -228981
35179b28981J750428J015296k10802n5237Q21754O83133m92881j223434o72957
$$ -228981 1521447 2536743 2325941 2270704 3092458 3775591 3282710 2059276 1386319
35170A386319N12423J018799M8414j742443k570104j658647n36349q04791j379697
$$ 1386319 1898742 2917541 2965955 1223512 -1346592 -3005239 -3541588 -4346379 -5726076
35161e726076j30946K283097L044628J600188L04378J89464m60182k178877k519473
$$ -5726076 -5857022 -3573925 -529297 1070891 1375269 1564733 1104551 -1074326 -3593799
35152c593799j91888K105971J538863o65510j508752o29640K67980O23556R39158
$$ -3593799 -3785687 -1679716 -140853 -806363 -2315115 -2944755 -2676775 -2053219 -1114061
35143a114061R30600L29853K21153J154944J397813l28395j921418p85166J663718
$$ -1114061 -183461 146392 367545 1522489 2920302 2591907 670489 -114677 1549041
35134A549041J859324l58560j767885j076011l24390n39992J10653K397144L639779
$$ 1549041 3408365 3049805 1281920 205909 -118481 -658473 -547820 1849324 5489103
35125E489103J490112k224703l775703k211430K41160J397850Q83109o02844j990917
$$ 5489103 6979215 4754512 978809 -1232621 -991461 406389 1289498 686654 -1304263
35116a304263k071425n28726J190397J213122l92583j581943r32993O72048J516045
$$ -1304263 -3375688 -3904414 -2714017 -1500895 -1893478 -3475421 -4408414 -3736366 -2220321
35107b220321J333697J103782J045249L08726j063269j425484J38480J947056
$$ -2220321 -886624 217158 1262407 1571133 507864 -917620 -779140 1167916
35099A167916J752247o1810j102846m57066M24785L84919J6469m9598l20053j016053
$$ 1167916 2920163 2858353 1755507 1298441 1723226 2108145 2124614 2075016 1754963 738910
35089G38910j212869m34316L83848M72291L01793K26292k67314r62727m56901
$$ 738910 -473959 -908275 -524427 -52136 249657 475949 208635 -754092 -1210993
35080a210993J344996K148212M14100k031944k428457p38253R97065J644011J359444
$$ -1210993 134003 2282215 2696315 664371 -1764086 -2502339 -1505274 138737 1498181
35071A498181K53273j208147j540746j26417J205612N81741r52710j104982P4807
$$ 1498181 1751454 543307 -997439 -1123856 81756 663497 -289213 -1394195 -1319388
35062a319388P65871O17683O72923P30990k72686j610961j491261l37495k76644
$$ -1319388 -553517 64166 737089 1468079 1195393 -415568 -1906829 -2244324 -2520968
35053b520968j221707p49069J519391K775483J481527j89051j04645N00113k75406
$$ -2520968 -3742675 -4491744 -2972353 -196870 1284657 1095606 990961 1491074 1215668
35044A215668j388248p44835R38630J192809r6450o22731L27568O40603r64855
$$ 1215668 -172580 -917415 21215 1214024 1117574 494843 822411 1463014 498159
35035D98159k395826j077880J937916K934990M87487k490083k496929J23336J963501
$$ 498159 -1897667 -2975547 -1037631 1897359 2384846 -105237 -2602166 -2478830 -515329
35026e15329J109121q22768j330368j25264J135243J121473J126j041270r18604
$$ -515329 593792 -228976 -1559344 -1684608 -549365 572108 573234 -468036 -1386640
35017a386640K72563J236394J198430J135143J909966J924193q26269m516844
$$ -1386640 -1114077 122317 1320747 2455890 4365856 6290049 5463780 946936
35009I46936m758877j016681J981309J177500l74306Q46277K509590M93986l411376
$$ 946936 -3811941 -4828622 -2847313 -1669813 -2044119 -1197842 1311748 1805734 -1605642
35000a605642l660132K03474K793099J404482l85581O53925K272240J131445j571185
$$ -1605642 -5265774 -5062300 -2269201 -864719 -1250300 -596375 1675865 2807310 1236125
34991A236125k385425r65464K85232M07762N71635J182162R87257o52331k302796
$$ 1236125 -1149300 -2114764 -1829532 -1421770 -850135 332027 1319284 666953 -1635843
34982a635843j941635N90119K972988K610973k64953k499412j922367k13493j41283
$$ -1635843 -3577478 -2987359 -14371 2596602 2331649 -167763 -2090130 -2303623 -2444906
34973b444906j174552o51740J317770J715802k07922j358703J72040J941758J269678
$$ -2444906 -3619458 -4271198 -2953428 -1237626 -1445548 -2804251 -2632211 -690453 579225
34964E79225l83654n1781J770290K008446j36718k188133k099778o05327M75880
$$ 579225 195571 143790 1914080 3922526 3785808 1597675 -502103 -1107430 -631550
34955f31550N97993N53280J049251J730114J547761J57356j350249j730624j219302
$$ -631550 -33557 519723 1568974 3299088 4846849 5004205 3653956 1923332 704030
34946G04030q36779n40953L34651J190486Q61260J22135Q91661K575762K193724
$$ 704030 -132749 -673702 -339051 851435 1712695 1834830 2726491 5302253 7495977
34937G495977q33796l131673k305469m36821l35878j101848m40297Q90612N54237
$$ 7495977 6662181 3530508 1225039 788218 452340 -649508 -1089805 -199193 355044
34928C55044r35162j038546K85328O19554m59519o49821P75752J415905j65079
$$ 355044 -580118 -1618664 -1333336 -713782 -1173301 -1823122 -1047370 368535 203456
34919B03456j778172j044196P65451P65712j010736j744128j83016J551829J207315
$$ 203456 -1574716 -2618912 -1853461 -1087749 -2098485 -3842613 -4025629 -2473800 -1266485
34910a266485l74551o96594O68137J580974N93572j018578j295982k88984N96578
$$ -1266485 -1641036 -2337630 -1669493 -88519 505053 -513525 -1809507 -2098491 -1501913
34901a501913Q96008J060308Q91995J3930n08246O88070K491239K206042l08479
$$ -1501913 -605905 454403 1346398 1360328 852082 1540152 4031391 6237433 5928954
34892E928954k030081j289688k07110r93005k347199j863399m7472P79216K86569
$$ 5928954 3898873 2609185 2402075 1409070 -938129 -2801528 -2849000 -2069784 -1783215
34883a783215O3195M64987K66193o87203r47735P2402J112462J083567N03008
$$ -1783215 -1720020 -1255033 -988840 -1676043 -2623778 -2551376 -1438914 -355347 147661
34874A47661K73673K53266j80640q38346p64237M35790J688205J398174m08219
$$ 147661 421334 674600 493960 -344386 -1108623 -672833 1015372 2413546 2005327
34865B005327j647851q68712M72808K00922q53092o5369K192243K544517K24381
$$ 2005327 357476 -511236 -38428 162494 -690598 -755967 1436276 3980793 4205174
34856D205174j283331r5129P26139j255989k980105r83526K055804J419490j470738
$$ 4205174 2921843 2826714 3552853 2296864 -683241 -1666767 389037 1808527 337789
34847C37789j420413J282371J214904k266990l079195J308498M788466J986012
$$ 337789 -1082624 199747 1414651 -852339 -3931534 -2623036 2165430 4151442
34839D151442l219620l953867o22822J243255L77795L09776J851483J781460n28890
$$ 4151442 931822 -3022045 -3644867 -2401612 -2023817 -1714041 137442 1918902 1390012
34830A390012j258928J242959L068622Q34885k749641k920252J39860K098219
$$ 1390012 131084 1374043 4442665 5277550 2527909 -392343 -252483 1845736
34822A845736R74372q22400r07817j86479n84774j677365j366555Q48408K886004
$$ 1845736 2820108 1997708 1089891 903412 318638 -1358727 -2725282 -1876874 1009130
34813A009130K617114M48272j304503j262191l17820O2605j02122J50078P42701
$$ 1009130 3626244 4074516 2770013 1507822 1190002 1252607 1150485 1300563 2043264
34804B043264N11335p98041j823699j419994j37626P78124R10044M47368n64761
$$ 2043264 2554599 1756558 -67141 -1487135 -1624761 -846637 63407 510775 -53986
34795e3986j739371j971553p61595P44771J252914J126194J280040J154630j67391
$$ -53986 -1793357 -3764910 -4526505 -3781734 -2528820 -1402626 -122586 1032044 864653
34786H64653j434852m99582J799339K016317o91051k710442j150600J764010K042821
$$ 864653 -570199 -1069781 729558 2745875 2054824 -655618 -1806218 -42208 2000613
34777B000613l28341k043451j629808o87094m03135J9301J099492J834098J417092
$$ 2000613 1672272 -371179 -2000987 -2688081 -3091216 -3071915 -1972423 -138325 1278767
34768A278767L18321p90504j551517j298975K58588J731472J390120j89825r14415
$$ 1278767 1597088 806584 -744933 -2043908 -1785320 -53848 1336272 1146447 232032
34759B32032m97078n28127j204413r00279N56263J298027R34265J320374K533323
$$ 232032 -265046 -793173 -1997586 -2897865 -2341602 -1043575 -109310 1211064 3744387
34750C744387J733974j767399l885257j437789K435307K481128r92229k961776
$$ 3744387 5478361 3710962 -174295 -1612084 823223 3304351 2312122 -649654
34742f49654j300323Q48888O09721o54711l43953J233926J694756J39710j782439
$$ -649654 -1949977 -1101089 -491368 -1146079 -1490032 -256106 1438650 1578360 -204079
34733b04079k032104n36067P88494L81402q96750r20702N73777J628647J223576
$$ -204079 -2236183 -2772250 -1983756 -1602354 -2499104 -3419806 -2846029 -1217382 6194
34724F194O47254O43915k65523k559610l328825l03720L508126L135640j067804
$$ 6194 653448 1297363 1031840 -1527770 -4856595 -5160315 -1652189 1483451 415647
34715D15647l478619r46963L178735M010861J148070j969011k631441j018365
$$ 415647 -3062972 -4009935 -831200 3179661 4327731 2358720 -272721 -1291086
34707a291086R67440J585055N78587o61083p18491L5426Q1694r70589j876971
$$ -1291086 -323646 1261409 1839996 1178913 460422 495848 577542 -393047 -2270018
34698b270018j480208P2236J667391J969918M65094j333875r29309J558817K525781
$$ -2270018 -3750226 -3677990 -2010599 -40681 424413 -909462 -1838771 -279954 2245827
34689B245827k10798l453510k754410R15967K625408R02095q38734m60883J18866
$$ 2245827 2035029 -1418481 -4172891 -3256924 -631516 270579 -568155 -1029038 -910172
34680i10172m97088n44129Q95353J509635K2524j038837J27577R81659q39071
$$ -910172 -1407260 -1951389 -1056036 453599 476123 -562714 -435137 546522 -292549
34671b92549k764525j398587J383486J412001o34439n23888J957278K459107m32035
$$ -292549 -3057074 -4455661 -3072175 -1660174 -2294613 -2818501 -861223 1597884 1165849
34662A165849k629456j223810J048699P08431r71745p82208Q91909J178945j81693
$$ 1165849 -1463607 -2687417 -1638718 -930287 -1902032 -2684240 -1792331 -613386 -795079
34653g95079o69528M60130R36116n27383j827981o22592J955973K690733O60700
$$ -795079 -1464607 -1004477 -68361 -595744 -2423725 -3046317 -1090344 1600389 2261089
34644B261089j635125j693773l5723J027346O59450J62566N67104J031091K81911
$$ 2261089 625964 -1067809 -1103532 -76186 583264 745830 1312934 2344025 2625936
34635B625936j357394k350032j828169k36702J443337K201639J238468j026319
$$ 2625936 1268542 -1081490 -2909659 -3146361 -1703024 498615 1737083 710764
34627G10764k421329j054265J885333K947507P44162k084723k395531o10847N39382
$$ 710764 -1710565 -2764830 -879497 2068010 2812172 727449 -1668082 -2278929 -1739547
34618a739547L21986N23557J721483J826261m04580k646786j962538Q02719K035165
$$ -1739547 -1417561 -894004 827479 2653740 2249160 -397626 -2360164 -1557445 477720
34609D77720L92288j575304j230340Q22755K178037J781172L73368j107280k166900
$$ 477720 870008 -705296 -1935636 -1112881 1065156 2846328 3219696 2112416 -54484
34600e4484k338320j360423K69359J607564K075260J707466R73208N09917M49790
$$ -54484 -2392804 -3753227 -3483868 -1876304 198956 1906422 2879630 3389547 3839337
34591C839337l6625j585842k980560k141982O66623K355803R45296j531572j716786
$$ 3839337 3802712 2216870 -763690 -2905672 -2239049 116754 1062050 -469522 -2186308
34582b186308O35431K802537K885324J443159k64776j644033k278005j796782
$$ -2186308 -1550877 1251660 4136984 5580143 5315367 3671334 1393329 -403453
34574d03453o34476K17082L83115J96677j19119l83283k9009J075521J835382
$$ -403453 -1037929 -820847 -437732 -241055 -360174 -743457 -772466 303055 2138437
34565B138437J216971j52107r46810j058953j092449p43711M74112J555199J145465
$$ 2138437 3355408 3203301 2256491 1197538 105089 -638622 -164510 1390689 2536154
34556B536154p9550l48691K60389J46836p90710j014791k60046M5645m63349n45039
$$ 2536154 2456604 2107913 2368302 2515138 1724428 709637 449591 495236 31887 -513152
34546e13152K7929L040o05409j20979J546375K077103M24473j299375j077631
$$ -513152 -485223 -482183 -1087592 -1208571 337804 2414907 2839380 1540005 462374
34537D62374K39212Q84677O75529J52842n86518r03883K04905J712285J024978
$$ 462374 701586 1586263 2261792 2414634 1828116 924233 1129138 2841423 3866401
34528C866401j709813k815505n43802J884754J242435q50662j192817k19941k13610
$$ 3866401 2156588 -658917 -1202719 682035 1924470 1073808 -119009 -338950 -552560
34519e52560p36579l5001Q74003q2728j582642o98803J721274K087100Q8889r90281
$$ -552560 -1289139 -1324140 -450137 -532865 -2115507 -2814310 -1093036 994064 1082953 92672
34509I2672p0029L89237m98446m13812J268876J594509p37549k407948o51989
$$ 92672 22643 411880 -86566 -500378 768498 2363007 1625458 -782490 -1434479
34500a434479K041926J775210q04204j957026o06812Q23555N66169n04867r48820
$$ -1434479 607447 2382657 1578453 -378573 -985385 -161830 404339 -100528 -1049348
34491a049348n45128J77147O84081O54430L79915N95716J249919J299833M83251
$$ -1049348 -1594476 -1417329 -733248 -78818 301097 896813 2146732 3446565 3929816
34482C929816L9174N83617P16046o92397k172419j642778K46737J014905N5492
$$ 3929816 3968990 4552607 5268653 4576256 2403837 761059 1007796 2022701 2078193
34473B078193q90333q40985p63014j220250j049584N77116K389260K554680J003713
$$ 2078193 1187860 346875 -416139 -1636389 -2685973 -2108857 280403 2835083 3838796
34464C838796p80501j577289j239536l25895L47503K63372j78389j28250L07834
$$ 3838796 3058295 1481006 241470 -84425 263078 526450 348061 219811 527645
34455E27645K5891j147619j604505j55857J819427J978122K95153j013008q08851
$$ 527645 553536 -594083 -2198588 -2354445 -535018 1443104 1738257 725249 -83602
34446h3602l62605q46265j424460j027483m09217p35484j259611m15747J385616
$$ -83602 -446207 -1292472 -2716932 -3744415 -4153632 -4889116 -6148727 -6564474 -5178858
34437e178858K179418J499730Q59390R54828O05138p87511j806735j248956l6820
$$ -5178858 -2999440 -1499710 -640320 314508 919646 132135 -1674600 -2923556 -2960376
34428b960376M56164M29058N18331K18449p19042p81628J078544K838427J779817
$$ -2960376 -2504212 -2075154 -1556823 -1338374 -2057416 -2839044 -1760500 1077927 2857744
34419B857744j099946k068210j28399J600461P91929q07172o47519N88408N30140
$$ 2857744 1757798 -310412 -438811 1161650 1953579 1146407 498888 1087296 1617436
34410A617436r58601j859049j150857K75968J398925J867901J366232m1130j121442
$$ 1617436 658835 -1200214 -2351071 -2075103 -676178 1191723 2557955 2516825 1395383
34401A395383p61422J07556l47862j914199k585965j880964j458847j768820q39529
$$ 1395383 633961 741517 393655 -1520544 -4106509 -5987473 -7446320 -9215140 -10054669
34392a0054669J963566L596637J446930k086056k461932N19305K760588K224353
$$ -10054669 -8091103 -4494466 -3047536 -5133592 -7595524 -7076219 -4315631 -2091278
34384b091278J278202J808400K008192J83946j687186j222302K35145K03332m24652
$$ -2091278 -813076 995324 3003516 3187462 1500276 277974 513119 716451 291799
34375B91799N10654J489012o44177m237041l848600J259200M811780K178126k963455
$$ 291799 802453 2291465 1647288 -2589753 -6438353 -5179153 -367373 1810753 -1152702
34366a152702m029222l91614L049720L088680J056976n95889j060493o33315j7671
$$ -1152702 -5181924 -5573538 -2523818 564862 1621838 1025949 -34544 -667859 -685530
34357f85530j23093q08806n24535J102788J712013l99489k799210j987518J064301
$$ -685530 -808623 -1617429 -2141964 -1039176 672837 273348 -2525862 -4513380 -3449079
34348c449079K119874J25746j489012n55022O71287l07360k101257j791986P21404
$$ -3449079 -1329205 -1203459 -2692471 -3247493 -2576206 -2883566 -4984823 -6776809 -6055405
34339f055405K976094L231287J733593k93941j500879j076885L21043J044981
$$ -6055405 -3079311 151976 1885569 1591628 90749 -986136 -665093 379888
34331C79888N46148k8972R3707P2355p79741j418771o79724N68618N07483q25744
$$ 379888 926036 897064 990771 1063126 283385 -1135386 -1815110 -1246492 -739009 -1564753
34321a564753j375104K4980J688549R61520k045980l751820j326537K953018L855659
$$ -1564753 -2939857 -2914877 -1226328 -264808 -2310788 -6062608 -7389145 -4436127 -580468
34312e80468K39346k935470j553562J691949J768783p37727j125449J169158J753932
$$ -580468 -341122 -3276592 -4830154 -3138205 -1369422 -2107149 -3232598 -2063440 -309508
34303c09508p89548k255805j79678J829629M65951j554280m95807J763225J171974
$$ -309508 -1099056 -3354861 -3534539 -1704910 -1238959 -2793239 -3289046 -1525821 -353847
34294c53847j413477j953335p7587J079932P37172R98281K027773J635848j92120
$$ -353847 -1767324 -3720659 -3798246 -2718314 -1981142 -982861 1044912 2680760 2488640
34285B488640r02335L7848L85861m32684k82467J346953K000720O06567n57667
$$ 2488640 1586305 1624153 2010014 1577330 1294863 2641816 4642536 5249103 4691436
34276D691436J14747R38685J67115j145104j391976r01634m14453M27017J375878
$$ 4691436 4806183 5744868 5911983 4766879 3374903 2473269 2058816 2485833 3861711
34267C861711Q43235j360533k869513k086597m14688M49625R86733J812239J748178
$$ 3861711 4704946 3344413 474900 -1611697 -2026385 -1576760 -590027 1222212 2970390
34258B970390J28082j336858j300878j110567j994850k319691m70875J723164
$$ 2970390 3098472 1761614 460736 -649831 -2644681 -4964372 -5435247 -3712083
34250c712083J647160J70747m8670R97258J354740R45992J159905J601818Q77477
$$ -3712083 -2064923 -1894176 -1942846 -945588 409152 1355144 2515049 4116867 4994344
34241D994344j57658L29319J250358J3433k427408k341409N47111K122026L88124
$$ 4994344 4836686 5166005 6416363 6429796 4002388 1660979 2208090 4330116 4718240
34232D718240j460752n24666J236985P80730q81865p42934J102304J875946O08020
$$ 4718240 3257488 2732822 3969807 4750537 3868672 3125738 4228042 6103988 6712008
34223F712008q11020p86915J34772P31042P57264P95455J283398J865374J613010
$$ 6712008 5900988 5114073 5248845 5979887 6737151 7532606 8816004 10681378 12294388
34214A2294388K96910q30864n99693N4355o65815k294255k509839r31894J76016
$$ 12294388 12591298 11760434 11160741 11215096 10549281 8255026 5745187 4813293 4989309
34205D989309k25836l21335R47971J671156M20902r54692n87733J5783j056450
$$ 4989309 4763473 4442138 5390109 7061265 7482167 6527475 5939742 5955525 4899075
34196D899075k151418p59425J633392J523676q91916k185206j317198n34641p14124
$$ 4899075 2747657 1988232 3621624 5145300 4253384 2068178 750980 216339 -497785
34187d97785j50006J422681J779075L08213o90952j82324q5783j145737j001569
$$ -497785 -647791 774890 2553965 2862178 2171226 1988902 1903119 757382 -244187
34178b44187J290421K539164L07572k679808k614605m65235K48524n04635L7694
$$ -244187 1046234 3585398 3892970 1213162 -1401443 -1866678 -1618154 -2122789 -2085095
34169b085095J835316J914404j58735j192675K82296J592758M95210j278176j258170
$$ -2085095 -249779 1664625 1505890 313215 595511 2188269 2683479 1405303 147133
34160A47133k15034k36978q94212k72217J364978J891153Q69178N1398J78365
$$ 147133 -67901 -304879 -1199091 -1471308 -106330 1784823 2654001 2705399 2883764
34151B883764j61380j682379k656968j466671P05655J514556P97922L49699Q01012
$$ 2883764 2722384 1040005 -1616963 -3083634 -2377979 -863423 -65501 284198 1085210
34142A085210Q47618j45083q21616j16774Q16413M46687n87180n80182L60945
$$ 1085210 1932828 1787745 966129 849355 1665768 2112455 1525275 945093 1306038
34133A306038O18042k8312m9288R20726J093612m95345j978904j247732Q50665
$$ 1306038 1924080 1895768 1846480 2767206 3860818 3365473 1386569 138837 989502
34124I89502J765346Q29229l13992m47392o4626J01178J27137J12749k55600q45235
$$ 989502 2754848 3584077 3270085 2822693 2758067 2859245 2986382 3099131 2843531 1998296
34114A998296r39851m86017l98313r93638j174236q7799J228892J073491m09751
$$ 1998296 1058445 572428 174115 -819523 -1993759 -2081558 -852666 220825 -188926
34105a88926j205041j05383J614481J812489J27168j800895k484597j997627j073685
$$ -188926 -1393967 -1499350 115131 1927620 2054788 253893 -2230704 -4228331 -5302016
34096e302016R6311J348043J712770N56748p47265n2000K298193L261171J164953
$$ -5302016 -5205705 -3857662 -2144892 -1588144 -2335409 -2387409 -89216 3171955 4336908
34087D336908j733976k371387j046538k05779j97424O64595K033531J202962j974065
$$ 4336908 2602932 231545 -814993 -1020772 -1218196 -553601 1479930 2682892 708827
34078G08827l375585l93412L348424K681634j378189k956548j06759K425107O87283
$$ 708827 -2666758 -3060170 288254 2969888 1591699 -1364849 -1471608 953499 1640782
34069A640782k514904k292254P28497J704716q14133k971371j653042J329386
$$ 1640782 -874122 -3166376 -2437879 -733163 -1547296 -4518667 -6171709 -4842323
34061d842323K551378J581277K89704l90711p81805p74133K3055R97216J114805
$$ -4842323 -2290945 -709668 -419964 -810675 -1592480 -2366613 -2343558 -1346342 -231537
34052b31537M76469k2133j41255j69969O7793O81526P63949l89854j509836o49417
$$ -231537 244932 222799 81544 -88425 -20632 660894 1424843 1034989 -474847 -1124264
34042a124264J774493L089797J829441n80731k038588k087716j423263n84712
$$ -1124264 650229 3740026 5569467 4988736 2950148 862432 -560831 -1145543
34034a145543Q600p8472n48053m45951L67701Q37993L98692j07867P2659L48423
$$ -1145543 -1136943 -1215415 -1763468 -2209419 -1841718 -1003725 -605033 -712900 -640241 -291818
34024b91818n4128o85823o64855o8632M25953O10329O21871M42648K48395M82667
$$ -291818 -345946 -1031769 -1696624 -1765256 -1339303 -728974 -107103 335545 583940 1066607
34014A066607R07196N26569p82116j663819j239358m72197m41294n48564K4444
$$ 1066607 1973803 2500372 1718256 54437 -1184921 -1657118 -2098412 -2646976 -2622532
34005b622532L40121p40797j888290o77400K459105M092560K270592q24366j765688
$$ -2622532 -2282411 -3023208 -4911498 -5588898 -3129793 962767 3233359 2408993 643305
33996F43305r9874J545792R15606j380402k831477j987007j03002M75323o12692
$$ 643305 543431 2089223 3004829 1624427 -1207050 -3194057 -3297059 -2821736 -3434428
33987c434428j301794j60799J436483J438869K84341M4577R69067J096370m92991
$$ -3434428 -4736222 -4897021 -3460538 -2021669 -1737328 -1692751 -723684 372686 -120305
33978a20305k072221j682181L42335K099783K275775Q80859j173658k540816k247007
$$ -120305 -2192526 -3874707 -3532372 -1432589 843186 1724045 550387 -1990429 -4237436
33969d237436o14421J119624K163633K381778J419127q87753l095440k982086
$$ -4237436 -4851857 -3732233 -1568600 813178 2232305 1344552 -1750888 -4732974
33961d732974n59131J417020J052229j30945K44534J670074J684069j17798j358246
$$ -4732974 -5292105 -3875085 -2822856 -2953801 -2709267 -1039193 644876 527078 -831168
33952h31168m82206R04073M03833j634372k402215l13090K755199L541329J286486
$$ -831168 -1313374 -409301 -5468 -1639840 -4042055 -4355145 -1599946 1941383 3227869
33943C227869j372879j656325J00492J330235P68918l51201o58707n23625p90372
$$ 3227869 1854990 198665 299157 1629392 2398310 2047109 1388402 864777 74405
33934G4405r98192k01495J145901J487229K15257j514498k051041q39140J066918
$$ 74405 -923787 -1125282 20619 1507848 1723105 208607 -1842434 -2681574 -1614656
33925a614656J821016O54635q67403m76402J496925K021140l09022k644404j722387
$$ -1614656 206360 860995 -6408 -482810 1014115 3035255 2726233 81829 -1640558
33916a640558J105713J758610k62436j157643R15179K674685Q95687k373275k885395
$$ -1640558 -534845 1223765 961329 -196314 718865 3393550 4289237 1915962 -969433
33907i69433m52011J414236J104124M80085Q13737O89705r22216k341298j698713
$$ -969433 -1421444 -7208 1096916 1577001 2390738 3080443 2158227 -183071 -1881784
33898a881784R8819P80233m9505p35492n5948J399811K107259J163781p35995
$$ -1881784 -1782965 -1002732 -1052237 -1787729 -1843677 -443866 1663393 2827174 2091179
33889B091179j677939n98103R84644N66819j749093k951702j204304J520367K215889
$$ 2091179 413240 -184863 799781 1366600 -382493 -3334195 -4538499 -3018132 -802243
33880h02243P31972p63888r81968l06007P09985J687775J766832M01424j407977
$$ -802243 -70271 -834159 -1816127 -2122134 -1412149 275626 2042458 2443882 1035905
33871A035905k111262j510995m78289N29812J304955J135120j29608j128565q60813
$$ 1035905 -1075357 -2586352 -3064641 -2534829 -1229874 -94754 -224362 -1352927 -2213740
33862b213740m59670j066910j237255P66577L161304K609919l69231j719249P1975
$$ -2213740 -2673410 -3740320 -4977575 -4210998 -1049694 1560225 1190994 -528255 -456280
33853d56280J943804J299504m78667j060961n37433N4905P74187J419916O35886
$$ -456280 1487524 2787028 2308361 1247400 709967 764872 1539059 2958975 3594861
33844C594861j669640l209338k431833o66201L71355Q49505J090009L39557q76027
$$ 3594861 1925221 -1284117 -3715950 -4382151 -4010796 -3161291 -2071282 -1731725 -2607752
33835b607752j81225K559180L691491J124553j897055j741353j5527j32687j113190
$$ -2607752 -2788977 -229797 3461694 4586247 2689192 947839 932312 799625 -313565
33826c13565J16336K292149J437857j947651l176022j047584M08103j003108k167189
$$ -313565 -197229 2094920 3532777 1585126 -1590896 -2638480 -2230377 -3233485 -5400674
33817e400674l57966K197416K254390M71737n58406m56762l79044l23446J90730
$$ -5400674 -5758640 -3561224 -1306834 -835097 -1393503 -1850265 -2229309 -2552755 -2362025
33808b362025L77817m42920j039060o7086J408888J383370J22317k32381R92897
$$ -2362025 -1984208 -2427128 -3466188 -3533274 -2124386 -741016 -618699 -851080 141817
33799A41817J947844Q73981j464392k606501j296327R24338J439452j20710j274776
$$ 141817 2089661 2963642 1499250 -1107251 -2403578 -1479240 -39788 -160498 -1435274
33790a435274j81559J507961J066448r51853j386753N52996J940589P16432j114475
$$ -1435274 -1616833 -108872 957576 5723 -1381030 -828034 1112555 1828987 714512
33781G14512p44273J030340J148098r54687k464988j242178J210840J812088m6674
$$ 714512 -29761 1000579 2148677 1193990 -1270998 -2513176 -1302336 509752 463078
33772D63078j833215j356974L10376N86844n83184n43528J706707L317163J547024
$$ 463078 -1370137 -2727111 -2416735 -1829891 -2413075 -2956603 -1249896 2067267 3614291
33763C614291j913417l131009j353322N76661P62845K62615L19634L43393m71904
$$ 3614291 1700874 -1430135 -2783457 -2206796 -1443951 -1181336 -861702 -518309 -990213
33754i90213j567007j955644j312466K41583K029089K546455J022484r16959j103783
$$ -990213 -2557220 -4512864 -5825330 -5583747 -3554658 -1008203 14281 -902678 -2006461
33745b006461p7772j37409j365573j465235K07787J507495J098049J96978k39189
$$ -2006461 -2084233 -2221642 -3587215 -5052450 -4844663 -3337168 -2239119 -2042141 -2281330
33736b281330j008978k020660j253957J730563L995850L167731Q36907k54036
$$ -2281330 -3290308 -5310968 -6564925 -4834362 -838512 2329219 3166126 2912090
33728B912090k29619p15619j347053o15825R25127J204447n2758j009968o50883
$$ 2912090 2682471 1966852 619799 3974 929101 2133548 2080790 1070822 419939
33719D19939J9009r0008o07066n44086K56290R27009N66606o07863j264696n67126
$$ 419939 438948 348940 -258126 -802212 -545922 381087 947693 339830 -924866 -1491992
33709a491992N98818Q94288M79601K98562L9006j130818k198090j330234O94070
$$ -1491992 -893174 1114 480715 779277 818283 -312535 -2510625 -3840859 -3146789
33700c146789J125963j40727k4027K386881L531366P94859k916594l210309n65549
$$ -3146789 -2020826 -2161553 -2185580 201301 3732667 4527526 1610932 -1599377 -2164926
33691b164926Q76216m09989j786001r14987J225071K310756J627688L29335k07334
$$ -2164926 -1288710 -1698699 -3484700 -4399687 -3174616 -863860 763828 1093163 885829
33682H85829J83596M04408l89038j400990j217741j3299P25202N80916M22346
$$ 885829 1069425 1473833 1084795 -316195 -1533936 -1547235 -822033 -241117 181229
33673A81229K52958p31218j694552p06286J554936J907690k75716j617868j96601
$$ 181229 434187 -297031 -1991583 -2697869 -1142933 764757 489041 -1128827 -1325428
33664a325428J191252j09832j969139j180984J069322J470154J76617o7894R91867
$$ -1325428 -134176 -244008 -2213147 -3394131 -2324809 -854655 -678038 -745932 245935
33655B45935J044080n06849j848108j927133j158301M08609K530449L189050R50339
$$ 245935 1290015 783166 -1064942 -2992075 -4150376 -3741767 -1211318 1977732 2928071
33646B928071j730324j161297J936885L158406Q90846j709623j898887q89576
$$ 2928071 1197747 36450 1973335 5131741 6022587 4312964 2414077 1524501
33638A524501q71155j530939j361213l10993N76462Q17784N71311N7978l96729
$$ 1524501 653346 -877593 -2238806 -2549799 -1973337 -1155553 -584242 -526264 -922993
33629i22993n83792q39937j285857r24095J031721L159306K994048L72085k110375
$$ -922993 -1506785 -2346722 -3632579 -4556674 -3524953 -365647 2628401 3000486 890111
33620H90111k354452r40858L81936R23376J042865R95531O57041k593o87666j022517
$$ 890111 -1464341 -2405199 -2023263 -1099887 -57022 938509 1595550 1592957 905291 -117226
33610a17226r92500r80177j046852n77048N53218J051936l0152j157177j86421
$$ -117226 -1109726 -2089903 -3136755 -3713803 -3160585 -2108649 -2138801 -3295978 -3482399
33601c482399J851107J829260k89511r23802J296544K991280J426847j204800
$$ -3482399 -1631292 197968 -91543 -1015345 281199 3272479 4699326 3494526
33593C494526j707533p36662m57562l98528O73800J397524K19507j163098o00004
$$ 3494526 1786993 1050331 592769 194241 868041 2265565 2485072 1321974 721970
33584G21970N91497L64904l3940R19493R50933j873662l835363p34965L911610
$$ 721970 1313467 1678371 1644431 2563924 3514857 1641195 -2194168 -2929133 982477
33575I82477L203973j884850l672313k05084K050620l86565k500502j93795K568535
$$ 982477 4186450 2301600 -1370713 -1575797 474823 88258 -2412244 -2606039 -37504
33566c7504J146213j622086p83771J918942J234982k458124l664704l68417L376859
$$ -37504 1108709 -513377 -1297148 621794 1856776 -601348 -4266052 -4634469 -1257610
33557a257610L604197R89575j402859j910615r82004L8407K33817Q859M10564
$$ -1257610 2346587 3336162 1933303 22688 -959316 -920909 -687092 -678233 -267669
33548b67669J196666Q02540j053136k353656j562871J31528P80136M76565N65771
$$ -267669 928997 1731537 678401 -1675255 -3238126 -3106598 -2326462 -1849897 -1284126
33539a284126J117051R26348l97378j683736j562129m0194J260577O80111j236461
$$ -1284126 -167075 759273 361895 -1321841 -2883970 -2924164 -1663587 -983476 -2219937
33530b219937j857187R4733K278652J774225n76450j419137M1436J210839M63229
$$ -2219937 -4077124 -3982391 -1703739 70486 -505964 -1925101 -1883665 -672826 -209597
33521b09597o92892n18352N40500J275416J355287P57581m81801j429064j027509
$$ -209597 -902489 -1420841 -880341 395075 1750362 2507943 2026142 597078 -430431
33512d30431P7865L57888j75910m69270p14112j517130j618121K96575K279863
$$ -430431 -352566 5322 -170588 -639858 -1353970 -2871100 -4489221 -4192646 -1912783
33503a912783J461461r16812j176220N37039P41727o68071q5644K580953K715921
$$ -1912783 -451322 -1368134 -2544354 -2007315 -1265588 -1933659 -2019303 561650 3277571
33494C277571r39504l347058j321789J399698J025495j51763Q50355J558971j005675
$$ 3277571 2338067 -1008991 -2330780 -931082 94413 -57350 793005 2351976 1346301
33485A346301l692589j916389K248558L179217O71029o63689M23971O85433r16599
$$ 1346301 -2346288 -4262677 -2014119 1165098 1836127 1172438 1596409 2281842 1365243
33476A365243j486869O3854Q92066o42886k037848p99412J658543K316194P19184
$$ 1365243 -121626 -57772 834294 191408 -1846440 -2645852 -987309 1328885 2048069
33467B048069q67960n10601J180407J716862k45703k658711k237960Q31714K647492
$$ 2048069 1180109 669508 1849915 3566777 3321074 662363 -1575597 -743883 1903609
33458A903609J116155j015356n95441J237215J525658K67156m80620m02191n81916
$$ 1903609 3019764 2004408 1408967 2646182 4171840 4438996 3958376 3556185 2974269
33449B974269q58847o20503p93796k001509k303504n4941K513650K143278l35586
$$ 2974269 2115422 1494919 701123 -1300386 -3603890 -3658831 -1145181 998097 662511
33440F62511j464029o14699k9277k08490N13417J979139J919395O7159j091571
$$ 662511 -801518 -1416217 -1445494 -1653984 -1140567 838572 2757967 2825126 1733555
33431A733555l39830O82588N81579L9863j01944o4528P6666N70288P79701j2656
$$ 1733555 1393725 2076313 2657892 2697755 2595811 2531283 2607949 3178237 3957938 3945282
33421C945282p66047p0144R73805Q4715k170181k803500j071202M69887J82679
$$ 3945282 3179235 3109091 4082896 4167611 1997430 -806070 -1877272 -1407385 -1224706
33412a224706m55359O6203Q05447M60037k18841K39433J609587K216169R55055
$$ -1224706 -1680065 -1613862 -808415 -348378 -567219 -327786 1281801 3497970 4453025
33403D453025j492146l034027k010719O61350J966936M59140j681478j709056
$$ 4453025 2960879 -73148 -2083867 -1422517 544419 1003559 -677919 -2386975
33395b386975m3316J049893J061040R50142M97250j013328k257199j252346J085601
$$ -2386975 -2430291 -1380398 -319358 630784 1128034 114706 -2142493 -3394839 -2309238
33386b309238J929776Q87877J66769M73414J83551j063127j414324k93295L67534
$$ -2309238 -379462 508415 675184 1148598 1332149 269022 -1145302 -1438597 -1071063
33377a071063m92453j341354r50952l03809k26827L15905J905590K871778J697846
$$ -1071063 -1563516 -2904870 -3855822 -4159631 -4386458 -4070553 -2164963 706815 2404661
33368B404661m57472j456283j135488q66550j048766o93433P05364K063195J823552
$$ 2404661 1947189 490906 -644582 -1511132 -2559898 -3253331 -2547967 -484772 1338780
33359A338780n5953j582916q24339J386626K014952k05643k750980k551853J0000
$$ 1338780 1282827 -300089 -1124428 262198 2277150 2071507 -679473 -3231326 -3221326
33350c221326K011872J831040K65098j287300j916212j208681J74943P30136K46795
$$ -3221326 -1209454 621586 886684 -400616 -2316828 -3525509 -3350566 -2620430 -2373635
33341b373635L78813J699936K248833R77025J49423J472582K373360p9106l644293
$$ -2373635 -1994822 -294886 1953947 2930972 3080395 4552977 6926337 6847231 3202938
33332C202938l761708n53136J675399J113475l6201k77759l82966l34901P10152
$$ 3202938 -558770 -1111906 563493 1676968 1640767 1363008 980042 645141 1355293
33323A355293J379397m05528k841448k042386J351880K589047M28929j181227
$$ 1355293 2734690 2329162 -512286 -2554672 -1202792 1386255 1815184 633957
33315F33957k04476M97284p80278j260142P67857K292301Q40819j178338r46314
$$ 633957 429481 926765 146487 -1113655 -345798 1946503 2787322 1608984 662670
33306F62670P6400l81696r91862K41131J859779J613216M65932L31523L86745
$$ 662670 739070 357374 -634488 -393357 1466422 3079638 3545570 3877093 4263838
33297D263838q31051k056918j483289j52531J6565n25550n59734n54021p27403
$$ 4263838 3432787 1375869 -107420 -259951 -243386 -768936 -1328670 -1882691 -2610094
33288b610094N15855L129985L570545Q9024l294907k441911L26678L52332j369079
$$ -2610094 -2094239 1035746 4606291 4695315 1400408 -1041503 -714825 -362493 -1731572
33279a731572l69365K791375K905288j051119l864621k162275J012338J781178
$$ -1731572 -2100937 690438 3595726 2544607 -1320014 -3482289 -2469951 -688773
33271f88773Q44847N79251N41353p93956k277779j446119J399961L198534K150231
$$ -688773 156074 735325 1276678 482722 -1795057 -3241176 -1841215 1357319 3507550
33262C507550j09435q58112K17123Q57055l88652j795968q73498J534170K011862
$$ 3507550 3398115 2540003 2757126 3614181 3225529 1429561 556063 2090233 4102095
33253D102095k21381j829875m78056J598277J491115K58100M18255J157490K6940
$$ 4102095 3880714 2050839 1572783 3171060 4662175 4920275 5338530 6496020 6522960
33244F522960k099354k102826J2140J124661L23376j1795R83331R10093j460686
$$ 6522960 4423606 2320780 2332920 3457581 3780957 3769162 4752493 5662586 4201900
33235D201900l583345k869036l11348J459103J586209Q37059o8069m63757L14751
$$ 4201900 618555 -2250481 -2561829 -1102726 483483 1320542 1252473 788716 1103467
33226A103467J682815J919154N45110q72734j143853j008519j321400j443183
$$ 1103467 2786282 4705436 5250546 4377812 3233959 2225440 904040 -539143
33218e39143o68686K99565N97843N55766N90036J31270r83687j321785L65107
$$ -539143 -1207829 -908264 -310421 245345 835381 966651 -17036 -1338821 -973714
33209i73714L014675M316366L306798Q69384j571660k805167k162624l37942P94452
$$ -973714 2040961 6357327 9664125 10533509 8961849 6156682 3994058 3656116 4450568
33200D450568L14477m93085j30926P88398P12791j54462k76095M05653K24827
$$ 4450568 4765045 4271960 4141034 4929432 5642223 5487761 5211666 5617319 5842146
33191E842146j270989k143595q24141J463123K333523J288499k13130j030873
$$ 5842146 4571157 2427562 1603421 3066544 5400067 6688566 6475436 5444563
33183E444563j229319j004081k37171O82574Q51346J17794n62508m41009J90330
$$ 5444563 4215244 3211163 2973992 3656566 4507912 4625706 4063198 3622189 3812519
33174C812519P95635J240742J223261K32025j194174j389550J54447J535527Q80784
$$ 3812519 4608154 5848896 7072157 7304182 6110008 4720458 4874905 6410432 7291216
33165G291216r06161j539170p42257j89012l92331R090J513191K495159J636196
$$ 7291216 6385055 4845885 4103628 3914616 3522285 3531375 5044566 7539725 9175921
33156I175921k3237n61953L91098J617666J904174J053650m7462j47733Q78098
$$ 9175921 9152684 8590731 8981829 10599495 12503669 13557319 13509857 13362124 14240222
33147A4240222J508300O86957q4175J316934L905929M399144K129708L17399J319199
$$ 14240222 15748522 16435479 16351304 17668238 21574167 25973311 28103019 28420418 29739617
33138B9739617L380331L867106L247050L569039M946499O034228O544472O931759
$$ 29739617 33119948 36987054 40234104 43803143 48749642 54783870 61328342 68260101
33130F8260101O878231O417942P251746J0416852J3887835J5312713J6055906
$$ 68260101 75138332 81556274 88808020 99224872 113112707 128425420 144481326
33123A44481326J9308504K4907486K9645209L2553829L5905749M0245402M2394632
$$ 144481326 163789830 188697316 218342525 250896354 286802103 327047505 369442137
33116C69442137M0018292L4505149K6978653J5028575k812046k1684382l4061860
$$ 369442137 409460429 443965578 470944231 485972806 483160760 461476378 427414518
33109D27414518l8222600l8989102l9897211l8974698l3867198k7128084k3087543
$$ 427414518 389191918 350202816 310305605 271330907 237463709 210335625 187248082
33102A87248082k1802411j9805989j5819608j2092625j0192135q973237p479343
$$ 187248082 165445671 145639682 129820074 117727449 107535314 98562077 91082734
33095I1082734o705410p119287p161434n918145m865607n038057m822827k907759
$$ 91082734 84377324 77258037 70096603 64178458 59312851 54274794 49451967 46544208
33087D6544208j199318j945010l797680l960517k777750k665149l521892k993322
$$ 46544208 45344890 43399880 39602200 35641683 32863933 30198784 26676892 23683570
33079B3683570q25934P41410P67516K66853o54027k540561l707757j877816J184866
$$ 23683570 22857636 23599046 24366562 24633415 23979388 21438827 17731070 15853254 17038120
33070A7038120J306337j319798k037521N16371K064865J14043j883297q61675
$$ 17038120 18344457 17024659 14987138 15503509 17568374 17682417 15799120 14937445
33062A4937445O42342m44517k173056j621856l81761j049141j849659q6874K107174
$$ 14937445 15579787 15135270 12962214 11340358 10958597 9909456 8059797 7972923 10080097
33053A0080097J123196j481606j544783L82938L25215j769449k144872k03987
$$ 10080097 11203293 9721687 8176904 8559842 8885057 7115608 4970736 4766749
33045D766749P18409k90475m60854Q46407P20132j562915k621607o70474J466977
$$ 4766749 5485158 5194683 4733829 5580236 6300368 4737453 2115846 1445372 2912349
33036B912349J117953n00865j319342j457245j246961K02231K351611K516768
$$ 2912349 4030302 3529437 2210095 752850 -494111 -291880 2059731 4576499
33028D576499N5214j817400o83849J509658J910054R68613N29323K29534j115232
$$ 4576499 4631713 2814313 2130464 3640122 5550176 6518789 7048112 7277646 6162414
33019F162414k359734j451158R25106J896734L32081j861125k353044q73524R62606
$$ 6162414 3802680 2351522 3276628 5173362 5505443 3644318 1291274 417750 1380356
33010A380356J435213L17283r99036j152812l40266M05270Q28034J193082J147370
$$ 1380356 2815569 3132852 2133816 981004 640738 1046008 1874042 3067124 4214494
33001D214494M49552J19184R08362J408765P3035j667227j270839N04636N85909
$$ 4214494 4664046 4783230 5691592 7100357 7173392 5506165 4235326 4739962 5325871
32992E325871j189903j813448m63194K04635p68706p22305J354779K069698q33680
$$ 5325871 4135968 2322520 1859326 2063961 1295255 572950 1927729 3997427 3163747
32983C163747m002339l258224J18284J881565J337072J110222J779804J118614
$$ 3163747 -838592 -4096816 -3978532 -2096967 -759895 350327 2130131 3248745
32975C248745j406090l086311j779767J184186K842163J929487k25067j404974
$$ 3248745 1842655 -1243656 -3023423 -1839237 1002926 2932413 2707346 1302372
32967A302372q56419M3007j14141n32041L69067J745609J174978j038204j615823
$$ 1302372 445953 488960 374819 -157222 211845 1957454 3132432 2094228 478405
32958D78405N50098K394540J601700J10209K56396P60943k96570j548374j081477
$$ 478405 1028503 3423043 5024743 5134952 5391348 6152291 5855721 4307347 3225870
32949C225870m35222j695132k860542p80164K912690L737126J289601p14853q11060
$$ 3225870 2790648 1095516 -1765026 -2545190 367500 4104626 5394227 4679374 3868314
32940C868314j056466j877346r92047J555404K398964N37345p35617L05319O45679
$$ 3868314 2811848 934502 -57545 1497859 3896823 4434168 3698551 4003870 4649549
32931D649549j901058m175277k504678J161055K152113M6872j375594o7813K101955
$$ 4649549 2748491 -1426786 -3931464 -2770409 -618296 -571424 -1947018 -2014831 87124
32922H7124K778611J740222O8511j067116q91478L0412j04314j721889k497341
$$ 87124 2865735 4605957 4674468 3607352 2715874 2746286 2641972 920083 -1577258
32913a577258o22274J888564J890566O2950j73534J709865K520262O52033j456697
$$ -1577258 -2199532 -310968 1579598 1642548 1469014 3178879 5699141 6351174 4894477
32904D894477j555296r44498j525496k283514j375705L38493P86172L39517R71724
$$ 4894477 3339181 2394683 869187 -1414327 -2790032 -2451539 -1665367 -1325850 -354126
32895c54126K454628K388741O5595k294314k607421j124781Q54300K429716K692424
$$ -354126 2100502 4489243 4554838 2260524 -346897 -1471678 -617378 1812338 4504762
32886D504762R15427j841677k975505j331899J269057K419357J819264O92321
$$ 4504762 5420189 3578512 603007 -728892 540165 2959522 4778786 5471107
32878E471107k06658q32228j078992r34207p74313p50372n83828m11303p29747
$$ 5471107 5264449 4432221 3353229 2419022 1644709 894337 310509 -100794 -830541
32869h30541j058456j65101J672666K386638J116230m08950p70084r65324j797078
$$ -830541 -1888997 -2054098 -381432 2005206 3121436 2712486 1942402 977078 -820000
32860h20000j538136J053815L417615K379762o40350j457617M87262J647850L56776
$$ -820000 -2358136 -1304321 2113294 4493056 3852706 2395089 2882351 4530201 4886977
32851D886977r65116n90522l82613j899930l044902j370774J628740K444915M36743
$$ 4886977 3921861 3331339 2948726 1048796 -1996106 -3366880 -1738140 706775 1143518
32842A143518j727163j806068j62423J446925J764116Q51923j31115k12203J26286
$$ 1143518 -583645 -2389713 -2552136 -1105211 658905 1510828 1379713 1167510 1293796
32833A293796k68247j169779j112159J63499J074470N89291l94564p28031m00600
$$ 1293796 1025549 -144230 -1256389 -1092890 -18420 570871 176307 -551724 -952324
32824i52324L60981J505990K009869N23416j899956k226808M6205J508755o5932
$$ -952324 -591343 914647 2924516 3447932 1547976 -678832 -632627 876128 810196
32815H10196j994084q76800J834846K112888k51427j547485j29070J368806N40865
$$ 810196 -1183888 -2060688 -225842 1887046 1635619 88134 -40936 1327870 1868735
32806A868735j279857j481462J29945J724389K095463J415298K05787j072677
$$ 1868735 588878 -892584 -762639 961750 3057213 4472511 4678298 3605621
32798C605621j667192q93094P65813J499945k0467k513431k848517P211K810388
$$ 3605621 1938429 1045335 1811148 3311093 3290626 777195 -2071322 -2064111 746277
32789G46277J789646j931553l389164n79793K907212L304981J511624L06265k76871
$$ 746277 2535923 604370 -2784794 -3364587 -457375 2847606 4359230 4665495 4388624
32780D388624j562572k506692j268984P19102K64474k338144l312399r71724K053631
$$ 4388624 2826052 319360 -949624 -230522 33952 -2304192 -5616591 -6588315 -4534684
32771d534684K879035J754719M62297j75594j23979M82621Q26361n8657j598440
$$ -4534684 -1655649 99070 561367 385773 261794 744415 1570776 1512119 -86321
32762h6321k093166j138775L8216P32153J258785J296208J25245j219997o99361
$$ -86321 -2179487 -3318262 -3280046 -2547893 -1289108 7100 132345 -1087652 -1787013
32753a787013J237612J665845l74346k268289j934648o82697k63172Q0430J315796
$$ -1787013 -549401 1116444 742098 -1526191 -3460839 -4143536 -4406708 -4326278 -3010482
32744c010482J963039O00052r92584l48462J474709J498380k88020j052927J54226
$$ -3010482 -1047443 -447391 -1439975 -1788437 -313728 1184652 896632 -156295 -2069
32735b069J165321N57231l18622j11453L32237j33548r07739r40821n26366l96547
$$ -2069 1163252 1720483 1401861 1290408 1622645 1489097 581358 -359463 -885829 -1282376
32725a282376k66133L45817Q12487K97585o93512r47466l64225k5423n60350j294397
$$ -1282376 -1548509 -1202692 -390205 -92620 -786132 -1733598 -2097823 -2123246 -2683596 -3977993
32715c977993j067761N13569K489099L064522J325578j295328k161936n88714
$$ -3977993 -5045754 -4532185 -2043086 1021436 2347014 1051686 -1110250 -1698964
32707a698964J199766J098306j43185n94663k97477n94251j113138j95430J658147
$$ -1698964 -499198 599108 455923 -138740 -436217 -1030468 -2143606 -2339036 -680889
32698f80889J799977k35557j427139J9224J508710K11012k034236j481396J349284
$$ -680889 1119088 883531 -543608 -524384 984326 1195338 -838898 -2320294 -971010
32689i71010K327359J72620j857992j370241q12K84497M46992J600491J997900
$$ -971010 1356349 1528969 -329023 -1699264 -1700076 -1415579 -968587 631904 2629804
32680B629804j54484k922292k947270l74199J601913J492721Q43450R04798Q55114
$$ 2629804 2475320 -446972 -3394242 -3768441 -2166528 -673807 169643 1074441 1929555
32671A929555n0487r29928r22600p08251j254552k112241j955657l31634J703317
$$ 1929555 1879068 949140 26540 -681711 -1936263 -4048504 -6004161 -6335795 -4632478
32662d632478K521259J507857o9211k27745J282019K508400J986158P40686L42798
$$ -4632478 -2111219 -603362 -672573 -900318 381701 2890101 4876259 5616945 5959743
32653E959743K54331q30376j957856r88483J468224K173663J5105k139826j681868
$$ 5959743 6214074 5383698 3425842 2437359 3905583 6079246 6094351 3954525 2272657
32644B272657J09459N58552l13470n83383L2160R5486o03787n92095N56209J209995
$$ 2272657 2382116 2940668 2627198 2043815 2075975 2171461 1567674 975579 1531788 2741783
32634B741783J53350j585048k321087j887616j183977n47211J85414O01115Q2209
$$ 2741783 2895133 1310085 -1011002 -2898618 -4082595 -4629806 -4444392 -3843277 -3761068
32625c761068q58939q73030L85430J789211K410454K485976K180128Q23206j391841
$$ -3761068 -4620007 -5493037 -5107607 -3318396 -907942 1578034 3758162 4581368 3189527
32616C189527k285898l15901K377659K104251j048961k768551m67849K919806
$$ 3189527 903629 587728 2965387 5069638 4020677 1252126 784277 3704083
32608C704083L112942L81543j460200p24279O31866R28454J044605J923137K432223
$$ 3704083 6817025 7198568 5738368 5014089 5645955 6574409 7619014 9542151 11974374
32599A1974374J389553J8359M43692K482623L656180K369235j61511j503270q07656
$$ 11974374 13363927 13382286 13825978 16308601 19964781 22334016 22172505 20669235 19861579
32590A9861579M82198M79465j094556k903961l683733l372341k642843k054093
$$ 19861579 20343777 20823242 19728686 16824725 13140992 9768651 7125808 5071715
32582E071715j874016j969026j539587J26046K148310K445885N28726j240396
$$ 5071715 3197699 1228673 -310914 -184868 1963442 4409327 4938053 3697657
32574C697657n24870J736480K579805R53156j323522k281766j762857o28294L54839
$$ 3697657 3172787 4909267 7489072 8442228 7118706 4836940 3074083 2445789 2800628
32565B800628N60385j97752j096155j119959n20795l50340o71874n70492J64832
$$ 2800628 3361013 3163261 2067106 947147 426352 76012 -595862 -1166354 -1001522
32556a001522Q37436J211437J463444R33198j047812k994744k338515O82225K596677
$$ -1001522 -164086 1047351 2510795 3443993 2396181 -598563 -2937078 -2254853 341824
32547C41824J321373j041165j559339n11882N773j96304L29332J536141J627740
$$ 341824 1663197 622032 -937307 -1449189 -1443416 -1639720 -1310388 225753 1853493
32538A853493m6462j872797k129651q56127P10046J435459Q70421m46186j111716
$$ 1853493 1807031 -65766 -2195417 -3051544 -2341498 -906039 -35618 -481804 -1593520
32529a593520k17368J295587J535181O5137j500491j604687n79675J71139J52004
$$ -1593520 -1810888 -515301 1019880 1085017 -415474 -2020161 -2599836 -2428697 -2276693
32520b276693J13544O05006J043900O29022l21021o73864p7927N71597N75224
$$ -2276693 -2163149 -1558143 -514243 114779 -206242 -880106 -958033 -386436 188788
32511A88788M60809Q54904J149041M63952n95775o15419L48436O90009l51960
$$ 188788 649597 1504501 2653542 3117494 2521719 1906300 2254736 2944745 2592785
32502B592785j656302j918888j030889N80434K457125L435564K194506n55045
$$ 2592785 936483 -982405 -2013294 -1432860 1024265 4459829 6654335 6099290
32494F099290k041896q77407R19996Q60191m19832m80758R22130J516117N4058
$$ 6099290 4057394 3179987 4099983 4960174 4540342 4059584 4981714 6497831 6551889
32485F551889j997556k791871k347653j610726o46974R59592K547986K574365
$$ 6551889 4554333 1762462 -585191 -2195917 -2842891 -1883299 664687 3239052
32477C239052O25714j594016k022056p43872J83238l28055q12253L28814J932774
$$ 3239052 3864766 2270750 248694 -495178 -311940 -639995 -1452248 -1123434 809340
32468H09340J618424k41088p40521Q64317J568238o70349l223880k420567R16521
$$ 809340 2427764 2186676 1446155 2310472 3878710 3208361 -15519 -2436086 -1519565
32459a519565K707052J512470j18328k04487J9608j011795k344604k174697o21037
$$ -1519565 1187487 2699957 2581629 2377142 2396750 1384955 -959649 -3134346 -3755383
32450c755383P94474J322180J259320Q78322L32963Q7809L83941O39352K05178
$$ -3755383 -2960909 -1638729 -379409 498913 831876 919685 1303626 1942978 2148156
32441B148156o21951j040058q38014l88566J06924O53416R66881O72626p411l54133
$$ 2148156 1526205 486147 -351867 -740433 -633509 19907 986788 1659414 1652003 1297870
32431A297870p1712K91843M3554p38682j193791n91418Q18201J944295J857265
$$ 1297870 1226158 1518001 1561555 822873 -370918 -962336 -144135 1800160 3657425
32422C657425N98546r53099j850130j750671j102366o64498n74847o2069J344558
$$ 3657425 4255971 3302872 1452742 -297929 -1400295 -2064793 -2639640 -2701709 -1357151
32413a357151K537186J863134l59924j718577q42939O64503O64689l75585m49009
$$ -1357151 1180035 3043169 2683245 964668 121729 786232 1450921 1075336 626327
32404F26327O09996R95356K1941q55127n30037K22101M78886O77143J267758J306151
$$ 626327 1236323 2231679 2253620 1398493 868456 1090557 1569443 2246586 3514344 4820495
32394D820495j59947k129056k502589p05394J501641J885062K8808k190579k433783
$$ 4820495 4660548 2531492 28903 -676491 825150 2710212 2739020 548441 -1885342
32385a885342m54779J545211J682541P23162M05512L96123p76770k201295j187860
$$ -1885342 -2340121 -794910 887631 1610793 2016305 2412428 1635658 -565637 -1753497
32376a753497J940799L098927L01140k865334k346160M74455J434297J02833n11927
$$ -1753497 187302 3286229 3587369 722035 -1624125 -1149670 284627 387460 -124467
32367a24467L72783M66764q24041j217714j3742L82409j061151j770418J1317
$$ -124467 248316 715080 -108961 -1326675 -1340417 -958008 -2019159 -3789577 -3778260
32358c778260J899414J215849n76163m66948J099965J272894l50909j315423l74007
$$ -3778260 -1878846 -662997 -1239160 -1706108 -606143 666751 315842 -999581 -1373588
32349a373588J032428J488677J277794R59509L49818n58293j211255j389077j284815
$$ -1373588 -341160 1147517 2425311 3384820 3734638 3176345 1965090 576013 -708802
32340g08802p43909L10137R74406M02286n07034j26346J308608J871704P64457
$$ -708802 -1452711 -1142574 -168168 234118 -272916 -399262 909346 2781050 3545507
32331C545507p44845j358285j094794m32790K77780L77996n02561j281961n67442
$$ 3545507 2800662 1442377 347583 -85207 192573 570569 68008 -1213953 -1781395
32322a781395R52415J189292p0333p31981K78477J475211J370395M15224n35829
$$ -1781395 -828980 360312 289979 -442002 -163525 1311686 2682081 3097305 2561476
32313B561476j539157k252485j507774M66247J505046O61663k17509L44658J042169
$$ 2561476 1022319 -1230166 -2737940 -2271693 -766647 -104984 -322493 22165 1064334
32304A064334N29789J34627J137623J577022p65843l735846l161783O57262K824180
$$ 1064334 1594123 1728750 2866373 4443395 3677552 -58294 -3220077 -2562815 261365
32295B61365P18248k552558k850678l11631J824297J747621N60785J27483Q57757
$$ 261365 979613 -1572945 -4423623 -4735254 -2910957 -1163336 -602551 -475068 382689
32286C82689J511094P70252r27402j607842l93848J000091O39989p58589j157070
$$ 382689 1893783 2664035 1736633 128791 -265057 735034 1375023 616434 -540636
32277e40636n16140l93760p21198J38787J932397K138778J068j819132j109839
$$ -540636 -1056776 -1450536 -2171734 -2032947 -100550 2038228 2039296 220164 -889675
32268h89675O84429R37893l25228j100669o29585M9466R9220j97423j95748M78450
$$ -889675 -205246 732647 407419 -693250 -1322835 -1273369 -1174149 -1371572 -1567320 -1088870
32258a088870J620110K130295Q69743j486837k583121j302539O00982R03636k16638
$$ -1088870 531240 2661535 3531278 2044441 -538680 -1841219 -1240237 -336601 -553239
32249e53239j033247r02780m49755L4865O29974P44203k00961j305005j127911
$$ -553239 -1586486 -2489266 -2939021 -2904156 -2274182 -1529979 -1730940 -3035945 -4163856
32240d163856n0421O3621j145129j627269J61747K818835L692514K256891M75274
$$ -4163856 -4214277 -4150656 -5295785 -6923054 -6761307 -3942472 -249958 2006933 2482207
32231B482207r660K03654m13208j977673l040848k486490p00393J215890K508854
$$ 2482207 2472547 2676201 2262993 285320 -2755528 -5242018 -5942411 -4726521 -2217667
32222b217667K747495J748665K71414j31362R38001J661716L05749j953807k274759
$$ -2217667 529828 2278493 2549907 2418545 3356546 5018262 5324011 3370204 1095445
32213A095445j45985J759964J197254r01300k095987j458831M4751J102508J020747
$$ 1095445 949460 2709424 3906678 3005378 909391 -549440 -504689 597819 1618566
32204A618566o4159j171629j303820p00392m85832q98175j030473n46929j58395
$$ 1618566 1554407 382778 -921042 -1621434 -2107266 -3005441 -4035914 -4582843 -4741238
32195d741238K4980Q55536K136269K167929M55592j010107o54848L04698J75754
$$ -4741238 -4716258 -3860722 -1724453 443476 899068 -111039 -765887 -461189 -285435
32186b85435k89376M35468J515873R96557o98433j287181k87391N17666K37698
$$ -285435 -574811 -139343 1376530 2373087 1674654 387473 100082 617748 855446
32177H55446q8093R7167j03495r53002j224799l05685P04863Q64852O94904P95640
$$ 855446 767353 864520 761025 -191977 -1416776 -1722461 -1017598 -152746 542158 1337798
32167A337798P69493L71351J79605K58967k47282j239428j097286P34341K248544
$$ 1337798 2107291 2478642 2658247 2917214 2669932 1430504 333218 1067559 3316103
32158C316103J579838k19598r65341o82208r45168j678558j153269Q41440K199165
$$ 3316103 4895941 4676343 3711002 3028794 2083626 405068 -748201 93239 2292404
32149B292404J472197k46004j204521j142785o21054K98417J417352J617771K85772
$$ 2292404 3764601 3518597 2314076 1171291 550237 848654 2266006 3883777 4169549
32140D169549j151559p66533R86642J567810j57873k197020k030032J06083J682119
$$ 4169549 3017990 2251457 3238099 4805909 4648036 2451016 420984 527067 2209186
32131B209186J122928o16886j710935j551158o98969L43711J351373J736486Q54233
$$ 2209186 3332114 2715228 1004293 -546865 -1245834 -902123 449250 2185736 3039969
32122C039969p89697j620869r48986m0395k33167o50325N93389L003383L582881
$$ 3039969 2250272 629403 -319583 -359978 -593145 -1243470 -650081 2353302 5936183
32113E936183R78406k157281k640902j119955o28987j689146j780652J84443J867787
$$ 5936183 6914589 4757308 2116406 996451 367464 -1321682 -3102334 -2917891 -1050104
32104a050104J127045q33887j590694q62943O8432P45252J360027J415381N68087
$$ -1050104 76941 -756946 -2347640 -3210583 -3142151 -2396899 -1036872 378509 946596
32095I46596j24843K61119O43674l55326j683933j219137O59302J379053J9946
$$ 946596 821753 1082872 1726546 1371220 -312713 -1531850 -872548 506505 526451
32086E26451j524517j483450j95391J142421J758560J102086p03879k012776j262602
$$ 526451 -998066 -2481516 -2676907 -1534486 224074 1326160 622281 -1390495 -2653097
32077b653097M60498O98047m61376m68635J207681J833809m8665j858969q83836
$$ -2653097 -2192599 -1494552 -1955928 -2424563 -1216882 616927 568262 -1290707 -2174543
32068b174543J455836J817886j77951j878758j584211l21230J74936l80947q31593
$$ -2174543 -718707 1099179 921228 -957530 -2541741 -2862971 -2688035 -3068982 -3900575
32059c900575k8647J648450K341580J103963k73803L88673J927367J196853j717446
$$ -3900575 -3929222 -2280772 60808 1164771 890968 1279641 3207008 4403861 2686415
32050B686415l111015j455398K15688m18057j216291M7619J319631J31367j392537
$$ 2686415 -424600 -1879998 -1664310 -2082367 -3298658 -3251039 -1931408 -1800041 -3192578
32041c192578q7814K160534J234579j812589j934336J635010L979642K167129
$$ -3192578 -3280392 -1119858 114721 -1697868 -3632204 -1997194 1982448 4149577
32033D149577r11426j891035j406626j130015n10268R61423J688287Q38013L58097
$$ 4149577 3238151 1347116 -59510 -1189525 -1699793 -738370 949917 1787930 2146027
32024B146027J533893K250820M52391k104467k519706j135014j94846J31073J110503
$$ 2146027 3679920 5930740 6383131 4278664 1758958 623944 429098 560171 1670674
32015A670674K108387J327018o78791j424448l37416O52585M17218j62617m97285
$$ 1670674 3779061 5106079 4427288 3002840 2665424 3318009 3735227 3572610 3075325
32006C075325j107050j630629o86742J318841J748778m69810k729121k201664
$$ 3075325 1968275 337646 -349096 969745 2718523 2248713 -480408 -2682072
31998b682072K46046J582574Q41622k89892l83971L52420J346885K297670K441193
$$ -2682072 -2436026 -853452 -11830 -301722 -685693 -333273 1013612 3311282 5752475
31989E752475J029978j076095j933309j120825k60256l70233m49493L23222P32747
$$ 5752475 6782453 5706358 3773049 2652224 2391968 2021735 1572242 1895464 2628211
31980B628211n22202k276211k159821J84008K692734L275893J459476j597127
$$ 2628211 2106009 -170202 -2330023 -2146015 546719 3822612 5282088 3684961
31972C684961l509886k211129J316976L123362J136721j544062j014017J256110
$$ 3684961 175075 -2036054 -719078 2404284 3541005 1996943 982926 2239036
31964B239036O37240k868908m025336n01505L332539L107952N98693j60784O85040
$$ 2239036 2876276 7368 -4017968 -4519473 -1186934 1921018 2519711 2358927 3043967
31955C043967L12054j376287k116440j521257r57591k66633J523500K951801J551563
$$ 3043967 3356021 1979734 -136706 -1657963 -2615554 -2882187 -1358687 1593114 3144677
31946C144677j633823k768761q24343J058227N53423p71874o25858N30531Q59517
$$ 3144677 1510854 -1257907 -2082250 -1024023 -470600 -1242474 -1868332 -1337801 -478284
31937d78284J08809m22458J42505J342595J869439P49966j332789k297130j190145
$$ -478284 -369475 -791933 -649428 693167 2562606 3312572 1979783 -317347 -1507492
31928a507492L26048L68210l38323M7973J178419J202013J42388j60975O83650
$$ -1507492 -1181444 -813234 -1151557 -1103584 74835 1276848 1419236 1258261 1941911
31919A941911J110367M38477l23687o60699j045943j156787j86904R35428M12125
$$ 1941911 3052278 3490755 3167068 2506369 1460426 303639 116735 1052163 1464288
31910A464288j094219r60353J057052K059975M73932j693493k196046j359978
$$ 1464288 370069 -590284 466768 2526743 3000675 1307182 -888864 -2248842
31902b248842l24992P76524J480277N05832j746030k633296r10229J275718J629176
$$ -2248842 -2573834 -1797310 -317033 188799 -1557231 -4190527 -5100756 -3825038 -2195862
31893b195862P40960K14116j2485n47181p28558N3931Q20141N83982L1168Q2586
$$ -2195862 -1454902 -1240786 -1253271 -1800452 -2529010 -2475079 -1654938 -1070956 -1039788 -957202
31883i57202L12435K10233L59171R39723P99714n18358j566792j240468m33770
$$ -957202 -644767 -434534 -75363 864360 1664074 1145716 -421076 -1661544 -2095314
31874b095314r1386L65253J174673J022637n12097j470476m55076J001334J035274
$$ -2095314 -2186700 -1821447 -646774 375863 -136234 -1606710 -2061786 -1060452 -25178
31865b5178L41552L39681N67907J79129o7937L46452J11178j159517j107499J404902
$$ -25178 316374 656055 1223962 1403091 1335154 1681606 1792784 633267 -474232 930670
31855I30670L119525R31599k675066l103273p44566K79396p10965m72554J632007
$$ 930670 4050195 4981794 2306728 -796545 -1541111 -1261715 -1972680 -2445234 -813227
31846h13227K260798L39728o07897J411832K985868O78451l207764l937645j214605
$$ -813227 1447571 1787299 1179402 2591234 5577102 6255553 3047789 -889856 -2104461
31837b104461R47981K29161j471903j566609j68008R13445Q83211M69481M12655
$$ -2104461 -1156480 -927319 -2399222 -3965831 -4133839 -3220394 -2337183 -1867702 -1455047
31828a455047N78985O52991Q39745J261368J239268K24795q17489l60485J208628
$$ -1455047 -876062 -223071 616674 1878042 3117310 3342105 2524616 2164131 3372759
31819C372759J663195L3939j992860k546948j753012n27899Q54919J753151Q69445
$$ 3372759 5035954 5069893 3077033 530085 -1222927 -1750826 -895907 857244 1726689
31810A726689j263953j688701Q11586K999443J467105k077406l089553o22227
$$ 1726689 462736 -1225965 -414379 2585064 4052169 1974763 -1114790 -1737017
31802a737017J955952K130825P95498l14166p19263m70038K01973L56672m91474
$$ -1737017 218935 2349760 3145258 2831092 2111829 1641791 1843764 2200436 1708962
31793A708962j087589m13635L3181j354731k762615j345950J603545K002650n40658
$$ 1708962 621373 207738 240919 -1113812 -3876427 -5222377 -3618832 -1616182 -2156840
31784b156840j915786L3108K391469K030192l3330j054734m63388N48251J099032
$$ -2156840 -4072626 -4039518 -1648049 382143 348813 -705921 -1169309 -621058 477974
31775D77974Q06553k01031o22817O29654K082822J296894j062020j911756p54625
$$ 477974 1284527 1083496 460679 1090333 3173155 4470049 3408029 1496273 741648
31766G41648k35536j109722r38402R23229J527671m85241k258938j706338q56655
$$ 741648 506112 -603610 -1542012 -618783 908888 423647 -1835291 -3541629 -4398284
31757d398284j389420j153301J364581L213440J731064n69453l23325R00366L4087
$$ -4398284 -5787704 -6941005 -5576424 -2362984 -631920 -1201373 -1524698 -624332 -590245
31748e90245j436708m03108J502628N98471j634761o14357K915761L315823p30585
$$ -590245 -2026953 -2430061 -927433 -328962 -1963723 -2578080 337681 3653504 2922919
31739B922919l950587k816401j83062N11659K74989R73392J345943m6903j433857
$$ 2922919 -1027668 -3844069 -4027131 -3515472 -3240483 -2267091 -921148 -968051 -2401908
31730b401908p22297Q72312J043658Q8711k29295L04026P45616Q17142N13840
$$ -2401908 -3124205 -2251893 -1208235 -1119524 -1348819 -1044793 -299177 517965 1031805
31721A031805m61365j395597o87015J263349J640576m91292k005186j89261K882644
$$ 1031805 570440 -825157 -1512172 -248823 1391753 900461 -1104725 -1293986 1588658
31712A588658L283204P48498j701415k330233j886690j111622O4676J191639J571480
$$ 1588658 4871862 5620360 3918945 1588712 -297978 -1409600 -1344924 -153285 1418195
31703A418195J578370J741910J185011q92954k935884k679195n95469P63668N28296
$$ 1418195 2996565 4738475 5923486 5030532 2094648 -584547 -1180016 -416348 111948
31694A11948J07164K46266J57157l15174k82516J10065k37755q52029o179J772609
$$ 111948 219112 465378 622535 307361 24845 134910 -102845 -954874 -961053 811556
31684H11556J572167j212327l063881j292210J795570K316004L92884p29885J50489
$$ 811556 2383723 1171396 -1892485 -3184695 -1389125 926879 1319763 589878 740367
31675G40367J200472J198918R24713O68547n79865k533663k890623p32373J492942
$$ 740367 1940839 3139757 4064470 4733017 4153152 1619489 -1271134 -2003507 -510565
31666e10565J243999m99045j016559m6088L04803o50209j164691k37501O86209
$$ -510565 733434 234389 -782170 -828258 -523455 -1173664 -2338355 -2575856 -1889647
31657a889647L34954j48763O98950J907281J563799J01088l20300O13481R21527
$$ -1889647 -1554693 -1703456 -1004506 902775 2466574 2567662 2247362 2860843 3782370
31648C782370k53414j260036q70323k75694o87322r82239K46743J847960J682383
$$ 3782370 3528956 2268920 1398597 1122903 435581 -546658 -299915 1548045 3230428
31639C230428P1529p76575k98734p6149q63218j514589j247618p98896o94220
$$ 3230428 3301957 2525382 2226648 2150499 1287281 -227308 -1474926 -2273822 -2968042
31630b968042l22661M71888O50621k30974j014509o59761L22426R32213R15467
$$ -2968042 -3290703 -2818815 -2168194 -2399168 -3413677 -4073438 -3751012 -2818799 -1903332
31621a903332L54423n60032q73414L00873J790340J319908p86052j388842P00074
$$ -1903332 -1548909 -2108941 -2982355 -2681482 -891142 428766 -357286 -1746128 -1046054
31612a046054K519830J500392n84698r11874k35374p12146j283185M32912K926267
$$ -1046054 1473776 2974168 2389470 1477596 1242222 530076 -753109 -320197 2606070
31603B606070K292872j243984l097080j323657P12163K06095q76205R4110J725391
$$ 2606070 4898942 3654958 557878 -765779 -53616 152479 -723726 -629616 1095775
31594A095775J219762q31920j568434l43248P81879L17295j056025j755799p95665
$$ 1095775 2315537 1483617 -84817 -428065 353814 671109 -384916 -2140715 -2936380
31585b936380J362947K700610J602644n43160o94015J191890J627397q41280k807818
$$ -2936380 -1573433 1127177 2729821 2186661 1492646 2684536 4311933 3470653 662835
31576F62835j274097J407726J401058m81069q63149j7993q78588k831234k068295
$$ 662835 -611262 796464 2197522 1716453 853304 835311 -43277 -2874511 -4942806
31567d942806J543427L405700J432482p01392J17697J468311L7891k512675k375248
$$ -4942806 -3399379 6321 1438803 737411 855108 2323419 2361310 -151365 -2526613
31558b526613K24076J815923J205985L05125J66295j61313q51823o06246P35746
$$ -2526613 -2302537 -486614 719371 1024496 1190791 1029478 177655 -428591 307155
31549C07155J476988O72557n68118j001919p14989j52138O21227J113699M82721
$$ 307155 1784143 2456700 1888582 886663 171674 19536 640763 1754462 2237183
31540B237183q76739j279638q9671J191164J046371p781m88480r0482L42316L48431
$$ 2237183 1360444 80806 -8865 1182299 2228670 2220889 1732409 1641927 1984243 2332674
31530B332674K84858N03103Q39555P96820p3586j564344k450781j568581M03017
$$ 2332674 2617532 3120635 3960190 4757010 4683424 3119080 668299 -900282 -497265
31521d97265J319843M10242m97957K58239J419973O79184j451660k080590l86152
$$ -497265 822578 1232820 734863 993102 2413075 3092259 1640599 -439991 -826143
31512h26143R31587j98058j830021q72202K021097L113814R80576j434996j134962
$$ -826143 105444 -92614 -1922635 -2794837 -773740 2340074 3320650 1885654 750692
31503G50692P32444R19749r35303j920773m64240J187509L91019j841701k347538
$$ 750692 1483136 2402885 1467582 -453191 -917431 270078 661097 -1180604 -3528142
31494c528142m90416J155522Q87530J01056M06845Q37404r5305j222961k52060
$$ -3528142 -4018558 -2863036 -1975506 -1874450 -1467605 -630201 -725506 -1948467 -2200527
31485b200527K211669K944795O54807k181039k798002j442558j34811J98776Q1674
$$ -2200527 11142 2955937 3610744 1429705 -1368297 -2810855 -2945666 -2746890 -2665216
31476b665216J44265N90568J256239J510353Q96369J25439K09914N12918n11590
$$ -2665216 -2520951 -1930383 -674144 836209 1732578 1858017 2067931 2580849 2069259
31467B069259k336316k489870m47256J293303J291076J318964K513010K618195
$$ 2069259 -267057 -2756927 -3204183 -1910880 -619804 699160 3212170 5830365
31459E830365k5176k802545k821022j800986k527987k991663K71309M678108M177441
$$ 5830365 5805189 3002644 181622 -1619364 -4147351 -7139014 -6867705 -2189597 1987844
31450A987844q34505l260750l24246K231921j03788l324238j986761J863351K611037
$$ 1987844 1153339 -2107411 -2431657 -199736 -303524 -3627762 -5614523 -3751172 -1140135
31441a140135J29104j144254J09547J173457R15314R26852J336803L22991j862508
$$ -1140135 -1011031 -2155285 -2045738 -872281 43033 969885 2306688 2629679 767171
31432G67171k562526j057612L41209K37868q7837K88820J98235j097763k122368
$$ 767171 -1795355 -2852967 -2511758 -2273890 -2361727 -2072907 -1874672 -2972435 -5094803
31423e094803j353500N16440J657027J329761L34440n2574N70920J010596k24476
$$ -5094803 -6448303 -5931863 -4274836 -2945075 -2610635 -2663209 -2092289 -1081693 -1306169
31414a306169k336519k491365J17780K472257K029527O07499J008175J921976
$$ -1306169 -3642688 -6134053 -6016273 -3544016 -1514489 -906990 101185 2023161
31406B023161L28279k466943k212442J097522K662474M65176j645961m75855J540244
$$ 2023161 2351440 -115503 -2327945 -1230423 1432051 1897227 251266 -224589 1315655
31397A315655Q92151j225950j373121M74544J464024N34714q31327j615700k006624
$$ 1315655 2207806 981856 -391265 83279 1547303 2082017 1250690 -365010 -2371634
31388b371634j638008J36535K202032K286379N9210k098411j956493J40417K145417
$$ -2371634 -4009642 -3873107 -1671075 615304 674514 -1423897 -3380390 -3239973 -1094556
31379a094556K641451J776065M89535n00698r20698o36513K53497R71749N21264
$$ -1094556 1546895 3322960 3812495 3311797 2391099 1754586 2008083 2979832 3501096
31370C501096r07106j814077j405567p39653q39504q97694M5581Q89328J73298
$$ 3501096 2593990 779913 -625654 -1365307 -2204811 -3102505 -3056924 -2167596 -1994298
31361a994298r99510m97344R80397P81392r92626j183231J241523L149851J940587
$$ -1994298 -2993808 -3491152 -2510755 -1729363 -2721989 -3905220 -2663697 486154 2426741
31352B426741o95556j680060q08752m05j31939o19267q18092l48474P22618J130409
$$ 2426741 1731185 51125 -757627 -758032 -889971 -1509238 -2327330 -2675804 -1953186 -822777
31342h22777l90937k428509j868690J326287L234028J625245n92920j20966J547363
$$ -822777 -1213714 -3642223 -5510913 -4184626 -950598 674647 81727 -39239 1508124
31333A508124J111524q04299j036118M99816R34412l43317q44621L42075R34107
$$ 1508124 2619648 1815349 779231 1279047 2213459 1870142 1025521 1367596 2301703
31324B301703m27063j747923r80626P55993J070886k54276j400632j118529J15030
$$ 2301703 1874640 126717 -853909 -97916 972970 718694 -681938 -1800467 -1685437
31315a685437J051025R73044K92816N8945N58245P10037m09454j873030j906683
$$ -1685437 -634412 338632 631448 690393 1248638 1958675 1549221 -323809 -2230492
31306b230492l86608J004184J182258Q56997R40065J042537L64329p35501j045881
$$ -2230492 -2617100 -1612916 -430658 426339 1366404 2408941 2773270 2037769 991888
31297I91888k16551N94468J13722j346453k190584j623742n79556R291P58656
$$ 991888 775337 1369805 1483527 137074 -2053510 -3677252 -4256808 -4247517 -3488861
31288c488861K266760L045757J378288j174016j148952J438122K415975l81318
$$ -3488861 -1222101 1823656 3201944 2027928 878976 2317098 4733073 4351755
31280D351755l573820l284202p58968L48634q2651N07972K046240J889768o8998
$$ 4351755 777935 -2506267 -3265235 -2916601 -2999252 -2491280 -445040 1444728 1375730
31271A375730p83986P35178J566968k96586k631185k480922l62006J219712J499294
$$ 1375730 591744 1326922 2893890 2597304 -33881 -2514803 -2876809 -1657097 -157803
31262a57803J481961J584276J354690Q12497L67593j29325r54105j587595j361367
$$ -157803 1324158 2908434 4263124 5075621 5443214 5313889 4359784 2772189 1410822
31253A410822o12224j88729j94255j54858n6698k16424l34961K81314J445105
$$ 1410822 798598 609869 415614 260756 204058 -12366 -347327 -66013 1379092
31244A379092J901323Q24230j000698j990211j586446p61438n76550p63480l18720
$$ 1379092 3280415 4104645 3103947 1113736 -472710 -1234148 -1810698 -2574178 -2892898
31235b892898P59741J263859N44493m11760l04894P41784J548791J531133J122990
$$ -2892898 -2133157 -869298 -324805 -736565 -1041459 -299675 1249116 2780249 3903239
31226C903239P54398K32080p15573j726808j870619n49956J437889K098989L45885
$$ 3903239 4657637 4889717 4174144 2447336 576717 26761 1464650 3563639 3909524
31217C909524k228600k898906j290671J70779j98934j103231o53919P06990J350305
$$ 3909524 1680924 -1217982 -2508653 -2337874 -2536808 -3640039 -4293958 -3586968 -2236663
31208b236663J176525J172260J170284K47629j088466j306330m27429j55247j086630
$$ -2236663 -1060138 112122 1282406 1530035 441569 -864761 -1292190 -1447437 -2534067
31199b534067j623059l85227J660704K394851J118970p47680j277234q3140J220806
$$ -2534067 -4157126 -4542353 -2881649 -486798 632172 -115508 -1392742 -1475882 -255076
31190b55076Q94585o10238j114887J88470J467898J002344k56536m12067L07394
$$ -255076 639509 29271 -1085616 -897146 570752 1573096 1316560 904493 1211887
31181A211887J96343r53932j636082j095783r4638P05903J364624J659153J074860
$$ 1211887 1408230 454298 -1181784 -2277567 -2372205 -1666302 -301678 1357475 2432335
31172B432335j13865j054449j467080j411340m83310J255342K259943J283289
$$ 2432335 2318470 1264021 -203059 -1614399 -2097709 -842367 1417576 2700865
31164B700865m44782q84094l85654p71357j730111j137106R52219J830113M22544
$$ 2700865 2256083 1371989 986335 214978 -1515133 -2652239 -1700020 130093 552637
31155E52637r86509n77074K64463k36043j099479m47902J228546J881729R29879
$$ 552637 -433872 -1010946 -746483 -982526 -2082005 -2529907 -1301361 580368 1510247
31146A510247l99788j004242o59035M56102J615079J579193P0555j346477j097453
$$ 1510247 1110459 106217 -552818 -96716 1518363 3097556 3168111 1821634 724181
31137G24181J59098M16813p45102j434634o0670K193117K428548l28577l373877
$$ 724181 883279 1300092 554990 -879644 -940314 1252803 3681351 3352774 -21103
31128b1103l256162k34349J872500Q61864q95579l05195J670225J853416J16453
$$ -21103 -3277265 -3511614 -1639114 -777250 -1672829 -1978024 -307799 1545617 1662070
31119A662070p28431J18261M15076p05763j093744L25998J332433K65656r86501
$$ 1662070 933639 1051900 1466976 761213 -332531 -6533 1325900 1591556 605055
31110F05055l06753R92322O58040m91527j87280J160395J201175l15966j360078
$$ 605055 298302 1290624 1948664 1457137 1269857 2430252 3631427 3315461 1955383
31101A955383j164123j029871j462019j240155L124O58000k96676j402087p54649
$$ 1955383 791260 -238611 -1700630 -2940785 -2937661 -2279661 -2576337 -3978424 -4733073
31092d733073J209177K326179J554514O269p81731n77878n7794N46142J413016
$$ -4733073 -3523896 -1197717 356797 363066 -418665 -996543 -1054337 -508195 904821
31083I04821J925266Q52495j553477k886869j438457J101929J630293j16685j487865
$$ 904821 2830087 3682582 2129105 -757764 -2196221 -1094292 536001 419316 -1068549
31074a068549j132021p18786j576436k111190l91600K444037L534115K165897
$$ -1068549 -2200570 -2919356 -4495792 -6606982 -6998582 -4554545 -1020430 1145467
31066A145467L42141j79416K40783K88773m67018j280061j260474m48975K32633
$$ 1145467 1487608 1308192 1548975 1837748 1370730 90669 -1169805 -1618780 -1386147
31057a386147K45378J85606O18303Q00144j63734j401128j240271J64590J158293
$$ -1386147 -1140769 -955163 -336860 463284 299550 -1101578 -2341849 -2177259 -1018966
31048a018966J365279J736869J799440q8707l006626l376075k61198K422043J381131
$$ -1018966 346313 2083182 3882622 3793915 787289 -2588786 -2849984 -427941 953190
31039I53190j195959j260802R28551J822956L36262j092412p02690N61141J275560
$$ 953190 -242769 -1503571 -575020 1247936 1584198 491786 -210904 350237 1625797
31030A625797J146329K43098j162206j924470j146401J22811J66548p11910p81840
$$ 1625797 2772126 3015224 1853018 -71452 -1217853 -1095042 -928494 -1640404 -2422244
31021b422244J47510O06214K76459N78458K002213K916776J836576n74751k423206
$$ -2422244 -2274734 -1668520 -1392061 -813603 1188610 4105386 5941962 5367211 2944005
31012B944005k510039j088354M20974N22270p37902j660817j201813m05310l41534
$$ 2944005 433966 -654388 -233414 288856 -449046 -2109863 -3311676 -3716986 -4058520
31003d058520n1262J428675K390238P19932j960612j893834J005477K583864O88526
$$ -4058520 -4109782 -2681107 -290869 429063 -1531549 -3425383 -2419906 163958 852484
30994H52484j537636o19941J886658J920660r04499k877710j653902O88605R39274
$$ 852484 -685152 -1305093 581565 2502225 1597726 -1279984 -2933886 -2245281 -1306007
30985a306007p94791j569106R9216K214566K265546Q35888N06301J641907J687905
$$ -1306007 -2100798 -3669904 -3570688 -1356122 909424 1745312 2251613 3893520 5581425
30976E581425o45586k940286k537234m50351N20946M6691j42519J67027l13193
$$ 5581425 4935839 1995553 -541681 -992032 -471086 -424395 -566914 -399887 -713080
30967g13080j226145p81267O80986O50612j232036k004169M6014K453873K187865
$$ -713080 -1939225 -2720492 -2039506 -1388894 -2620930 -4625099 -4579085 -2125212 62653
30958F2653l0409j250215n89079K77213Q1398o15005p36022L9373J300436K259698
$$ 62653 32244 -1217971 -1807050 -1529837 -1448439 -2063444 -2799466 -2760093 -1459657 800041
30948H00041K159528R51026n26424j354604j335062r29493p38921r44669r37312
$$ 800041 2959569 3910595 3384171 2029567 694505 -234988 -973909 -1918578 -2855890
30939b855890N3814J504781J693789J80995j008065k24442J026044L71234j389943
$$ -2855890 -2802076 -1297295 396494 577489 -430576 -655018 371026 742260 -647683
30930f47683j395821O39338K077145J660456Q58214N07285l94120j655659j263071
$$ -647683 -2043504 -1404166 672979 2333435 3191649 3698934 3304814 1649155 386084
30921C86084P75949J467181l95098j901289p86952Q25353K97528j039799o85300
$$ 386084 1162033 2629214 2234116 332827 -454125 371228 668756 -371043 -1056343
30912a056343M75592K63389l98541N87883J867103M99354k478944l009990l82357
$$ -1056343 -580751 -317362 -715903 -128020 1739083 2238437 -240507 -3250497 -3632854
30903c632854J773650J291542J33844L20550R61857P28527J07242k42712o92086
$$ -3632854 -1859204 -567662 -433818 -113268 848589 1577116 1684358 1441646 749560
30894G49560j041646l48782P01685J47864j523589j304577J252368K520955N73511
$$ 749560 -292086 -640868 60817 208681 -1314908 -2619485 -1367117 1153838 1727349
30885A727349j252064K14084K346331Q83754k696575l127678L28658K827388J556953
$$ 1727349 475285 689369 3035700 3919454 1222879 -1904799 -1576141 1251247 2808200
30876B808200o25299o83037K1554p44706j668239m62400J631127J672123l5957
$$ 2808200 2182901 1499864 1521418 776712 -891527 -1353927 277200 1949323 1913366
30867A913366n22358Q77041J664447N06981q62189r20646o03838r14230q61492
$$ 1913366 1391008 2268049 3932496 4439477 3577288 2656642 2052804 1138574 277082
30858B77082L56683J230622K33395j309549j070067N72839J142878j30614j487575
$$ 277082 633765 1864387 2097782 788233 -281834 291005 1433883 1303269 -184306
30849a84306j463045l66835J035838K191632K036878j46517k804848l246884j240978
$$ -184306 -1647351 -2014186 -978348 1213284 3250162 3103645 298797 -2948087 -4189065
30840d189065O49740Q44761M79392O31161N23939j91061q1333J274871J670785
$$ -4189065 -3539325 -2694564 -2215172 -1584011 -1060072 -1251133 -1332466 -57595 1613190
30831A613190k69886k322687j973838l56737J37409J61243J640176L232234J871824
$$ 1613190 1343304 -979383 -2953221 -3309958 -3172549 -3011306 -1371130 1861104 3732928
30822C732928j715310l391078j707969M68427J004482J009711J235669K44009
$$ 3732928 2017618 -1373460 -3081429 -2613002 -1608520 -598809 636860 880869
30814H80869j917606k221504M91004K655899J180509j459969j020296J877168
$$ 880869 -1036737 -3258241 -2767237 -111338 1069171 -390798 -1411094 466074
30806D66074K991223J007839j274665j814001j486452j173834k44308J199405
$$ 466074 3457297 4465136 3190471 1376470 -109982 -1283816 -1528124 -328719
30798c28719J529138K77568p06724o1984J003867P15398o64156j486215r32698
$$ -328719 1200419 1477987 771263 709279 1713146 2428544 1764388 278173 -654525
30789f54525M48943J635444J782111O77351q57627j584913j201810n20999k53023
$$ -654525 -205582 1429862 3211973 3889324 3031697 1446784 244974 -276025 -529048
30780e29048l66839o14807p50558k85149Q86562J698844J042822l55400p16189
$$ -529048 -895887 -1510694 -2261252 -2546401 -1659839 39005 1081827 726427 10238
30771A0238J6187q949j447319k408525j282635P43035J456266P09798J45477N38283
$$ 10238 26425 17476 -1429843 -3838368 -5121003 -4377968 -2921702 -2211904 -2066427 -1528144
30761a528144R40802L05519j113005k041496j450108K69321J382281P71870k95831
$$ -1528144 -587342 -281823 -1394828 -3436324 -4886432 -4617111 -3234830 -2462960 -2758791
30752b758791L35350K356551K970044R09395j510748j683452k36689M77016j09757
$$ -2758791 -2423441 -66890 2903154 3812549 2301801 618349 381660 858676 748919
30743G48919q11275j030214r13735j01326J496192K442351J528996O7063O0975
$$ 748919 -62356 -1092570 -2006305 -2107631 -611439 1830912 3359908 3426971 3487946
30734C487946Q18868J49266j536722j540753N49431J903929Q41885r23369j546645
$$ 3487946 4306814 4456080 2919358 1378605 1928036 3831965 4673850 3750481 2203836
30725B203836j543296j556505o39084J220813J636480n63736k598614j526125
$$ 2203836 660540 -895965 -1535049 -314236 1322244 758508 -1840106 -3366231
30717c366231J093742J539648l99166j546333n06303P49931N84358j60912l71017
$$ -3366231 -2272489 -732841 -1132007 -2678340 -3184643 -2434712 -1850354 -2011266 -2382283
30708b382283l55308m37529r1396N55002L58576o61939o82009J125971K802393
$$ -2382283 -2737591 -3175120 -3266516 -2711514 -2352938 -3014877 -3696886 -2570915 231478
30699B31478K144233j89152j702334j344918j85875O69316J188933J415255Q20845
$$ 231478 2375711 2186559 484225 -860693 -1046568 -377252 811681 2226936 3047781
30690C047781o86125j953391j665782r7920R38923K31320j245384j535898k48412
$$ 3047781 2361656 408265 -1257517 -1355437 -416514 -185194 -1430578 -2966476 -3214888
30681c214888J109137J399902J137844R29393J77046j355826k057997n31814J703170
$$ -3214888 -2105751 -705849 431995 1361388 1538434 182608 -1875389 -2407203 -704033
30672g04033J882762O2145r49450J19766J331124Q75160l68571q42754p01864
$$ -704033 1178729 1240874 291424 411190 1742314 2617474 2248903 1406149 704285
30663G04285o10525n2277J290179K030861J019596m47322n13223J51786m75401
$$ 704285 93760 41483 1331662 3362523 4382119 3934797 3421574 3573360 3097959
30654C097959k173853k663607j309484o3629k14082n66064R7152P48505j13179
$$ 3097959 924106 -1739501 -3048985 -3112614 -3326696 -3892760 -3795608 -3047103 -3160282
30645c160282j698797j692982N66844L015943L194619J002238j219531j290878
$$ -3160282 -4859079 -6552061 -5985217 -2969274 225345 1227583 8052 -1282826
30637a282826L63292J364532N50871n33802j58627P38784L5880j828833k064214
$$ -1282826 -919534 444998 995869 462067 303440 1042224 1078104 -750729 -2814943
30628b814943J38965J994639J121046r78161j320559K72158J559780J506124J043696
$$ -2814943 -2675978 -681339 439707 -538454 -1859013 -1586855 -27075 1479049 2522745
30619B522745O99614L140o80809k41247P38821J32503k099700k899251n02659
$$ 2522745 3222359 3225499 2544690 2303443 3042264 3174767 1075067 -1824184 -2326843
30610b326843K312295J911292p41765j432012R89354K960745J555114j509302
$$ -2326843 -14548 1896744 1154979 -277033 712321 3673066 5228180 3718878
30602C718878k802923j838478o28441j10964M88302J314655J283446N4786j167155
$$ 3718878 915955 -922523 -1550964 -1661928 -1173626 141029 1424475 1479261 312106
30593C12106j297761n84225J97010O54894O23155J59469m5947O41255J486847
$$ 312106 -985655 -1569880 -1372870 -717976 -94821 64648 18701 659956 2146803
30584B146803J044514n12427j194467p8157J074639K72552j789009k731072j679233
$$ 2146803 3191317 2678890 1484423 1406266 2480905 2753457 964448 -1766624 -3445857
30575c445857M2671J041308J269636J312943J359204J114436K47216r73708j329048
$$ -3445857 -3403186 -2361878 -1092242 220701 1579905 2694341 2941557 1967849 638801
30566F38801K10497K483869K606422l18355l219607k670374M26388K067086O24897
$$ 638801 849298 3333167 5939589 5621234 2401627 -268747 157641 2224727 2849624
30557B849624j505185j893958r90929j97062M48697J200298J285069L97678j15345
$$ 2849624 1344439 -549519 -1540448 -1737510 -1288813 -88515 1196554 1594232 1478887
30548A478887N96650R41740q39231l442874l818518j353889J328325J858002O93067
$$ 1478887 2075537 3017277 2178046 -1264828 -5083346 -6437235 -5108910 -3250908 -2557841
30539b557841j27402N25025K070591L034039K354322M36468j122986j300294p50871
$$ -2557841 -2685243 -2160218 -89627 2944412 5298734 5735202 4612216 3311922 2561051
30530B561051o03080q30554p11892k03806K99410R51494J855053K011191M52121
$$ 2561051 1957971 1127417 415525 211719 511129 1462623 3317676 5328867 5780988
30521E780988j821256k650122j490874P6404O66900M89021L02367L69865O58526
$$ 5780988 3959732 1309610 -181264 -104860 562040 1051061 1353428 1723293 2381819
30512B381819Q81783L42103j000813j573308j8787K155101J898188j091253l613424
$$ 2381819 3263602 3605705 2604892 1031584 1012797 3167898 5066086 3974833 361409
30503C61409l237681j178242J60691M33939O28154Q00158L89794k35528j72890
$$ 361409 -2876272 -4054514 -3893823 -3459884 -2831730 -2031572 -1641778 -1877306 -2050196
30494b050196O36775J456825J574242N33675j394424k583586j473319Q00741J218077
$$ -2050196 -1413421 43404 1617646 2151321 756897 -1826689 -3300008 -2499267 -1281190
30485a281190p43278j924336k33496J978744J645730k41971o65473M22451P21191
$$ -1281190 -2024468 -3948804 -4182300 -2203556 -557826 -799797 -1465270 -1042819 -321628
30476c21628Q3576M68917J695305J226019j213023k505076r58476R29614L76718
$$ -321628 -238052 230865 1926170 3152189 1939166 -565910 -1524386 -594772 -218054
30467b18054j563759j975994l61721J352359K013584K220409K373386J632503
$$ -218054 -1781813 -3757807 -4119528 -2767169 -753585 1466824 3840210 5472713
30459E472713n91653l038105l397398r63281J962014K251574k55097k374498j726221
$$ 5472713 4881060 1842955 -1554443 -2517724 -555710 1695864 1440767 -933731 -2659952
30450b659952K32147P49223j59930m56150K06056L27154k68723q2680J032226
$$ -2659952 -2427805 -1678582 -1838512 -2294662 -2088606 -1761452 -2030175 -2112855 -1080629
30441a080629J326916K11358p99672r05481j119581j645866r30071J325296K832832
$$ -1080629 246287 457645 -342027 -1247508 -2367089 -4012955 -4943026 -3617730 -784898
$$ [...]
##END NTUPLES=NMR SPECTRUM
##END=
