##TITLE=31Pdec_LR-746-R-H-EtOAc
 CDCl3, 24 sc
 17.3.2022
##JCAMPDX= 6.0         $$ Bruker NMR JCAMP-DX V2.0
##DATA TYPE= NMR SPECTRUM
##DATA CLASS= NTUPLES
##ORIGIN= UXNMR, Bruker Analytische Messtechnik GmbH
##OWNER= root
$$ XWIN-NMR		Version 3.5
$$ Thu Mar 17 13:15:26 2022 Russian Standard Time (UT+4h)  she@DPX200
##.OBSERVE FREQUENCY= 81.013821
##.OBSERVE NUCLEUS= ^31P
##.ACQUISITION MODE= SIMULTANEOUS
##.ACQUISITION SCHEME= undefined
##.AVERAGES= 24
##.DIGITISER RES= 16
##SPECTROMETER/DATA SYSTEM= spect
##.PULSE SEQUENCE= zgpg30
##.SOLVENT NAME= CDCl3
##.SHIFT REFERENCE= (INTERNAL, CDCl3, 0, 248.564)
##AUDIT TRAIL= $$ (NUMBER, WHEN, WHO, WHERE, WHAT)
$$ ##TITLE= Audit trail, XWIN-NMR		Version 3.5
$$ ##JCAMPDX= 5.01
$$ ##ORIGIN= Bruker BioSpin GmbH
$$ ##OWNER= she
$$ F:/spectra/data/she/nmr/P31/1/pdata/1/auditp.txt
$$ ##AUDIT TRAIL=  $$ (NUMBER, WHEN, WHO, WHERE, WHAT)
(   1,<2022-03-17 13:14:23.15 +0400>,<she>,<DPX200>,
      <created by zg, POWCHK disabled, PULCHK disabled
       configuration hash MD5:
       00 E9 B6 7A A2 85 ED C7 34 08 36 98 17 FE 4E 26
       data hash MD5: 32K
       AD E4 9E 83 6D 01 99 84 32 E0 72 9C 7B F6 CF DC>)
(   2,<2022-03-17 13:14:25.59 +0400>,<she>,<DPX200>,
      <Start of raw data processing
       efp BC_mod = 2 LB = 1 FT_mod = 6 PKNL = 1 PHC0 = -9122.788 PHC1 = -87.52437 SI = 64K 
       data hash MD5: 64K
       1D D4 EE 87 DC E3 68 88 A6 D5 30 A9 1F BE AE B1>)
(   3,<2022-03-17 13:14:42.87 +0400>,<she>,<DPX200>,
      <pk PHC0 = 31.34972 PHC1 = 0 
       data hash MD5: 64K
       2C E2 85 9F CA 21 A9 74 E5 DE 57 76 3D C8 8E A1>)
(   4,<2022-03-17 13:14:45.95 +0400>,<she>,<DPX200>,
      <abs ABSG = 5 
       data hash MD5: 64K
       FC D2 89 A5 83 73 83 8F 30 29 91 CB DA 1F 11 0D>)
$$ ##END=
$$ 
$$ hash MD5
$$ B3 B2 36 69 5F D8 70 65 9E 55 D8 A6 9B 29 29 60
##$RELAX= 
##$RELAX= 
##$RELAX= 
##$RELAX= 
##$RELAX= 
##$RELAX= 
##$RELAX= 
##$RELAX= 
$$ Bruker specific parameters
$$ --------------------------
##$DU= <F:/spectra>
##$EXPNO= 1
##$NAME= <P31>
##$PROCNO= 1
##$TYPE= <nmr>
##$USER= <she>
##$AMP= (0..31)
100 100 100 100 100 100 100 100 100 100 100 100 100 100 100 100 100 100 
100 100 100 100 100 100 100 100 100 100 100 100 100 100 
##$AQSEQ= 0
##$AQ_mod= 1
##$AUNM= <au_zg>
##$AUTOPOS= <>
##$BF1= 81.014009
##$BF2= 200.13
##$BF3= 200.13
##$BF4= 200.13
##$BF5= 200.13
##$BF6= 200.13
##$BF7= 200.13
##$BF8= 200.13
##$BYTORDA= 1
##$CFDGTYP= 0
##$CFRGTYP= 5
##$CHEMSTR= <none>
##$CNST= (0..31)
1 1 145 1 1 1 1 1 1 1 1 1 1 1 1 1 1 1 1 1 1 1 1 1 1 1 1 1 1 1 1 1 
##$CPDPRG= <waltz16>
##$CPDPRG1= <>
##$CPDPRG2= <waltz16>
##$CPDPRG3= <>
##$CPDPRG4= <mlev>
##$CPDPRG5= <mlev>
##$CPDPRG6= <mlev>
##$CPDPRG7= <mlev>
##$CPDPRG8= <mlev>
##$CPDPRGB= <>
##$CPDPRGT= <>
##$D= (0..31)
0 1 0 0 0 0 0 0 0 0 0 0.03 2e-05 3e-06 0 0 0 0 0 0 0 0 0 0 0 0 0 0 0 0 
0 0 
##$DATE= 1647508462
##$DBL= (0..7)
120 120 120 11 120 120 24 19 
##$DBP= (0..7)
150 150 150 150 150 150 150 150 
##$DBP07= 0
##$DBPNAM0= <>
##$DBPNAM1= <>
$$ [...]
##$SUBNAM3= <"">
##$SUBNAM4= <"">
##$SUBNAM5= <"">
##$SUBNAM6= <"">
##$SUBNAM7= <"">
##$SUBNAM8= <"">
##$SUBNAM9= <"">
##$SW= 501.771253377433
##$SWIBOX= (0..15)
0 1 3 0 0 0 0 0 0 0 0 0 0 0 0 0 
##$SW_h= 40650.406504065
##$TD= 32768
##$TD0= 1
##$TE= 0
##$TE2= 300
##$TE3= 300
##$TEG= 300
##$TL= (0..7)
0 120 53 12 22 120 120 120 
##$TP= (0..7)
150 150 150 150 150 150 150 150 
##$TP07= 0
##$TPNAME0= <>
##$TPNAME1= <>
##$TPNAME2= <>
##$TPNAME3= <>
##$TPNAME4= <>
##$TPNAME5= <>
##$TPNAME6= <>
##$TPNAME7= <>
##$TPOAL= (0..7)
0.5 0.5 0.5 0.5 0.5 0.5 0.5 0.5 
##$TPOFFS= (0..7)
0 0 0 0 0 0 0 0 
##$TUNHIN= 0
##$TUNHOUT= 0
##$TUNXOUT= 0
##$USERA1= <user>
##$USERA2= <user>
##$USERA3= <user>
##$USERA4= <user>
##$USERA5= <user>
##$V9= 5
##$VALIST= <valist>
##$VCLIST= <CCCCCCCCCCCCCCC>
##$VD= 0
##$VDLIST= <DDDDDDDDDDDDDDD>
##$VPLIST= <PPPPPPPPPPPPPPP>
##$VTLIST= <TTTTTTTTTTTTTTT>
##$WBST= 1024
##$WBSW= 4
##$XGAIN= (0..3)
0 0 0 0 
##$XL= 0
##$YL= 0
##$YMAX_a= 6384
##$YMIN_a= -6741
##$ZGOPTNS= <>
##$ZL1= 120
##$ZL2= 120
##$ZL3= 120
##$ZL4= 120
##$ABSF1= 248.5645
##$ABSF2= -253.2056
##$ABSG= 5
##$ABSL= 3
##$ALPHA= 0
##$AQORDER= 0
##$ASSFAC= 0
##$ASSFACI= 0
##$ASSFACX= 0
##$ASSWID= 0
##$AUNMP= <proc_1d>
##$AZFE= 0.1
##$AZFW= 0.5
##$BCFW= 0
##$BC_mod= 2
##$BYTORDP= 0
##$COROFFS= 0
##$CY= -3
##$DATMOD= 1
##$DC= 0
##$DFILT= <>
##$DTYPP= 0
##$F1P= 0
##$F2P= 0
##$FCOR= 1
##$FTSIZE= 65536
##$FT_mod= 6
##$GAMMA= 0
##$GB= 0
##$INTBC= 1
##$INTSCL= 5.30512e-09
##$ISEN= 30
##$LB= 1
##$LEV0= 0
##$LPBIN= 0
##$MAXI= 10000
##$MC2= 0
##$MEAN= 0
##$ME_mod= 0
##$MI= 50
##$NCOEF= 0
##$NC_proc= -6
##$NLEV= 6
##$NOISF1= 182.463
##$NOISF2= 159.3651
##$NSP= 0
##$NTH_PI= 0
##$NZP= 0
##$OFFSET= 248.5645
##$PC= 4
##$PHC0= -9091.438
##$PHC1= -87.52437
##$PH_mod= 1
##$PKNL= yes
##$PPARMOD= 0
##$PSCAL= 0
##$PSIGN= 0
##$REVERSE= no
##$SF= 81.014009
##$SI= 65536
##$SIGF1= 159.3651
##$SIGF2= -187.1042
##$SINO= 113.3802
##$SIOLD= 16384
##$SREGLST= <1H.CDCl3>
##$SSB= 0
##$STSI= 65536
##$STSR= 0
##$SW_p= 40650.406504065
##$SYMM= 0
##$S_DEV= 0
##$TDeff= 32768
##$TDoff= 0
##$TI= <>
##$TILT= no
##$TM1= 0
##$TM2= 0
##$TOPLEV= 0
##$USERP1= <user>
##$USERP2= <user>
##$USERP3= <user>
##$USERP4= <user>
##$USERP5= <user>
##$WDW= 1
##$XDIM= 65536
##$YMAX_p= 564791032
##$YMIN_p= -30159840
$$ End of Bruker specific parameters
$$ ---------------------------------
##NTUPLES= NMR SPECTRUM
##VAR_NAME=  FREQUENCY,     SPECTRUM/REAL,   SPECTRUM/IMAG
##SYMBOL=    X,             R,               I
##VAR_TYPE=  INDEPENDENT,   DEPENDENT,       DEPENDENT
##VAR_FORM=  AFFN,          ASDF,            ASDF
##VAR_DIM=   65536,         65536,           65536
##UNITS=     HZ,            ARBITRARY UNITS, ARBITRARY UNITS
##FACTOR=    0.620285442955139, 1,           1
##FIRST=     20137.2065510759, 0,            0
##LAST=      -20513.1999529892, 0,           0
##MIN=       -20513.1999529892, -30159840,   0
##MAX=       20137.2065510759, 564791032,    0
$$ Real data points
##PAGE= N=1
##DATA TABLE= (X++(R..R)), XYDATA
$$ [...]
38509F62252J47769J55386J46386n65663j245396p21237L92778M49770m79264
38500a057219o81563K86124Q73449J91949o04174m17620O9854j24469n08713r8558
38490b070940Q05195J058699L29698o51983j123340q96217k71689K26501L73734
38481b220342O01798J247409J549110M64490j412057k112781r49032M89926P26969
38472a614510L64459N74504R66492N05472l79075l73298M52403O65748k38585
38463I23610j083263q37573L5280N27570M24041J38415r1158k54313k15596J73010
38453b59977P22467R66269N93376k13733q67094r17938n73737m52070p17549q15537
38443b535523l11637L94292O24421M16103M28382R28689J349740R84765j13706
$$ plain form
38509 662252 810021 965407 1111793 546130 -699266 -1420503 -1027725 -577955 -1057219
38500 -1057219 -1738782 -1452658 -579209 -387260 -991434 -1409054 -1339200 -1463669 -1972382 -2070940
38490 -2070940 -1265745 -207046 122652 -529331 -1652671 -2548888 -2820577 -2594076 -2220342
38481 -2220342 -1618544 -371135 1177975 1642465 230408 -1882373 -2831405 -2341479 -1614510
38472 -1614510 -1250051 -675547 290945 796417 417342 44044 496447 1162195 923610
38463 923610 -159653 -997226 -961946 -434376 -10335 128080 36922 -217391 -432987 -259977
38453 -259977 462490 1428759 2022135 1808402 941308 23370 -550367 -1002437 -1719986 -2535523
38443 -2535523 -2847160 -2452868 -1828447 -1412344 -983962 -55273 1294467 2279232 2165526
38434B165526j081611j120627m25662j8940m26621q60186l11222Q04973J064907
38425b09463J42790o36382k70983N15982O00085J75230J08095L13060k2812r52269
38415b36667j586315j266670j34516J229040K036055J581167J06721j036555r09765
38406b17505j64247J51141K17000O78457J013471L01853q35195r00183K9828M16205
38396F90825j22580l17675L04151N87975K9726k06037M56440P51103j11302p77932
38386A284694m3436R15823N28019m39861l45232L23693j03655j281180j257377
38377d18512J21858Q28485m0588r55335o08911K04081K83188j19472j53159K43532
38367f14833O91818J013808R02114Q9471o95223l02917Q16080P95188p12302j592922
$$ plain form
38434 2165526 1083915 -36712 -462374 -481314 -907935 -1768121 -2079343 -1274370 -209463
38425 -209463 -66673 -703055 -974038 -458056 142029 317259 425354 738414 715602 -236667
38415 -236667 -1822982 -3089652 -3224168 -1995128 40927 1622094 1728815 692260 -217505
38406 -217505 -381752 -230611 -13611 664846 1678317 1980170 1144975 244792 274620 690825
38396 690825 568245 250570 554721 1142696 1172422 966385 1422825 2173928 2062626 1284694
38386 1284694 1241258 2157081 2685100 2245239 1900007 2223700 2120045 838865 -418512
38377 -418512 -296654 531831 491243 -464092 -1073003 -868922 -585734 -705206 -858365 -614833
38367 -614833 76985 1090793 1992907 2082378 1387155 1084238 1900318 2695506 1983204 390282
38357C90282m35570J147968J002655l00952p04259m5453Q4811o99102j087794
38348f47414n25410k6961j64427q2484P70798J419861Q08019n14305j066975l03834
38338c33132Q51753J117995J99746q82709q91342P6700O21821Q074p01272l18031
38328b50397N20148M40209k60350q0184J008631J323587K34129p51651m28394
38319A755728K72543r30q25911q47476P2004Q10179N91505l33639j233950j415964
38309a155911o30068M92077R14251N04992J55110K39822K0016q09657j201408
38300a470776m13035N15790K89057m94127k70984R03471J360280L62456q36773
38291e4641q23851J74721Q09926L04849p50360j093389k53316P10308M36782p20330
$$ plain form
38357 390282 -45288 1102680 2105335 1804383 1100124 1054671 1139482 440380 -647414
38348 -647414 -1172824 -1199785 -1364212 -1446696 -675898 743963 1551982 1037677 -29298 -333132
38338 -333132 518621 1636616 1836362 953653 62311 139011 760832 768906 67634 -250397
38328 -250397 269751 709960 449610 369426 1378057 2701644 2935773 2184122 1755728
38319 1755728 2028271 2027341 1201430 353954 425958 1236137 1827642 1494003 260053 -1155911
38309 -1155911 -1785979 -1293902 -379651 125341 280451 520273 540289 -269368 -1470776
38300 -1470776 -1883811 -1368021 -1078964 -1573091 -1844075 -940604 419676 782132 -54641
38291 -54641 -878492 -703771 106155 411004 -339356 -1432745 -1686061 -975753 -538971 -1259301
38281a259301r44158L20655J259181L92932r60744o81442P17778R11944l82032
38272f25187q91163M99038J879503J235525o15354j425335o15484M83805P43254
38263F68602K45832m59218r96260j101152o79734j999N28735P31820O11422K45062
38253b06890j05057j08366J98295L89195J96913k14066n43135n68180j41924N52808
38243e50407Q61514L69050l61131m53720K17J75186p9976j16286J69082N9501
38233G3030n71858p75842n6436O69163M28071l32931m89334J60938Q61910J025530
38223I92241O69363M1449n92318r77730j050491q88606m32600K88381P13423L17405
38213i19483l60253k77610L80447L16356o44829r32988L10649J612298J277742
$$ plain form
38281 -1259301 -2203459 -1882804 -623623 -230691 -1191435 -1872877 -1155099 -243155 -625187
38272 -625187 -1516350 -1017312 862191 2097716 1482362 57027 -558457 -74652 668602
38263 668602 914434 455216 -541044 -1642196 -2321930 -2323929 -1795194 -1063374 -451952 -206890
38253 -206890 -311947 -420313 -222018 167177 364090 150024 -393111 -961291 -1103215 -550407
38243 -550407 311107 680157 319026 -134694 -134477 40709 -39267 -155553 13529 73030
38233 73030 -498828 -1274670 -1331106 -661943 -233872 -566803 -1056137 -895199 -33289 992241
38223 992241 1661604 1703053 1110735 133005 -917486 -1806092 -2238692 -1950311 -1236888 -919483
38213 -919483 -1279736 -1557346 -1176899 -860543 -1505372 -2438360 -2127711 -515413 762329
38204G62329n9954n24444K40805R98572J002228N36027k12965j170793j488611
38195H3194l44168J322285J533830L3637j234341q76622K03506N34551J89164
38186A445036J14319L62212K30959l55608p48349o72579n09159m85575l34913
38177i53657J06561N25246N71376L10639K5050j88025l89112n06015l34119J24680
38167g07376M97973L71247k44897q69941r71154m02284M68402R94662P88142J65113
38157H9887j49557N0474J56083k85217p35610m40852L15741O07912L26865J98305
38147A34031L33412j8969r39874j285601l38766R95997J430281Q79707N1048o81965
38137E59301j094143o59372N91940J422947Q09776m39518o92907J93804Q12803
$$ plain form
38204 762329 702375 177931 418736 1417308 2419536 2955563 2742598 1571805 83194
38195 83194 -260974 1061311 2595141 2628778 1394437 517815 721321 1255872 1445036
38186 1445036 1559355 1921567 2152526 1796918 1048569 375990 -133169 -618744 -953657
38177 -953657 -847096 -321850 249526 560165 585215 397190 8078 -497937 -832056 -707376
38167 -707376 -209403 161844 -83053 -952994 -1924148 -2326432 -1858030 -863368 -75226 89887
38157 89887 -59670 -9196 146887 -138330 -873940 -1314792 -999051 -391139 -64274 134031
38147 134031 467443 448474 -491400 -1777001 -2115767 -1119770 310511 1190218 1241266 559301
38137 559301 -534842 -1194214 -602274 820673 1630449 1190931 498024 691828 1504631
38128A504631L28220n55344q66207n51133j08404J50249J43981j24028n08879
38119e86914q15380r54954q10964k28312N58739R17425O51005L42269M02417M25061
38109i9608Q2661j19427J83352L05643l30691q83088k86650P97704P84065l54454
38099G9507r93105k87606P71404R81017L31180n24488j098708j055469l23732
38090b120000M94009O23653J40508k62013l99747n70096o00817p9963N57157M34579
38080a782730k20842k32292O37932J202297N92461n78682j142424o12675O18705
38071a518250J511200R69983p85573j795683o16901J366780J558271j51884j297258
38062g59315n70135N23517L52270n17905o80006K5146P68970Q77293P4313j224198
$$ plain form
38128 1504631 1832851 1277507 411300 -139833 -248237 -97988 45993 -78035 -586914
38119 -586914 -1402294 -2357248 -3168212 -3396524 -2837785 -1920360 -1269355 -927086 -524669 -99608
38109 -99608 -16947 -136374 46978 352621 21930 -861158 -1147808 -350104 433961 79507
38099 79507 -913598 -1201204 -429800 551217 882397 357909 -740799 -1796268 -2120000
38090 -2120000 -1625991 -1002338 -861830 -1123843 -1523590 -2093686 -2694503 -2774466 -2217309 -1782730
38080 -1782730 -2003572 -2235864 -1597932 -395635 196826 -381856 -1524280 -2136955 -1518250
38071 -1518250 -7050 962933 177360 -1618323 -2235224 -868444 689827 537943 -759315
38062 -759315 -1329450 -805933 -453663 -971568 -1651574 -1626428 -857458 19835 94148 -1130050
38052a130050j596910j19871J679605J345060p69992j687119l18659R68714M45703
38043a183519k78331M81052J305172L21004j237775j055309L51487P54066L2637
38034e09516j26722M82986N56015L5668J07740O79293M96158l40678m97534J9873
38024I03283n4455n77281o6589J266232J292405m85492j737121q04670Q40263
38015E76575J056480R7246l96830r8430o382n23310r54396o56624K15213R68073
38005B77615R62985K25190m18644k73055K27350J42620m91937p54895l67617n5055
37995e25443k47456m71490k80439J25231M18549M92247K46875j62041m6775Q42470
37985C91728J372936L74356j294654j630309m32914M28046l360m58008J36324
$$ plain form
38052 -1130050 -2726960 -2846831 -1167226 177834 -592158 -2279277 -2597936 -1629222 -1183519
38043 -1183519 -1461850 -980798 324374 645378 -592397 -1647706 -1296219 -542153 -509516
38034 -509516 -636238 -153252 402763 438431 546171 1225464 1721622 1380944 883410 903283
38024 903283 848828 271547 204958 1471190 2763595 2278103 540982 -263688 576575
38015 576575 1633055 1730301 1333471 1235041 1228659 705349 -249047 -905671 -690458 277615
38005 277615 1240600 1465790 1047146 774091 1001441 1144061 652124 -102771 -470388 -525443
37995 -525443 -772899 -1244389 -1524828 -1399597 -981048 -488801 -241926 -403967 -450742 391728
37985 391728 1764664 2139020 844366 -785943 -1218857 -790811 -794171 -1252179 -1115855
37976a115855P76664J82015r60701j048094R957Q18040N21199l26211p43107l81038
37966b267131L29927O55075K85750k84750m08051j84611j16272m1204N98991J399244
37956c3032J098550n27441j937244j643058j9459J307663J330835M19045l97890
37947d02031n08037k05532j19276j63546L30854J156119J028701k61347q57671
37938a766M16173J647436N04857j703633j677544N67475J549689p0779j398271
37929a66363j89212J596028J298388k55714p17808j26701l1790l97081k20812
37920G88935R107p28457j500782o40423J150989J585998L75641n05167p4441N45370
37910A006770M58478J94355J44068k10433q91556r24754O6020J072165J104184
$$ plain form
37976 -1115855 -339191 -157176 -1117877 -2165971 -2156014 -1337974 -816775 -1142986 -1886093 -2267131
37966 -2267131 -1937204 -1282129 -996379 -1281129 -1689180 -1873791 -1990063 -2031267 -1432276 -33032
37956 -33032 1065518 538077 -1399167 -3042225 -3061684 -1754021 -423186 -4141 -402031
37947 -402031 -910068 -1115600 -1234876 -1398422 -1067568 88551 1117252 855905 -1766
37938 -1766 414407 2061843 2566700 863067 -814477 -247002 1302687 1231908 -166363
37929 -166363 -355575 1240453 2538841 2283127 1565319 1438618 1406828 1009747 788935
37920 788935 798042 69585 -1431197 -2071620 -920631 665367 1041008 535841 461400 1006770
37910 1006770 1465248 1659603 1803671 1593238 701682 -223072 -157052 915113 2019297
37901B019297L44107m90418r84295r66312m87470k4914K7916r790K53641L73660
37891E5422j77594p59812l67365N68196O24104l79162j023392l87396P71351J249401
37881A73753P68448j55069q28740p24505K3112M97442J23974l98641k09468J99854
37871e29840j23903o79895j75032J084276J350913K12663o55015j04379Q04507
37862A184295O21325l78333r20289n69178J18993N62307N03678l0718n70170n40121
37852a8211j17640j01267o52075r46911m35818L57285P16137O61706N26157K75443
37842B64806j98657n92074m89614Q4369O52171O67226j2301p97055q17908o1638
37832a300675M62766K13249m356M93026Q26143o5447j353830j332214m0563R33594
$$ plain form
37901 2019297 2363404 1872986 888691 -77621 -565091 -590005 -562089 -571879 -318238 55422
37891 55422 -122172 -881984 -1249349 -681153 -57049 -436211 -1459603 -1846999 -1075648 173753
37881 173753 942201 787132 -41608 -766113 -743001 -245559 -121585 -520226 -729694 -529840
37871 -529840 -653743 -1333638 -1508670 -424394 926519 1139182 484167 379788 1184295
37862 1184295 1805620 1427287 506998 -62180 56813 619120 1122798 1092080 521910 -18211
37852 -18211 -135851 -237118 -889193 -1836104 -2271922 -1914637 -1198500 -536794 -10637 264806
37842 264806 66149 -525925 -1015539 -931170 -278999 388227 375926 -421129 -1239037 -1300675
37832 -1300675 -837909 -624660 -629016 -135990 690153 624706 -729124 -2061338 -2101901 -1168307
37822a168307J002867R82743J062848N02430m75703o56700r7226k31921j152028
37813b30997j080994N44691J777757J183575l280k35654j16414p14097j260270
37804a35683o32809L09657R4369p26701n01694O94273J268352O93335o4823m34293
37794E63983p52380r91394n95582L23742R27711Q46938M43474L5024k35097j02680
37784D63739L28114L03076m13620p70408K2429R31251N14371p36975j105208l01668
37774g64899K83057j24809p38039o85039q8181M98924O71434K13654n01808m72265
37764a707971N31869J096216P8195j229351o79422J328997K146542O93497j120187
37755A138385j330042l54485L33439L37487J34170o272N1032M76211Q53296L44251
$$ plain form
37822 -1168307 -165440 817303 1880151 2382581 1906878 1250178 1152952 921031 -230997
37813 -230997 -1311991 -767300 1010457 2194032 2190752 1955098 1838684 1124587 -135683
37804 -135683 -768492 -458835 -364466 -1091167 -1592861 -898588 369764 1063099 998276 563983
37794 563983 -188397 -1179791 -1775373 -1451631 -523920 323018 766492 801516 566419 463739
37784 463739 791853 1094929 681309 -89099 -66670 864581 1378952 641977 -463231 -764899
37774 -764899 -481842 -606651 -1344690 -2029729 -2117910 -1618986 -947552 -733898 -1235706 -1707971
37764 -1707971 -1176102 -79886 -1691 -1231042 -1910464 -581467 1565075 2258572 1138385
37755 1138385 -191657 -546142 -212703 124784 258954 252682 303714 779925 1633221 1977472
37745A977472r19030j608860r73793J51855O84502O06498L44530q2243n60644
37736c79713n30559P9330M42142Q0558l46613j81725K39967M33367N86496P58934
37726A182184L59719n99718q52763K73748J348801O72674j102874j823664q77672
37717a419565K88380N75613M74026O37212P30826L14310k60224n21821o36368
37708A82389q54876q54183k59059O20449J115924R66906L73678l89047j012296
37699a10115j090843m77847L94691Q76236P38309K68231j55251l65702l88673
37690c10964l40679l15011k32128R9244O12328Q25909L57089m55626p98826l52353
37680i11017L13598M97733K15709j3934K6931J01576M9365o06L6667P0757Q1625
$$ plain form
37745 1977472 1058442 -550418 -1524211 -1372356 -687854 -81356 263174 180931 -379713
37736 -379713 -910272 -830942 -388800 -308242 -654855 -836580 -596613 -163246 423250 1182184
37726 1182184 1541903 942185 89422 363170 1711971 2384645 1281771 -541893 -1419565
37717 -1419565 -1131185 -555572 -81546 555666 1286492 1600802 1340578 818757 182389
37708 182389 -672487 -1526670 -1785729 -1165280 -49356 917550 1291228 902181 -110115
37699 -110115 -1200958 -1678805 -1284114 -407878 330431 598662 443411 77709 -310964
37690 -310964 -651643 -966654 -1198782 -1099538 -487210 338699 695788 240162 -558664 -911017
37680 -911017 -597419 -99686 116023 102089 129020 230596 279961 279355 316022 386779 468404
37669D68404J08953K420l48970n60218j48300N52410O43570M1232k92747R1039
37659E57793L45518j70731o19167l8263Q34100N62982n93471r39521L232P46463
37649F88935K07638o45710m09195N97078R11572R4005p99814p95238j89977N4242
37639b86464l68040p68569m26646L94571P53201L44668n2596K28409P14354N93698
37629A126586K4066k29029q8166q7440k07482J08432P74648R72179L82392m21187
37619B354999r00358r57811m70693M73438R31269N3748j226057j023016O47676
37610a16805J571988N58284q30559q34999o3539J7744l12135J30842R64314P14506
37600A799641o16139j408551q85933k5831K38972K38275M83678N93824M7085p30867
$$ plain form
37669 468404 577357 579777 230807 -329411 -477711 74699 718269 759501 466754 557793
37659 557793 903311 732580 113413 75150 909250 1472232 878761 -60760 -57528 688935
37649 688935 896573 250863 -158332 438746 1350318 1444323 644509 -150729 -340706 -286464
37639 -286464 -654504 -1423073 -1849719 -1455148 -701947 -357279 -409875 -181466 532888 1126586
37629 1126586 1150652 921623 833457 746017 538535 646967 1421615 2393794 2776186 2354999
37619 2354999 1454641 496830 26137 499575 1430844 1484592 258535 -764481 -116805
37610 -116805 1455183 2013467 1182908 347909 284370 302114 -10021 120821 1085135 1799641
37600 1799641 1183502 -225049 -1110982 -1136813 -897841 -659566 -175888 417936 465021 -265846
37590b65846p73286J63578J173670J099285j63270j375169j299933k43886M10986
37581a273871K16317J27753O19436O85569l47100j276946o97005P28278J247086
37572B9517O19472M9135j6418j99520n04780k01321M93569M28621m42312p58339
37562e02376K348O32722K43622l73572l11373k1956j64369k61484K51041O75697
37552A70300J01527r30424j111177k28537P88773J264229J144874M10704p41617
37543H68652j416360q74202K63348P27018L80300J47100K39264j57371j113608
37534i35859j291745R9712J752458J816467M04817o90522n52601j23036m21587
37525E8104r95533q60428j26345L16164K76778L27647N09418J64785o66056q50867
$$ plain form
37590 -265846 -1039132 -875554 298116 1397401 1234131 -141038 -1440971 -1684857 -1273871
37581 -1273871 -1057554 -929801 -310365 375204 28104 -1248842 -1945847 -1217569 29517
37572 29517 648989 698124 681706 482186 -22594 -223915 269654 698275 255963 -502376
37562 -502376 -500028 132694 376316 2744 -308629 -330585 -494954 -756438 -505397 170300
37552 170300 271827 -658597 -1769774 -1998311 -1209538 54691 1199565 1610269 868652
37543 868652 -547708 -1421910 -1158562 -431544 -51244 95856 335120 177749 -935859
37534 -935859 -2227604 -2127892 -375434 1441033 1845850 1155328 602727 479691 58104
37525 58104 -937429 -1797857 -1924202 -1608038 -1331260 -1003613 -494195 -329410 -995466 -1846333
37515a846333J37133J090130O67044n24928p10661M44973J361489Q70384k36080
37506A253151n87471j76423k29l34327m19752J66648P18749L61922o67869j228339
37496i13940o95285K59099N50166O7864k70658J72684R25183J107538N26589k86738
37486A442502p74184o98294j32330M57617M36842k09284o23548j49050O70752
37477D21023P98762J23306n59932p68909p22044n99416k70963J64062L22714J63428
37467i27969M4475R2251J07566R2801K30910L74653K36952K3994J42848L82051
37457H00532K16054j88427k24671n255j65327n35566k82513M92827O76794n97
37447G83851m43566m7895L39356L7497k82857K6953L14562j56737q00487p13125
$$ plain form
37515 -1846333 -1709200 -619070 47974 -476954 -1187615 -742642 618847 1489231 1253151
37506 1253151 665680 489257 489028 154701 -265051 -98403 620346 982268 314399 -913940
37496 -913940 -1609225 -1350126 -799960 -732096 -1002754 -830070 95113 1202651 1729240 1442502
37486 1442502 668318 -29976 -162306 295311 732153 522869 -100679 -249729 421023
37477 421023 1219785 1343091 783159 14250 -707794 -1307210 -1578173 -1414111 -1091397 -927969
37467 -927969 -883494 -791243 -683677 -590876 -359966 14687 251639 275633 418481 800532
37457 800532 1016586 828159 603488 598233 432906 -102660 -385173 107654 784448 783851
37447 783851 340285 292390 631746 669243 386386 413339 727901 571164 -229323 -942448
37437i42448j83182j8792j56938o8270J84042L25528N18041O59301N1809j123625
37427g54534j252698L15543J619403P77490q37189n68648J173213J443697m83664
37418A432613j961928j198334K51466M61200M4674L27326P01208k1962j048058
37409a011795o82724P88287J413315M76527p36888j049610o84828k70851J05584
37400a652983M87261O83992O72671O41826M70346j38707q91956j011236l10519
37391a049305M70801O29633K45781k06107m42029l67708j6655K82732J61953j44239
37381d35143P1032R07825J440272Q48972m25662j224263j111981o63562l99232
37372i91742j33734L97675Q46312O80171N3572k83144K2589M43588L10196k26691
$$ plain form
37437 -942448 -1125630 -1144422 -1301360 -1369630 -1185588 -860060 -342019 317282 369091 -754534
37427 -754534 -2007232 -1691689 -72286 705204 -131985 -700633 472580 1916277 1432613
37418 1432613 -529315 -1727649 -1476183 -1014983 -970309 -642983 58225 36263 -1011795
37409 -1011795 -1694519 -906232 507083 983610 246722 -802888 -1487716 -1758567 -1652983
37400 -1652983 -1165722 -481730 190941 832767 1303113 1164406 272450 -738786 -1049305
37391 -1049305 -578504 51129 296910 90803 -351226 -718934 -735589 -452857 -290904 -435143
37381 -435143 -364111 543714 1983986 2832958 2407296 1183033 71052 -592510 -991742
37372 -991742 -1125476 -727801 118511 798682 852254 569110 591699 1035287 1345483 1118792
37362A118792l32644L86942J212648J047366k19907j419143j382741l03213N64607
37353F72707M62825j35176m55042m33126l61675j32890L96757O98352K17524m41732
37343D88524j42553Q68616R91507k76125j279896o04377O73546O13903n28910
37334H04235p58227L76100R74441j99270j685774j450045K00801J228898P42797
37325B33956j69220l46895j731Q0846j72920k62714l7985J65454J74343K14038
37315a22828L93916L95451j8435m73874m41103j11260k09702q04126r84981j72154
37305b549096Q76242J060838M95745J84616L97454M07482j17587n33122l73010
37296a50438j40942l83376p34008n66388k0881L51766N29367Q05555R28448L38682
$$ plain form
37362 1118792 786148 1173090 2385738 3433104 3213197 1794054 411313 108100 672707
37353 672707 1135532 1000356 545314 112188 -249487 -382377 14380 712732 930256 488524
37343 488524 345971 1214587 2206094 1929969 650073 45696 719242 1333145 804235
37334 804235 46008 422108 1396549 1197279 -488495 -1938540 -1737739 -508841 233956
37325 233956 64736 -282159 -283890 -203044 -375964 -638678 -676663 -511209 -336866 -122828
37315 -122828 271088 666539 648104 174230 -266873 -378133 -587835 -1391961 -2376942 -2549096
37305 -2549096 -1672854 -612016 -116271 68345 465799 873281 755694 222572 -150438
37296 -150438 -291380 -674756 -1408764 -1975152 -1996033 -1644267 -1114900 -309345 619103 957785
37286I57785p32241j221004n73246M48038O85032k2839p65206p13870L6838P80361
37276a120352R90290O38242J8111m08971j80233O58373J226575O23952p34309
37267A711678j318765m87506M85889K12239o90052n55857N99275R49240k77045
37258F29096j425914q02991Q40218J466799O18685k76889j75486L47006L07091
37249A527615k77591o75925n38554j92815o3063j63708k04698n2198R3086P2138
37239d75713J03015M03287O49645L65264k01539k81661K35032O07486M41498J82318
37229B028632N7303m10952j194777j201128N0864J200793Q29353l32837n31324
37220D95927K90322O95886L28857K07861M01199l10056j810712j980015O7702
$$ plain form
37286 957785 225544 -995460 -1568706 -1120668 -435636 -458475 -1223681 -1937551 -1900713 -1120352
37276 -1120352 -130062 508180 526291 117320 -62913 595460 1822035 2445987 1711678
37267 1711678 392913 -94593 391296 603535 -86517 -642374 -43099 906141 629096
37258 629096 -796818 -1599809 -759591 707208 1325893 1049004 873518 1220524 1527615
37249 1527615 1250024 574099 35545 -157270 -220333 -384041 -588739 -640937 -547851 -475713
37239 -475713 -372698 30589 680234 1045498 843959 562298 797330 1404816 1846314 2028632
37229 2028632 2085935 1674983 480206 -720922 -670058 530735 1360088 1027251 495927
37220 495927 786249 1482135 1810992 2018853 2420052 2109996 299284 -1680731 -1613029
37211a613029K061684J675271n7652n91720P4051j78381j611727j977498k88180
37202b507181J389506J114250q5184k07594M90631K98266q63171j316032l67305
37193b053814P43543Q61320L01049j85388m58414m71905P9936R39564J156973
37184I12864M77412j10903N9561K37014l68685j082583q27594O7157M38336J29222
37174f8199j02701j20635m06530p47115m18575L53025N99344L21715M31635Q40671
37164F82635L82557r16478j375180l13668O48876J68353o46446k33801O89979
37155i13173L96035q32027j125790q1884P20050L16916l77262l07444K38829M48450
37145a517300J65612k54268m65871k14916M19939Q19142N61799J77510K66442
$$ plain form
37211 -1613029 448655 2123926 2066274 1474554 1548605 1370224 -241503 -2219001 -2507181
37202 -2507181 -1117675 -3425 -88609 -296203 194428 492694 -370477 -1686509 -2053814
37193 -2053814 -1310271 -448951 -147902 -333290 -791704 -1263609 -1183673 -244109 912864
37184 912864 1390276 1279373 1338934 1575948 1207263 124680 -702914 -635757 -197421 -68199
37174 -68199 -170900 -291535 -698065 -1445180 -1863755 -1510730 -911386 -589671 -158036 682635
37164 682635 1065192 148714 -1226466 -1540134 -891258 -722905 -1369351 -1603152 -913173
37155 -913173 -517138 -1349165 -2474955 -2556839 -1836789 -1519873 -1897135 -2204579 -1965750 -1517300
37145 -1517300 -1351688 -1605956 -2071827 -2286743 -1866804 -1047662 -485863 -308353 -41911
37136d1911K48638p01451j744678j131440R54176K146609J161033l99817n22430
37127c1271M32377P71235J46280l67981k08439J56749L43053M13054K55548l12203
37117A598402q72917p86705k15840Q6935j5667P3521N42106P85501L98897k14156
37107A380077n63109p49024r81327r44418k49617P21270J045184M13662l97675
37098c24977m94723k0808R6992m82708r58256n13364M49966P99501K01163n05044
37088a752258m91269J09384O10238O06951J86875k64284k74417K86425Q45212
37079a37143O52853j80833p01902l58385L34443O35593M74323J30943l57021r14535
37069d21664j035351l25759P85964J414865J177770M41252k09467m49874l48246
$$ plain form
37136 -41911 206727 -494724 -2239402 -3370842 -2416666 -270057 890976 491159 -31271
37127 -31271 401106 1172341 1318621 950640 742201 898950 1242003 1655057 1910605 1598402
37117 1598402 725485 -61220 -277060 -190125 -205792 -132271 409835 1195336 1594233 1380077
37107 1380077 816968 67944 -913383 -1857801 -2107418 -1386148 -340964 72698 -324977
37098 -324977 -819700 -840508 -743516 -1226224 -2184480 -2697844 -2247878 -1448377 -1247214 -1752258
37088 -1752258 -2243527 -2134143 -1523905 -916954 -730079 -994363 -1268780 -982355 -137143
37079 -137143 515710 334877 -367025 -725410 -390967 244626 718949 849892 492871 -421664
37069 -421664 -1457015 -1782774 -996810 418055 1595825 2037077 1827610 1377736 1029490
37060A029490k52312l68489l87327J21651Q97408J101960M10486n64460j109909
37051H78498j061240m82804M72933J114773N99103p25161j345639o33428J67388
37042a015577j13186p02765k40210Q58051R79861j40549j075735q90420k27614
37033b568144L9928K6694K66668P82970J115500P85882k80779j317578j056476
37024b205335O81739K151990J572710m10041j459163o68169N07324O10718m2814
37015G38959m58755m34760j89389L24325Q96138P96326j26651q73123o01279J85387
37005B57178M79166J21702l87281p69226r24856o33577l2654J76643k79254o16992
36995b609151q6776Q75574J340311J154674P26625J44777n44513p16633Q2067
$$ plain form
37060 1029490 777178 408689 21362 143013 1040421 2142381 2552867 1988407 878498
37051 878498 -182742 -665546 -192613 922160 1521263 796102 -549537 -1182965 -1015577
37042 -1015577 -1128763 -1831528 -2071738 -1213687 -233826 -374375 -1450110 -2340530 -2568144
37033 -2568144 -2528216 -2501522 -2234854 -1451884 -336384 449498 168719 -1148859 -2205335
37024 -2205335 -1523596 628394 2201104 1791063 331900 -336269 171055 781773 738959
37015 738959 280204 -154556 -343945 -19620 876518 1672844 1546193 673070 71791 257178
37005 257178 736344 858046 470765 -298461 -1223317 -1856894 -1889548 -1712905 -1992159 -2609151
36995 -2609151 -2695927 -1820353 -480042 674632 1401257 1546034 1001521 284888 366955
36986C66955J088729J101918J25351p54360r58460q51969o99314l08560J83060
36977g06650K34106j37722k49688J16969L87350K96006L49498P17598O54640k27499
36967A434608r79153o19615K06785J24375p20792p49846M81023J279615K75790
36958G32790j282675j147368N92561J562147O24471m91792j538J099882O43491
36949B331969j253808k335714j529542j24959N83894Q84765J200433Q84394l65175
36940B76257j327966q91010J99062N77478L29272L77019O35946M08344P669K49391
36930H41462P03670K63173p23501p87067J18775L96290m56198q84964R5961J175605
36920G43206Q84402r0887k66809J57155n0691p56024o04301N74090J243431M35205
$$ plain form
36986 366955 1455684 2557602 2682953 1928593 970133 118164 -581150 -889710 -706650
36977 -706650 -472544 -610266 -859954 -742985 -355635 -59629 289869 1007467 1662107 1434608
36967 1434608 455455 -164160 42625 167000 -553792 -1303638 -822615 457000 732790
36958 732790 -549885 -1697253 -1104692 457455 1081926 590134 588596 1688478 2331969
36949 2331969 1078161 -1257553 -2787095 -2912054 -2328160 -1443395 -242962 641432 276257
36940 276257 -1051709 -1942719 -1743657 -1166179 -836907 -459888 176058 584402 592071 841462
36930 841462 1545132 1808305 1084804 297737 416512 812802 356604 -528360 -432399 743206
36920 743206 1627608 1536721 1269912 1427067 1376376 620352 16051 590141 1833572 2268777
36910B268777q06605r49647m1673O00140L48806K4173N18940J294243R45903p10432
36900C492625j924585j079054J008146J934652Q31947o13534o78483J10887J55045
36891C237646p11071j198839o40271K10597M68651J70127j73087k85296j42158
36882I36299J50801L06151J31623p4492J29904N78615O34113J41429l24768l25665
36872B284010j32061j79832m09902m83071l34254j69035p9585L8394K19827K78764
36862A033255Q159m85164p54487m84123P7701M49735O33228R84291J300358Q21824
36852C584777m17856j109648m09040N68442K48523q54416p09758J026900K134001
36843D061925R25702j208824j636183L3878J689552J587691J98270q73002p99604
$$ plain form
36910 2268777 1462172 512525 470852 1070992 1419798 1443971 1962911 3257154 4203057 3492625
36900 3492625 1568040 488986 1497132 3431784 4263731 3650197 2971714 3082601 3237646
36891 3237646 2526575 1327736 687465 898062 1366713 1536840 1363753 1078457 936299
36882 936299 1087100 1393251 1524874 1450382 1580286 2158901 2793014 2934443 2609675 2284010
36872 2284010 2151949 1972117 1562215 1079144 744890 575855 496270 534664 754491 1033255
36862 1033255 1041414 556250 -198237 -682360 -604659 -154924 478304 1462595 2762953 3584777
36852 3584777 3166921 2057273 1648233 2216675 2465198 1610782 901024 1927924 4061925
36843 4061925 4987627 3778803 2142620 2176498 3866050 5453741 5652011 4779009 3979405
36834C979405p2415K84704k10307r58782r11625J6953N98749p9201j135331j013478
36824D98672J95263Q10906P9358p16732k84647P19488P92366j62622r13397q23753
36814A94902m47627k73233o8978K95621M22250J88222J05235L90852M76629J5547
36804A299420l79754j30725K58731M1781m41677l36398K05257K72812j80043k57529
36794C51875K25666L54009k27050n67377k1261N95551L98326n7829J79645P53840
36784A985395O74840R5994n2671J56951j88598r82940j025503p0356O09049K58181
36774A460342j88438K11467Q16661N53912l08203p12171m74833k46578k53966
36765H58193j86227p8312k91931p14700q17530m31242K13804R91944J690547J637849
$$ plain form
36834 3979405 3906990 4191694 3981387 3022605 2110980 2127933 2726682 2647481 1512150 498672
36824 498672 693935 1504841 1584199 867467 582820 1302308 2094674 1932052 1018655 194902
36814 194902 -252725 -525958 -594936 -299315 122935 311157 416392 807244 1283873 1299420
36804 1299420 919666 788941 1047672 1089453 647776 311378 516635 789447 609404 351875
36794 351875 577541 931550 704500 137123 115862 711413 1109739 1051910 1231555 1985395
36784 1985395 2660235 2756229 2703558 2860509 2671911 1688971 663468 593112 1202161 1460342
36774 1460342 1271904 1483371 2300032 2853944 2545741 1833570 1358737 1112159 858193
36765 858193 671966 593654 301723 -412977 -1230507 -1661749 -1447945 -456001 1234546 2872395
36755B872395M59807r85276j429401q64387l67153l32962j14042M24533L74460
36746C7974n85784j242591m71527J029894J644938R37754r7847n32094l33582
36737C87135J10221M75546M97629J08127l69469n54834m45591k04928J74477N64026
36727G42339M92308j00904l30428N00547J503592J094823o49878j749465r02378
36718F00556P51295J240260L24682n72140n42372j54706j97299m69714l19931
36709F60631J98133L68124q2217m69114l6686Q97252J162860K35555r37891j039047
36699I57600j2853R98553J223330R99005Q34310N74471l6430o19263o23414j47114
36689D148195K43743K19783j91755p86079j079110n79688L23965M42573n17461
$$ plain form
36755 2872395 3332202 2346926 917525 53138 -314015 -646977 -761019 -336486 37974
36746 37974 -547810 -1790401 -2261928 -1232034 412904 1350658 1252811 720717 387135
36737 387135 497356 972902 1470531 1578658 1209189 654355 208764 3836 178313 742339
36727 742339 1234647 1133743 803315 1303862 2807454 3902277 3252399 1502934 600556
36718 600556 1351851 2592111 2916793 2344653 1802281 1647575 1450276 980562 660631
36709 660631 858764 1226888 1144671 675557 638871 1536123 2698983 2934538 1996647 957600
36699 957600 944747 1943300 3166630 4165635 4999945 5574416 5537986 4918723 4295309 4148195
36689 4148195 4391938 4611721 4419966 3633887 2554777 1975089 2299054 2741627 2224166
36680B224166j131265k25528J074069Q03235p79332j463497m32259O95408O75016
36671A440013M23514R22326J239721K92144q79756n74630P50200J158042K28723
36662E000297o28960o77102o80138j077779j187236o83185k40315j36268K72428
36653c8258J034567J067284j2218r13983n79138J88910J92158j84992J08575P65005
36643A627910O22927k56460o02914N9702Q04882Q10936L15208j18847k81655p3223
36633B908466M94752Q43899K68841r00766j425081p73110J82275M83711L16384
36624B399371L60511N96201M98286L2949k92833k70187k63333n73560r58658r59679
36614E69068m85929R0018L53623K50840M3790n3346o3378q1144j13420j51980
$$ plain form
36680 2224166 1092901 867373 1941442 2744677 1965345 501848 69589 764997 1440013
36671 1440013 1863527 2785853 4025574 4317718 3437962 2863332 3613532 4771574 5000297
36662 5000297 4371337 3694235 3014097 1936318 749082 65897 -174418 -310686 -38258
36653 -38258 996309 2063593 2051375 1137392 558254 747164 939322 754330 862905 1627910
36643 1627910 2250837 1994377 1391463 1451165 2256047 3066983 3382191 3263344 2981689 2908466
36633 2908466 3403218 4247117 4515958 3615192 2190111 1417001 1599276 2082987 2399371
36624 2399371 2759882 3356083 3854369 3887318 3594485 3324298 3060965 2487405 1528747 569068
36614 569068 83139 173157 526780 777620 821410 768064 704686 623542 510122 358142
36604C58142k02500j56923J08737M18467M37284K64173L71495O81180L91074o89526
36594A981603j354183n50194P92148Q09684n34575j236985j57269J328108J433005
36585B511342M97433J28573N92811O49373j57812o29537J14177R94934L78325
36576E079619j431615k315272j099673Q17960J270161Q5926r59195p44516q3325
36567F20070n686l6904P22334J662409J331550k11189j256241q78290r4504o4848
36557A788701m43204l66937N015L8676q1170J90294N05471P5269q39545j091720
36547b19150l55570M08257M38456J70901L22898P45028P69944K37596l87623o77761
36537A452976n69037j75463L22987O32370N12665Q5315k11206p5555L45813O80714
$$ plain form
36604 358142 155642 -1281 107456 525923 963207 1227380 1598875 2280055 2671129 1981603
36594 1981603 627420 77226 869374 1679058 1144483 -92502 -249771 1078337 2511342
36585 2511342 3008775 3137348 3730159 4379532 4221720 3592183 3706360 4701294 5079619
36576 5079619 3648004 1332732 233059 1051019 2321180 2407106 1447911 703395 620070
36567 620070 614384 577480 1299814 2962223 4293773 4082584 2826343 1948053 1853549 1788701
36557 1788701 1345497 978560 983575 1022251 941081 1131375 1636846 1712115 872570 -219150
36547 -219150 -574720 -166463 271993 442894 765792 1510820 2280764 2518360 2130737 1452976
36537 1452976 883939 708476 1031463 1663833 2176498 2261813 2050607 1975052 2320865 3001579
36527C001579P56797O71232N47021M77132O46499J079610J192796K26967j479284
36518G120349k329020j363221K09232M52976o47787j331579q00604j89214l54814
36509G66318m40806L04232Q28519j2748j186616q55608N97273J007185j85822
36500H21927j088974l95039O54031M21323m80247k21586J296953K117087R12419
36491D037894j152555j831365n54707R21208P46144p04844j433192n92412M19032
36482a44797J49546p32295o31196L89259Q34671L05261l0178K94384J79011q57437
36472b43771j371010k03754J326519J142430m60146j213320k05110R50102O38674
36463C60614n09336p61051K18787J059625O63414l92954p57051j35938L96132
$$ plain form
36527 3001579 3758376 4429608 4976629 5453761 6100260 7179870 8372666 8599633 7120349
36518 7120349 4791329 3428108 3637340 4090316 3442529 2110950 1310346 1121132 766318
36509 766318 325512 629744 1458263 1445515 258899 -596709 564 1007749 821927
36500 821927 -267047 -662086 -8055 413268 -66979 -288565 1008388 3125475 4037894
36491 4037894 2885339 1053974 499267 1420475 2166619 1461775 28583 -563829 -144797
36482 -144797 4749 -727546 -1358742 -969483 -134812 170449 140271 434655 613666 -243771
36472 -243771 -1614781 -1818535 -492016 650414 190268 -1023052 -1228162 -278060 360614
36463 360614 -148722 -909773 -690986 368639 1032053 639099 -117952 -253890 142242
36454A42242L906o44687l49728P42526J206864L82027o81994q07141k78494l8842
36444c23321n3214L90250J120135J078962k519r85006q05044J48813O69603K90461
36434A529120l34122m26713R895L78428L02912L261j46699j54145k35289k99342
36424F27306p2866K75905K04565l39075o87255l92562J40833L55933L35961M00856
36414H49601M18882J42434j70714j31811R4255J07966l2230p3176j67188m81405
36404E56614n67660J3963P27825O81768K2270l20293j53655j31043l40067j08136
36394C81586N21380N12672l68924q20309J4371R77103N51469p53762j124142j33427
36384b41983P58335M29828m97399q54274m83589k7872J22830M4916j19618k22070
$$ plain form
36454 142242 146148 -498539 -848267 -105741 1101123 1483150 801156 -5985 -284479 -323321
36444 -323321 -376535 13715 1133850 2212812 2210293 1225287 420243 569056 1238659 1529120
36434 1529120 1194998 768285 778180 1156608 1459520 1462781 1316082 1161937 926648 627306
36424 627306 554440 830345 1034910 695835 8580 -383982 -243149 112784 448745 849601
36414 849601 1268483 1410917 1240203 1108392 1202647 1310613 1278383 1205207 1038019 556614
36404 556614 -11046 2917 730742 1412510 1434780 1114487 960832 829789 489722 381586
36394 381586 902966 1415638 1046714 226405 240776 1217879 1769348 1015586 -108556 -241983
36384 -241983 516352 946180 448781 -405493 -889082 -916954 -794124 -749208 -868826 -1090896
36374a090896m0506L70609M81458p7622q22248r00129k73234J86806r84j66464
36364b333210M14398J161788Q74363l19539q22179J70919J307763R26585m62491
36355I18397q64858K53426J176810M80229r25050j169223k2185R87582P57928
36346A593056j19784m43399O351M31928K64732j08814m5124K81117N6440q31490
36336A085013j298198m67069R13735J318361M98188l10235k82339k0083k85754
36327A151619p37279o19877J4416N29714O43234M86220J69459j33116j18360R6736
36317A482766r6101p41191q66378J13353J180347R44698l37641j104079o29893
36308e4119K72287O36068L63650j94694o96842p15032r2606M83498J77472o11272
$$ plain form
36374 -1090896 -1131402 -760793 -279335 -356957 -1179205 -2079334 -2352568 -2165762 -2166746 -2333210
36364 -2333210 -1918812 -757024 117339 -202200 -1024379 -853460 454303 1380888 918397
36355 918397 53539 306965 1483775 1964004 1038954 -130269 -152454 835128 1593056
36346 1593056 1473272 1029873 1036224 1468152 1732884 1624070 1578946 1860063 1916503 1085013
36336 1085013 -213185 -680254 233481 1551842 2050030 1739795 1457456 1437373 1151619
36327 1151619 414340 -205537 -191121 338593 981827 1468047 1637506 1504390 1386030 1482766
36317 1482766 1386665 645474 -220904 -107551 1072796 2017494 1679853 575774 -54119
36308 -54119 218168 854236 1217886 1023192 326350 -388682 -481288 2210 179682 -431590
36298d31590n83027M83376J184988M75421p70043r46705J79414J360644J472716
36289B425194N55739n23156r15330m19641L87588P42628N15023J75080m6106m05663
36279B491356q90499q84533o0661Q85792R67612J29917p22265q02570k12129L19593
36269A221613K67777j18700j26434M59888R79230Q11971L10683J89167L07044
36260D302239k6721o84877p60005q4451M24491K39936r2131j74680m61256j086996
36250A595549j188111k88967O69726P06940K82247L08863N59035K99928k22070
36241B723140k94206j46389m17836o77692l0248J040656J050958j83340j128263
36232A936780p25641K85975O58758J66850n68324q93402m38329N93708J261280
$$ plain form
36298 -431590 -1014617 -531241 653747 1129168 359125 -587580 -408166 952478 2425194
36289 2425194 2980933 2457777 1542447 1122806 1510394 2253022 2768045 2943125 2897019 2491356
36279 2491356 1600857 716324 655663 1541455 2509067 2638984 1916719 1114149 902020 1221613
36269 1221613 1489390 1370690 1244256 1704144 2683374 3495345 3806028 3995195 4302239
36260 4302239 4275518 3590641 2830636 2746185 3170676 3410612 3318481 3143801 2682545 1595549
36250 1595549 407438 118471 788197 1495137 1777384 2086247 2645282 2945210 2723140
36241 2723140 2428934 2282545 1864709 1187017 1156769 2197425 3248383 3065043 1936780
36232 1936780 1211139 1497114 2155872 2322722 1754398 860996 422667 1016375 2277655
36223B277655P96674k59256p07312m14238k79293m98475k56927N78153R52460
36214B189441M18839J9376N04756R73268M29630l92512j77530P28620P70817l71484
36204E093221j272615q94218p88J24534m63997o15975J40582R06561P13948j01272
36194C629981m55271j53562n8784n10620o67129k5971M64740j22571r88468p67463
36184C44882K18040M84279j69818n03633o1226K61298O5694N4637M02016L05816
36174A401985l23397n02712o3788l2981n04893k28370Q38700Q81388o24570j525972
36164f84610m35296Q32808L99116m34639K53262J303961N77843q90696n19611
36155D02138J074977R12036j110743j831148q2450J499277R44713k70384l76872
$$ plain form
36223 2277655 3074329 2815073 2107761 1693523 1414230 915755 658828 1236981 2189441
36214 2189441 2608280 2627656 3132412 4105680 4535310 4142798 3965268 4693888 5464705 5093221
36204 5093221 3820606 2926388 2925600 3050134 2586137 1970162 2110744 3017305 3731253 3629981
36194 3629981 3174710 3021148 2962364 2451744 1784615 1758644 2223384 2100813 1112345 344882
36184 344882 562922 1047201 877383 373750 312524 573822 639516 694153 1096169 1401985
36174 1401985 1078588 575876 512088 479107 -25786 -254156 584544 1465932 841362 -684610
36164 -684610 -1119906 -287098 112018 -322621 -69359 1234602 1812445 921749 402138
36155 402138 1477115 2389151 1278408 -552740 -635190 864087 1808800 1538416 1161544
36146A161544j10478n32485p40862J71013J037383N74595l55765l80222O1435
36137H86158r4637m51370j34084L86106K53716j23980p7986j18609o41682n13058
36127f29426J036062K333771J430507o11646j141207K977N76867j18860k86939
36118B592106R39177J902884J309589L14920L14980P26469P94924J849327N172706
36109A5917082Q392383O995786L67127n826571n277873J505173P235938N775341
36101C5084386j378059p476315q190116n100794k067117o72591k90841n30896
36093I377657j427301k060286j196024O37753J427868L95879r34761r44023n8004
36084E218758J19063q57800j675024r48241R52902K060834R86329j211806k020379
$$ plain form
36146 1161544 1051066 518581 -222281 -51268 986115 1560710 1204945 824723 886158
36137 886158 791521 340151 206067 592173 845889 721909 643923 525314 -116368 -629426
36127 -629426 406636 2740407 4170914 3559268 2418061 2421038 2997905 2879045 2592106
36118 2592106 3531283 5434167 6743756 7058676 7373656 8100125 8895049 10744376 15917082
36109 15917082 24309465 31305251 31672378 25845807 20567934 22073107 29309045 35084386
36101 35084386 33706327 26230012 18039896 12939102 10871985 10199394 9908553 9377657
36093 9377657 7950356 5890070 4694046 5331799 6759667 7155546 6220785 5276762 5218758
36084 5218758 5337821 4480021 2804997 1856756 2809658 4870492 5856821 4645015 2624636
36075B624636n90864J056179P05784j068174j858961p86843O67224J067573O49676
36066B466230K27817p5325l83334m75625l21506l42384n94909n22503L531L08673
36056B90665J15611J31616P39911J100628M82837l80732l66339L16844O73083
36047C104124O17320P64912Q92731J68613j055030j254657O203J234994J165225
36038E644435N18389N87288J094483Q49896o0576l22598M34680J006906N10000
36029A0262903l78118o87843n75912o57829q32049p45724p05676j029316j076043
36020C574393j82762Q45520O15187o21618j137508k94111O04155M51698j86768
36011C668186m49662n45078p48161m09032P24049J355828M04303r51305p50352
$$ plain form
36075 2624636 2033772 3089951 3795735 2727561 868600 81757 748981 1816554 2466230
36066 2466230 2694047 2618722 2235388 1759763 1438257 1095873 500964 -21539 -18008 290665
36056 290665 406276 537892 1277803 2378431 2861268 2480536 2114197 2431041 3104124
36047 3104124 3721444 4486356 5379087 5547700 4492670 3238013 3244216 4479210 5644435
36038 5644435 6162824 6750112 7844595 8694491 8633915 8311317 8745997 9752903 10262903
36029 10262903 9884785 9196942 8621030 7963201 7131152 6385428 5679752 4650436 3574393
36020 3574393 3391631 4237151 4852338 4230720 3093212 2799101 3403256 3854954 3668186
36011 3668186 3218524 2673446 1925285 1516253 2240302 3596130 4000433 3049128 2298776
36002B298776P41441J394573M77957l51247K89840J547804J839021J055572K78611
35993I572348R0593J49739P0978o9537q2229o7768l45173j001403j539899j263621
35983E514028k38244N05991J74459p55994j245302j031400n77585r6735M83301
35974B732519Q64730O51563J17706j93410m02935q54348j072101m08235N05020
35965A940509M18263m63679o93373j5212K15496m75781o88694M08811J430393
35956B076733R13824l69509q02498l97218j74997p5858N89848J255688P21594
35947C737607n52188p85391L20331J013740K39675p79162n80301L45592N54365
35938C514268j52548p63669p12737l48948l8671J95308K50748N0238L4729O80828
$$ plain form
36002 2298776 3040217 4434790 4912747 4561500 4851340 6399144 8238165 9293737 9572348
35993 9572348 9662941 9812680 9883658 9814121 9731892 9664124 9318951 8317548 6777649 5514028
35983 5514028 5275784 5781775 5956234 5200240 3954938 2923538 2345953 2249218 2732519
35974 2732519 3597249 4248812 4366518 4173108 3770173 2915825 1843724 1435489 1940509
35965 1940509 2358772 1895093 1201720 1186508 1402004 926223 237529 646340 2076733
35956 2076733 2990557 2621048 1818550 1421332 1246335 1170477 1760325 3016013 3737607
35947 3737607 3185419 2400028 2720359 3734099 3973774 3194612 2614311 2959903 3514268
35938 3514268 3361720 2598051 1885314 1536366 1497695 1693003 1943751 1993989 2028718 2709546
35928B709546J453677J186562j66405j089597m72869P57120R21555k6093o15940
35919D657556j99786K13531k07487p81607o03692p8317p2594l30839j5873O44371
35909C225263O20542j53926n99131j81664L87893M06364R1374o4828O6229N35281
35899D333397J336623J895071J512317O36092O23670J786848K752599K386821
35891A7263438J300323O54370M72597J66449p3099L47311J053990Q84742n73875
35882B1496246k418073l412082l042205j744181n48566l14646r21572j426138
35874G668783j248367p65073m79253k70220N0124J28686k82243o30657l07310
35865C864470L16183L62799l16553j068719j342658j049176k99286N79807J001144
$$ plain form
35928 2709546 4163223 5349785 5183380 4093783 3620914 4378034 5299589 5273496 4657556
35919 4657556 4457770 4671301 4463814 3682207 3078515 3000198 2927604 2596765 2580892 3225263
35909 3225263 3845805 3691879 3092748 2911084 3298977 3705341 3796715 3731887 3798116 4333397
35899 4333397 5670020 7565091 9077408 9713500 10337170 12124018 14876617 17263438
35891 17263438 18563761 19218131 19690728 19857177 19784078 20131389 21185379 22070121 21496246
35882 21496246 19078173 15666091 12623886 10879705 10331139 10016493 9094921 7668783
35874 7668783 6420416 5655343 5176090 4905870 4955994 5084680 4802437 4171780 3864470
35865 3864470 4180653 4543452 4226899 3158180 1815522 766346 467060 1046867 2048011
35856B048011O93472J40350l5142J39171K58180K36806K05949O6402k90060o14926
35846B848213o68466o34544p07123o41136j89464M10448Q29367J070786J100393
35837C418474O42513j81583o66178m89784j71099p3276J47890N26027L51246m10997
35827C093233n40678M43490J050900J22748r51631l59453R01309M73393j280837
35818B952474j578013K88824J714272Q95391n25765l90888O71321P76259n5005
35809D748870l85247J8588J28523k76569l69383j0792q8098q67294j318247n76381
35799A003970Q04677J565814J170519J54311n63830m34051L47287R40330N79817
35790E568844n15904j131899l63072J084181J456540J37037j324561j116849L27904
$$ plain form
35856 2048011 2741483 2881833 2846691 2985862 3244042 3480848 3686797 3753199 3463139 2848213
35846 2848213 2179747 1545203 838080 196944 7480 417928 1247295 2318081 3418474
35837 3418474 4060987 3879404 3213226 2723442 2552343 2479067 2626957 3152984 3504230 3093233
35827 3093233 2552555 2996045 4046945 4169693 3218062 2858609 3759918 4233311 2952474
35818 2952474 1374461 1663285 3377557 4272948 3747183 3356295 4027616 4803875 4748870
35809 4748870 4363623 4382211 4510734 4234165 3864782 3853990 3765892 2898598 1580351 1003970
35799 1003970 1808647 3374461 4544980 4699291 4135461 3701410 4048697 4989027 5568844
35790 5568844 5052940 3921041 3557969 4642150 6098690 6235727 4911166 3794317 4122221
35781D122221R37487N8832o55794J0919Q87398M82361m18230r2785J103644J254911
35771G690964M5142q47468o14805l51702p13464o73360M43131J543181J560829
35762H082448J073608Q63771L81726q24437j486754l16044J555789J843725M18717
35753A1592549o16125j47393N77203K89432l02959R0774J108260J244497J97625
35744A4033863n40258L21606K114845L029840K331651J082145O28679J067846
35736B4070217J619993J950437K348041K836521K996942K777447K724962L181892
35728D4506452L899801M697815N835761P366445Q759779R717311J0883758J3100019
35720A08767141J6209847J9313790K2249076K6149889L2086384L9530998M6917812
$$ plain form
35781 4122221 5059708 5118540 4462746 4473665 5361063 5843424 5425194 5332409 6436053 7690964
35771 7690964 7736106 6888638 6273833 5922131 5208667 4535307 4978438 6521619 8082448
35762 8082448 9156056 10019827 10401553 9577116 8090362 7774318 9330107 11173832 11592549
35753 11592549 10976424 10829031 11406234 11695666 11392707 11483481 12591741 13836238 14033863
35744 14033863 13493605 13815211 15930056 18959896 21291547 22373692 23002371 24070217
35736 24070217 25690210 27640647 29988688 32825209 35822151 38599598 41324560 44506452
35728 44506452 48406253 53104068 58939829 66306274 75066053 84783364 95667122 108767141
35720 108767141 124976988 144290778 166539854 192689743 224776127 264307125 311224937
35713C11224937N3532161N9225162O1085915N2210762K7512095q117205m0459995
35706E16213832n7542034n9394453n4555318m9185626m3229081l5817949k9045784
35699A87443587k4787445k1730236j8087064j4669721j2884146j1800702r763485
35692G3720788p355419o256569o262547n800673m593150l595829k948538k126878
35684C4781185j596524k167314l056532k732627j511530j173988j969700k181856
35676A8391114j053854p0125n39086j646883j942243j412590r62383p82928l91384
35667I589638K05984L86646j20362p55661p69134j49027K60365k55790j265775
35658G126884j624510r77579j31746K86765N79105Q84200N11858o82851j369100
$$ plain form
35713 311224937 364757098 423982260 485068175 537278937 564791032 556673827 516213832
35706 516213832 458671798 399277345 344722027 295536401 252307320 216489371 187443587
35699 187443587 162656142 140925906 122838842 108169121 95284975 83484273 73720788
35692 73720788 66365369 60108800 53846253 48045580 43452430 39856601 36908063 34781185
35684 34781185 33184661 31017347 27960815 25228188 23716658 22542670 20572970 18391114
35676 18391114 17337260 17267135 16728049 15081166 13138923 11726333 10763950 9981022 9589638
35667 9589638 9795622 10182268 10061906 9306245 8537111 8388084 8648449 8392659 7126884
35658 7126884 5502374 4524795 4393049 4679814 5258919 6143119 6654977 5972126 4603026
35649D603026n21029P60822P59475k31862n52831K9642J47333o33909j125870
35640C234797o96569k62233m65447n35388J45584P43243L17413n67736o84119
35631A229545P6432P37116O61726J58622j46460Q236M04220O49748O31262N80651
35621D991098N32617P9885q60280j474495j025465p0383K25074k19369m19421
35612A759261N7091N97217P18991O40263M90186P682o70757q62270l39170K80183
35602B678677M16058J42338k12669m24067l22712n6485k20770r35554j156288
35593i1472j7805J466309J461835m5151j207459r91889k68519M5964K29905N65006
35583A146724M97994j89140o92576m73832p3415M6928K82826Q13833R54689L31755
$$ plain form
35649 4603026 4081997 4842819 5602294 5370432 4817601 4847243 4994576 4360667 3234797
35640 3234797 2538228 2275995 1810548 1275160 1420744 2163987 2481400 1913664 1229545
35631 1229545 1305977 2043093 2704819 2863441 2716981 2725217 3129437 3779185 4410447 4991098
35621 4991098 5523715 5603600 4743320 3268825 2243360 2172977 2398051 2178682 1759261
35612 1759261 1816352 2413569 3132560 3772823 4263009 4270691 3599934 2737664 2398494 2678677
35602 2678677 3094735 3237073 3024404 2600337 2277625 2221140 2000370 1064816 -91472
35593 -91472 -109277 1357032 2818867 2773716 1566257 574368 305849 351813 581718 1146724
35583 1146724 1644718 1455578 763002 289170 215755 262683 545509 1359342 2314031 2645786
35573B645786m04242o99277p79743o77614L1975Q78959N09358j017433j624456
35564a136687j73700J559860J410609q2869q54485m19139R7644J85966K70919
35555H58118L23654n3708m65616k20844K99859K27690j92257n8680M64620M30313
35545A613149j26193k75510N9849J9893m95340n77456L7194M90254K99115L1777
35535A076732P3875q2289p49267j213447o71454N76437J400836J053465r7026
35526A367862q83158n06437M57541O48404k33496r23197m56606M17680N85570
35517D74163L26463M51041N81829p4233q82854n79493M16860M64208n36683q60870
35507b19569K05564J194813Q19403k08851o32397m74011l92870l99739k61119
$$ plain form
35573 2645786 2241544 1542267 762524 84910 116885 995844 1505202 487769 -1136687
35564 -1136687 -1310387 249473 1660082 1577213 722728 303589 401233 587199 858118
35555 858118 1181772 1128064 662448 441604 741463 969153 776896 718216 1182836 1613149
35545 1613149 1486956 1211446 1271295 1291188 795848 218392 255586 745840 1044955 1076732
35535 1076732 1150607 1068318 319051 -894396 -1565850 -989413 411423 1464888 1367862
35526 1367862 484704 -21733 435808 1084212 850716 -72481 -529087 -111407 474163
35517 474163 800626 1251667 1833496 1759263 876409 296916 713776 1177984 641301 -219569
35507 -219569 -14005 1180808 2000211 1791360 1158963 684952 292082 -107657 -368776
35498c68776k58180n69123o43486n1806O95634R26371P59300N87563K89956k58227
35488A109226m90465J29225J027618J016631j79936j481878j619967m76282Q02762
35479a63066J019445K52767l01822R905M01685M588n66967j45378R13511J048279
35469B472947j10346j160573j078160n19445m07594n20518k66963K00220M73413
35460i17019O38519Q11388P12336L32665K13227M55009L18623n36306j281681
35451G46761j097910l08589L28806O22847N90794N4508o60309o24719K30278N86239
35441D68706l17282j268399q65198K45942M23585l61134o16253K69287J269458
35432g51288J390430Q10907J91848j63187k94669m15766p22640r00906k47606
$$ plain form
35498 -368776 -626956 -1196079 -1839565 -1891371 -1195737 -269366 489934 1077497 1367453 1109226
35488 1109226 618761 747986 1775604 2792235 2612299 1130421 -489546 -965828 -163066
35479 -163066 856379 1109146 807324 817229 1218914 1223502 656535 511157 1424668 2472947
35469 2472947 2362601 1202028 123868 -395577 -803171 -1323689 -1590652 -1390432 -917019
35460 -917019 -278500 532888 1245224 1577889 1791116 2246125 2564748 2028442 746761
35451 746761 -351149 -659738 -330932 291915 882709 937217 276908 -347811 -117533 468706
35441 468706 151424 -1116975 -1982173 -1736231 -1312646 -1673780 -2290033 -2020746 -751288
35432 -751288 639142 1450049 1641897 1478710 1184041 768275 45635 -855271 -1102877
35423a102877J102816J758098Q02014p18285j167301n69655j89697m15298n56864
35414a057049l82645k54546M9514R66572J686587Q84468r15431j595005n24876
35405a142411M88246J00305n70730l4681J067446J114450R1365n96468l04823
35396B12699K99899N61721M62181Q4235m77986p41753l01865L50199L17648l83035
35386C83943q09928m93211m1532q6218l30632j40206L77546M92288n6746o21059
35376a325755m68377K93172R12960R22110M84437n8800m80703m94263N3848O11621
35366D50250L15941o11963p54035M45634J419284N20599j335883j715267j33236
35357a398676J291395R22434l84182j035976q97102o65257l11258N21769J311692
$$ plain form
35423 -1102877 -61 1758037 2560051 1841766 674465 104810 -84887 -500185 -1057049
35414 -1057049 -1439694 -1694240 -1644726 -678154 1008433 1892901 977470 -617535 -1142411
35405 -1142411 -654165 -553860 -1124590 -1159271 -91825 1022625 1113990 517522 212699
35396 212699 512598 1074319 1536500 1620735 1142749 400996 99131 449330 766978 383943
35386 383943 -425985 -919196 -960728 -1046946 -1377578 -1517784 -1140238 -647950 -704696 -1325755
35376 -1325755 -1794132 -1500960 -588000 334110 818547 759747 279044 -215219 -161371 450250
35366 450250 766191 154228 -599807 -154173 1265111 1785710 449827 -1265440 -1398676
35357 -1398676 -107281 815153 430971 -605005 -1502107 -2167364 -2478622 -1956853 -645161
35348f45161J143524R0367q42906r43308l03538N43444R28669M24782n18747q15494
35338i38368j50075M84706K65438k17839l2330N34995N71767J35456M0503L65594
35328A059847L86110q6322l99004j64755K48220M37495M03079J92171k05436n62619
35318A308786n99696m21381k60265K837M83257P68323M47733j32838l79052l61520
35308H56184m37389l93275Q9644N40618L52689n2427J03068N00054K96715j94210
35298A661671n56N30649Q2027j208479j626963o36422J96353k00332p33350j61187
35288b096589Q63964J077210N73414J51712j69320o47315q25163l39558J68720
35279a242925J26920M8802L31965K04599p45837j239478k28979R82157N91114
$$ plain form
35348 -645161 498363 588730 -254176 -1197484 -1501022 -957578 -28909 395873 -122874 -938368
35338 -938368 -1088443 -603737 -338299 -556138 -588468 -53473 518294 653750 694253 1059847
35328 1059847 1445957 1359635 960631 795876 1044096 1481591 1884670 2076841 1871405 1308786
35318 1308786 709090 287709 27444 30281 513538 1281861 1729594 1596756 1217704 856184
35308 856184 418795 25520 115164 655782 1008471 956044 1059112 1559166 1855881 1661671
35298 1661671 1661115 2191764 2273791 1065312 -561651 -1198073 -1001720 -1202052 -1935402 -2096589
35288 -2096589 -1232625 -155415 417999 569711 400391 -246924 -1072087 -1411645 -1242925
35279 -1242925 -1116005 -1067203 -735238 -530639 -1276476 -2515954 -2744933 -1762776 -1171662
35270a171662o67355o69603N46248R75773J86602j08699O42043P36706n87044
35261a16991j387649j9043K062486K333970P13853p74719r70524n07087k62728
35252A071568l58511n47956n26942J1542Q48828J072463J92073r44973j147686
35243c29594m59081O7450r0159m11588k55324L74034R42722Q48692m5812j011520
35233c70180r82291R4357R54114O19779k64439m53822P6632L28326n077j41086
35223a43687L98125R81595Q26223J01955l59808j53323K38017M3288q01989j400609
35213b70213r26668J73486O35491J41848k43853J67475N37516j0423p12774l30454
35203h38569O35182N45607o99653j307165k63276J168978J337805L56814n17817
$$ plain form
35270 -1171662 -1839017 -2508620 -1962372 -986599 -799997 -908696 -266653 470053 -116991
35261 -116991 -1504640 -1523683 538803 2872773 3586626 2811907 1841383 1334296 1071568
35252 1071568 713057 165101 -361841 -350299 498529 1570992 1763065 818092 -329594
35243 -329594 -788675 -721225 -811384 -1222972 -1478296 -1104262 -161540 687152 641340 -370180
35233 -370180 -1352471 -1258114 -304000 315779 51340 -402482 -325850 2476 -2601 -143687
35223 -143687 254438 1236033 2062256 2164211 1804403 1651080 1889097 1932385 1130396 -270213
35213 -270213 -1196881 -1023395 -387904 -246056 -489909 -322434 215082 204659 -508115 -838569
35203 -838569 -203387 342220 -357433 -1664598 -1927874 -758896 578909 935723 417906
35194D17906p14310n49223k48911K08158N72398N10188K15943J88756M30806L87825
35184A419536k55114j058226j218340m15116P07690J033471K07207p94074q08791
35175a181757m2567K84492j79564m11109K79504J095800J013381K90607j83716
35166I65071l16765n29491o26675j67639L73784J21018o17236n78866M74197J275131
35156C72529R27052P7080l49769m84060p78078q82136k94820M73572M71426k45216
35146g12420o73675k52790N72114J060297Q01686j65679j191308j244416j04764
35137a910955R68166P03214l25296n02333L25776O65333j10570p49388l01048
35128a237101L26359R7528l44879o9568K28637m82257j350307q16741N91832R53410
$$ plain form
35194 417906 -296404 -845627 -1094538 -886380 -313982 196206 412149 600905 1031711 1419536
35184 1419536 1164422 106196 -1112144 -1527260 -819570 213901 421108 -372966 -1181757
35175 -1181757 -1224324 -939832 -1119396 -1530505 -1251001 -155201 858180 1148787 965071
35166 965071 648306 118815 -507860 -675499 -301715 -180697 -797933 -1376799 -902602 372529
35156 372529 1299581 1376661 1026892 542832 -235246 -1117382 -1412202 -938630 -467204 -712420
35146 -712420 -1386095 -1638885 -1066771 -6474 795212 629533 -561775 -1806191 -1910955
35137 -1910955 -942789 -239575 -564871 -1067204 -741428 -76095 -186665 -936053 -1237101
35128 -1237101 -910742 -813214 -1158093 -1227661 -999024 -1481281 -2831588 -3648329 -3056497 -2103087
35118b103087J97172J57120J156864J213012m68029j766527r36210O00301O91431
35109a257953j27084M9889J108021J357347N59788J576n9146n42716j221623p27264
35099h59165P79855J309200J17717j051890p67196K0406o9632n40000j92831O65867
35089e87669Q12481J01090n31870n25868m6978N97612R53926M42373o96463j155638
35079f37004k26293J004908J161173N15287K06148K51006j61278q61130q22132
35070D30685o247M36552k4251o05178n72980j59664J56419K77309J73305j27594
35060b1644j38894N01658J033343L61828j044423j456802m41257M02319o5959
35051h69831p99598l94817O74593J035140O37041M57347O34550M96371R6401J29497
$$ plain form
35118 -2103087 -1905915 -1748795 -591931 621081 153052 -1613475 -2549685 -1949384 -1257953
35109 -1257953 -1385037 -1335148 -227127 1130220 1690008 1691584 1632438 1089722 -131901 -859165
35099 -859165 -79310 1229890 1347607 295717 -471479 -451073 -520705 -1060705 -1253536 -587669
35089 -587669 224812 325902 -205968 -731836 -778814 -181202 772724 1215097 518634 -637004
35079 -637004 -863297 141611 1302784 1818071 2024219 2275225 2113947 1252817 430685
35070 430685 424438 860990 836739 231561 -341419 -501083 -344664 -67355 105950 -21644
35060 -21644 -160538 341120 1374463 1736291 691868 -764934 -1206191 -803872 -869831
35051 -869831 -1669429 -2064246 -1389653 -354513 282528 739875 1374425 1870796 1967197 2096694
35041B096694M11455K5113q72695r82160m7494M37170m62951j476754r82589N21015
35031a333196J231468O94323Q7652Q3280K3244n17835p97891j96252O65629Q99856
35021H40278O10234L37871j1802p00431j184674p53157J63889M79677J39603J33748
35011E5236P24372R07648P0840r37906j080498n67515k13159o3937L83208J021340
35001B99629J150109N49823j99131m91498k84488P2526K06720k4393l65389l82891
34991E31017n5930J24873j29506m61363m10404J236N05019R15694R30109K36696
34981B187441p50003r96181k77822K73877j79015p98765l72479O99412R77630
34972G64095J17690q48015j104229p15905P1423R55686J202832M29514m26792
$$ plain form
35041 2096694 2508149 2533262 1660567 678407 630913 1068083 605132 -871622 -1854211 -1333196
35031 -1333196 -101728 592595 680247 763527 786771 268936 -528955 -725207 -59578 840278
35021 840278 1450512 1788383 1776581 1076150 -108524 -861681 -697792 -218115 -78512 55236
35011 55236 779608 1687256 1758096 820190 -260308 -827823 -1040982 -1104919 -721711 299629
35001 299629 1449738 1999561 1800430 1308932 1024444 1096970 1303690 1279297 913908 531017
34991 531017 475087 599960 470454 9091 -401313 -400077 104942 1020636 1950745 2187441
34981 2187441 1437438 441257 163435 437312 258297 -540468 -912947 -213535 764095
34972 764095 881785 33770 -1070459 -1786364 -1714941 -759255 443577 873091 446299
34963D46299k66834K99080j49326j255657j188841K76612J168537M85626k24379
34954d08883L77430J119785M46678q08309p97534K91201O67484j51190q37450
34945a00788n07272K25767N43387M00358M9589l30733m42561j67261L2770j86235
34935d82979k79096K94012Q35284L13258q10032j085980l16721K39592K5543o5728
34925a332847M52446O43202j63009j000445p12807K25135N47759J55639n0609
34916a235536J32888M2817l74103k46801O66606J228756M89970p49868r33234
34907i78505N5552P78888L84909k80556k12377J59091p5065n06555m35J165963
34897D90910J352270M6129j197050j007460o5421K80292R9994K84145P04533M92964
$$ plain form
34963 446299 179465 478545 329219 -926438 -2115279 -1838667 -670130 -184504 -408883
34954 -408883 -31453 1088332 1535010 726701 -70833 220368 887852 736662 -100788
34945 -100788 -608060 -382293 161094 561452 611041 280308 -162253 -329514 -296744 -482979
34935 -482979 -762075 -468063 367221 680479 -129553 -1215533 -1532254 -1292662 -1267119 -1332847
34925 -1332847 -880401 -237199 -400208 -1400653 -2113460 -1888325 -1340566 -1184927 -1235536
34916 -1235536 -1102648 -1059831 -1433934 -1680735 -1014129 214627 704597 -45271 -978505
34907 -978505 -922953 -144065 240844 -39712 -252089 -92998 -168063 -674618 -675053 490910
34897 490910 1843180 1889309 692259 -315201 -380622 -100330 -336 283809 988342 1481306
34887A481306k35940m00746L36419J078300J011003K51326o79765j361297j416001
34878F4605p55258P8731M66256M74904M48958K30111l50278o72093j70478M01035
34868B16493o5024j015356p90387P03508J564385O37059q52718j178974l38112
34859a119126N11642P72490N94204J36538m09039n81639j77630L70148N88903
34850F86491M59016M3921o63929j231427r74279n9786M67992K00733p5056J60144
34840i86180K56970l01936q16714n68801j07386j85256k71209N27773J659447
34831g93292J694971M80792n96686n33602J86084N46709J86874n52886j093195
34822d74231r63759j84592O09765P74052L43193j36541k65653j4071M05543N87965
$$ plain form
34887 1481306 1245366 844620 1181039 2259339 3270342 3521668 2841903 1480606 64605
34878 64605 -690653 -611922 -145666 329238 778196 1008307 658029 -14064 -184542 216493
34868 216493 151469 -863887 -1654274 -950766 613619 1250678 397960 -781014 -1119126
34859 -1119126 -607484 165006 759210 895748 486709 -94930 -272560 97588 686491
34850 686491 1145507 1189428 525499 -705928 -1680207 -1739993 -1272001 -1071268 -1146324 -986180
34840 -986180 -729210 -1031146 -1847860 -2416661 -2524047 -2709303 -2980512 -2452739 -793292
34831 -793292 901679 1382471 785785 252183 438267 984976 1171850 618964 -474231
34822 -474231 -1437990 -1622582 -1012817 -238765 104428 -32113 -297766 -311837 93706 681671
34812F81671K26664l47398l78961K31889O30255K14457m66727n71079j48416J38185
34802B10540q274l79607o51191m80910K09508P14656J47693j004680j046270M75378
34792a813157J721758J096330l50890n57760M43472Q56143M7609p18771m42325
34783B82409L45235O85380L21143m47896j044566p88522K68399R35900L51017
34774I08499n63219l62879O38507Q94291J32435l94616j30185R9378j68420l13750
34764G40041n9472l5256m48869o43616m08630l03091l21201K03460R57820O53003
34754C34189p05678j334685l33421Q77207Q21449L5725l31301l99947o28536m64096
34744b129094M47338R52187P4501r96386n00193J032977J477737K98800q67489
$$ plain form
34812 681671 908335 560937 181976 413865 1044120 1258577 791850 220771 72355 210540
34802 210540 202266 -177341 -828532 -1309442 -1099934 -385278 -237585 -1242265 -2288535 -1813157
34792 -1813157 -91399 1004931 654041 96281 539753 1395896 1443505 724734 282409
34783 282409 627644 1313024 1634167 1186271 141705 -646817 -378418 557482 908499
34774 908499 345280 -17599 620908 1515199 1647634 1253018 1122833 1222211 1053791 740041
34764 740041 680569 645313 196444 -447172 -855802 -1158893 -1480094 -1276634 -318814 334189
34754 334189 -371489 -1706174 -2039595 -1162388 -340939 -305214 -636515 -1036462 -1664998 -2129094
34744 -2129094 -1681756 -729569 -655068 -1651454 -2151647 -1118670 359067 657867 -209622
34735b09622p99217j30369Q1784j76465l13990p7217L33782M93003K9351p88214
34725a557174r70059L372J213885J363079N22384j16093m2483O7726l21236p71861
34715f08460o31552P1384P45500Q30155K26238n39203p38382l48494j51487n27097
34705a671398p54101j80061N81926N77055M8478j06688M0565k47874o98027k19095
34695b629220J082950J652166P60043l43058l21524L62845M33686k19556o54571
34686A23761m40968k4783K41397M49402N28933J68817m58734o24539n4450N47072
34676D55908M62908J8942K7485M25782L24890m83696r98426m87193L26577L82063
34666D55240p1052l8927M39250M04898k70403o75020n01674m05028m24391K74364
$$ plain form
34735 -209622 -1008839 -1139208 -1057424 -1233889 -1547879 -1625096 -1291314 -798311 -768960 -1557174
34725 -1557174 -2527233 -2523861 -1309976 53103 575487 459394 416911 484637 163401 -608460
34715 -608460 -1240012 -1168628 -423128 407027 633265 94062 -644320 -992814 -1144301 -1671398
34705 -1671398 -2425499 -2605560 -2023634 -1446579 -1398101 -1504789 -1464224 -1712098 -2410125 -2629220
34695 -2629220 -1546270 105896 865939 522881 201357 564202 997888 778332 123761
34686 123761 -317207 -341990 -100593 348809 877742 1046559 587825 -36714 -91164 455908
34676 455908 918816 937758 965243 1391025 1715915 1232219 233793 -253400 73177 455240
34666 455240 384188 345261 784511 1189409 919006 243986 -257688 -662716 -1087107 -812743
34656h12743J445381J349046n57936k165332j518045K71697P81674j05708m91757
34647a803723K43385P41455K55183k15190J22378N07601K0746r09027j156399
34638b193591l18259R70611J622488R62160m11887r07513J36700J300784R66586
34629B128079k31523m06739N21171P39983l91355j271133o68732M59274P33837
34620A612862L86121L88320P49637Q30569M99143P281n77622j052448r06054j48274
34610A789535L83414J43070l61091l77068K13951J098395J742453J287797n43506
34601E376950k245662j811101K83452J162221m69516k285980j690684M79861J481496
34592B81037O40806l18107k28451L14423M95447K60483k71558r65515j215536
$$ plain form
34656 -812743 632638 1981684 1423748 -741584 -2259629 -1987932 -1206258 -1311966 -1803723
34647 -1803723 -1560338 -818883 -563700 -778890 -656512 -148911 -128165 -1037192 -2193591
34638 -2193591 -2511850 -1541239 81249 1043409 631522 -275991 -139291 1161493 2128079
34629 2128079 1896556 1489817 2010988 2750971 2359616 1088483 419751 879025 1612862
34620 1612862 1998983 2387303 3136940 3967509 4466652 4473933 3896311 2843863 1937809 1789535
34610 1789535 2172949 2316019 1954928 1577860 1791811 2890206 4632659 5920456 5376950
34601 5376950 3131288 1320187 1603639 2765860 2296344 10364 -1680320 -1200459 281037
34592 281037 921843 603736 375285 689708 1185155 1445638 1174080 208565 -1006971
34583a006971n10710N99209J106898Q79026M17002k26737j081518j313522j59440
34574a296763J431466J651899L48456p83160o39535P2567L19463R1508j60119
34565A035782k91833k12693J89739N20678J80367n47491o80677r5267J40523n78337
34555c39209j386677j191657j47027P31669Q62885M75210Q2020j9743M9531n3725
34545i36723k77183o077R54232J616333R54722m12233q36660K7675P35534J98450
34535B018070q46498j074061l27757N15990P62064M09869n9831o0936M89536Q49436
34525B675882L45418m72667m68222K88971M99694l72211j279591j192711l96092
34516c71529L12428O27184M29514l77044j160559r04643J11194L27216o22814
$$ plain form
34583 -1006971 -1517681 -918472 188426 1067452 1484454 1257717 176199 -1137323 -1296763
34574 -1296763 134703 1786602 2135058 1351898 712363 784930 1104393 1195901 1035782
34565 1035782 743949 531256 720995 1241673 1422040 874549 193872 98605 239128 -339209
34555 -339209 -1725886 -2917543 -3064570 -2332901 -1470016 -994806 -912786 -932529 -882998 -936723
34545 -936723 -1213906 -1219983 -265751 1350582 2305304 1893071 1056411 1084086 1819620 2018070
34535 2018070 1171572 97511 -230246 285744 1047808 1457677 1397846 1336910 1826446 2675882
34525 2675882 3021300 2548633 2080411 2369382 2869076 2496865 1217274 24563 -371529
34516 -371529 -59101 568083 997597 620553 -540006 -1444649 -1333455 -1006239 -1629053
34507a629053j008506K66042J613307J105369m57317q52329J04435O47615J61957
34498d8480j27193L55129N30957k72719j053927p36091K96963J032467J139239
34489A116345Q04652J95301l43085l60186k4484P451k80307k24230J43540j20897
34479I14100j149828j559526l89847J262062J658421P41566j24147k30486j28929
34470I93386l38953n83150m56900n0042L14161M34598K37878j34777k60863Q1950
34460B37288M02434j863r50175j321942l80986J175465J858460J021392m17602
34451A622471j016478m33676K93433J79269m35561n11643R3301M56293P1183l79057
34441f0465j62261L24413K09553m66406p83326k20500P03631J076004N01945n52781
$$ plain form
34507 -1629053 -2637559 -2371517 -758210 347159 -110158 -962487 -858052 -210437 -48480
34498 -48480 -175673 179456 710413 437694 -616233 -1352324 -1055361 -22894 1116345
34489 1116345 1920997 2116298 1773213 1413027 1388543 1395994 1115687 891457 1034997 914100
34479 914100 -235728 -1795254 -2185101 -923039 735382 1476948 1352801 1122315 993386
34470 993386 654433 71283 -385617 -435659 -121498 313100 550978 416201 155338 237288
34460 237288 639722 637859 -312316 -1634258 -2015244 -839779 1018681 2040073 1622471
34451 1622471 605993 172317 465750 645019 209458 -302185 -208884 247409 318592 -60465
34441 -60465 -222726 101687 311240 -155166 -938492 -1158992 -455361 620643 1122588 569807
34431E69807j075639l94197R54470J576114Q29794l28696o65659l70796n65801
34422E29397j356014j507096l29812J120137J398702N91553K6741L09099N58087
34413A340794j12078j066537q82618N41813J535573P82511q20612j352863n17134
34404e51151J49689k43235o98440j89810O01312N58052Q4041K93402Q93959N67782
34394A465601p05823j365979n55909P23978J185616P81638J71020k84475m44425
34385I71242k13547N8799j85039p05457o03380J81708N68163J2051o30390n53721
34375a099571j66522r531L14202J093369J474816P16976m17602q23662p74122
34366C08353j037908j068186J39988J802998J914538J81565j341416j006669M38801
$$ plain form
34431 569807 -505832 -900029 54441 1630555 2460349 2131653 1465994 1095198 529397
34422 529397 -826617 -2333713 -2663525 -1543388 -144686 446867 473608 782707 1340794
34413 1340794 1228716 162179 -720439 -178626 1356947 2139458 1318846 -34017 -551151
34404 -551151 -401462 -644697 -1343137 -1532947 -931635 -373583 -289542 3860 897819 1465601
34394 1465601 759778 -606201 -1162110 -438132 747484 1529122 1700142 1415667 971242
34385 971242 757695 816494 631455 -74002 -677382 -495674 72489 84540 -545850 -1099571
34375 -1099571 -1266093 -1275624 -961422 131947 1606763 2323739 1906137 1082475 308353
34366 308353 -729555 -1797741 -1657753 145245 2059783 2241348 899932 -106737 332064
34357C32064J175913N09558q11250j617611j243241q6066N99975J30639n72043
34348a582062l04256M36243K56819n47654k09773J352591J805632n8660k047657
34339h98777j566008O17022J674313Q34349o7516K01020P32367M29933l66243
34330A590460q32314q19647m05276N08220J453977J371758J36186q53921n47344
34321A602099J63902j40394j098401j129955m1408N66394j71793r68568m01693
34312a619817Q19557R41752j26726p53444j66051M56340n697q35291p04157K22404
34302a771130O37911J42941k98780L4629O43956P52456M05556J45673J19794L2092
34292H45098k44876m28896k14240K71558N10184J95563k81235k91193N3906m3516
$$ plain form
34357 332064 1507977 2017535 1206285 -411326 -1654567 -1740633 -1140658 -1010019 -1582062
34348 -1582062 -1886318 -1450075 -1193256 -1740910 -1950683 -598092 1207540 1148880 -898777
34339 -898777 -2464785 -1847763 -173450 660899 593383 794403 1526770 1956703 1590460
34330 1590460 758146 -61501 -466777 41443 1495420 2867178 3003364 2149443 1602099
34321 1602099 1766001 1625607 527206 -602749 -644157 -77763 -249556 -1218124 -1619817
34312 -1619817 -800260 141492 14766 -738678 -904729 -448389 -454086 -1289377 -1993534 -1771130
34302 -1771130 -1133219 -990278 -1289058 -1254429 -610473 141983 547539 693212 813006 845098
34292 845098 600222 171326 -42914 228644 738828 934391 653156 361963 415869 372353
34282C72353p58122j111554l85132O04650N90835k49540o20755j02411M13785
34273a245891L18649R0387K12251L85253K80745J70424L08566M26606K83432Q0122
34263A310544m466o8465o6781J66778L41359k0792o08468n87007j7822J08135
34253E53015m44963o82408q0771N08612L45323l2364N7939K97388K44665K27163
34243I93599M01162Q9810q57212j244239l60639N32424P4196q87562o48261N11087
34233a395635Q44142O6589l14300L89111J023794N76434l84638p91265m45753
34224d31521J44339M30878Q2459o77218r78497l05374O01441O90230J15332k05701
34214e33632j43900k25590l03021J95623Q69874P18792j15771m74240p0751K69905
$$ plain form
34282 372353 -385769 -1497323 -1882455 -1277805 -686970 -936510 -1557265 -1659676 -1245891
34273 -1245891 -927242 -836855 -624604 -239351 41394 211818 520384 946990 1230422 1310544
34263 1310544 1306078 1237613 1170832 1337610 1678969 1658177 1049709 462702 444880 553015
34253 553015 108052 -574356 -655127 -146515 198808 166444 224383 521771 766436 993599
34243 993599 1394761 1484571 627359 -616880 -977519 -445095 -370899 -1258461 -1906722 -1395635
34233 -1395635 -551493 -484904 -799204 -410093 613701 1190135 805497 14232 -431521
34224 -431521 -287182 143696 226155 -451063 -1429560 -1734934 -1133493 -443263 -327931 -533632
34214 -533632 -677532 -903122 -1206143 -1010520 -140646 578146 462375 -11865 -82616 187289
34204A87289L06541O40290J104112O91231m82689r31860j54118M72404o3799q93616
34194H75785r32013n18608l34887j13742L95105M79077k48582p78406k36078N76899
34184h35450N43888J41686M53606J065057O36497q07160j747411j300510k07584
34175b057381L97832K51738j15821o2941N43754J025293N58934n42171r49551
34166i50314k23947L77571j60585r08290m56207P83949J261601P03959K29648
34157F57385L17964K92214j58674m72940m44673n74510q71958o02321L32876R60907
34147e63730P32527L62644N27700P23054K41063n18948o81969l22328k62484o54579
34137d17050p14963k1866O75937M11307o02800j098129l36107R02046J295750
$$ plain form
34204 187289 493830 1134120 2238232 2929463 2446774 1514914 1360796 1833200 1769401 875785
34194 875785 -56228 -574836 -909723 -1023465 -628360 -149283 -397865 -1176271 -1412349 -835450
34184 -835450 -291562 -149876 303730 1368787 2005284 1198124 -549287 -1849797 -2057381
34175 -2057381 -1659549 -1407811 -1523632 -1586573 -1042819 -17526 541408 -763 -950314
34166 -950314 -1174261 -796690 -957275 -1865565 -2321772 -1537823 -276222 427737 657385
34157 657385 975349 1267563 1108889 635949 191276 -383234 -1255192 -1857513 -1524637 -563730
34147 -563730 168797 531441 1059141 1782195 2023258 1504310 822341 500013 237529 -417050
34137 -417050 -1132013 -1153879 -477942 -66635 -669435 -1767564 -2103671 -1201625 94125
34128I4125O84709J60114M30833Q42864M39221o05926j262214j018170l33359
34119e67803J22150J16273j71611l71032k06893J02679j2551n72322p14362J40047
34109b135425J202838J224330K50575m38652j23335N31517O08086Q2104m56965
34100G45073n70976j42349O54250J223367Q97020k19003j137221j080439l82167
34091a2445K7329k02837n26365k89565M13467P91320K85977o48151r82407l91793
34081a535470L49068N11072L93314N89823P99960L00946o25843q42186p9930N13049
34071C73803J6286r07471r63808J6316R95173J145700O89368L08533K08724J4284
34061A896908n15579r24081n19504N37404J091832M06160o76124p25810L09302
$$ plain form
34128 94125 778834 938948 1369781 2212645 2651866 2045940 783726 -234444 -567803
34119 -567803 -445653 -329380 -500991 -872023 -1078916 -976237 -988788 -1561110 -2275472 -2135425
34109 -2135425 -932587 291743 542318 103666 -19669 511848 1119934 1202038 745073
34100 745073 174097 31748 685998 1909365 2806385 2587382 1450161 369722 -12445
34091 -12445 14884 -187953 -714318 -1003883 -590416 200904 486881 -161270 -1143677 -1535470
34081 -1535470 -1186402 -675330 -282016 307807 1107767 1408713 782870 -59316 -139246 373803
34071 373803 390089 -517382 -1481190 -1464874 -469701 675999 1365367 1673900 1882624 1896908
34061 1896908 1381329 457248 -62256 475148 1566980 1973140 1297016 571206 880508
34052H80508J066900P34245N272k54948k37128m16356m87615k0504M82512K47458
34042B000344m54567p14460m39962k82219k52776K96210J150933J066526k83770
34033B086259j399670r39325L15693O47890q6775n09541l7912L08601k98605j148175
34023a061560j081897r0431Q78148J134419O68090j59734p50900n09892M61029
34014e12728J236205J147652O12520L61798L27830K119n24283p21597n46760l72821
34004A009935k31443J8625M0420m62985q24309k19591O97554L98907j072905j782670
33994b428462o19726J078745J518501Q33250L36906L59445J68451m87199j011113
33985b51202r43057l78593M15148J074080J107995M74992j44816k48772j97809
$$ plain form
34052 880508 1947408 2681653 2686925 2431977 2194849 1778493 1290878 1270374 1752886 2000344
34042 2000344 1545777 831317 391355 109136 -143640 152570 1303503 2370029 2086259
34033 2086259 686589 -252736 62957 710847 624072 114531 76619 385220 86615 -1061560
34023 -1061560 -2143457 -2233888 -1355740 -221321 446769 287035 -463865 -973757 -512728
34014 -512728 723477 1871129 2483649 2845447 3173277 3175396 2651113 1929516 1382756 1009935
34004 1009935 778492 797117 837537 374552 -449757 -669348 28206 427113 -645792 -2428462
33994 -2428462 -3048188 -1969443 -450942 382308 719214 1078659 1247110 759911 -251202
33985 -251202 -1194259 -1572852 -1157704 -83624 1024371 1499363 1354547 1105775 907966
33976I07966l68817l15561L22470P70546J63241q73025j006705k52874J61619
33967d91140j51615k99714J76513O00453N11928L55297L16910j97997j196882
33958c76247j443343k11284J244861J216726j1747n54954L54156J293139P05380
33949B216687q93745j579405n62983Q15821R23441m2992n56624q2489K60749l28168
33939A70292r07752k94755Q98392J076026P0498p26113n66978j89716j95365o9711
33929g35182N47939R19426M34708k39285k42736P0570r8823m93527l02927K51538
33919A11701J73731n55744q07331j09321N97656N27100K72236O34653J092170
33910A936851N91340n74489r93132k80326K90838k03023q62217m41827N61990
$$ plain form
33976 907966 539149 223588 546058 1316604 1479845 606820 -399885 -652759 -491140
33967 -491140 -642755 -942469 -765956 -165503 346425 701722 1018632 820635 -376247
33958 -376247 -1819590 -2030874 -786013 430713 418966 -135988 218168 1511307 2216687
33949 2216687 1322942 -256463 -819446 -3625 919816 876824 320200 237711 498460 170292
33939 170292 -737460 -1032215 -133823 942203 1012701 286588 -280390 -470106 -665471 -735182
33929 -735182 -187243 732183 1166891 927606 684870 755440 656617 163090 -139837 111701
33919 111701 285432 -270312 -1077643 -1186964 -589308 -62208 210028 844681 1936851
33910 1936851 2528191 1953702 960570 680244 971082 768059 -94158 -535985 26005
33901B6005O22704m02699j034089m59409L36095K66337k43440k00999L11662M79101
33891b98732J62694o7401j6644n0901k98289m27746k28243J29604L81877L78140
33881c35641J67621Q9549L98791O63387K28971n07627l55929O32251P43982p58481
33871I66874j996604j070932Q95028J377943L01312j79244N75717Q30748k65933
33862A434909j148626n48647M60418M66319l5558Q8668N34083L57700k07072l11638
33852A090556j06004l12919p24542n09398K72710O57018J62555o93658j141558
33843a305240p84545K13094J016462O87943n35061j140264k42258J070138J186442
33834A66711J86300m72212r1269N82663P18758M08578J45086M4728j34397n53554
$$ plain form
33901 26005 648709 246010 -788079 -1247488 -911393 -645056 -888496 -1089495 -777833 -298732
33891 -298732 -136038 -203439 -220083 -270984 -569273 -997019 -1225262 -1095658 -713781 -335641
33881 -335641 -168020 -78471 320320 983707 1212678 705051 349122 981373 1725355 966874
33871 966874 -1029730 -2100662 -1205634 172309 473621 294377 870094 1700842 1434909
33862 1434909 286283 -262364 198054 664373 628815 717483 1251566 1609266 1402194 1090556
33852 1090556 984552 671633 -52909 -562307 -289597 367421 529976 -163682 -1305240
33843 -1305240 -2089785 -1876691 -860229 -172286 -707347 -1847611 -2089869 -1019731 166711
33834 166711 353011 -119201 -210470 372193 1090951 1499529 1644615 1689343 1554946 1001392
33824A001392r84393q71901K5801R77862Q41279m09263j368955r12295M05558
33815a294915J222364J023178K73529m87882r19341p32177n6390M14337K73732
33806b83565k9707j5377N6887j36701k72644j14643j55545n96479n55693N08254
33796a595213J398947O94785r22487j485173n49086M99569P91383Q38208R31079
33787F02012N12518l47170n17639L72367J093723O75222j26182j99922J33374
33778B198303j43989r71756j333220p72117J52670P11682O12425J803n69914m67340
33768e81453K42981O52710J44731p20593r84407n45448k2038K46046L16506P4941
33758a176024n63325r72851k96797J168390J908484J001703o02370j226384n20805
$$ plain form
33824 1001392 16999 -854902 -829101 148761 990040 580777 -788178 -1700473 -1294915
33815 -1294915 -72551 950627 1224156 736274 -183067 -915244 -971634 -557297 -283565
33806 -283565 -313272 -328649 -271762 -408463 -681107 -795750 -951295 -1547774 -2103467 -1595213
33796 -1595213 -196266 498519 -423968 -1909141 -2458227 -1958658 -1167275 -329067 602012
33787 602012 1114530 767360 249721 622088 1715811 2391033 2264851 2064929 2198303
33778 2198303 2054314 1082558 -250662 -1022779 -870109 -158427 453998 455801 -114113 -581453
33768 -581453 -338472 314238 458969 -261624 -1246031 -1791479 -1813517 -1567471 -1250965 -1176024
33758 -1176024 -1739349 -2712200 -3008997 -1840607 67877 1069580 467210 -759174 -1279979
33749a279979L21818K97639k15613k57030L11467P36823M60959k75131q69783
33740g68830r08901k45109R21458J836572J598184J88039j237424j517669p37780
33731h71460M9779J11152l77508q22857q11553k75008N21126J121484J265959
33722h8886J072724O91610O9919o45836q84550l71034K34507R3536n83435p94978
33712a206423j83680N44986P13988M37427J10580j42160k36121k3813K40293P58
33702B55835o26680o85931K39474J143643Q93298j03671n00299j207L62049r925
33692I66586m01409j09570L23940l401q76185j275021q53165k09623K02330N48859
33682a686659Q97432Q82388M21414O2902J81062L94205K42610p7765j58755n8699
$$ plain form
33749 -1279979 -958161 -660522 -876135 -1133165 -821698 -84875 376084 100953 -768830
33740 -768830 -1677731 -1922840 -1001382 835190 2433374 2621413 1383989 -133680 -871460
33731 -871460 -821681 -710529 -1088037 -1910894 -2722447 -2997455 -2476329 -1354845 -88886
33722 -88886 983838 1675448 1745367 1099531 214981 -156053 78454 171990 -411445 -1206423
33712 -1206423 -1390103 -845117 -131129 306298 416878 274718 38597 14784 255077 255835
33702 255835 -370845 -1056776 -817302 326341 1219639 1115968 615669 614462 976511 966586
33692 966586 565177 455607 779547 776146 -100039 -1375060 -2228225 -2437848 -2235518 -1686659
33682 -1686659 -789227 93161 514575 577477 758539 1152744 1395354 1317589 1158834 1100135
33672A100135Q919J61422L96268J95603o18257j135434m76228P00296R58619J68364
33662A459707m48415l51246l54506r43167j311867p66039Q4169L73773K93189
33653a964402M68285P95619P83780M50899P7078l71530q21412p14698J16391P84685
33643c95305M73705k65776l06022L65475P47231L79199j70454l02736n8610K08987
33633F75694K29332n6483l38049j74619K45117J24460o66010j086289m51014L84425
33623a113436M16607K34278R18941J832550J317474n31135j672912j051761j3278
33614C37328j05422r22483j096673l36017N63968R83357Q17139J47204n63235
33605a74834m72154N44081J206510K53721j609578k234578p19497J321727J738345
$$ plain form
33672 1100135 1109054 1270476 1666744 1862347 1244090 108656 -367572 332724 1291343 1459707
33662 1459707 1011292 660046 305540 -637627 -1949494 -2715533 -2631364 -2257591 -1964402
33653 -1964402 -1496117 -700498 83282 534181 611259 239729 -581683 -1296381 -1179990 -395305
33643 -395305 78400 -187376 -493398 -127923 619308 998507 828053 525317 466707 675694
33633 675694 905026 848543 510494 335875 580992 705452 39442 -1046847 -1497861 -1113436
33623 -1113436 -696829 -462551 456390 2288940 3606414 3075279 1402367 350606 337328
33614 337328 231906 -690577 -1787250 -2123267 -1559299 -575942 241197 388401 -174834
33605 -174834 -646988 -102907 1103603 1357324 -252254 -2486832 -3206329 -1884602 -146257
33596a46257M71647o14231k99820N90567O79503J1876l26372l2452J30934j94692
33586B70703m12227j72614N7j92633j67903L68916O06581o1148p67706l74508
33576i02482O76350R42015O4206q73026r00173j09060P96860J067852K79400j061652
33566a9710j638267q70377J36992J14032n04002l97187M93665J037523P87414
33557h59917L34638j3380m45135o39642n6382P52027O33284k40693m79193K73496
33547g40897P77591L15837j90072J38774P12049N76499j19517o11007o74174n87234
33537d02151n14704m30334k27728K51353Q38845Q78557J36305n20526l20380P9699
33527b31064k21663m97324M31092J592947Q49691j423863k264285m56198J577476
$$ plain form
33596 -146257 325390 -288841 -588661 1906 681409 693285 366913 334461 465395 270703
33586 270703 -141524 -314138 -314081 -506714 -674617 -305701 300880 239732 -527974 -902482
33576 -902482 -226132 715883 780089 -92937 -993110 -1102170 -305310 762542 1041942 -19710
33566 -19710 -1657977 -2528354 -2391362 -2277330 -2781332 -3178519 -2684854 -1647331 -859917
33557 -859917 -525279 -538659 -983794 -1623436 -1679818 -927791 -294507 -535200 -1014393 -740897
33547 -740897 36694 352531 162459 301233 1013282 1589781 1470264 859257 185083 -402151
33537 -402151 -916855 -1347189 -1574917 -1323564 -484719 393838 530143 9617 -310763 -231064
33527 -231064 -452727 -950051 -518959 1073988 1923679 499816 -1764469 -2220667 -643191
33518f43191J432593k6696o56302k70105j2435o1092Q1717J43123k71669n17701
33508h01758k1106L84847j41916o62584J31889J470970J409179j90654j430060
33499A48807j095495r363N02115J91541l29391m51114N944O18569O45430n6174
33489A70869o83051n20335J16283M60305K78029k03826o92146o80809K47616J426021
33479h1044J412985J195j171963q64696R2030L81793K10190L89286N77117N5998
33469A002891o15785m45086J41683j3735p23221p52104P3100O77868N75387M09230
33459C30228N97737P03207L13057l80721r19847q66903o7655Q04869O44105m62054
33449F96023r66054j37590O22499N4166p08408N820J412160J385380j05847j048194
$$ plain form
33518 -643191 789402 762706 106404 -163701 -176136 -237228 -155511 -12388 -284057 -801758
33508 -801758 -822864 -438017 -579933 -1242517 -1110628 360342 1769521 1578867 148807
33499 148807 -946688 -956051 -453936 -262395 -591786 -1042900 -1036956 -418387 227043 170869
33489 170869 -512182 -1032517 -916234 -455929 -177900 -381726 -1073872 -1754681 -1507065 -81044
33479 -81044 1331941 1333136 161173 -703523 -611493 -229700 -19510 369776 946893 1002891
33469 1002891 387106 -57980 83703 69968 -653253 -1405357 -1332257 -654389 -79002 330228
33459 330228 927965 1631172 1944229 1563508 643661 -223242 -290897 513972 1158077 696023
33449 696023 -270031 -407621 214878 269044 -439364 -433544 978616 2363996 2258149 1209955
33439A209955o08592r034j29019l86567k88289j74589p4962M55818J063079P88276
33429A846076k15126p39075m51430j67947j35749J89516N49842N287j063421j050902
33419a232929K97270J320255J016648K88170j6585l36524q56336o82583L64981
33410A62367R02122J03958q91297q72509l36523j60841J3727O80837J066771L43142
33400A011754p85759j123725p26126l10347J61361R23308J237538L04473j127012
33391d34535j460384l70995Q77080J108819L83596l98059m05182M04798J088881
33382G94019O43895o13995j278410p52058J4282J36877M9912L84910O66616J84118
33372B30166o14096p02365J9054P18772P75010K32076m91410q17038l93028L42748
$$ plain form
33439 1209955 601363 592329 463310 76743 -211546 -386135 -461097 -5279 1057800 1846076
33429 1846076 1630950 891875 440445 272498 136749 326265 876107 881394 -182027 -1232929
33419 -1232929 -935659 384596 1401244 1689414 1672829 1336305 479969 -202614 162367
33410 162367 1064489 1168447 277150 -595359 -931882 -1092723 -1078996 -398159 668612 1011754
33400 1011754 225995 -897730 -1623856 -1934203 -1772842 -849534 388004 692477 -434535
33391 -434535 -1894919 -2265914 -1388834 -280015 103581 -294478 -699660 -294862 794019
33382 794019 1437914 823919 -454491 -1206549 -1192267 -1055390 -1005478 -620568 46048 230166
33372 230166 -383930 -1086295 -1067241 -348469 426541 658617 167207 -649831 -1042859 -700111
33362g00111N66201K60787J60498L22390j4042p58490o78133M60034J037514K1014
33352F77662j234486j057575n145L40861k1670j4311K96901M9730l76332J82374
33342a161991J323154J277912k76005j466867q45631P54515J620605J206154J22133
33333B553979r18473j453146j258663n80331K5194L47552O19051Q79376P95496
33324A010035K66377k79694l78508k1758L89793L86671j34087o36496m39663K98468
33314D61138O09117N7430n93964n55310j12294R8799J56876L62759M03541k1909
33304H66183l98529k46697j15945n86629r64327l31262O79205P06318j33777n10857
33294a036317j16774J13139r379M15709J396340J538705K15396j277101j555172
$$ plain form
33362 -700111 -133910 126877 287375 609765 595723 -162767 -840900 -380866 656648 677662
33352 677662 -556824 -1614399 -1619544 -1278683 -1300353 -1314664 -1017763 -968033 -1344365 -1161991
33342 -1161991 161163 1439075 1163070 -303797 -1149428 -394913 1225692 2431846 2553979
33333 2553979 1635506 182360 -1076303 -1656634 -1631440 -1283888 -664837 214539 1010035
33324 1010035 1276412 996718 618210 596452 986245 1372916 1238829 602333 162670 461138
33314 461138 1070255 1127685 533721 -21589 -133883 -35084 121792 484551 888092 866183
33304 866183 467654 220957 105012 -481617 -1445944 -1777206 -1098001 -391683 -525460 -1036317
33294 -1036317 -1153091 -1039952 -1049331 -633622 762718 2301423 2516819 1239718 -315454
33285c15454q71788j75591L76321R89229J250983O52295m23173j040889p49516
33276c07583J40751Q88914P27760m15088j420632j025954M02162J113767L38390
33267D42487p01499o92972q107K54533L119j08008N7309J54729J56859K12559
33257b28991J62439k8662R1630N93156O09633l32054j094680l49631J212408J580088
33247B215336K68883j021695q86840J7761K92945k45409p53424p31010l38440
33238a181893J99520P28119R41472O55399J78161n4524q4707k74286o71127r10762
33228d74628o88097o6161N84140P85932L36609l19931m46272J0099K67192p4400
33218h5517l00975K14632P32420K11417p52133n64395P50606J262438L1159j350173
$$ plain form
33285 -315454 -1187242 -1362833 -986512 2717 1253700 1905995 1482822 441933 -307583
33276 -307583 -166832 722082 1449842 1034754 -385878 -1411832 -1009670 104097 442487
33267 442487 -259012 -951984 -960091 -705558 -702439 -810447 -753138 -598409 -441550 -228991
33257 -228991 -66552 -95214 -3584 589572 1199205 867151 -227529 -577160 635248 2215336
33247 2215336 2484219 1462524 575684 593445 886390 640981 -112443 -843453 -1181893
33238 -1181893 -982373 -254254 687218 1342617 1520778 1466254 1381547 1107261 436134 -474628
33228 -474628 -1162725 -1228886 -644746 141186 477795 157864 -288408 -278309 -11117 -85517
33218 -85517 -386492 -171860 560560 771977 19844 -544551 206055 1468493 1499652 149479
33208A49479j167514q4791K42093j35179q253M97062J26358r77335j102550K87585
33198b173045J534678J229917R2470m62534k66419O6975L83530P08925O42169
33189A756666M0315m28103k82085m4937k61848n21211l38304j71266n16192p35603
33179a502568K9734J284354J658996P05596o84328j415675j090046j53490L46246
33170h21181k61244j136787p39577P56670J282753J3059j025228m8315J431343
33161e48507R03989j009633j468665J05190J325969P35709l07008k64354L97500
33152a29810N93342K94388j15598n93116p91937j53610P65254O36409m17524o99931
33142f12133L09947J028375M88398q4072K92953M09739q46468k032042j202124
$$ plain form
33208 149479 -1018035 -1102826 -860733 -995912 -1004165 -507103 -380745 -1358080 -2460630 -2173045
33198 -2173045 -638367 591550 684020 221486 -44933 22042 405572 1114497 1756666
33189 1756666 1796981 1368878 1086793 1041856 780008 258797 -79507 -250773 -766965 -1502568
33179 -1502568 -1472834 -188480 1470516 2176112 1491784 76109 -1013937 -1167427 -821181
33170 -821181 -1082425 -2219212 -2958789 -2202119 -919366 -906307 -1931535 -1979850 -548507
33161 -548507 355482 -654151 -2122816 -2017626 -691657 44052 -262956 -527310 -129810
33152 -129810 463532 757920 642322 49206 -742731 -896341 -131087 505322 87798 -612133
33142 -612133 -302186 726189 1214587 1130515 1423468 1833207 986739 -1045303 -2247427
33133b247427Q09794J521018M98157l61140L6490P12498O15839L3842m11991p09927
33123D97153q95268o84988j53951J11989o9686j49911K44458P20547P47280L62112
33113G29735k1803j40238o323K31201M25954N29813N24629K71684k96556q08853
33103A439243p41956k15297M4839k52017n72110m83423k52946j40410J13985N72525
33093d87567O69028J41956l59585k93017n6680o3198J05230O53108O57191m86445
33083D80021j516140q44822Q19719J199125k41214j490824r20031N81478J182810
33074g49878O04716N122J07571M93153N35722K32911k4637p3233q7288j54683
33064H89476n7321K65944L07466l53059j080798p71612M20712J030609M31622
$$ plain form
33133 -2247427 -1437633 83385 581542 220402 256892 969390 1585229 1619071 1207080 497153
33123 497153 -398115 -1083103 -1237054 -1125065 -1194751 -1344662 -1100204 -379657 367623 729735
33113 729735 707932 567694 561371 792572 1218526 1748339 2272968 2544652 2248096 1439243
33103 1439243 697287 481990 526829 274812 -297298 -780721 -1033667 -1174077 -1060092 -487567
33093 -487567 181461 323417 -36168 -329185 -385865 -449063 -343833 309275 966466 480021
33083 480021 -1036119 -1880941 -1061222 137903 -103311 -1594135 -2514166 -1932688 -749878
33074 -749878 -145162 -140040 -32469 460684 996406 1229317 1204680 1131447 1044159 889476
33064 889476 832155 1098099 1405565 1052506 -28292 -799904 -379192 651417 1083039
33055A083039j88848J42386M83432l38155j470120j273314o4552M41088P7591
33046a107453L72049J604714K012326O56896r14559r91038p3279L26100l7643
33037A848113m02930n34354o16868l54258M70717J040348M35209p45162r70441
33028A70374K1204P79471J76904j050694j335870l01744Q72800R95062K34122
33019E61629l22223j86968O0175p4205j60335K41416N42636M2245n89644j11958
33009B768J123405J375928J74414q55926n30310J07949l13296j155994q76340
33000i47402M24138J216022Q57127J23775l70303p83931j041023o28359K94165
32991h55791P54370L45369k01682j87019J77812M20612N07227M65019P4029n67200
$$ plain form
33055 1083039 894191 1036577 1520009 1181854 -288266 -1561580 -1626132 -1185044 -1107453
33046 -1107453 -735404 869310 2881636 3538532 2623973 1632935 1559656 1885756 1848113
33037 1848113 1445183 910829 293961 -60297 410420 1450768 1885977 1140815 170374
33028 170374 191578 971049 1147953 97259 -1238611 -1540355 -667555 327507 561629
33019 561629 239406 52438 112613 38408 -121927 119489 662125 704370 114726 2768
33009 2768 1126173 2502101 2676515 1820589 1290279 1398228 1084932 -71062 -947402
33000 -947402 -523264 692758 1549885 1673660 1303357 519426 -521597 -1149956 -855791
32991 -855791 -101421 243948 42266 -144753 33059 453671 960898 1425917 1499946 932746
32981I32746q21093l83358J62856J66525k02282l87441l26435l36396m45012l86343
32971b026233q5096K74273N00035M25421l0827n37129m71836K16556O95491L36823
32961g02522l05191l21924J14415J03882l55114k60716O46491J211442N84921
32952G15684l56222k64590O41716R04706o5125j250892j433956m92328Q00472
32943h00535J529208J096382l03055j482226j272559L1063R31397O27184j72752
32934A84107n94431p29127q49183n44852M05829J124098P36383j49087k56830
32925f73093M30901P89037L82333r5278k08617l33339o17526n87860j50934Q8776
32915i75600p2504m2278L99165N56225L5809m55233k33727K96277M38254K47256
$$ plain form
32981 932746 111653 -271705 -108849 57676 -144606 -532047 -858482 -1194878 -1639890 -2026233
32971 -2026233 -2111329 -1837056 -1337021 -911600 -942427 -1479556 -1951392 -1734836 -1039345 -702522
32961 -702522 -1007713 -1329637 -1215222 -1111340 -1466454 -1727170 -1080679 130763 715684
32952 715684 359462 94872 736588 1641294 1576169 325277 -1108679 -1601007 -800535
32943 -800535 728673 1825055 1522000 39774 -1232785 -1201722 -270325 356859 184107
32934 184107 -410324 -1139451 -1988634 -2533486 -2127657 -1003559 -267176 -416263 -673093
32925 -673093 -242192 546845 929178 833900 625283 291944 -325582 -913442 -1064376 -975600
32915 -975600 -1048104 -1090382 -691217 -134992 -99183 -554416 -788143 -491866 -53612 193644
32905A93644K1170l84652q33045m05649J164893K314171J388567q28447j906046
32896G24606j007867K43681L79169n0660P9574N39657L88246l14207o47983l08893
32886B5323R6813J11096p0999j64158j60442n3069K24219M70292L37499r7537
32876G19037l62431l21398l65214o58687p56537l46758J45891K44226K65695P63122
$$ plain form
32905 193644 214814 -169838 -1002883 -1408532 -243639 2070532 3459099 2630652 724606
32896 724606 -283261 -39580 339589 288929 368503 908160 1296406 982199 334216 25323
32886 25323 122136 233232 162233 -1925 -162367 -215436 8783 479075 816574 719037
32876 719037 356606 35208 -330006 -988693 -1745230 -2091988 -1946097 -1701871 -1436176 -673054
$$ [...]
##END NTUPLES=NMR SPECTRUM
##END=
