##TITLE=31Pdec_LR-745-M2_PE-MT
 CDCl3, 24 sc
 15.4.2022
##JCAMPDX= 6.0         $$ Bruker NMR JCAMP-DX V2.0
##DATA TYPE= NMR SPECTRUM
##DATA CLASS= NTUPLES
##ORIGIN= UXNMR, Bruker Analytische Messtechnik GmbH
##OWNER= root
$$ XWIN-NMR		Version 3.5
$$ Fri Apr 15 13:47:25 2022 Russian Standard Time (UT+4h)  she@DPX200
##.OBSERVE FREQUENCY= 81.013821
##.OBSERVE NUCLEUS= ^31P
##.ACQUISITION MODE= SIMULTANEOUS
##.ACQUISITION SCHEME= undefined
##.AVERAGES= 24
##.DIGITISER RES= 16
##SPECTROMETER/DATA SYSTEM= spect
##.PULSE SEQUENCE= zgpg30
##.SOLVENT NAME= CDCl3
##.SHIFT REFERENCE= (INTERNAL, CDCl3, 0, 248.564)
##AUDIT TRAIL= $$ (NUMBER, WHEN, WHO, WHERE, WHAT)
$$ ##TITLE= Audit trail, XWIN-NMR		Version 3.5
$$ ##JCAMPDX= 5.01
$$ ##ORIGIN= Bruker BioSpin GmbH
$$ ##OWNER= she
$$ F:/spectra/data/she/nmr/P31/1/pdata/1/auditp.txt
$$ ##AUDIT TRAIL=  $$ (NUMBER, WHEN, WHO, WHERE, WHAT)
(   1,<2022-04-15 13:46:12.81 +0400>,<she>,<DPX200>,
      <created by zg, POWCHK disabled, PULCHK disabled
       configuration hash MD5:
       00 E9 B6 7A A2 85 ED C7 34 08 36 98 17 FE 4E 26
       data hash MD5: 32K
       AC DA 0A D9 D1 25 38 70 8E D6 60 E8 DF 3C 8F F2>)
(   2,<2022-04-15 13:46:26.95 +0400>,<she>,<DPX200>,
      <Start of raw data processing
       efp BC_mod = 2 LB = 1 FT_mod = 6 PKNL = 1 PHC0 = -9795.444 PHC1 = 644.4757 SI = 64K 
       data hash MD5: 64K
       DE 66 94 BE 31 00 69 C4 F1 85 5E 35 D9 64 B9 03>)
(   3,<2022-04-15 13:46:47.95 +0400>,<she>,<DPX200>,
      <pk PHC0 = 13.4423 PHC1 = 0 
       data hash MD5: 64K
       CE CE 58 C0 2B 1A DC CA 81 5F CB 5B E4 F2 EB F3>)
$$ ##END=
$$ 
$$ hash MD5
$$ DE C4 83 56 62 02 8E 0B 2D 1F 78 2F 43 55 82 4E
##$RELAX= 
##$RELAX= 
##$RELAX= 
##$RELAX= 
##$RELAX= 
##$RELAX= 
##$RELAX= 
##$RELAX= 
$$ Bruker specific parameters
$$ --------------------------
##$DU= <F:/spectra>
##$EXPNO= 1
##$NAME= <P31>
##$PROCNO= 1
##$TYPE= <nmr>
##$USER= <she>
##$AMP= (0..31)
100 100 100 100 100 100 100 100 100 100 100 100 100 100 100 100 100 100 
100 100 100 100 100 100 100 100 100 100 100 100 100 100 
##$AQSEQ= 0
##$AQ_mod= 1
##$AUNM= <au_zg>
##$AUTOPOS= <>
##$BF1= 81.014009
##$BF2= 200.13
##$BF3= 200.13
##$BF4= 200.13
##$BF5= 200.13
##$BF6= 200.13
##$BF7= 200.13
##$BF8= 200.13
##$BYTORDA= 1
##$CFDGTYP= 0
##$CFRGTYP= 5
##$CHEMSTR= <none>
##$CNST= (0..31)
1 1 145 1 1 1 1 1 1 1 1 1 1 1 1 1 1 1 1 1 1 1 1 1 1 1 1 1 1 1 1 1 
##$CPDPRG= <waltz16>
##$CPDPRG1= <>
##$CPDPRG2= <waltz16>
##$CPDPRG3= <>
##$CPDPRG4= <mlev>
##$CPDPRG5= <mlev>
##$CPDPRG6= <mlev>
##$CPDPRG7= <mlev>
##$CPDPRG8= <mlev>
##$CPDPRGB= <>
##$CPDPRGT= <>
##$D= (0..31)
0 1 0 0 0 0 0 0 0 0 0 0.03 2e-05 3e-06 0 0 0 0 0 0 0 0 0 0 0 0 0 0 0 0 
0 0 
##$DATE= 1650015972
##$DBL= (0..7)
120 120 120 11 120 120 24 19 
##$DBP= (0..7)
150 150 150 150 150 150 150 150 
##$DBP07= 0
##$DBPNAM0= <>
##$DBPNAM1= <>
##$DBPNAM2= <>
##$DBPNAM3= <>
##$DBPNAM4= <>
##$DBPNAM5= <>
##$DBPNAM6= <>
##$DBPNAM7= <>
##$DBPOAL= (0..7)
0.5 0.5 0.5 0.5 0.5 0.5 0.5 0.5 
##$DBPOFFS= (0..7)
$$ [...]
##$SUBNAM2= <"">
##$SUBNAM3= <"">
##$SUBNAM4= <"">
##$SUBNAM5= <"">
##$SUBNAM6= <"">
##$SUBNAM7= <"">
##$SUBNAM8= <"">
##$SUBNAM9= <"">
##$SW= 501.771253377433
##$SWIBOX= (0..15)
0 1 3 0 0 0 0 0 0 0 0 0 0 0 0 0 
##$SW_h= 40650.406504065
##$TD= 32768
##$TD0= 1
##$TE= 0
##$TE2= 300
##$TE3= 300
##$TEG= 300
##$TL= (0..7)
0 120 53 12 22 120 120 120 
##$TP= (0..7)
150 150 150 150 150 150 150 150 
##$TP07= 0
##$TPNAME0= <>
##$TPNAME1= <>
##$TPNAME2= <>
##$TPNAME3= <>
##$TPNAME4= <>
##$TPNAME5= <>
##$TPNAME6= <>
##$TPNAME7= <>
##$TPOAL= (0..7)
0.5 0.5 0.5 0.5 0.5 0.5 0.5 0.5 
##$TPOFFS= (0..7)
0 0 0 0 0 0 0 0 
##$TUNHIN= 0
##$TUNHOUT= 0
##$TUNXOUT= 0
##$USERA1= <user>
##$USERA2= <user>
##$USERA3= <user>
##$USERA4= <user>
##$USERA5= <user>
##$V9= 5
##$VALIST= <valist>
##$VCLIST= <CCCCCCCCCCCCCCC>
##$VD= 0
##$VDLIST= <DDDDDDDDDDDDDDD>
##$VPLIST= <PPPPPPPPPPPPPPP>
##$VTLIST= <TTTTTTTTTTTTTTT>
##$WBST= 1024
##$WBSW= 4
##$XGAIN= (0..3)
0 0 0 0 
##$XL= 0
##$YL= 0
##$YMAX_a= 1384
##$YMIN_a= -1075
##$ZGOPTNS= <>
##$ZL1= 120
##$ZL2= 120
##$ZL3= 120
##$ZL4= 120
##$ABSF1= 0
##$ABSF2= 0
##$ABSG= 0
##$ABSL= 0
##$ALPHA= 0
##$AQORDER= 0
##$ASSFAC= 0
##$ASSFACI= 0
##$ASSFACX= 0
##$ASSWID= 0
##$AUNMP= <proc_1d>
##$AZFE= 0.1
##$AZFW= 0.5
##$BCFW= 0
##$BC_mod= 2
##$BYTORDP= 0
##$COROFFS= 0
##$CY= -3
##$DATMOD= 1
##$DC= 0
##$DFILT= <>
##$DTYPP= 0
##$F1P= 0
##$F2P= 0
##$FCOR= 1
##$FTSIZE= 65536
##$FT_mod= 6
##$GAMMA= 0
##$GB= 0
##$INTBC= 1
##$INTSCL= 5.30512e-09
##$ISEN= 30
##$LB= 1
##$LEV0= 0
##$LPBIN= 0
##$MAXI= 10000
##$MC2= 0
##$MEAN= 0
##$ME_mod= 0
##$MI= 50
##$NCOEF= 0
##$NC_proc= -10
##$NLEV= 6
##$NOISF1= 182.463
##$NOISF2= 159.3651
##$NSP= 0
##$NTH_PI= 0
##$NZP= 0
##$OFFSET= 248.5645
##$PC= 4
##$PHC0= -9782.002
##$PHC1= 644.4757
##$PH_mod= 1
##$PKNL= yes
##$PPARMOD= 0
##$PSCAL= 0
##$PSIGN= 0
##$REVERSE= no
##$SF= 81.014009
##$SI= 65536
##$SIGF1= 159.3651
##$SIGF2= -187.1042
##$SINO= 113.3802
##$SIOLD= 16384
##$SREGLST= <1H.CDCl3>
##$SSB= 0
##$STSI= 65536
##$STSR= 0
##$SW_p= 40650.406504065
##$SYMM= 0
##$S_DEV= 0
##$TDeff= 32768
##$TDoff= 0
##$TI= <>
##$TILT= no
##$TM1= 0
##$TM2= 0
##$TOPLEV= 0
##$USERP1= <user>
##$USERP2= <user>
##$USERP3= <user>
##$USERP4= <user>
##$USERP5= <user>
##$WDW= 1
##$XDIM= 65536
##$YMAX_p= 375444135
##$YMIN_p= -503207351
$$ End of Bruker specific parameters
$$ ---------------------------------
##NTUPLES= NMR SPECTRUM
##VAR_NAME=  FREQUENCY,     SPECTRUM/REAL,   SPECTRUM/IMAG
##SYMBOL=    X,             R,               I
##VAR_TYPE=  INDEPENDENT,   DEPENDENT,       DEPENDENT
##VAR_FORM=  AFFN,          ASDF,            ASDF
##VAR_DIM=   65536,         65536,           65536
##UNITS=     HZ,            ARBITRARY UNITS, ARBITRARY UNITS
##FACTOR=    0.620285442955139, 1,           1
##FIRST=     20137.2065510759, 0,            0
##LAST=      -20513.1999529892, 0,           0
##MIN=       -20513.1999529892, -503207351,  0
##MAX=       20137.2065510759, 375444135,    0
$$ Real data points
##PAGE= N=1
##DATA TABLE= (X++(R..R)), XYDATA
$$ [...]
##PAGE= N=2
##DATA TABLE= (X++(I..I)), XYDATA
12830e341299j0358171l058485N695608J1013972J0200532M937851p75149l856961
12822H457898l355116K9076L753713L482943k677016q652186m947112O725659
12814B817859J0442952k829154j7403471j1409483R125923J4835725l617126j8839679
12806a6876454o906481J5788990J7727834R9711q432531J086349O880024l284269
12798F083173j0679193J366891J6958882J1017053j1997644k5050096j6272945
12791b8573879J092525J2646326J6551735J3277775J206689j2548260j3363657
12784i710746J011283J4252474J2797605K323667m700388o225410n425114J96876
12776D520247J0644948J3270156k142110k2462513k3384017k559796J6459971
$$ y = [-5341299, -15699470, -18757955, -13062347, -2048375, 8152157, 13090008, 12314859, 8457898, 5102782, 5131858, 8885571, 12368514, 9691498, 1039312, -3907800, 2817859, 13260811, 10431657, -6971814, -18381297, -9255374, 5580351, 1963225, -16876454, -23782935, -7993945, 9733889, 9833600, 1401069, 2487418, 9367442, 6083173, -4596020, -3229129, 13729753, 24746806, 12749162, -12300934, -28573879, -27481354, -14835028, 1716707, 14994482, 16201171, 3652911, -9710746, -8699463, 5553011, 18350616, 20674283, 15973895, 9748485, 4323371, 4520247, 15165195, 28435351, 26293241, 3830728, -19553289, -22113085, -5653114]
12769e653114J6164030M308875m213572q085570j2263151j3716341p242916L284074
12761b7417685J0618781J3858151J3535595O385072m635614n814475Q045439J9547550
12753C4122814J0506184j0011623j8277120j0620505m094607n358679l195184
12746f928720N379374O186852o431283j6732595j2368960l581530l693123o424126
12738d4594111J071652J4696465J9916876J3789509N272160l30047l406559j854260
12730D561685N806292J3012476J2745504Q841893Q794955R604631K540515j1176822
12722E4731129k0801401k0118423j1699214m75660P722467N994367m728985j1502784
12714h78504n474245L283999L33922r147681p487022P002083J6820975J1827539
$$ y = [-5653114, 10510916, 14819791, 10606219, 2520649, -9742502, -23458843, -30701759, -27417685, -16798904, -2940753, 10594842, 16979914, 12344300, 6529825, 14575264, 34122814, 44628998, 34617375, 16340255, 5719750, 1625143, -3733536, -6928720, -1549346, 4637506, -1793777, -18526372, -30895332, -34476862, -38169985, -44594111, -43522459, -28825994, -8909118, 4880391, 10152551, 9822504, 6415945, 4561685, 10367977, 23380453, 36125957, 44967850, 53762805, 63367436, 65907951, 54731129, 33929728, 13811305, 2112091, 1636431, 9358898, 15353265, 10624280, -878504, -6352749, -3068750, -2734828, -11882509, -19369531, -12367448, 4453527, 16281066]
12706A6281066J469823l623124n970722j0354941j2567829p803248k27447L668395
12698a9128027L804565L210245L130306M819324Q239019P294327l093792j3612684
12690e336717q432935R031705J4453812m031398k5952130k5141101l855540J4731672
12682c4532632J7974022J1041498P55847r151637j0847027N03207J3184285J0471213
12674f01224l402964p125471M842692J2881440L154067j1056443j1512724k477054
12666a5297681N79820k129286J330927J0066560J0266197o56060q532932m887504
12658i259959J297386P36360j357052L234945J0614924J1836920P115185K321356
12650B6540065k471833r817822j4905276j0886589k314077j285805r452970j4689294
$$ y = [16281066, 17750889, 14127765, 8157043, -2197898, -14765727, -22568975, -22796422, -19128027, -15323462, -12113217, -8982911, -4163587, 4075432, 11369759, 8275967, -5336717, -13769652, -4737947, 9715865, 5684467, -20267663, -45408764, -49264304, -34532632, -16558610, -5517112, -4761265, -13912902, -24759929, -24256722, -11072437, -601224, -4004188, -11129659, -6286967, 6594473, 9748540, -1307903, -12820627, -15297681, -14717861, -16847147, -15516220, -5449660, 4816537, 4160477, -4372455, -9259959, -7962573, -7226213, -8583265, -5348320, 5266604, 17103524, 24218709, 26540065, 24068232, 14250410, -654866, -11541455, -13855532, -15141337, -24594307, -39283601]
12642c9283601q195606M501712J3094016J4637789J1841691O661978J037737j676036
12634B619680j405877k960087q099149j0709759n607097K021222L080802j890072
12626b2950337l494894K144307P705062O644277M237243R517871J8636728J5571017
12618C8011274o277943k9947163l1508005r492701J2221801J3761052J673483
12611a1558202m652737j06873L972697L43056m370868j618086P147235J3397540
12603B553762J0388055j703873j4168533j4824657j637387J0918493P827613o218322
12595f864849j3016554n746384M991126J0237757J3207493J6940773J5510898
12588C5260260M905340p805338j3401250j0953933m895996L12432J9574o571521
$$ y = [-39283601, -47479207, -42977495, -29883479, -15245690, -3403999, 3257979, 4295716, 2619680, 1213803, -1746284, -9845433, -20555192, -26162289, -24141067, -21060265, -22950337, -26445231, -24300924, -16595862, -9951585, -5714342, 3803529, 22440257, 38011274, 31733331, 1786168, -29721837, -39214538, -26992737, -13231685, -11558202, -16210939, -16317812, -12345115, -12002059, -16372927, -17991013, -10843778, 2553762, 12941817, 11237944, -2930589, -17755246, -19392633, -8474140, -646527, -6864849, -19881403, -25627787, -20636661, -10398904, 2808589, 19749362, 35260260, 40165600, 32360262, 18959012, 8005079, 3109083, 3421515, 3441089, -3130432]
12580c130432j0686447l803405O243534L846902q586501j2164857k196952M918642
12572b5559516K385186M868181J6998539J7671781l586370k0474869p950163J5063441
12564e83790J4099773n787689j0833391M635229J2233275K4420r995308k744726
12556A047793O118809M83854j0573133j2702450q582724n133900J663276J4001758
12548a3676717K1024896J4836471M072101n27372j003026k232920r58803M304349
12540B5838979N429706k322098j0978016j2478494q691163j986106R120203J7510297
12532B1443308R228087j1213943j6970234M059201K6556750K1392875l815751
12525E0680293j9432799j6123726q396227m870496o22091M166532J769408n974049
$$ y = [-3130432, -13816879, -17620284, -11376750, -7529848, -16116349, -28281206, -30478158, -25559516, -23174330, -18306149, -1307610, 16364171, 12777801, -7697068, -15647231, -583790, 13515983, 7728294, -3105097, 1530132, 13763407, 13787827, 3792519, 1047793, 7166602, 7650456, -2922677, -15625127, -24207851, -29341751, -27678475, -13676717, 7348179, 22184650, 26256751, 25729379, 24726353, 22493433, 21534630, 25838979, 31268685, 28946587, 17968571, 5490077, -3201086, -5187192, 3933011, 21443308, 30671395, 19457452, 2487218, 6546419, 33103169, 54496044, 50680293, 31247494, 15123768, 6727541, 1857045, 1234954, 5401486, 7170894, 1196845]
12517A196845p830714j879908K952668M052431O404915O932882l004094j6999703
12509h174678j5783792L280335J7422958R323894q773324j4155021m508048M689835
12501a6677841N468596M231578N643749M471974k537622p155684l65195J1426399
12493D505954J0393634r361937k9442677k6471405j654485J9294116J8011233
12486a4725567M271743j612732L269531N465551k507604j3978195j9609010j5238712
12478e4664995j17539K0501776L1970360K2870452K502675p407596j338645L457149
12470A7773637n840474j8317912j6907797l319597P354020Q901871P201579O000231
12462B845558L641065K544149Q042711J5698063J2385354m730451k0462520k0053274
$$ y = [1196845, -6633869, -8513777, -5561109, -1508678, 4896237, 11829119, 8825025, -8174678, -23958470, -20678135, -3255177, 6068717, -2704607, -16859628, -21367676, -16677841, -11209245, -6977667, -1333918, 3138056, 600434, -6555250, -6920445, 4505954, 14899588, 5537651, -23905026, -50376431, -52030916, -32736800, -14725567, -10453824, -12066556, -8797025, -3331474, -5839078, -19817273, -39426283, -54664995, -54782534, -34280758, -2310398, 20560054, 23062729, 15655133, 14316488, 17773637, 11933163, -6384749, -23292546, -26612143, -19258123, -10356252, -3154673, 2845558, 6486623, 9030772, 17073483, 32771546, 45156900, 40426449, 19963929, -89345]
12454h9345p905092K69976j287105m189911n24981P598097J3549634J3435428
12446B0856701O258151o099434j6352327j5720231m373780O841560Q718226L228975
12438C357841k064629l114504Q80542R261942J5257012P874025j1831031k3741765
12430d120567j1230340J3722122K3242498J0067619n221648n474217K017382K535380
12422B5538229l969878q608246r263882q580499m896850L517267J1633030J4292118
12414A9661289J2914352Q054369m729860k1806642k6397894j1079220N708261
12407a7675345M100150n484995J740913K2529825K7216649O892796j0009898j119484
12399B8190611J4844979P364157j8440300k8972012j0394198J4187119J8161355
$$ y = [-89345, -7994437, -7724461, -9011566, -13201477, -13726458, -6128361, 7421273, 20856701, 27114852, 21015418, 4663091, -11057140, -15430920, -8589360, 128866, 3357841, 1293212, -1821292, -940750, 8321192, 23578204, 31452229, 19621198, -4120567, -15350907, -1628785, 21613713, 31681332, 26459684, 20985467, 23002849, 25538229, 21568351, 12960105, 3696223, -4884276, -9781126, -6263859, 5369171, 19661289, 32575641, 40630010, 35900150, 14093508, -12304386, -23383606, -17675345, -13575195, -19060190, -17319277, 5210548, 32427197, 39319993, 29310095, 28190611, 43035590, 50399747, 31959447, 2987435, -7406763, 6780356, 24941711]
12392B4941711L562557p768206l666990O874607P675584n417476j9941951k0698223
12384a4438387p325649N583822P307762L827378O653660J4631250J5696050M356081
12376C6291967j1450403k0766843j9561308j0656649r07098K181656j557364j715644
12368b8141686R104571K0599245J6086582j686115j1629339m784619L595553M86137
12360C630329m590134N15901P209269K205747o265459j807436R540734Q171369
12352A8610320m508875q653687k073952k790159j1750844o954872J4159108K1387767
12344A7424806L70633j8328952o035747J7007474J5371931m375457r943483J3166
12336A1504371n27679j3450794j4416721j367814P65368j0373666o290962J8003751
$$ y = [24941711, 28504268, 20736062, 17069072, 23943679, 31619263, 26201787, 6259836, -14438387, -21764036, -16180214, -8872452, -5045074, 1608586, 16239836, 31935886, 36291967, 24841564, 4074721, -15486587, -26143236, -27050334, -24868678, -26426042, -28141686, -19037115, 1562130, 17648712, 15962597, 4333258, -451361, 3144192, 3630329, -959805, -443904, 6765365, 8971112, 2705653, 898217, 10438951, 18610320, 14101445, 5447758, 3373806, 583647, -11167197, -18122069, -3962961, 17424806, 17795439, -533513, -6569260, 10438214, 25810145, 21434688, 11491205, 11504371, 10976692, -2474102, -16890823, -18258637, -17493269, -27866935, -34157897, -16154146]
12328a6154146K6665602J764773k2189286j1771905J2980991J4581654k524611
12321C353072p677184J976876M192048m352717o560348j265093l726568j1469755
12313b5529669n063078J4340422K1434638P491342n517616j767864M475389l964343
12305E899221j7787982j6207904K168154J8551869J7432642J797878j0887370
12298I66508n287279J3911722K3223870Q294736j5121147k1925621j2537088o903817
12290a5378116q611627j620144J5424188K0918697O209205p293884k118637Q047304
12282A5576986M029522p028239q361507m927604j1491946k0725360j1968361J2044813
12274c2851696K4905820J5433957K182263K028465O192309j11828j1155718j0563794
$$ y = [-16154146, 10511456, 12276229, -9913057, -21684962, -8703971, 5877683, 3353072, -4324112, -2347236, 1844812, -2507905, -9068253, -10333346, -14059914, -25529669, -30592747, -16252325, 5182313, 12673655, 7156039, 5388175, 9863564, 5899221, -11888761, -28096665, -25928511, -7376642, 10056000, 11853878, 966508, -4320771, 9590951, 32814821, 41109557, 25988410, 4062789, -8474299, -15378116, -23989743, -25609887, -10185699, 10732998, 16942203, 9648319, 7529682, 15576986, 19606508, 12578269, 4216762, -710842, -12202788, -32928148, -44896509, -32851696, -7945876, 7488081, 9670344, 11698809, 17891118, 17779290, 6623572, -3940222]
12266c940222J622211R002304L922484k405413J621753J0658452J0990658P3005
12258C1545232j1339757j4355432j0532682m946655L27096K755289j554337r428700
12250a7529946r795451M86221Q061206J482636r039880n166341J0698011J7877150
12242b926394Q776771j097243Q63464O536842M256791j963577k590839L15407
12234A2171222l96591k373822Q19245O061297N352569k60906l259588k771709
12226A5341717l923707o564132n551117j207266M68590j991187l638940j775712
12218h841754O72133P13232j470837m065487l522691M216209J6124699J9434949
12210B3260453N545264j5108793k1853471q330877J0263183J6349180Q560290
$$ y = [-3940222, -2318011, 6684293, 10606777, 8201364, 9823117, 20481569, 31472227, 31545232, 20205475, 5850043, -4682639, -9629294, -9302198, -6546909, -8101246, -17529946, -27325397, -26839176, -18777970, -17295334, -26335214, -31501555, -20803544, -2926394, 5850377, 4753134, 5616598, 12153440, 16410231, 14446654, 11855815, 12171222, 11774631, 9400809, 10220054, 16281351, 21633920, 21373014, 18113426, 15341717, 11418010, 4853878, -697239, -1904505, -1435915, -3427102, -7066042, -8841754, -8169621, -7456389, -8927226, -12992713, -16515404, -12299195, 3825504, 23260453, 28805717, 13696924, -8156547, -16487424, -6224241, 10124939, 18685229]
12203A8685229j858559o252892n070401l153616l841542p317598j1680199j4212553
12195c4702131j2018848l522295Q064149J4058089Q298297l139910o262531L557752
12187b5667428J4393356J2701869L79445r130931p842859J75186O586412P006574
12179a398376K903263j69572J939734N606146L224812l566482k774361Q842342
12171A4607506J5006990Q59421k1850595k6776185q649772J0150868J1821299
12164d830468N068432O274004J2928344J0088958l759602j2863147p035199L713320
12156I584642L418432p525378j2779551k544187J2250276J3659676O8003j2829826
12148C302087j3456946o322867k6097M776576Q310013M349057q121627j5151077
$$ y = [18685229, 16826670, 10573778, 5503377, 2349761, -1491781, -8809379, -20489578, -34702131, -46720979, -50243274, -42179125, -28121036, -19822739, -22962649, -29225180, -25667428, -11274072, 1427797, 1807242, -7323689, -15166548, -14991362, -8404950, -1398376, 1504887, 1335315, 3275049, 8881195, 12106007, 8539525, 5765164, 14607506, 29614496, 30473917, 8623322, -18152863, -26802635, -16651767, -4830468, 237964, 6511968, 19440312, 29529270, 25769668, 12906521, 5871322, 9584642, 13003074, 5477696, -7301855, -9846042, 2404234, 16063910, 16131913, 3302087, -10154859, -16477726, -16503823, -11727247, -3417234, 931823, -7189804, -22340881]
12140b2340881m777067J2404818J6229219O550627J231015N834444O406538l949207
12132A7589506j2709810j0668334p343064j1401954j3146893k185942J1475856
12125b8390635J1712052J474837m081612k022327j071651j921497L300311J3686944
12117g313578J8601948J4096275N698895m219167j6543292k3615603j4698646
12110b7993168M384415J3897855P016293j755668n59311L455132R4623o257416
12102g717245o075622m25066L881893N844814O886951M437666j149561j673831
12094D009999O376817J2420038O457529m063507m781378L764887Q110256K134279
12086C4428920p211160j2104361j0263519j547323J0375091J5198192O442791
$$ y = [-22340881, -27117948, -14713130, 1516089, 8066716, 9297731, 15132175, 21538713, 17589506, 4879696, -5788638, -13131702, -24533656, -37680549, -39866491, -28390635, -16678583, -15203746, -19285358, -21307685, -22379336, -24300833, -21000522, -7313578, 11288370, 25384645, 31083540, 26864373, 10321081, -13294522, -27993168, -23608753, -9710898, -2694605, -4450273, -5009584, -1554452, -1459829, -7717245, -13792867, -14217933, -10336040, -4491226, 2395725, 6833391, 5683830, 4009999, 10386816, 22806854, 29264383, 25200876, 20419498, 24184385, 32294641, 34428920, 27217760, 15113399, 4849880, 3302557, 13677648, 28875840, 35318631]
12079C5318631p315746j3164631j2481716j5138319j8457585r851812Q764226
12072c2326952J8320116R927272k383219m223424p5256N01127J090900Q808201
12064c61235J7208144J4246363J563173p521211n972601J561650P878996Q305421
12056C6908700N04495j1535797j7201320j1838719m826034n329324o197100M382509
12048a5132590J9382130J8272107k576120k1272059j8737202k473338P253215
12041a5283857N006667K069205N684413R091684L984870o025507r877936l513804
12033h864265N420553P370199J274715o670042j0999958r923294l405267N425776
12025b0371583Q481022N32227j0321125r185051N381999J7197356J4083568L928737
$$ y = [35318631, 28002885, 14838254, 2356538, -12781781, -31239366, -41091178, -32326952, -14006836, -4079564, -6462783, -10686207, -10761463, -10260336, -9169436, -361235, 16846909, 31093272, 32656445, 25135234, 19162633, 20724283, 28603279, 36908700, 37413195, 25877398, 8676078, -3162641, -7988675, -13317999, -19515099, -15132590, 4249540, 22521647, 19945527, -1326532, -20063734, -22537072, -15283857, -10277190, -8207985, -2523572, 6568112, 10552982, 4527475, -5350461, -8864265, -3443712, 3926487, 5201202, -1468840, -12468798, -22392092, -25797359, -20371583, -11890561, -11358334, -21679459, -30864510, -25482511, -8285155, 5798413, 9727150]
12017I727150O56059L257644J083411n786163n928638M236103J3354367J0236974
12009C0836907k590147j3540091j4538202p058077R16246L872643N754434J3350784
12001A7004497K1231251J3915966r652488k6369034j7853917J324982L508045
11994C109302j0962051j6122159k481475R435238L800193o938856n631460K934077
11986b2857191M984984J628662K497958O905228P719740N129425J681807p165354
11978E25259k1800650k7241192j1984263R144692J2317469Q25187J26673J6231424
11970b1855401K4986414J1165140o251726m002929R430271R498498m524468j0175787
11962H270012P86218J0031455K669832j1311185j5997473j2846905j0575688n322538
$$ y = [9727150, 10383209, 13640853, 14724264, 8938101, 3009463, 7245566, 20599933, 30836907, 28246760, 14706669, 168467, -6889610, -5973364, -2100721, 3653713, 17004497, 38235748, 52151714, 42499226, 16130192, -1723725, -398743, 3109302, -7852749, -23974908, -26456383, -17021145, -13220952, -20159808, -25791268, -22857191, -17872207, -16243545, -13745587, -6840359, 879381, 6008806, 7690613, 525259, -21275391, -48516583, -60500846, -51356154, -39038685, -38213498, -38086825, -21855401, 3131013, 14296153, 8044427, 4041498, 13471769, 22970267, 18445799, 8270012, 9056230, 19087685, 21757517, 10446332, -5551141, -18398046, -28973734, -34296272]
11954c4296272R931566K3966468J7454394o151613k1232622j5512077m072729
11947b9912885k70221M773954J8646233K4897153P502555j6586339j7743428Q69066
11939g823912Q655285k498973o457579J0847020K5142438J2316157j1914724j5819691
11931A2446021P59760R644224j718794j5074122j1451783L993278J3661999J0602447
11923B2863030K313774j628773M8940N48281n643956j3684368j2577461n84250
11915h344783R654627O437634n980968j3832531j0806207k283375L795419M442534
11907a6917650K395674K885338O726702O476463l562807j4142563j0179920M930486
11899b1388277J0429792k3848o687395L965029J5244564Q114184m652382R99145
$$ y = [-34296272, -24364706, -398238, 17056156, 10904543, -10328079, -25840156, -29912885, -30183106, -25409152, -6762919, 18134234, 25636789, 9050450, -8692978, -7823912, 831373, -1667600, -8125179, 2721841, 27864279, 40180436, 28265712, 12446021, 13205781, 22850005, 21131211, 6057089, -5394694, -1401416, 12260583, 22863030, 25176804, 23548031, 23596971, 24145252, 18501296, 4816928, -7760533, -8344783, 1309844, 7747478, 1766510, -12066021, -22872228, -25155603, -21360184, -16917650, -14521976, -11636638, -4909936, 1566527, -1996280, -16138843, -26318763, -21388277, -10958485, -10982333, -17669728, -13704699, 1539865, 9654049, 5001667, 6000812]
11891F000812J7513479J5215867q494349k2234611q568822J0761653R687332o342487
11883A3538874j5082836r763992p9593O179626P477696L689203j391079r80477
11875C587422K967980l6594r249046q157338Q401119J9170956O525939j2868844
11867A0341594j1107640O936150J0883735o322946j7628715o783738N762293j139287
11859i058554j2137179l11485K5556832K9806314L408355k1672706j9522557n101677
11851i032657n313420j6030904j2862159N922643J5617750M844560p095297j793941
11843b5743425J0774311J1085823N38463m828196r99998K360921J643234K457224
11835b711643M828718K512162k029513J407675J1372360J2219359k468445j7642198
$$ y = [6000812, 23514291, 38730158, 30235809, 8001198, -567624, 10194029, 19881361, 13538874, -1543962, -11307954, -11387547, -5207921, 2269775, 5958978, 4567899, 3587422, 6555402, 6518808, -2730238, -10887576, -2486457, 16684499, 23210438, 10341594, -766046, 6170104, 17053839, 10730893, -6897822, -13681560, -7919267, -9058554, -21195733, -21507218, 4049614, 33855928, 37264283, 15591577, -3930980, -9032657, -14346077, -30376981, -43239140, -37316497, -21698747, -16854187, -23949484, -25743425, -14969114, -3883291, -3344828, -8173024, -9173022, -6812101, -5168867, -2711643, 2117075, 4629237, 2599724, 4007399, 15379759, 27599118, 25130673, 7488475]
11827G488475j6646452k457911R894915J2726780P890291j941306j2612152j4881513
11819a0538873m026207R233040R210727l003665r246442J119058J5771672J5205295
11811B3724605j605126j5506252j0762652O353461J6108003Q976547m833807j0103168
11803A2351611n187704r88250l989338p532349k476707Q527586J3059419M753836
11795A8518104p830075j1185755l161974N661951O889640L842986K443220K45985
11787A5424082o319144r790069j038817J1127578P674500r893126j6627312j813009
11779a1255317J1403221J584062j4882137r006070J2822099J8233108J582140
11772A0481106p847755M494248J4905241K370115j6560845j5830722n13125O035864
$$ y = [7488475, -9157977, -11615888, -1720973, 11005807, 18896098, 16954792, 4342640, -10538873, -14565080, -5332040, 3878687, 875022, -8371420, -7252362, 8519310, 23724605, 22119479, 6613227, -4149425, 2204036, 18312039, 27288586, 22454779, 12351611, 7163907, 6175657, 2186319, -5346030, -7822737, 704849, 13764268, 18518104, 10688029, -497726, -3659700, 2002251, 8891891, 12734877, 15178097, 15424082, 9104938, -685131, -1723948, 9403630, 17078130, 7185004, -9442308, -11255317, 147904, 1731966, -13150171, -22156241, -9334142, 8898966, 10481106, 2633351, 7127599, 22032840, 24402955, 7842110, -7988612, -8501737, -2465873]
11764b465873N24395j190551N161927P828708K483198k087303j822170j590708
11756F841623n72326P884906J8756905J5966989k777950j7486742j1824521M257194
11748B1046078Q693199l715077j7505311j8024375o980803L332911M342996k348390
11740a1158772q970551r111361j878107Q882290J7212492J7554989Q367433m880465
11732A6017948j2931498j1069023k465462P049357J3450988J3064275L514300
11725B6630885r806379j4680424o004511N715244O803696j975086p618694k719446
11717c654715O261100Q510017J056655r160176j2274360n190672M146664N049484
11709e256003k310244p119151l403711K998743O399771R257771J1487250M575405
$$ y = [-2465873, -1941478, -3132029, 2029898, 9858606, 12341804, 10254501, 8432331, 6841623, 6269297, 14154203, 32911108, 48878097, 46100147, 28613405, 16788884, 21046078, 29739277, 26024200, 8518889, -9505486, -16486289, -13153378, -8810382, -11158772, -20129323, -29240684, -31118791, -22236501, -5024009, 12530980, 20898413, 16017948, 3086450, -7982573, -10448035, -3398678, 10052310, 23116585, 26630885, 16824506, 2144082, -3860429, 1854815, 8658511, 6683425, -935269, -3654715, 2606385, 11116402, 12173057, 3012881, -9261479, -14452151, -10305487, -5256003, -7566247, -14685398, -18089109, -15090366, -8690595, 567176, 12054426, 16629831]
11701A6629831j1850229j9817680o190783J3270415J3302983l245806j0230043
11694h131312R76559J0759866N672231j821709J208823N670802m07441q148884
11686E778935k868499R001986Q487541o142592j6755170j1586210Q10391N663210
11678g610408k64295p240305l325108J2993342K7899391K4525604L841136j3984177
11670C6835180j4444293n668449k698049n529385n014932j446949j801683m342761
11662d111321k116703J888218m39646m632781J520073J5083433J8170251M677741
11654C0039265j0389988j4189694j2116307j2274861r721042J250146J1151904
11647a6250577O769914p680639j4726824o763699O223838J1914394R403816N692486
$$ y = [16629831, 4779602, -15038078, -21228861, -7958446, 5344537, 2098731, -8131312, -7154753, 3605113, 9277344, 7455635, 8664458, 14335260, 13927819, 5778935, 2910436, 11912422, 20399963, 14257371, -2497799, -14084009, -13273618, -7610408, -7874703, -15115008, -18440116, -5446774, 22452617, 46978221, 50819357, 36835180, 22390887, 16722438, 14024389, 8495004, 3480072, 2033123, 231440, -4111321, -6228024, -4339806, -4779452, -9412233, -7892160, 7191273, 25361524, 30039265, 19649277, 5459583, -6656724, -18931585, -28652627, -27402481, -16250577, -9480663, -17161302, -31888126, -38651825, -32427987, -20513593, -11109777, -5417291]
11639e417291M852644M622084J952900j452197j733687l76786l677081j1648435
11631a2877849j4284059n906583L682966L168295j524717K838623J2862011J3276670
11623A235357L870554m48064J763296m336481j7046842j1916346J5521862K9952791
11615A8596127N652132k7940689k4246592J1833972L1725421J4167836j1134606
11608A8653601j5272836p838172q505325j2462863o096845M553042M915473j165980
11600b3219905K184063J5056385J9188822L958693j7594825k2665397m080422
11593b7172586K0466730K5931161Q063473j1189338j2220519k921902k034387
11586a077368o384825K308642K0444873K1202236k225469k0502039j1291118O455721
$$ y = [-5417291, -564647, 4057437, 6010337, 4558140, 2824453, 2447667, -1229414, -12877849, -27161908, -33068491, -29385525, -26217230, -27741947, -24903324, -12041313, 1235357, 5105911, 4657847, 6421143, 2084662, -14962180, -26878526, -11356664, 18596127, 24248259, -3692430, -27939022, -16105050, 15620371, 29788207, 18653601, 3380765, -4457407, -12962732, -25425595, -31522440, -26969398, -22053925, -23219905, -21035842, -5979457, 13209365, 17168058, -426767, -23092164, -27172586, -6705856, 19225305, 27288778, 16099440, 3878921, 957019, -1077368, -7462193, -5153551, 15291322, 36493558, 34268089, 13766050, 2474932, 8930653]
11578H930653L845089j2293305j3022346N515988J8372582J1861699q9345k752072
11570B0368943n89947k924655p341444p252234m600016n921727j1882608j6708135
11562c6851823j4854370o110337L399425O323100L312014L643498J1926703J9234672
11554i977118J4753802J813760o523659m959661r2386J377829K02399L68079L454936
11545D17981P303769P279004J179388n627860n526870n05313J7762m715244n085993
11536e263376N10100J143811n428377n318583N807156R606556m634249j6446294
11528b0023256n045710J3647843J0703011q151022j2762510R55594P741408q95128
11520a3829770n089634L551171P233132k316398p763186N1666M656582k806853
$$ y = [8930653, 12775742, 482437, -12539909, -7023921, 11348661, 23210360, 23121015, 20368943, 19778996, 16854341, 9512897, 2260663, -2339353, -8261080, -20143688, -36851823, -51706193, -57816530, -54417105, -48094005, -44781991, -41138493, -29211790, -9977118, 4776684, 6590444, 66785, -4892876, -4985262, -3607433, -3405034, -3036955, 417981, 7721750, 15000754, 16180142, 10552282, 5025412, 4520099, 4537861, -177383, -5263376, -4753276, -3609465, -9037842, -14356425, -8549269, 1057287, -3576962, -20023256, -25068966, -11421123, -718112, -8869134, -21631644, -20676050, -12934642, -13829770, -18919404, -15368233, -8135101, -10451499, -18214685, -18163019, -13506437, -16313290]
11512a6313290m559463Q866978J5550525K16078j2995145J852231K5021195J8759420
11504C6398529j2278577k7760728j3045297M528964L032032n491335l619902L297499
11496a4938815K416772m077811p185761p292724q006091m362277R074960K4346029
11488a0025718K6507752J2422825n311741j3489470j1284070o131786j193292
11481h505500O792952J6027629J4310109m895128k4848489j9637484R858111K9786522
11473A8888722J4126451k0583713l6124336k0005182M947836J4789359J0266186
11466a3694677N508257N571008L598410n790713j6914537j7347581k287960J5988513
11458b5369280J8975191M953657o898418j379068J2468566J5204405L348098r890598
$$ y = [-16313290, -20872753, -12005775, 3544750, 3760828, -9234317, -7382086, 17639109, 36398529, 24119952, -3640776, -16686073, -12157109, -9125077, -14616412, -18236314, -14938815, -12522043, -16599854, -23785615, -31078339, -39084430, -43446707, -34371747, -10025718, 16482034, 28904859, 23593118, 10103648, -1180422, -7312208, -8505500, -1712548, 14315081, 28625190, 23730062, -1118427, -20755911, -10897800, 18888722, 33015173, 12431460, -23692876, -43698058, -38750222, -23960863, -13694677, -8186420, -2615412, 982998, -4807715, -21722252, -39069833, -41357793, -25369280, -6394089, -1440432, -8338850, -9717918, 2750648, 17955053, 21303151, 11412553]
11450A1412553j4487533j1111299k310919J0072029J9303422J7753001P464730
11443C8095984k427792p852560j0385543q785164j479390M705592J276810p025712
11435F122225p191168J778753P048609K068358n092672o485889l993871m20497
11427f166152N627320J0736028O160976o493834j1876615k089825J0269881J0377667
11419A6545446J799209k916661k719980m842365p608011k297888R755219J6284518
11411B3999487J1080031j0400j0583877j8811065j9749437p168566J1229073J4744916
11403D730162l422895k1544817j5681940P399675K0640763J5579994J0019780
11396A7720722J4736826J5540410K17184j6480504j4242390k65864K635166n937396
$$ y = [11412553, -3074980, -14186279, -16497198, -6425169, 12878253, 30631254, 38095984, 35668192, 27815632, 17430089, 8644925, 7165535, 11871127, 13147937, 6122225, -1068943, 709810, 7758419, 9826777, 4734105, -1751784, -5745655, -6166152, -538832, 10197196, 16358172, 9864338, -2012277, -4102102, 6167779, 16545446, 18344655, 15427994, 12708014, 7865649, 257638, -2040250, 7714969, 23999487, 35079518, 35069118, 24485241, 5674176, -14075261, -21243827, -10014754, 4730162, 1307267, -20237550, -35919490, -28519815, -7879052, 7700942, 17720722, 32457548, 47997958, 48215142, 31734638, 17492248, 17226384, 19861550, 13924154]
11388A3924154m310831J2130203J9374677K093462k0705171k3286026r263900
11381a0043432j228545n699320q533825m29503J1042328J4889357Q958528j892945
11373G062643j0104917q606178J654159R008569M092856o926704j0580764m579017
11365a8979353J298981O40738k795661l024075J280980P171963R122584L358646
11357a925197m526008k754282Q768265J2759761j888955j9626600j7197649K469280
11349b3921385J3693073M210721j0421924j1475482K80194J2152363J6449950
11342I67510J3087450N069591k625434o151997p484667j0150866j1361501o855770
11334b5505684j312792k412298n835355J55456J4315413K0902087J1908323k201832
$$ y = [13924154, 9613323, 21743526, 41118203, 43211665, 22506494, -779532, -10043432, -11271977, -16971297, -25505122, -25934625, -14892297, -2940, 8955588, 7062643, -3042274, -11648452, -9994293, -985724, 3107132, -3819572, -14400336, -18979353, -17680372, -17039634, -19835295, -22859370, -21578390, -14406427, -5283843, -1925197, -6451205, -9205487, -437222, 12322539, 10433584, -9193016, -26390665, -23921385, -10228312, -6017591, -16439515, -27914997, -27634803, -15482440, 967510, 14054960, 19124551, 16499117, 10347120, 2862453, -7288413, -18649914, -25505684, -26818476, -29230774, -35066129, -34910673, -20595260, 306827, 12215150, 10013318]
11326A0013318q281559n369139M22193M885974N291594O06030m754229n977973
11318c163791o467692j0734433j1413158R33399J6504560J4864884k533482j0380080
11310a2389793K832741J7033975J1758753n002342j3531640j0556233m742052
11303a4596591J203092P467942Q498586K877722M69378N776989P113851l158786
11295A5652183j2575131r800692n669598j1780242j4409435K712464K2323550
11288a3546901J3611003j6692091k7985713l971692K4955243K6687784O733155
11281I790788j0185304j3686211p452686M809405J6257637J4661718r09786j2894043
11273C91518q379821K031717K028179n332225o016372O82411L280689j619660
$$ y = [10013318, 1731759, -3637380, -3215187, 1670787, 6962381, 7568411, 2814182, -3163791, -9631483, -20365916, -31779074, -30845675, -14341115, 523769, -2009713, -12389793, -9557052, 7476923, 19235676, 14233334, 701694, -9854539, -14596591, -13393499, -5925557, 2573029, 5450751, 5920129, 11697118, 18810969, 15652183, 3077052, -6723640, -12393238, -24173480, -38582915, -35870451, -13546901, 64102, -16627989, -44613702, -48585394, -23630151, 3057633, 9790788, -394516, -14080727, -21533413, -16724008, -466371, 14195347, 13285561, 391518, -7988303, -5956586, -3928407, -9260632, -15277004, -14594593, -11313904, -12933564]
11265a2933564o052193n496328l472021k040417J297313P546329J5204938K2914953
11257A6969010K5845743J5082190q967698k8113069k4759449n730511O322290
11250c351494L618033k13325M943787J1170519Q296167q05433q794880j5237647
11242c74273k0081931j6494338j060542J6421692K3191887J7508717M952360j0394839
11234A3668733k1743885j7287946L631960K0407322J4378276l385681o741119
11227B927660O243436J1351752k258978j5086374r418075L829764N866073m51085
11219C004173j005363L264449K037793j495246L346720J0271360K047496j7727623
11211C743759k3035686l188903J9000126J9318151N410923J465027J1155527J5291905
$$ y = [-12933564, -18985757, -24482085, -27954106, -29994523, -28697210, -21150881, -5945943, 16969010, 42814753, 57896943, 48929245, 20816176, -3943273, -9673784, -3351494, 266539, 53214, 4997001, 16167520, 24463687, 23658254, 14863374, -374273, -20456204, -36950542, -38011084, -21589392, 1602495, 19111212, 24063572, 13668733, -8075152, -25363098, -21731138, -1323816, 13054460, 9668779, 2927660, 9171096, 20522848, 18263870, 3177496, -6240579, -2410815, 3455258, 3004173, 1998810, 5263259, 7301052, 5805806, 9152526, 19423886, 21471382, 3743759, -19291927, -22480830, -3480704, 15837447, 21248370, 22713397, 33868924, 49160829]
11203D9160829K967666j3102742j6327558q473032m367413j0796236j8754345
11196a9692831j5898992j295230J3990517J8368742R924119k971581q778257k134097
11188h487610J0399377J5184627O567225m638153m671948K831313J560768j0636156
11180H109443j4871133L25546J8381674J6971178n10994j3446977j5205286j4953873
11172a5200422j3716660k969086J2344000J4085973K78072q338780j99184R599739
11164d116348N538386m241354n259844j183935l331604q943154q352099l840220
11156c3730172l275375k882345N661292J6781218J7133636O363896m028032q828279
11148f804161j0802796q463687J066642R604283N695205n667846p820805K430102
$$ y = [49160829, 52128495, 39025753, 22698195, 14225163, 9857750, -938486, -19692831, -35591823, -36887053, -22896536, -4527794, 5396325, 2424744, -6353513, -8487610, 1911767, 17096394, 23663619, 19025466, 14353518, 17184831, 18745599, 8109443, -6761690, -6436144, 11945530, 28916708, 28405714, 14958737, -246549, -15200422, -28917082, -31886168, -19542168, -5456195, -5178123, -13516903, -13716087, -4116348, 1422038, -2819316, -8079160, -9263095, -12594699, -21537853, -29889952, -33730172, -37005547, -39887892, -34226600, -17445382, -311746, 6052150, 2024118, -6804161, -17606957, -26070644, -25004002, -15399719, -9704514, -15372360, -23193165, -20763063]
11140b0763063J0710499P837666P17762k514495k949063k342603J613424O620491
11132a069382N397068j494589n009865l379501m428933q030976k710087J2577999
11124h148266J9755416O508648j3515401j8713003p251791O462428J3852992J6295001
11116A5246024J3972309N739188k855604m291570m90406O70426j827112k440664
11108B3722591j62642j52111n510611j4308156k1887986k0645988m576086J7785889
11100b5735100K4349231O210543j5290030j4784775J319415O184217m919004r516666
11092c2182169K276248J1014992K117210q680614k229491J1756228J1704292m31955
11084d655259m865373K942606Q669761N458356J468059N80631l778006j1948184
$$ y = [-20763063, -10052564, -2214898, -1497136, -4011631, -6960694, -9303297, -7689873, -1069382, 4327686, 2833097, -2176768, -5556269, -9985202, -18016178, -20726265, -8148266, 11607150, 18115798, 4600397, -14112606, -21364397, -14901969, -1048977, 15246024, 29218333, 34957521, 32101917, 27810347, 27319941, 27990367, 26163255, 23722591, 23559949, 23407838, 17897227, 3589071, -18298915, -38944903, -43520989, -25735100, -1385869, 4824674, -10465356, -25250131, -23930716, -17746499, -22665503, -32182169, -29905921, -18890929, -16773719, -25454333, -27683824, -15927596, -4223304, -4655259, -9520632, -6578026, 2091735, 7550091, 9018150, 9598781, 5820775, -6127409]
11076f127409j3543606n279460K466565L011215K851498P261265J0406125P782245
11068H828438N457930P471101N818075n810205j7764328j5969776j491033J1987958
11060a471840J5283735R358182o84128q024906n674748M878899J0850958L180957
11052B7697109r835167j3371706o301435L7457J98747l9877L644426P004100M886725
11043A3920379j840624q848060j2217561r832929m205465k211987n806811n759253
11035c6802311O814889K4194963K7496227J0261353j1869402j8872405q221623
11028f998309M569303M318095p519347j4742420n193358J3198596K0010166P196168
11020A4838894j0706202j5110261m446204R034703J5295450J1439175j331996
$$ y = [-6127409, -19671015, -24950475, -22483910, -19472695, -16621197, -9359932, 1046193, 8828438, 14286368, 21757469, 27575544, 21765339, 4001011, -11968765, -13459798, -1471840, 13811895, 23170077, 22485949, 14461043, 8786295, 13665194, 24516152, 27697109, 17861942, 4490236, -1811199, -1773742, -1574995, -1614872, 2029554, 9033654, 13920379, 12079755, 3231695, -8985866, -18818795, -23024260, -25236247, -31043058, -36802311, -29987422, -5792459, 21703768, 31965121, 20095719, 1223314, -6998309, -2429006, 1889089, -5630258, -20372678, -25566036, -12367440, 7642726, 14838894, 4132692, -10977569, -15423773, -6389070, 8906380, 20345555, 19013559]
11013A9013559j5499626j8432386o502331P278316R358447K714464k218090m525766
11005h813413p416231n440244N748236J4790880R212050k011492k130432L050882
10997F990236n386481k2170742k0354330M169691K1380217J2203787l071749J015874
10989e223497J5844384J5480781l453843k0808577k2411398j2028431K75736P452870
10981b4871975P787417P398737J4002891K2381082J7555051j031847j4074851
10974B9146505j0848470n416792j0671756j4792070l111859J2633352J0965465
10967G904375m500205j2006497o234282n62149Q09750O488202J4154455J0098023
10959A6151672l433219o393950N305450R343839o147341j8479480l957676K1523100
$$ y = [19013559, 3513933, -14918453, -21420784, -14142468, -4784021, -2069557, -4287647, -8813413, -16229644, -21669888, -15921652, -1130772, 8081278, 6069786, 3939354, 6990236, 1603755, -20566987, -40921317, -36751626, -15371409, -3167622, -6239371, -5223497, 10620887, 26101668, 22647825, 1839248, -20572150, -32600581, -32324845, -24871975, -17084558, -9685821, 4317070, 26698152, 44253203, 43221356, 29146505, 18298035, 12881243, 2209487, -12582583, -15694442, -3061090, 7904375, 3404170, -8602327, -14836609, -15398758, -14589008, -8100806, 6053649, 16151672, 12718453, 6324503, 11629953, 20973792, 14826451, -3653029, -7610705, 13912395]
10951A3912395K1853898o693047k9875455k4614693p562865l384383p236831L22882
10943d3278099J6055754J9198947Q877057O125183J4264473Q994069j7464837
10936A2772547l3368503j4147559J4313041J3761954n396080m297385J5388240
10929i73745J4083851j3300322k2573650O161397L1847601J7679493j1884400
10922B1040225j6147154k814902l913018j5521981j0057455Q709158J1497856
10915g207271l559221r179171J708470O942646j804152o046200K683484Q626837
10907g834578M113068L764283J3940999J6419670k325917k7677510l6465023k2975397
10899e9040405L315887K8363910L5438303J6269382j1872302j9634867l819691
$$ y = [13912395, 35766293, 29073246, -802209, -25416902, -32979767, -36364150, -43600981, -43278099, -27222345, -8023398, 853659, 6978842, 21243315, 30237384, 12772547, -20595956, -34743515, -20430474, -6668520, -12064600, -16361985, -973745, 13110106, -190216, -22763866, -16602469, 15245132, 32924625, 21040225, 4893071, 2078169, -1834849, -17356830, -27414285, -18705127, -7207271, -10766492, -19945663, -18237193, -11294547, -13098699, -19144899, -16461415, -7834578, -3721510, 42773, 13983772, 30403442, 28077525, 400015, -36065008, -59040405, -55724518, -27360608, 8077695, 24347077, 12474775, -7160092, -10979783]
10892a0979783P941887j089225j2947623o008445J1050563J4590574Q00323j3535016
10884a0176745j6423960j0514095k178209N746289J1054650J0727691L975805
10877g788574n311851r271315k345728R872021J4064575P418757L233199Q650130
10869A8521214R670751m797231j7332835n804987J6268396J4790219j1327645
10862A9987882k5925317j0767133R061285Q001871l028464k248064N788410K431044
10854C301514j2064749j9795597j0353659J0124615K6709491K4103170r7084k4187546
10846b259845k1460132K714690J4224969n51660j5111652p236929N637072o18068
10838b4661555j3798749o791689J5202417K2722100Q441149o155581o939075j541972
$$ y = [-10979783, -3037896, -4127121, -17074744, -23083189, -12032626, 2557948, 3358271, -10176745, -26600705, -37114800, -39293009, -33546720, -22492070, -11764379, -7788574, -13100425, -22371740, -24717468, -14845447, -780872, 6637885, 9871084, 18521214, 28191965, 23394734, 6061899, 256912, 16525308, 31315527, 19987882, -5937435, -16704568, -7643283, 358588, -2669876, -4917940, 870470, 3301514, -8763235, -28558832, -38912491, -28787876, -2078385, 22024785, 21927701, -2259845, -23719977, -21005287, -6780318, -7331978, -22443630, -29680559, -24043487, -24661555, -38460304, -45251993, -30049576, -7327476, 1113673, -5041908, -11980983, -13522955]
10830a3522955K080607O163848R932038O916028j864459q538021j1669749j3573833
10822b4076496q804293O308005J7827684R986814o505394o645371Q714892J2147154
10814H952995o075542k0884267j1351444P968607J1928367K066223j384765P164507
10806a615319J3807330Q778140k065834q982228r461829o706155m870421o158948
10798a7275264p954448m691500L687716R207341O454226Q35685K73207L442757
10790f020280L628434J98286k405946m244638q556843j1922796o744082M676005
10782c1391860R621658L379472k008100M861891J7032963J9061598Q678631l080746
10774B6155507r668149j3729322j5043086q317394L984279J0220547O334238J495537
$$ y = [-13522955, -11442348, -5278500, 4653538, 11569566, 9705107, 1167086, -10502663, -24076496, -32880789, -26572784, -8745100, 1241714, -5263680, -11909051, -3194159, 8952995, 2877453, -18006814, -29358258, -21389651, -9461284, -7395061, -8779826, -1615319, 12192011, 20970151, 18904317, 9922089, 460260, -6245895, -11116316, -17275264, -25229712, -29921212, -26233496, -17026155, -10571929, -9736244, -9463037, -6020280, -2391846, -2193560, -4599506, -8844144, -17400987, -29323783, -36067865, -31391860, -21770202, -18390730, -20398830, -15536939, 1496024, 20557622, 29236253, 26155507, 16487358, 2758036, -12285050, -20602444, -16618165, -6397618, -63380, 1432157]
10766A432157P83443l832005j5449590j9319115l219702J9410083K4713238J1387719
10758A5906228J99175K308314O378314J51931j1080584j4299618o357704M634325
10750b159619Q906731K346861j0270440j7485198j1594934K367821J2005079J0447056
10742e436643L27080j0793285j4071493m656024J0079882J4663271N272152l535993
10734h151053m87741N752932L664718r34650J237987J979622r628595k2046895
10726b8613675j5991411K809391J1774709P199453M422041O258523J167944q217214
10718a9190239o029486N543031P155112k435677m198927M324190M957711k675063
10710a2549348K526639J8525245J4309111j4492458k7888102m419585K0332001
$$ y = [1432157, 2215600, -1616405, -17065995, -36385110, -39604812, -20194729, 4518509, 15906228, 16105403, 18413717, 24792031, 24943962, 13863378, -436240, -6793944, -2159619, 6747112, 9093973, -1176467, -18661665, -30256599, -27888778, -15883699, -5436643, -5109563, -15902848, -29974341, -34630365, -24550483, -9887212, -4615060, -8151053, -8638794, -2885862, 778856, -155794, 1082193, 3061815, -6566780, -28613675, -44605086, -41795695, -30020986, -22821533, -18399492, -12140969, -10973025, -19190239, -25219725, -19676694, -12521582, -14957259, -19156186, -14831996, -9874285, -12549348, -10022709, 8502536, 22811647, 8319189, -19568913, -23988498, -3656497]
10703c656497J0852524j1215065p182404J3842863J6127537n01787p926150l718670
10695F622351r401789k2289510j6053348J0087193K4829824J3142190m526812
10688B410099q182981j924227N224407J2847836J5840386M698989j2488757j3578220
10680D847532L288797J3155922K205288j1371275p651007N085079P408490n69123
10672A6399703m222072j98949J010212n046059r511034m965472K793774L336500
10664d03397k633041l431937O276669J5392210J0664076l534584j0457313m458883
10656G413800L221392K798672l228203r297193j2649380q368922N089995J3998454
10648a021385L198937j5499232j3787295Q170075J6874510k037473j8680152o835608
$$ y = [-3656497, 7196027, -4019038, -11201442, 2641421, 18768958, 18267171, 10341021, 6622351, -2779438, -25068948, -41122296, -31035103, -6205279, 6936911, 2410099, -5772882, -7697109, -2472702, 10375134, 26215520, 30914509, 18425752, 4847532, 8136329, 21292251, 23497539, 12126264, 4475257, 9560336, 16968826, 16399703, 12177631, 11978682, 12988894, 7942835, -1568199, -6533671, -3739897, -403397, -3036438, -6468375, -191706, 15200504, 25864580, 22329996, 11872683, 7413800, 10635192, 13433864, 10205661, 908468, -11740912, -20109834, -15019839, -1021385, 2177552, -13321680, -27108975, -18938900, -2064390, -4101863, -22782015, -29617623]
10640b9617623J4052922J3059392k617757n834012L053704L043487o733378q437386
10632b0030651K13718M920521K449764J103755n07537q700974j5319216q631077
10624d4501697L520777N865999K064654M540599R136056N769927J677657O348754
10616e577274P815163n333959j4428754J087556K1534481J4106879j0731884j5515154
10608g042946M68871L254656j3115307j8012023k415476N793116m660323q622459
10600d4351891N981713J4339366P02487j2322729l174008J4573952J9713798J4707890
10592A0170578R167220J08081j2120741j4068437k853947M321621j247316n981564
10584a2504505r50597L556075K159503N417116J4333212J2409162l319832j1894925
$$ y = [-29617623, -15564701, -2505309, -5123066, -10957078, -7903374, -4859887, -11593265, -20030651, -19816933, -14896412, -12446648, -11342893, -11850430, -20551404, -35870620, -44501697, -40980920, -35114921, -33050267, -28509668, -19373612, -13603685, -11926028, -5577274, 2237889, -3096070, -17524824, -16437268, 5097213, 19204092, 8472208, -7042946, -6574075, -3319419, -16434726, -34446749, -36862225, -31069109, -35729432, -44351891, -38370178, -24030812, -23328325, -35651054, -38825062, -24251110, -4537312, 10170578, 19337798, 19445879, 7325138, -6743299, -9597246, -5275625, -6522941, -12504505, -13455102, -9899027, -7739524, -2322408, 12010804, 24419966, 21100134, 9205209]
10576I205209l425378L900682l079485j0302976l596716Q016869J1799090J0023726
10568B2541021O207607l186234j2937410j0738436k553670p359450k0255621j4872251
10560d3154444R677971K2493412J2096642K856806O637202K269844j7811690k5309438
10552c0243695m815809J7023627J6787325Q214622N801631k349288j7583656j2364980
10544a9530223J8074082L1442746L833585k5010449j4617527J0949194R139793
10537A4281201r120844p610880P438496M617936j1340818j0460583O769289J3712228
10529H286025M183492p253226j5931203k0680362p875482K0815296L0539580K956201
10521A5040321k5192462j6394712O965348N375412p913826K503698K2973722J4152846
$$ y = [9205209, 5779831, 9680513, 6601028, -3701948, -7298664, 718205, 12517295, 22541021, 28748628, 25562394, 12624984, 1886548, -667122, -8026572, -28282193, -43154444, -33476473, -10983061, 1113581, 3970387, 10607589, 12877433, -4934257, -30243695, -35059504, -18035877, -1248552, 6966070, 12767701, 10418413, -7165243, -19530223, -1456141, 29986605, 33820190, 8809741, -5807786, 5141408, 14281201, 5160357, -2450523, 4987973, 9605909, -1734909, -12195492, -5426203, 8286025, 12469517, 5216291, -10714912, -31395274, -39270756, -18455460, 12084120, 15040321, -10152141, -26546853, -19581505, -14206093, -22119919, -19616221, 3357501, 17510347]
10513A7510347j5514258k3764015p080504J403727n907699q022228k017652j43717
10505d3535999L286571J3024379O876428k0209944k3872659J6873527M2050624
10498e507073K604306m3020452k0534232K5892912J0636766l2305414j3406327
10491g5639514K6105947k3588140j01293369j7227370K14716027L14579692J24595403
10484D62248676j38705777j85552842m5800019L7411737j1134118n2051580j1520792
10477E4895285K1373622j0964329l7907172p050151K5297289R471948j3012309
10470D2104183m5382J6173079K604885j1303611J093742R201480j1085814k5543378
10462B3199184n654521J5228850K514121j6127887k646614K1312113J3131207
$$ y = [17510347, 1996089, -21767926, -28848430, -27444703, -33352402, -41374630, -43392282, -43535999, -40249428, -27225049, -20348621, -40558565, -64431224, -47557697, -5507073, -2902767, -45923219, -66457451, -40564539, -29927773, -62233187, -75639514, -49533567, -73121707, -174415076, -191642446, 23073581, 337653273, 462248676, 323542899, 137990057, 92190038, 129601775, 118467657, 66416077, 54895285, 76268907, 65304578, 27397406, 20347255, 45644544, 55116492, 42104183, 42058801, 58231880, 60836765, 49533154, 50626896, 59828376, 48742562, 23199184, 17544663, 32773513, 35287634, 19159747, 16513133, 37825246, 50956453]
10455E0956453j6456766k3783701m040799Q605469l00910j0532873n885521N608689
10447D170041R486621J964748q290373n769014J4291266K9935671J4434962k0872571
10439C9351351l3783736j0812943J3032497R317000m302452k502738M625521j588557
10431A3335943q205283M890770K2017108J3584702j2106600j9005917j07298J3531339
10423B7934764K781765j3788225j3016920J23552O108115N8931o623463n911259
10415b332740l021859o184202j1907587p037589J0645470K1888441R389522j2920165
10407a480709j4380931P577938K1772260J0298197n333970r66282J2179985R369502
10399C9035990p137185j6020618j1881674n601335M34443J0729687J7192633Q214858
$$ y = [50956453, 34499687, 10715986, 6675187, 15280656, 14979746, 4446873, -1438648, 4170041, 13656662, 15621410, 7331037, 1562023, 15853289, 45788960, 60223922, 39351351, 5567615, -5245328, 7787169, 17104169, 12801717, 10298979, 14924500, 13335943, 5130660, 10021430, 32038538, 45623240, 33516640, 14510723, 14403425, 27934764, 30716529, 16928304, 3911384, 4034936, 10143051, 10201982, 3578519, -2332740, -5354599, -11538801, -23446388, -30483977, -19838507, 2049934, 11439456, -1480709, -15861640, -8283702, 13488558, 23786755, 18452785, 17486503, 29666488, 39035990, 31898805, 15878187, 3996513, -1604822, -1170379, 9559308, 26751941, 34966799]
10391C4966799o454696o243900O319604Q618057m241899j2062632n303057q25395
10383A4772881j0329328j7182325k582117K1814236K7512492P432379j6897422
10376B4540796k3929147j3879812o00549P375340J1638469J4471978J2501200
10369C2118275K966322p981000j0337623l578629K434688J402909k678328m969987
10361I376627o048173n165122Q46846O601768K38693j5369483j9475778l440567
10353c2435189J3000446J1261625K246000M522376J1275466N715780m612939o02881
10345A0370684J0845999O847856q708661r587145N617409R691933m517893j1526337
10337I033845k3686P760303l50265l384304J0010700J4442399p217707k6741631
$$ y = [34966799, 28512103, 22268203, 28587807, 37205864, 32963965, 20901333, 15598276, 14772881, 4443553, -12738772, -15320889, 6493347, 34005839, 41438218, 24540796, 611649, -13268163, -13868712, -6493372, 5145097, 19617075, 32118275, 35084597, 27103597, 16765974, 13187345, 15622033, 17024942, 14346614, 9376627, 3328454, -1836668, -989822, 5611946, 5850639, -9518844, -28994622, -32435189, -19434743, -8173118, -5927118, -1404742, 9870724, 15586504, 10973565, 10370684, 21216683, 28064539, 19355878, 9768733, 15386142, 25078075, 20560182, 9033845, 9010159, 16770462, 16420197, 13035893, 23046593, 37488992, 30271285, 3529654]
10329C529654j3970357J2042366J4622709j664245n905350L747293M067464n744538
10321A0724996n694393J749081n190223k1498485j6564958J2362358K8992999
10314D881375J1850605j6432601k7110824k0713824j0162733J983502J3163232
10307d2541268J3162243L039606J76507J0957576J9288507J3878556M881104J916640
10299B4759471j184059p398873o536531K058362J708591j1365089j5880376j558988
10291a5397492R260127j601077j5222545o512423J3583278J6988285L187019n687627
10283a402455k740613K61135n51568J665531N877395N024345J463025J211203
10275A0807998P87515k359714J078014J2878523J3424860p932439k6267866j5332477
$$ y = [3529654, -10440703, 1601663, 16224372, 14560127, 8654777, 12402070, 16469534, 10724996, 5030603, 6779684, 1589461, -19909024, -36473982, -24111624, 4881375, 16731980, 299379, -26811445, -47525269, -57688002, -55704500, -42541268, -29379025, -26339419, -26162912, -15205336, 4083171, 17961727, 22842831, 24759471, 23575412, 16176539, 9640008, 11698370, 13406961, 2041872, -13838504, -15397492, -6137365, -7738442, -22960987, -29473410, -15890132, 1098153, 4285172, -1402455, -4143068, -3881933, -4433501, -2767970, 3109425, 8133770, 9596795, 10807998, 11595513, 9235799, 10313813, 23192336, 36617196, 28684757, 2416891, -12915586]
10267a2915586Q199405J0650155l042214j813303J3295566J1508596q838569j4526701
10259B517349K591576J0531811l327600p916370J2811505K4560621j69127l0268418
10251A1331347k2869244Q607917J8627344J383648q238487L921902J3533368K693177
10243B8990972j4596797j9062033j0053742M137741J6767811J8026233J366011
10236B5576196j9904021k2219031m000113J0532642O322659l133341j084498O416098
10228a493409M769751k722831j312570Q818106J1336005k97242j1469935p604123
10220B3752M382216O314145m790509j2746191n546394Q706371J4829868J0176216
10212B1349474K565537l719987q411025p449116J243671P390875m42906j4255274
$$ y = [-12915586, -4716181, 5933974, 2891760, 1078457, 14374023, 25882619, 17044050, 2517349, 5108925, 15640736, 12313136, 4396766, 17208271, 41768892, 41599765, 11331347, -11537897, -2929980, 15697364, 17081012, 8842525, 12764427, 26297795, 28990972, 14394175, -4667858, -14721600, -10583859, 6183952, 24210185, 25576196, 5672175, -16546856, -20546969, -10014327, -3691668, -6825009, -7909507, -1493409, 3276342, 553511, -759059, 8059047, 19395052, 19097810, 7627875, 23752, 4405968, 10720113, 5929604, -6816587, -12362981, -3656610, 11173258, 21349474, 23915011, 20195024, 11783999, 4334883, 5578554, 12969429, 12526523, -1728751]
10204a728751j4854047k050551L625177n338142j0405169Q81259J1719304L076683
10196a5074237j4142214j6296577l325999O229556P403474J0288023J4232836
10189a0685138P498205o772690j0163373N21147O337019k171021q900592N18343
10181b3818100J5138960J7201025Q264020Q45792k994832p621413q763961r71534
10173b720043O648398Q06040j3229667j7260138p624892P05580p42921k455783
10165c5873426L760037J0013465O404742k223071m457533J104007P558566J1320950
10157b392263J2148571P061310n288605j7366903j9294437j0849062J46292Q044282
10149b7790815J0940486P346132M38867o6186Q538805J2710678J292722j2555411
$$ y = [-1728751, -16582798, -18633349, -15008172, -20346314, -30751483, -29870224, -18150920, -15074237, -29216451, -45513028, -48839027, -42609471, -35205997, -24917974, -10685138, -3186933, -9959623, -20122996, -19601849, -13264830, -15435851, -24336443, -23818100, -8679140, 8521885, 16785905, 17631697, 14636865, 7015452, -1748509, -2720043, 3928355, 4734395, -8495272, -25755410, -33380302, -32674722, -33417643, -35873426, -32113389, -22099924, -15695182, -17918253, -22375786, -21271779, -13713213, -2392263, 9756308, 16817618, 11529013, -5837890, -25132327, -35981389, -35835097, -27790815, -16850329, -9504197, -9065330, -9131516, -592711, 12117967, 13410689, 855278]
10141H55278p340852J1554267J6104228j933728j8102281j3967940l290511l468099
10133a9589638m661530Q785084K4202822J7182720o958843j8019873n536449Q766315
10125D170608O875916j465066M77964J0237749J2380159M00500j6308495k2266612
10117e497277j0339326Q935274J5507513M212888o276625m1117J0790511N524055
10109B2815896r490056j0096929M516095R395443l869013j2618364j930791R829767
10101H552048J676304j6114296j9455851n897875P656924J1282772P448803j100382
10093e951553j1333077j3940222l242025J0624726J2463503K100546o777191m985067
10085b1040360L605580R314689O317542k191883n896245O59842Q523567N973914
$$ y = [855278, -6485574, 5068693, 21172921, 19239193, 1136912, -12831028, -16121539, -19589638, -24251168, -15466084, 8736738, 25919458, 18960615, 940742, -4595707, 4170608, 11046524, 9581458, 10059422, 20297171, 32677330, 33077830, 16769335, -5497277, -15836603, -6901329, 8606184, 12819072, 6542447, 6501330, 17291841, 22815896, 13325840, 3228911, 7745006, 17140449, 13271436, 653072, -1277719, 8552048, 10228352, -5885944, -25341795, -31239670, -23582746, -12299974, -4851171, -5951553, -17284630, -31224852, -34466877, -23842151, -11378648, -9278102, -16055293, -21040360, -17434780, -8120091, -1802549, -3994432, -9890677, -9230835, -707268, 5266646]
10077E266646k166486j427934O843786O623347l581816o179854L558842O868949
10069A5805480m475696j0237051L404894J6637422Q131913q303996q058333K485023
10061A5389656J121580q298830n345108N255495j21499j8785578k1282027j12364
10053c2178675J7170021J2586416K412078M204823Q983341L364317n496005o150815
10045D895501m006797p133432p758999K434068J2262214O873770o115910p235749
10037e785334L354138N792259p408816j7854523p351257J4732554K1924377N291229
10029A2694627j3794900j1098457P609313J3916227k551063j7274183n434219
10022a5932655K0598403K7516834Q003184j1199105r089108L808218P124929o00044
$$ y = [5266646, 3100160, 1672226, 8516012, 15139359, 11557543, 5377689, 8936531, 15805480, 11329784, 1092733, 4497627, 21135049, 29266962, 20962966, 12904633, 15389656, 16511236, 8212406, 2867298, 8122793, 8001294, -10784284, -32066311, -32178675, -15008654, -2422238, -10160, 4194663, 13178004, 16542321, 11046316, 4895501, 888704, -6244728, -14003727, -11569659, 692555, 7566325, 1450415, -5785334, -2431196, 3361063, -4047753, -21902276, -29253533, -14520979, 7403398, 12694627, -1100273, -12198730, -4589417, 9326810, 6775747, -10498436, -15932655, 4665748, 32182582, 40185766, 28986661, 19897553, 23705771, 30830700, 30230656]
10014C0230656p399872r031140j0234851j1552074p707864K324881J1998601J4371619
10006A2999956Q963116J823441m89545J546735P51750n720369j0182910o087555
9998C604619p19198n081863j4195974j1538788O014447K1517290J9938879N177501
9990B4716913q723774j2572646m906549Q807998J5942093O958193r926396j5691485
9982D604347n951148L521756J507353l558066j523871J657867l172733r849387
9974a2763882o538911L821694P796619J913734m389621l880567J672256P857921
9966d510757J0725628N600909p206719j6914410j2369941K476293J2058040Q585561
9958a555396r9817k927272J659223P225337P667834K005657n097296p040197l021025
$$ y = [30230656, 22830784, 13799644, 3564793, -7987281, -15695145, -13370264, -1371663, 12999956, 21963072, 23786513, 23296968, 24843703, 25595453, 19875084, 9692174, 3604619, 2885421, -2196442, -16392416, -27931204, -21916757, -399467, 19539412, 24716913, 15993139, 3420493, -1486056, 7321942, 23264035, 30222228, 20295832, 4604347, -1346801, 2174955, 3682308, 124242, -1399629, 258238, -2914495, -12763882, -19302793, -15481099, -7684480, -5770746, -10160367, -14040934, -12368678, -4510757, 6214871, 11815780, 4609061, -12305349, -24675290, -22198997, -10140957, -1555396, -1655213, -4582485, -2923262, 4302075, 11969909, 13975566, 8878270, 1838073, -1182952]
9949a182952o97826o172674j3291973j0282560L228706J4252327J3466638N926861
9941E246547R99273m6220o1076K574524Q764403J0170097j469416j7677333j9794236
9932a1293437n295109O549377K714934l975800L337991J5743754J0562161j1160005
9924G183866k1775444o158294J6164541J8525744J903192j1150792p859608L115174
9916e1621P051535n96100j2032546j5091645n413348O871620P864444j390624
9908a2788285n833995J546447J0201470R355841K178674m121411r123704j1693762
9900b0278725n337354Q688002J6803227J2255049N091304K708838k595555j3767023
9892C567763j6296722k870263R014979M984380r65121O075735J0786379m708220
$$ y = [-1182952, -1880778, -8053452, -21345425, -31627985, -28399279, -14146952, -680314, 5246547, 6245820, 6199600, 6138524, 8713048, 17477451, 27647548, 26178132, 8500799, -11293437, -16588546, -10039169, -7324235, -11300035, -7962044, 7781710, 18343871, 7183866, -14591578, -20749872, -4585331, 13940413, 15843605, 4692813, -3166795, -51621, 6999914, 6403814, -5628732, -20720377, -26133725, -19262105, -11397661, -12788285, -18622280, -17075833, -6874363, 2481478, 4660152, 538741, -8584963, -20278725, -25616079, -16928077, -124850, 12130199, 17221503, 19930341, 17334786, 3567763, -12728959, -15599222, -6584243, -1599863, -2564984, 3510751, 14297130, 9588910]
9884I588910k2170583j4314697O026608P206438m269151R94540J0970481j5761769
9876b1729223o7282157p2477067l172778P4324608Q5917995M1901388K182864
9869C9665630j0233329j3081986j2447492J76165J3389508O831978r506443q305684
9861F488347O813388N595710j6606330k9275937j5085703O261256J2540258Q601842
9853a4667169Q578622J1252444P737663j208485p523614o555110N73965P828784
9845F017100O815902k412802n945924N928971J9114478J1389696j3438329k6868567
9837F00525j4534775N888923J2953804R175461Q467433J0863152O437679l483945
9829C6368257o607991o93217R24085r428727j8219595p827117J5240735K3774878
$$ y = [9588910, -12581673, -26896370, -20869762, -13663324, -17932475, -16937935, -5967454, -21729223, -89011380, -161488447, -164661225, -90336617, -4418622, 37482766, 39665630, 29432301, 16350315, 3902823, 4078988, 17468496, 24300474, 14794031, 6488347, 13301735, 18897445, 2291115, -26984822, -42070525, -35809269, -23269011, -14667169, -6088547, 5163897, 12901560, 11693075, 4169461, -2385649, -1811684, 6017100, 12833002, 10420200, 4474276, 10403247, 29517725, 40907421, 27469092, 600525, -13934250, -8045327, 4908477, 14083938, 22551371, 33414523, 39852202, 36368257, 29760266, 29067049, 29991134, 20562407, 2342812, -5484305, 9756430, 33531308]
9821C3531308N631501j7393946j7808405M49760R986711J89276j0979952p301821
9813c695568L940588Q097872L820259k211037o900408p672791j350088N321482
9805f49691r68801j6891475j9791904n53294J8529280J4634050l209047j1039643
9797a9940525m539870L736987Q905831J3363499J2040780Q23921p913614n02345
9789E974664J3479135J3797999J415495m585884J658361O636123J342544q474362
9781C1244075j5018881j4612013m996117P391443N894715j1186071j6116508J0585331
9773f814026L9689064K6871139j7983707l7978669j2005561J4304484N5239k8779269
9765b2641306k1694720J9266569M4282153K6886560n948666j7120399m588716
$$ y = [33531308, 39162809, 21768863, 3960458, 4410218, 14396929, 14586205, 3606253, -3695568, 245020, 8342892, 12163151, 9952114, 3051706, -4621085, -5971173, -649691, -1618492, -18509967, -38301871, -38855165, -20325885, -5691835, -8900882, -19940525, -24480395, -20743408, -11837577, 1525922, 13566702, 14390623, 6477009, 5974664, 19453799, 33251798, 34667293, 30081409, 31739770, 38375893, 39718437, 31244075, 16225194, 1613181, -3382936, 4008507, 9903222, -1282849, -17399357, -6814026, 32875038, 59746177, 41762470, 3783801, -8221760, 6082724, 6137963, -22641306, -44336026, -25069457, 19212696, 46099256, 40150590, 23030191, 18441475]
9758A8441475P465471N085198k742358k749860L528888M063545n328920j5379777
9750A2383662j7410478j4135424j1161051o581953K338649R998142J0210998O071360
9742h286095K253911l256983q814376l669728J1595477J4855196n034943k1235250
9734b1592791m861887K4654135K3808898n841851j7852876M503156K1297005J986600
9726B6100389k5369233k0942397N283389J5320507L239529m677432K839364J0104449
9718A1898565N796814k776300p018689o741916k528240M213967N579627k828869
9710E594959j0126280m174830P429896P721509k310095n896572J212263M671735
9702D122585k889189q896051j807118R358136Q470441k940611p702047J405669
$$ y = [18441475, 25906946, 30992144, 28249786, 25499926, 29028814, 33092359, 27763439, 12383662, -5026816, -19162240, -30323291, -36905244, -34566595, -24568453, -14357455, -8286095, -6032184, -9289167, -18103543, -21773271, -10177794, 4677402, -357541, -21592791, -26454678, -1800543, 22008355, 16166504, -1686372, 2816784, 24113789, 26100389, 731156, -20211241, -14927852, 392655, 3632184, -1045248, 1794116, 11898565, 17695379, 14919079, 7900390, 1158474, -1369766, 2844201, 8423828, 5594959, -4531321, -8706151, -1276255, 6445254, 4135159, -1761413, -549150, 4122585, 1233396, -7662655, -9469773, -111637, 8358804, 5418193, -2283854, -878185]
9694h78185J0379308M374543r239970j0720599J383153O419770n303620j4299861
9686a7885461k472498J4626030J0635457p588345r870627O953902J3696895r76341
9678G119012j1024816J827591J6700700R474197p483653q331014M303007Q664581
9670B1249605O03835o232731o992388p664283p711252k478287L062921J744299
9662d418281j600007j71941J89625o048948q404505K077052J1605482L452183
9654c319340j1558884j0390888M378677R893917J461740l029811L650803Q392951
9646e20835M218829Q32716L516531M256636j16687j452681K197028J759150m310236
9637A0380451n044802L110608Q836011N464198J817518N616541J0232261O419856
$$ y = [-878185, 9501123, 13875666, 4635696, -6084903, -4701750, 1718020, -3585600, -17885461, -20357959, -5731929, 4903528, -2684817, -12555444, -5601542, 8095353, 7119012, -3905804, -2078213, 14622487, 24096684, 16613031, 8282017, 12585024, 21249605, 21853440, 15620709, 8628321, 964038, -6747214, -9225501, -6162580, -4418281, -6018288, -6190229, -6000604, -12049552, -20454057, -18377005, -6771523, -3319340, -14878224, -25269112, -20890435, -10996518, -9534778, -12564589, -8913786, -520835, 3697994, 4530710, 8047241, 12303877, 12187190, 10734509, 12931537, 14690687, 10380451, 5335649, 8446257, 17282268, 22746466, 24563984, 30180525, 40412786, 46832642]
9629D6832642l864535j2397488j4453954r100953J459861R329073N897183p487122
9621A6214707j9531728j9967648o588159J3810117K5937183J6210008q624104
9614A7460376k3279251j5139081j060818J25125m550068o66072N304185K008574
9606a9797030Q94936J5794264K8419044J2018725j9225813k6179434o612644L657153
9598a1030799o576410q164970J1321141K2971351P839065j1131470j1935968p707053
9590a4415113j1743747p619538J4468914K7708738J0934491j0765182o246674
9583B321889R153133L426050j3717324q893905J4470738K1215590K556901j4953941
9575A5579131j6156104j2560185j0470642j651750J0574654R870108l530620j1318958
$$ y = [46832642, 42968107, 30570619, 16116665, 7015712, 8475573, 17804646, 23701829, 16214707, -3317021, -23284669, -29872828, -16062711, 9874472, 26084480, 17460376, -5818875, -20957956, -22018774, -21893649, -26443717, -27109789, -21805604, -19797030, -18902094, -3107830, 25311214, 37329939, 18104126, -8075308, -14687952, -11030799, -17607209, -25772179, -14451038, 8520313, 16359378, 5227908, -6708060, -14415113, -26158860, -33778398, -19309484, 8399254, 19333745, 8568563, 2321889, 11475022, 14901072, 1183748, -7710157, 6760581, 27976171, 30533072, 15579131, -576973, -13137158, -23607800, -25259550, -14684896, -4814788, -8345408, -19664366]
9567a9664366p999900m837455k737848P669842J8188197R673335r614183q533148
9559a7855526J5841004K8569393J1524956q826055p313910R26025p022474k0026484
9551d183071j4688180K797702R025094K926201J344447M730464j330862j4159175
9543a3537380j3607721L954487J7452868J3384902M135568M587542R093619M906540
9535C0370425m674219n965238K587101P862747J568475q683163j0526041j561996
9527A0978091J0792459J8470641J7021609N447598j1390235k2596015k1006298
9520G717850j2509599q162064p949568k504204Q367187J2190951M041865l310819
9512b118401J116573Q780303N539193o221228j2892182r755730k534151M591239
$$ y = [-19664366, -27664266, -32501721, -35239569, -27569727, -9381530, 291805, -9322378, -17855526, -2014522, 26554871, 38079827, 29253772, 21939862, 22865887, 15843413, -4183071, -18871251, -16073549, -7048455, -4122254, -2777807, 1952657, 621795, -13537380, -27145101, -23190614, -5737746, 7647156, 11782724, 16370266, 25463885, 30370425, 25696206, 19730968, 22318069, 30180816, 31749291, 23066128, 12540087, 10978091, 21770550, 40241191, 57262800, 62710398, 51320163, 28724148, 7717850, -4791749, -12953813, -20903381, -23407585, -15040398, -2849447, 1192418, -2118401, -1001828, 7778475, 13317668, 7096440, -5795742, -15551472, -18085623, -13494384]
9504a3494384R426713P098737j500681m105250N645543J4202733Q080483k406656
9496B2947238j89367P896598L533428p739053m878460P827083L611350j8632046
9488A4376771k5539846j344802K4812516K2487215K089835q740696o656187n918756
9480A5566050r130788r337825p617269p047386j533369J0391498J4395685K208017
9472G894613r948819n364669N599688M648236k501652N37836Q065082K232147
9464A1162462j2427270j4791393l666255J421912m232683l561070R491392J7419218
9456H16313Q039026o206742q091116J525425R238382N800409p205419j7887211
9448a3970933j2349834O690581J5798242R42551j6914305q722343J7399577K6572511
$$ y = [-13494384, -4067671, 3031066, 1530385, -2574865, 3070678, 17273411, 25353894, 22947238, 22757871, 30654469, 34187897, 26448844, 21570384, 29397467, 33008817, 14376771, -11163075, -12507877, 12304639, 34791854, 36881689, 28140993, 21484806, 15566050, 6435262, -2902563, -10519832, -17567218, -19100587, -8709089, 5686596, 7894613, -2054206, -7418875, -1819187, 2829049, 327397, 865233, 8930315, 11162462, -1264808, -16056201, -19722456, -18300544, -22533227, -26094297, -16602905, 816313, 8855339, 2648597, -5442519, -3917094, 5321288, 11121697, 3916278, -13970933, -26320767, -19630186, -3831944, -2889393, -19803698, -28526041, -11126464, 15446047]
9440A5446047J0462008k825812L172823R627503k93265j2077229p527755L692194
9432A9676514K951766n857813o423929K006088P355131N439460P59361m461630
9424B1444948p715286k524095R593646J4344015M532930p248780q555657n971286
9416A7900435r675216j3932928j0155466n129891o742186n147184R428376K1983038
9408a471022J1512072j3157214k2751297r290173O851822J0533577P722538N956030
9400d093667K262681m433434q091467p342992o529973l812387M978477J1844638
9392a5218124N946435l870568N59201J3527678J0292033j0375922j9212489l240210
9384b1591966J1419307K034716j3684447q360853R841811J2872395j193673r090276
$$ y = [15446047, 25908055, 23082243, 26255066, 35882569, 35589304, 23512075, 15984320, 19676514, 22628280, 16770467, 10346538, 12352626, 19707757, 25147217, 25906578, 21444948, 13729662, 11205567, 20799213, 35143228, 39676158, 32427378, 23871721, 17900435, 8225219, -5707709, -15863175, -20993066, -27735252, -32882436, -23454060, -1471022, 10041050, -3116164, -25867461, -35157634, -28305812, -17772235, -10049697, -4093667, -1830986, -6264420, -14355887, -21698879, -28228852, -32041239, -27062762, -15218124, -9271689, -13142257, -12583056, 944622, 11236655, 860733, -18351756, -21591966, -10172659, -8137943, -21822390, -30183243, -20341432, -7469037, -8662710, -17752986]
9376a7752986k015346N241261L537738J517613N353097P778663K665614n301655
9368A023999r480117p754069K12682J0647833J3185639L527882o164258m479363
9360G20228j126460j0096498j9929042q224254J6668404K1209003n97900j4414675
9352a5791194N35018J8309037R879436r351779o636425J4550608K2865705Q968357
9344D3328763p372959j4252011j8186519j8298096k895655K2006585K9935217
9337C4265325J0707247j3185450j8320613q837926j839367j793432j977862J779367
9329G97289R223265J7120977J7008458L814851j0558852q847270L705702M232572
9321C6496992j0127578j5421472j862143P380830l813213j4582533l219053J2191760
$$ y = [-17752986, -19768332, -14527071, -10989333, -9471720, -4118623, 3660040, 6325654, 1023999, -8456118, -16210187, -15997505, -5349672, 7835967, 11363849, 5199591, 720228, -406232, -10502730, -30431772, -38656026, -21987622, -778619, -1376519, -15791194, -15256176, 3052861, 12932297, 3580518, -3055907, 11494701, 34360406, 43328763, 35955804, 21703793, 3517274, -14780822, -17676477, 4330108, 34265325, 44972572, 31787122, 13466509, 4628583, 2789216, 995784, -982078, 797289, 10020554, 27141531, 44149989, 47964840, 37405988, 28558718, 32264420, 36496992, 26369414, 10947942, 9085799, 16466629, 12653416, -1929117, -5148170, 7043590]
9313G043590K911233j9282985j8742568N833338J9600179P087973q293511o529576
9305a0372327J389884L93022k774445L034210J1229673R568691K51652n650590
9297G069770l934728J763707O212065M507319l617793r617662o173154J2074j746693
9288e525095o942034l970043K516052j413036j0412829m973595J2354260J5166352
9280c199968m088993j8780447q777331J0596045J6673658J1332815N894178k164498
9272G485459j5203414j8656813k824531J4490192J1259678n490075j2288161m031404
9264b5259069N482484Q145121O031509l21662r282034j1559196k511645P991626
9256b1282866J1560783J3863506J7399991J0174590j0096030k1107217q880786
$$ y = [7043590, 9954823, -9328162, -28070730, -22237392, -2637213, 4450760, -3842751, -10372327, -8982443, -8589421, -11363866, -8329656, 2900017, 12468708, 12720360, 7069770, 3135042, 4898749, 11110814, 15618133, 12000340, 2382678, -3790476, -3778402, -5525095, -12467129, -16437172, -13921120, -15334156, -25746985, -30720580, -18366320, -3199968, -7288961, -26069408, -34846739, -24250694, -7577036, 3755779, 9649957, 7485459, -7717955, -26374768, -29199299, -14709107, -3449429, -8939504, -21227665, -25259069, -19776585, -11631464, -5599955, -5921617, -15203651, -26762847, -29274492, -21282866, -9722083, 4141423, 21541414, 31716004, 21619974, 512757, -8368029]
9249h368029M993826k839429j6671228q671781J0961541J0769597o890149j0905583
9241b7621235L492819Q958596l067569q701967L731601J4995179J1579127N069236
9233H435787L417225k669389j2335646p922174R920364J4304211l801604j6574853
9225g226079m304754J2229783P622127q472786j3106759o727415j974931K281088
9217a9679726R597255Q803543n192012j2034782M846779K6001201K1936557j844198
9209C2434617j5013479p749837K589898L252501k369851j0432499j9257563j9805240
9201c6351453o033162Q950497Q440379p28553J574190J5850104K3165879J5310655
9193C0178536K062205r336283j8667237j8411041m40645K1141678J9726074n171354
$$ y = [-8368029, -3374203, -6213632, -22884860, -31556641, -20595100, -9825503, -16715652, -27621235, -24128416, -15169820, -18237389, -26939356, -23207755, -8212576, 3366551, 8435787, 11853012, 9183623, -3152023, -11074197, -1153833, 13150378, 9348774, -7226079, -11530833, 698950, 8321077, -151709, -13258468, -19985883, -21960814, -19679726, -10082471, -1278928, -6470940, -18505722, -13658943, 12342258, 34278815, 32434617, 17421138, 9671301, 12261199, 15513700, 13143849, 2711350, -16546213, -36351453, -42384615, -33434118, -24993739, -25722292, -24148102, -8297998, 14867881, 30178536, 32240741, 22904458, 4237221, -14173820, -14614465, 6527213, 26253287, 21081933]
9185B1081933k2970735j4583536K597463M650975m155306l975504P261104J2901811
9177B808205M530710p486590j1493651r664993r926343j0307688r70358J7536362
9169b4974346K7598704J5013397q729173j7912067o422195N340926J716369p407222
9161a5775607o787339K40168K860556L083789O996498Q119370l45815p103724
9153h712104J088243J3244672Q645042q255253j3894074l913553K883978m5427
9145h958476K247821J3344615J3714517m380208j7309886n168507J4725480J2685834
9137B0901190r116519k1527461j0752087O620561J0768750K627349m028252k573390
9129g079859J442615Q77869k787511j735907O076884J1785500P703503K2554j83115
$$ y = [21081933, -1888802, -16472338, -13874875, -9223900, -13379206, -17354710, -10093606, 2808205, 7338915, -147675, -11641326, -21306319, -31232662, -41540350, -42510708, -24974346, 2624358, 17637755, 8908582, -9003485, -15425680, -10084754, -8368385, -15775607, -22562946, -22322778, -19462222, -16378433, -9381935, -1262565, -1608380, -8712104, -7623861, 5620811, 14265853, 6010600, -7883474, -11797027, -8913049, -8958476, -6710655, 6633960, 20348477, 15968269, -1341617, -6510124, 8215356, 20901190, 11784671, -9742790, -20494877, -13874316, -3105566, -478217, -4506469, -7079859, -5637244, -4759375, -7546886, -9282793, -3205909, 8579591, 16283094, 16305648, 16122533]
9120A6122533M214030R3662j2600258j6989242m625062R987483J0058349l83653
9112E877842o051851l558628j131436j206344J761894P474216P581002J96723
9104A0943418m328571J682089R554835M149970j3856589k4451527j2390001J0725438
9096a7970938J8678250M610936j0126446o699437N562395O958007j048593j711563
9088a747389N744794M482172q708279j4171359k29405J6706624J5946424J238000
9080A9261582q848039q124598n647694q347456j3453055j4151939m903251J2635967
9072c1578483K3485984J0631409j8788383l2384533j1591698K0694521K9324408
9065a0206775J3015072p75155J86721J090865p047075j0560147O98719J3174877
$$ y = [16122533, 20336563, 20430225, 7829967, -9159275, -13784337, -3796854, 6261495, 5877842, -174009, -3732637, -4864073, -6070417, -4308523, 3165693, 10746695, 10943418, 6614847, 8296936, 17851771, 22001741, 8145152, -16306375, -28696376, -17970938, 707312, 5318248, -4808198, -11507635, -5945240, 1012767, -35826, -1747389, 3997405, 8479577, -228702, -14400061, -14629466, 2077158, 18023582, 19261582, 10413543, 2288945, -3358749, -11706205, -25159260, -39311199, -44214450, -31578483, -8092499, 2538910, -16249473, -48634006, -60225704, -39531183, -10206775, 2808297, 2033142, 2219863, 3310728, -3736347, -14296494, -13597775, -422898]
9057d22898J1049302J226602m47343M144569J690070o708608o501595M296473
9049H326572R421383k67497j1781694r505056K251650P808060L391375j240317
9041H404476q83207j020063m888429o690630k276413L228177M750373N977558
9033F601842J0673167J2077237J899386j2991895j4899971J148429J7522513J3792772
9025C5823480q011320k4456613j7368358M941345J7157901P243474r189894j0380345
9017d240330J586120N068216p079359j4798008j019049K0439502K3016740M440593
9009B7414425j2306929j1201566J057738J0739056J1731424K769734j3969390
9002A6234492k7184145k3222638l943096J3256262J6738696J0789468K895555
$$ y = [-422898, 10626404, 11853006, 11405663, 15550232, 17240302, 10531694, 4030099, 8326572, 17747955, 17480458, 5698764, -3806292, -1554642, 6253418, 9644793, 8404476, 7521269, 6501206, 1612777, -5077853, -7354266, -4126089, 624284, 6601842, 17275009, 29352246, 31251632, 18259737, 3359766, 4508195, 22030708, 35823480, 27812160, 3355547, -14012811, -9071466, 8086435, 15329909, 6140015, -4240330, -2654210, 2414006, -4665353, -19463361, -20482410, -42908, 22973832, 27414425, 15107496, 3905930, 4963668, 15702724, 27434148, 30203882, 16234492, -10949653, -34172291, -38115387, -24859125, -8120429, 2669039, 5564594]
8995E564594m728994p519094J147235J5063104J6291380M94224j3320320r268208
8987C723921K889534M624018m128946r631184p087070l272878k406126l217623
8979a8506354n488287p590991k919401R368121J6146224O191990j0740381j4656155
8971b8195234j656061J3791716J9520283J4772737J823583j5685437k6212017
8964b1840430j7695239N178255K2830135K2607896R373472n380142j3771167j1401114
8956a0098334m4965Q385281L491022o748410m874318Q528261J3263062R87219
8948A2888818j0152574l621801R246619P818168m805128p958560K138303N950318
8940A1504163p610135k1659258j4609799Q489142K1864351J2631134m571162r088455
$$ y = [5564594, 835600, -6683494, -5536259, 9526845, 25818225, 26312449, 12992129, 3723921, 6613455, 11237473, 7108527, -2522657, -9609727, -12882605, -15288731, -18506354, -23994641, -31585632, -34505033, -25136912, -8990688, -2798698, -13539079, -28195234, -29851295, -16059579, 3460704, 18233441, 20057024, 4371587, -21840430, -39535669, -34357414, -11527279, 11080617, 20454089, 15073947, 1302780, -10098334, -10143299, -1758018, 1733004, -5015406, -9889724, -1361463, 11901599, 12888818, 2736244, -885557, 8361062, 16179230, 11374102, 3415542, 5553845, 11504163, 3894028, -17765230, -32375029, -23885887, -2021536, 10609598, 6038436, -3050019]
8932c050019j42139O196559N07273r280575j1165554m686110J173988P09031l315664
8923b3053210n377540l857263j719922j754854j156594O545871K0181805K5515968
8915A5324261J1143156j1124328j6165415l70025R781088m950220k6255761k3421172
8907d6038416K312571K1122903J7376466M886203j328807m173390q364650o933167
8899b1140287M089164J3592385J0659419K32078o648299p216020l157545N049224
8891d539881J1262400N345386q161742r117514P457071J7519043L133889j6105462
8883F793190j1612645Q229486J1353131o110291j5278888k660269J1127999R032249
8875A0873962K255624K942744P31159j3295886k2628969r459389J3775049K1433393
$$ y = [-3050019, -3192158, 3004401, 3511674, -5768901, -16934455, -21620565, -20446577, -19737546, -23053210, -28430750, -32288013, -34007935, -35762789, -36919383, -30373512, -10191707, 15324261, 26467417, 15343089, -822326, -1192351, 8588737, 3638517, -22617244, -46038416, -43725845, -22602942, -5226476, -340273, -1669080, -5842470, -14207120, -21140287, -17051123, -3458738, 7200681, 7432759, 784460, -6431560, -9589105, -4539881, 6722519, 12067905, 3906163, -5211351, 2245720, 19764763, 22898652, 6793190, -4819455, 3410031, 14763162, 8652871, -6626017, -9286286, 1841713, 10873962, 13129586, 16072330, 16803489, 3507603, -19121366, -28580755, -14805706, 6627687]
8867F627687J1741439L405514L812757M036300L38873j955259l798001j0854597
8859A3354713j7615903j2792966m13541L758290k522359n534895K94125N493358
8851a5979178N143006N301583O540574J952287m330478L48014J0292589L505662
8843A2774059j8961635k4780145L91608K3698199J1756476j7030060k0330295
8836c2481793L993575J9456864R964768j422105M028388J3655321J0915030J554359
8828B9664407k233676j975096k774280q91967M567787L070195j0035714k0734608
8820a342952j5265374j186419M576903J44580k963313J95409L470040K526694
8812i844432P33746J879414M406253L635987l253881j2850637j5494690m719575
$$ y = [6627687, 18369126, 21774640, 25587397, 29623697, 29962570, 28007311, 24209310, 13354713, -4261190, -17054156, -17467697, -13709407, -16231766, -21766661, -21472536, -15979178, -10836172, -5534589, 1005985, 2958272, -1372206, -1024192, 9268397, 12774059, -6187576, -30967721, -30576113, -6877914, 4878562, -12151498, -32481793, -28488218, -9031354, 933414, -488691, 3539697, 17195018, 28110048, 29664407, 27430731, 25455635, 22681355, 21789388, 26357175, 29427370, 19391656, -1342952, -16608326, -17794745, -13217842, -13073262, -16036575, -15841166, -12371126, -9844432, -9110686, -7231272, -2825019, 810968, -2442913, -15293550, -30788240, -35507815]
8804c5507815J2282332K0433064J4626385M277741j219463k148121j477519Q82412
8796A2149016L000022Q06819k862240l72743N703983L185236q563383j3330452
8788b83742k627890R695410Q881163Q45862j491327j42283l981656r621215p906472
8779f632150j461097J131313J519188N260830O573283k293851j2267722p570322
8771a5740528Q779339J8619093J5359074Q016584Q24827j0173383k0028226j6459420
8763a0802640k208987N017178L50095r65628Q582881J4426551M795035q420636
8755A0773849q132167K834735R829603Q227986K889887m334874j1748252j0724575
8747c83808K552533J3830934N963658j4537542k2455364p642854J0767108J0571537
$$ y = [-35507815, -23225483, -2792419, 11833966, 16111707, 14892244, 12744123, 11266604, 12149016, 15149038, 15955857, 13093617, 12720874, 18424857, 21610093, 13046710, -283742, -2911632, 6783778, 15664941, 16510803, 15019476, 14877193, 10895537, 1274322, -6632150, -8093247, -6961934, -5442746, -181916, 6391367, 4097516, -8170206, -15740528, -6961189, 11657904, 27016978, 35033562, 35858389, 25685006, 5656780, -10802640, -13011627, -7994449, -7644354, -8609982, -27101, 14399450, 19194485, 10773849, 2641682, 5476417, 15306020, 23534006, 26423893, 22089019, 10340767, -383808, 2168725, 15999659, 21963317, 7425775, -15029589, -22672443, -11905335, -1333798]
8739a333798m010922r586653M066225K0347976J8044159m96750j2579583n625654
8731H825000O513824L990810j1035077j8560038r209018M963965R476715M892236
8723a41583O47961J185589M285132O537324N365353K73734n369949q472608j1470710
8714g159757j5917734j3408941L915324K3974497K3543411J833138j3424787m139305
8706g84154J1997252R362842p619595j5361114q425543j681745j186041J640674
8698a2057424P524775O035211j866830k026316N873080L939384j0889473j4680883
8690a8148476N296675K3147938R821069k0750347l0228840j1098798P983611R216677
8682b4760491N105674N988889J243188j2811194j5715535M279679K3314836J4851403
$$ y = [-1333798, -5344720, -14931373, -10865148, 9482828, 27526987, 27030237, 14450654, 8825000, 15338824, 19329634, 8294557, -10265481, -19474499, -14510534, -5033819, -141583, 506378, 1691967, 5977099, 12514423, 17879776, 18153510, 12783561, 4310953, -7159757, -23077491, -36486432, -32571108, -8596611, 14946800, 16779938, 3355151, -784154, 11213098, 20575940, 12956345, -2404769, -10830312, -12512057, -13698098, -12057424, -4532649, 1502562, -364268, -2390584, 3482496, 7421880, -3467593, -18148476, -12851801, 10296137, 20117206, -633141, -30861981, -41960779, -33977168, -24760491, -19654817, -13665928, -12422740, -25233934, -40949469, -36669790, -13354954, 1496449]
8674A496449p294813r296241R694394J8293603M108691j0033547o960596J08773
8666A16713l037157o185012J891312Q232531k002543j5447452r434001R948453
8658a5917156J5996793K564250r429791o666335N37284J701914K817578R620353
8650A224890J2543984J757662j4391198j9008351q698249M169167Q196031M417003
8642i789061J465341L442918M580595k034962j1131948q811970N738826J3128243
8634c412018L68130j5476976r052974J3679332K1316535L516833j3593432o924121
8626i578691J1843208J8242366R795115J047554k352914n655354r527697r682767
8618D130820o803255l392066L240559J2529140J3349239k79099j3966222j0137655
$$ y = [1496449, -5798364, -15094605, -5400211, 12893392, 17002083, 6968536, 7940, 116713, -2920444, -9105456, -7214144, 1018387, -984156, -16431608, -25865609, -15917156, 79637, 2643887, -6785904, -13452239, -12914955, -11213041, -8395463, 1224890, 13768874, 15526536, 1135338, -17873013, -26571262, -22402095, -14206064, -9789061, -8323720, -4880802, -300207, -2335169, -13467117, -22279087, -16540261, -3412018, -3043888, -18520864, -27573838, -13894506, 7422029, 10938862, -2654570, -9578691, 2264517, 20506883, 30301998, 31349552, 28996638, 23341284, 13813587, 4130820, -2672435, -6064501, -2823942, 9705198, 23054437, 22775338, 8809116, -1328539]
8610a328539N763932J4175387J1115343Q382650P262172l525220k0665807k2260489
8602a080571j465549J7302763J1140263q701804j4755119k376432Q659790N664465
8594A4387806l236504o552047l763608J282477P751929J2937608J0462914J80328
8586C3450903p681394n139086K389727M338051k34689l875199l736832m219460
8578A5292021o485095m622378L637369R476512L127509j1764629k0665052j4582096
8570b6585839J110408J4058403J6101511P032542o519889j3676887o855340Q563619
8562f771472J6498531P965490o363920q488309L265264J1639266L958862j0393921
8554A1309791j3063718j669493Q514055O975872Q68527P24053K918926l125561
$$ y = [-1328539, 4435393, 18610780, 29726123, 38108773, 45370945, 41845725, 21179918, -1080571, -2546120, 14756643, 25896906, 17195102, 2439983, 63551, 8723341, 14387806, 11151302, 4599255, 835647, 2118124, 9870053, 22807661, 33270575, 33450903, 25769509, 20630423, 23020150, 27358201, 27123512, 23248313, 19511481, 15292021, 8806926, 4184548, 7821917, 17298429, 20425938, 8661309, -12003743, -26585839, -25475431, -11417028, 4684483, 11717025, 5197136, -8479751, -15335091, -6771472, 9727059, 17692549, 11328629, 2840320, 6105584, 17744850, 21703712, 11309791, -1753927, -3423420, 5090635, 12066507, 12935034, 13659087, 16578013, 13452452]
8546A3452452j4621806j5636180n35392J4309656J0801958n842775j3665531l913754
8538a5651372P604346L418424j1114362j5842742m182913Q374824O837348k521291
8530b3077738k794825P696833J2653402K150782j2285186j3956908l430774N488544
8522b7555870O613483O005427P593528O959691J699326k967904l058675j483623
8514f194617r20075O02908L059443K028615k471745l508310J167134L950204j61430
8505b447873m961005l744274L32838K027558K876711M252623J673618m530627
8497d520431l833178P490687J5039069O462558p079824o703900N118727J0296225
8489B2269933M263139q36012O21441J387349k090828n429591q768834j5317725
$$ y = [13452452, -1169354, -16805534, -17340926, -3031270, 7770688, 1927913, -11737618, -15651372, -8047026, -4628602, -15742964, -31585706, -35768619, -27393795, -20556447, -23077738, -25872563, -18175730, -5522328, -3371546, -15656732, -29613640, -33044414, -27555870, -20942387, -14936960, -7343432, -383741, 1315585, -1652319, -4710994, -6194617, -7114692, -6511784, -3452341, -1423726, -3895471, -7403781, -6236647, -2286443, -2447873, -7408878, -11153152, -10820314, -8792756, -5916045, -1663422, 10196, -4520431, -8353609, -862922, 14176147, 20638705, 13558881, 6854981, 11973708, 22269933, 26533072, 25697060, 26318501, 27705850, 25615022, 20185431, 11416597, -3901128]
8481c901128j7905457o693658R391659J0557563k369715p548056K190850Q241893
8473h036049m34767q431954k555903M298809k605657j1103285j121398K0171202
8465i819002K6497246J0443851p945960j0321032j194461K859448n457985j6979613
8457a1917508j6300575M03324J7819433J7773105K724617p621022m071714K452476
8449A262136K838872L236074P913803P403528k589697p640523K525201J2402881
8441B7352275K842192j6214066j8413373p50051J2635343O331693p214623q685563
8433b116173L633194J6253251J7114782N055006j1128887k0374450j8771186j0534856
8425b0869319J29694J1154602J5848046O533137r705434j3052225K113921J6333677
$$ y = [-3901128, -21806585, -28500243, -19108584, -8551021, -10920736, -18468792, -16277942, -8036049, -8470816, -16902770, -19458673, -15159864, -17765521, -28868806, -29990204, -9819002, 16678244, 27122095, 19176135, 8855103, 7660642, 10520090, 5062105, -11917508, -28218083, -27814759, -9995326, 7777779, 10502396, 2881374, -1190340, 1262136, 4101008, 7337082, 15250885, 22654413, 20064716, 12424193, 14949394, 27352275, 30194467, 13980401, -4432972, -5183023, 7452320, 13784013, 6569390, -2116173, 1517021, 17770272, 34885054, 39940060, 28811173, 8436723, -10334463, -20869319, -20739625, -9585023, 6263023, 12796160, 3090726, -9961499, -7847578, 8486099]
8417H486099J2361807j216132p287282n851841n372198l413176L565562M576389
8409E849228q167523j7588008m482646J7231248J7915393m82864p358244N930746
8401H847330J2726712l330068k1255414j6912961J070791Q764000K484143k461829
8393a0067296K083241Q747557P580498k892082j4452856j5273171k760688R711046
8385a7323751Q208308j239108j071162R699854J3322501J919557j0412203j0538429
8377g434433l870298m57507O12128K934664K822799j807450m084534P15601O694062
8368c874968P466287M559288n824p388060j2743032o774489O687922J0493849
8360a579027L30869n824807L963100J4931771Q835910p083903j2672070n061611
$$ y = [8486099, 20847906, 19631774, 12344492, 6492651, 1120453, -2292723, 1272839, 5849228, -2318295, -19906303, -24388949, -7157701, 10757692, 10274828, 2916584, 8847330, 21574042, 18243974, -3011440, -19924401, -18853610, -10089610, -7605467, -10067296, -7984055, 763502, 8344000, 5451918, -9000938, -24274109, -27034797, -17323751, -9115443, -10354551, -11425713, -1725859, 11596642, 13516199, 3103996, -7434433, -11304731, -11762238, -11150110, -8215446, -5392647, -7200097, -11284631, -10569030, -3874968, 3591319, 8150607, 8144783, 756723, -11986309, -18760798, -12072876, -1579027, -1248158, -7072965, -3109865, 11821906, 20657816, 13573913, 901843, -4159768]
8352d159768K594979L992940K470945k207586j0573400j1902806L683237K3393195
8344G291736K2864257J395391j3796421n159144J1067844R551099q635179k0209413
8336D370170j3055527J20516K486132n183104r808226n088173L701102J0229733
8328a2227377J2267421P075374o467773j8343429j3453987N490182J5124023L515335
8320g020231q945992J151742K2114612K3053445J416100j4286354r835465l108166
8312D539691q688186j3726007l913039J0726346J3999717Q205338K949818l341780
8304A0751898j2812261j5387594n492247L385464j41100m779714K413914J0414367
8296a1647273M094886m853705L952330K0756288J7258701o931606k1846709j2755765
$$ y = [-4159768, -1564789, 2428151, 4899096, 2691510, -7881890, -19784696, -16101459, 7291736, 30155993, 31551384, 17754963, 12595819, 23663663, 33214762, 24579583, 4370170, -8685357, -8564841, -6078709, -11261813, -21070039, -26158212, -22457110, -12227377, 40044, 7115418, 647645, -17695784, -31149771, -25659589, -10535566, -7020231, -15966223, -14814481, 7300131, 30353576, 31769676, 17483322, 7647857, 4539691, -4148495, -17874502, -21787541, -11061195, 2938522, 11143860, 14093678, 10751898, -2060363, -17447957, -22940204, -19554740, -19695840, -24475554, -22061640, -11647273, -7552387, -12406092, -8453762, 12302526, 29561227, 22629621, 782912, -11972853]
8288a1972853K376101O442233N209786O579936M607973k938572m343332M035858
8280I997130O087067p228940j7784289o772907J2655867J1486030j3295423l3593247
8272c8448712k6201967J933155K5854212K8249879J1404992p279465j0022622
8265a4510528M266457J7080196J0507319j0120884k1086536r037065J2546141
8258a0354900K0049501P900098o825129p409777K194528N292416l311347j0453839
8250b918449m553822O777465P675304k514833q318150j019491Q851848P223544
8242A1203416l593725q962047k154579Q117660J0863834O096465R34923k454343
8234B0051604p479562j2343786q091713O801624J7371883Q669530j1417487j8882123
$$ y = [-11972853, -9596752, -3154519, 2055267, 8635203, 13243176, 10304604, 5961272, 9997130, 16084197, 8855257, -8929032, -15701939, -3046072, 8439958, -4855465, -38448712, -64650679, -62717524, -36863312, -8613433, 2791559, -4487906, -14510528, -10244071, 6836125, 17343444, 7222560, -13863976, -22901041, -10354900, 9694601, 17594699, 10769570, 3359793, 5554321, 10846737, 7535390, -2918449, -7472271, -694806, 6980498, 4465665, -3852485, -4871976, 3979872, 11203416, 7609691, -1352356, -3506935, 4610725, 15474559, 21571024, 22505947, 20051604, 12572042, 228256, -7863457, -1061833, 16310050, 24979580, 13562093, -5320030]
8226e320030n014916J2164622J3593860L253276l351132l414765n324241r960571
8218c373897r436096k435171L544270N507190P622648R638752N831845j625144
8210A5274397j641647P409216J0367669m085502k3931704k6513163p353086J4317051
8202a6156769J9193209Q253235l671767p436184n585418j952344M882880J4212585
8194A1739427J7671605R555025k252085o094675m156459p199816j3158247q537839
8186b433064N326884Q203838n877140j2248917Q154247L3057191K6095623r017819
8178E1260843l1266448j9220186L398158O305654q107014j7109770j0608552L049334
8170b2297981J2275165J0993800R31995o555324m41460J2153802J0796623q256022
$$ y = [-5320030, -10334946, 1829676, 15423536, 18676812, 15325680, 11910915, 6586674, -3373897, -12809993, -15245164, -11700894, -6193704, 1428944, 11067696, 16899541, 15274397, 13632750, 21041966, 31409635, 27324133, 3392429, -23120734, -30473820, -16156769, 3036440, 11289675, 7617908, 181724, -5403694, -7356038, -2473158, 11739427, 29411032, 38966057, 36713972, 30619297, 26462838, 19263022, 6104775, -2433064, 2893820, 11097658, 5220518, -7028399, 1125848, 34183039, 60278662, 51260843, 19994395, 774209, 4172367, 10478021, 2371007, -14738763, -25347315, -22297981, -10022816, 970984, 1902979, -4652345, -5093805, 7059997, 17856620, 9600598]
8162I600598k2135726j2907489N948901J0355115M66028m480427K100777Q408174
8154b644049P103222L878968K396776j331360o335171m651604L351958O439389
8146H208129J291943m60220P797484J4107670N871089r232169j4043458o865379
8138F675089r76219k366509k814142L758308J1211244J1689024O084764p35829
8130C2525730o700769r823757o966136p18772O08343l869227l252628P919297
8122I722081J6968564R398685q921750j9572480j6493872p971703J777248J4110711
8114i82516K0630766R094977j1099734j3290249O401232J7237199j226456k4642087
8106B123132j8593473R062590K0903762O442949p127620j784140N822679l229336
$$ y = [9600598, -12535128, -25442617, -19493716, -9138601, -8672573, -13153000, -11052223, -2644049, 4459173, 8338141, 10734917, 9403557, 3068386, -1583218, 1768740, 8208129, 9500072, 9039852, 16837336, 30945006, 36816095, 27583926, 13540468, 6675089, 5698870, 3332361, 518219, 4276527, 15487771, 27176795, 33261559, 32525730, 25824961, 16001204, 9035068, 8316296, 8924639, 5055412, 1802784, 9722081, 26690645, 36089330, 27167580, 7595100, -8898772, -16870475, -15093227, -982516, 19648250, 28743227, 17643493, 4353244, 10754476, 27991675, 26765219, 2123132, -16470341, -7407751, 13496011, 19938960, 12811340, 11027200, 16849879, 13620543]
8098A3620543j8328892j7990073l736638M186242k517832j0458021m711457J2273925
$$ y = [13620543, -4708349, -22698422, -26435060, -22248818, -24766650, -35224671, -39936128, -27662203]
$$ [...]
##END NTUPLES=NMR SPECTRUM
##END=
